##TITLE=	Document 1
##JCAMP-DX=	6.0	$$ MestReNova 15.0.0-34764
##DATA TYPE=	LINK
##BLOCKS=	3    
##ORIGIN=	Mestrelab Research S.L.
##OWNER=	PC
##$MNOVA/METADATA=	(DOCUMENT,BASE64)
ewogICAgIm5hbWUiOiAiRG9jdW1lbnQgMSIsCiAgICAicGFnZXMiOiBbCiAgICAgICAgewogICAgICA
gICAgICAiaXRlbXMiOiBbCiAgICAgICAgICAgICAgICAiMiIsICAgICAgICAgICAgICAgICAgICAgIC
AgICAgICAgICAgICAgIAogICAgICAgICAgICAgICAgIjEiICAgICAgICAgICAgICAgICAgICAgICAgI
CAgICAgICAgICAgIAogICAgICAgICAgICBdCiAgICAgICAgfQogICAgXQp9Cg==
##TITLE=	H NMR calculated spectrum
##JCAMP-CS=	3.7	$$ MestReNova 15.0.0-34764
##BLOCK_ID=	1
##ORIGIN=	Mestrelab Research S.L.
##OWNER=	PC
##$MNOVA/METADATA=	(ITEM,BASE64)
ewogICAgImFuZ2xlIjogMCwKICAgICJwb2ludHMiOiBbCiAgICAgICAgewogICAgICAgICAgICAieCI
6IDUzODQsCiAgICAgICAgICAgICJ5IjogNjI5OQogICAgICAgIH0sCiAgICAgICAgewogICAgICAgIC
AgICAieCI6IDU5NzUuNzc3NDE2MjI2NjQxLAogICAgICAgICAgICAieSI6IDYyOTkKICAgICAgICB9L
AogICAgICAgIHsKICAgICAgICAgICAgIngiOiA1OTc1Ljc3NzQxNjIyNjY0MSwKICAgICAgICAgICAg
InkiOiA3MTE3LjcyOTg3ODg4NzczNwogICAgICAgIH0sCiAgICAgICAgewogICAgICAgICAgICAieCI
6IDUzODQsCiAgICAgICAgICAgICJ5IjogNzExNy43Mjk4Nzg4ODc3MzcKICAgICAgICB9LAogICAgIC
AgIHsKICAgICAgICAgICAgIngiOiA1Mzg0LAogICAgICAgICAgICAieSI6IDYyOTkKICAgICAgICB9C
iAgICBdLAogICAgInoiOiAxCn0K
##NAMES=	H NMR calculated spectrum
##ATOMLIST=	
$$ AN	AS	NH
	1	C	3
	2	C	2
	3	C	2
	4	O	 
	5	P	 
	6	O	 
	7	C	3
	8	S	 
	9	C	2
	10	C	2
	11	N	 
	12	C	1
	13	C	3
	14	C	3
	15	C	1
	16	C	3
	17	C	3
##BONDLIST=	
$$ AN1	AN2	BT
	1	2	S
	2	3	S
	3	4	S
	4	5	S
	5	6	D
	5	7	S
	5	8	S
	8	9	S
	9	10	S
	10	11	S
	11	12	S
	11	15	S
	12	13	S
	12	14	S
	15	16	S
	15	17	S
##MAXRASTER=	32768
##XY_RASTER=	
$$ AN	X	Y	Z
	1	10965	14331	0
	2	13658	14331	0
	3	14941	16640	0
	4	17634	16640	0
	5	18916	18949	0
	6	21225	17602	0
	7	16672	20263	0
	8	20295	21289	0
	9	18916	23501	0
	10	20295	25842	0
	11	18916	28150	0
	12	20295	30459	0
	13	22988	30459	0
	14	18916	32768	0
	15	16319	28150	0
	16	14941	30459	0
	17	14941	25842	0
##END=		$$ JCAMP-CS
##TITLE=	
##JCAMP-DX=	6.0	$$ MestReNova 15.0.0-34764
##DATA TYPE=	NMR SPECTRUM
##DATA CLASS=	XYDATA
##BLOCK_ID=	2
##ORIGIN=	Mnova: Peaks
##OWNER=	PC
##NUMDIM=	1
##$MNOVA/METADATA=	(ITEM,BASE64)
ewogICAgImFuZ2xlIjogMCwKICAgICJheGVzIjogewogICAgICAgICJ4IjogewogICAgICAgICAgICA
ibWF4IjogMjAuMDAwMTUwMDAxMTI1MDA3LAogICAgICAgICAgICAibWluIjogLTQuOTk5NjU2MDI3Nj
kzNjQ1NQogICAgICAgIH0sCiAgICAgICAgInkiOiB7CiAgICAgICAgICAgICJtYXgiOiAwLjMxMzA5M
TQyNzA4Nzc4MzgsCiAgICAgICAgICAgICJtaW4iOiAtMC4wMjg0NjI4NTcwMDc5ODAzNDcKICAgICAg
ICB9CiAgICB9LAogICAgInBvaW50cyI6IFsKICAgICAgICB7CiAgICAgICAgICAgICJ4IjogNTMyMSw
KICAgICAgICAgICAgInkiOiA1ODM1CiAgICAgICAgfSwKICAgICAgICB7CiAgICAgICAgICAgICJ4Ij
ogODcyMiwKICAgICAgICAgICAgInkiOiA1ODM1CiAgICAgICAgfSwKICAgICAgICB7CiAgICAgICAgI
CAgICJ4IjogODcyMiwKICAgICAgICAgICAgInkiOiA4MjA4CiAgICAgICAgfSwKICAgICAgICB7CiAg
ICAgICAgICAgICJ4IjogNTMyMSwKICAgICAgICAgICAgInkiOiA4MjA4CiAgICAgICAgfSwKICAgICA
gICB7CiAgICAgICAgICAgICJ4IjogNTMyMSwKICAgICAgICAgICAgInkiOiA1ODM1CiAgICAgICAgfQ
ogICAgXSwKICAgICJ6IjogMAp9Cg==
##.OBSERVE FREQUENCY=	200.12849902499999644
##.OBSERVE NUCLEUS=	^Unknown
##.SOLVENT NAME=	
##.PULSE SEQUENCE=	
##.ACQUISITIONMODE=	SIMULTANEOUS
##$ORIGINAL FORMAT=	MNova
##$MNOVA/SCALES_VERSION=	9
##$PARAMETER FILE=	(originalData.xml, ASCII, , 0)
$$ <?xml version="1.0" encoding="UTF-8"?>
$$ <MnovaSpectrumParams>
$$     <itemId>{6df48552-bce5-4b28-86e6-cf322f873174}</itemId>
$$     <spectrumIndex>0</spectrumIndex>
$$     <DataFileName/>
$$     <Title>
$$         <dim0>Simulated Unknown NMR Spectrum</dim0>
$$     </Title>
$$     <Comment/>
$$     <Origin>
$$         <dim0>Mnova: Spin Simulation</dim0>
$$     </Origin>
$$     <Owner/>
$$     <Site/>
$$     <Instrument/>
$$     <Author/>
$$     <Solvent/>
$$     <Temperature/>
$$     <PulseSequence/>
$$     <Experiment>
$$         <dim0>1D</dim0>
$$     </Experiment>
$$     <Probe/>
$$     <NumberofScans/>
$$     <ReceiverGain/>
$$     <RelaxationDelay/>
$$     <PulseWidth/>
$$     <PresaturationFrequency/>
$$     <AcquisitionTime/>
$$     <AcquisitionDate/>
$$     <ModificationDate/>
$$     <Class/>
$$     <Purity>
$$         <dim0>100</dim0>
$$     </Purity>
$$     <SpectrumQuality>
$$         <dim0>0</dim0>
$$     </SpectrumQuality>
$$     <Version/>
$$     <Algorithm/>
$$     <UseDB/>
$$     <GMMXCycles/>
$$     <LineWidth>
$$         <dim0>0</dim0>
$$     </LineWidth>
$$     <SpectrometerFrequency>
$$         <dim0>200.13</dim0>
$$     </SpectrometerFrequency>
$$     <SpectralWidth>
$$         <dim0>5003.25</dim0>
$$     </SpectralWidth>
$$     <LowestFrequency>
$$         <dim0>-1000.65</dim0>
$$     </LowestFrequency>
$$     <Nucleus>
$$         <dim0>Unknown</dim0>
$$     </Nucleus>
$$     <AcquiredSize/>
$$     <SpectralSize>
$$         <dim0>65536</dim0>
$$     </SpectralSize>
$$     <DigitalResolution>
$$         <dim0>0.0763435363769531</dim0>
$$     </DigitalResolution>
$$     <AbsoluteReference/>
$$ </MnovaSpectrumParams>
$$ 
##$PARAMETER FILE=	(parameters, ASCII, , 0)
$$ <MnovaSpectrumParams>
$$ <SpecCount>1</SpecCount>
$$ <Dimensions>1</Dimensions>
$$ <Origin>Mnova: Peaks</Origin>
$$ <Window Dim="f1">
$$ <Nucleus>Unknown</Nucleus>
$$ <Points>65536</Points>
$$ <Width>5003.25</Width>
$$ <MHz>200.128499024999996</MHz>
$$ <Hz>-1000.64999999999998</Hz>
$$ </Window>
$$ <Window Dim="f0">
$$ <Points>1</Points>
$$ </Window>
$$ </MnovaSpectrumParams>
##$PARAMETER FILE=	(title, ASCII, , 0)
$$ 
##XUNITS=	HZ
##YUNITS=	ARBITRARY UNITS
##FIRSTX=	4002.5999999999999091
##LASTX=	-1000.5736564636230241
##DELTAX=	-0.076343536376953125
##XFACTOR=	1
##YFACTOR=	1.325405064096413557E-10
##FIRSTY=	7.5107635666427086107E-09
##MINY=	0
##MAXY=	0.2846285700798034668
##NPOINTS=	65536
##XYDATA=	(X++(Y..Y))
$$ [...]
900 15723 15747 15771 15794 15818 15842 15866 15890 15914 15938 15963 15987 16011 16036 16060 16085 16109 16134 16159 16183 16208 16233 16258 16283 16308 16333 16359 16384 16409 16435 16460 16486 16512 16537 16563
897 16563 16589 16615 16641 16667 16693 16719 16745 16772 16798 16825 16851 16878 16904 16931 16958 16985 17012 17039 17066 17093 17120 17148 17175 17203 17230 17258 17285 17313 17341 17369 17397 17425 17453 17481
895 17481 17510 17538 17567 17595 17624 17652 17681 17710 17739 17768 17797 17826 17855 17885 17914 17944 17973 18003 18033 18062 18092 18122 18152 18182 18213 18243 18273 18304 18334 18365 18396 18427 18458 18489
892 18489 18520 18551 18582 18614 18645 18676 18708 18740 18772 18804 18836 18868 18900 18932 18964 18997 19029 19062 19095 19128 19160 19193 19227 19260 19293 19326 19360 19393 19427 19461 19495 19529 19563 19597
889 19597 19631 19666 19700 19735 19769 19804 19839 19874 19909 19944 19980 20015 20051 20086 20122 20158 20194 20230 20266 20302 20339 20375 20412 20448 20485 20522 20559 20596 20633 20671 20708 20746 20784 20821
887 20821 20859 20897 20936 20974 21012 21051 21089 21128 21167 21206 21245 21284 21324 21363 21403 21442 21482 21522 21562 21603 21643 21683 21724 21765 21806 21846 21888 21929 21970 22012 22053 22095 22137 22179
884 22179 22221 22263 22306 22348 22391 22434 22477 22520 22563 22607 22650 22694 22738 22782 22826 22870 22914 22959 23003 23048 23093 23138 23183 23229 23274 23320 23366 23412 23458 23504 23551 23597 23644 23691
882 23691 23738 23785 23833 23880 23928 23976 24024 24072 24120 24168 24217 24266 24315 24364 24413 24463 24512 24562 24612 24662 24713 24763 24814 24865 24916 24967 25018 25070 25121 25173 25225 25277 25330 25382
879 25382 25435 25488 25541 25595 25648 25702 25756 25810 25864 25919 25973 26028 26083 26138 26194 26249 26305 26361 26417 26474 26530 26587 26644 26701 26759 26816 26874 26932 26990 27049 27108 27166 27225 27285
876 27285 27344 27404 27464 27524 27585 27645 27706 27767 27828 27890 27951 28013 28076 28138 28201 28263 28327 28390 28453 28517 28581 28646 28710 28775 28840 28905 28971 29036 29102 29169 29235 29302 29369 29436
874 29436 29504 29571 29639 29708 29776 29845 29914 29983 30053 30123 30193 30263 30334 30405 30476 30548 30619 30691 30764 30836 30909 30983 31056 31130 31204 31278 31353 31428 31503 31579 31654 31731 31807 31884
871 31884 31961 32038 32116 32194 32272 32351 32430 32509 32589 32669 32749 32829 32910 32991 33073 33155 33237 33320 33403 33486 33569 33653 33738 33822 33907 33993 34078 34164 34251 34337 34425 34512 34600 34688
869 34688 34777 34866 34955 35045 35135 35226 35317 35408 35500 35592 35684 35777 35870 35964 36058 36153 36247 36343 36438 36535 36631 36728 36826 36923 37022 37120 37220 37319 37419 37520 37621 37722
866 37722 37824 37926 38029 38132 38236 38340 38445 38550 38655 38761 38868 38975 39082 39190 39299 39408 39517 39627 39738 39849 39960 40072 40185
864 40185 40298 40411 40526 40640 40756 40871 40988 41104 41222 41340 41458 41577 41697 41817 41938 42059 42181 42304 42427 42551 42675 42800 42926
863 42926 43052 43179 43306 43434 43563 43692 43822 43953 44084 44216 44348 44481 44615 44750 44885 45021 45157 45294 45432 45571 45710 45850 45991
861 45991 46133 46275 46418 46561 46706 46851 46997 47143 47291 47439 47588 47738 47888 48039 48191 48344 48498 48653 48808 48964 49121 49279 49437
859 49437 49597 49757 49919 50081 50244 50408 50572 50738 50905 51072 51240 51410 51580 51751 51923 52096 52270 52445 52621 52798 52976 53155 53335
857 53335 53516 53698 53881 54066 54251 54437 54624 54812 55002 55192 55384 55577 55771 55966 56162 56359 56558 56757 56958 57160 57363 57567 57773
856 57773 57980 58188 58397 58608 58820 59033 59247 59463 59680 59898 60118 60339 60561 60785 61010 61237 61465 61694 61925 62158 62391 62626 62863
854 62863 63101 63341 63582 63825 64070 64316 64563 64812 65063 65315 65569 65825 66082 66341 66602 66865 67129 67395 67663 67932 68204 68477 68752
852 68752 69029 69308 69588 69871 70155 70442 70730 71021 71313 71608 71905 72203 72504 72807 73112 73419 73728 74040 74354 74670 74988 75309 75632
850 75632 75957 76285 76615 76947 77282 77620 77960 78302 78647 78995 79345 79698 80054 80412 80773 81137 81503 81872 82245 82620 82998 83379 83763
849 83763 84150 84540 84933 85329 85729 86131 86537 86946 87359 87775 88194 88617 89043 89472 89906 90342 90783 91227 91675 92127 92582 93042 93505
847 93505 93972 94444 94919 95399 95883 96371 96863 97360 97861 98366 98877 99391 99911 100435 100963 101497 102036 102579 103128 103682 104241 104805 105374
845 105374 105949 106529 107115 107707 108304 108907 109516 110131 110752 111380 112013 112653 113299 113952 114611 115277 115950 116630 117317 118011 118713 119421 120138
843 120138 120862 121593 122333 123080 123836 124600 125372 126153 126943 127741 128549 129365 130191 131026 131871 132726 133591 134466 135351 136247 137153 138071 138999
842 138999 139939 140890 141853 142828 143816 144815 145828 146853 147892 148944 150009 151089 152183 153292 154415 155554 156708 157878 159064
840 159064 160266 161486 162723 163977 165250 166541 167850 169179 170528 171897 173287 174697 176130 177584 179062 180562 182087
839 182087 183636 185210 186810 188436 190089 191770 193480 195219 196988 198788 200620 202484 204382 206315 208284 210289 212331
838 212331 214413 216535 218698 220903 223153 225448 227789 230179 232619 235111 237656 240256 242913 245629 248407 251248 254155
836 254155 257130 260177 263296 266492 269768 273126 276571 280104 283732 287456 291282 295214 299257 303415 307695 312101 316640
835 316640 321318 326142 331120 336259 341567 347054 352730 358604 364687 370993 377533 384322 391374 398706 406336 414283 422567
834 422567 431212 440242 449685 459571 469931 480802 492224 504240 516899 530255 544368 559305 575140 591959 609855
833 609855 628937 649326 671161 694601 719827 747052 776518 808512 843368 881481 923323 969455 1020561 1077471
831 1077471 1141210 1213054 1294611 1387942 1495718 1621473 1769965 1947741 2164036 2432215 2772187 3214461
831 3214461 3806899 4624874 5780063 7394941 9444797 11470034 12638157 12492596 11558854 10747668 10616373
830 10616373 11317441 12890557 15394382 18813854 22777645 26256203 27773992 26560870 23419534 19862776
829 19862776 16965270 15149052 14468889 14802342 15499322 15062492 12938906 10364599 8248979 6672198
828 6672198 5513975 4659325 4020156 3533847 3157317 2861093 2624825 2434238 2279136 2152102 2047649
827 2047649 1961652 1890968 1833172 1786375 1749092 1720152 1698625 1683777 1675028 1671927 1674128 1681380 1693507 1710408
826 1710408 1732045 1758444 1789688 1825926 1867366 1914285 1967033 2026041 2091837 2165054 2246454 2336955 2437659
825 2437659 2549898 2675293 2815828 2973953 3152733 3356047 3588881 3857762 4171411 4541770 4985666
824 4985666 5527595 6204590 7074896 8233281 9833945 12096130 15152889 18591783 21467595 23245395
824 23245395 24425839 26267855 29445157 32206103 32069760 30203517 29208313 29863861 32166525 36118437
823 36118437 41650200 48372140 55279858 60667515 62674826 60491166 55034742 48175308 41550126 36074959
822 36074959 32060850 29514592 28372840 28621473 30338732 33698223 38931580 45967192 52901636 55190370
821 55190370 50463669 42127858 34327594 28369833 24180427 21546923 20317179 20239734 20466115 19468406
821 19468406 16839692 13831705 11358062 9535810 8213974 7238103 6499060 5925595 5471422 5105893
820 5105893 4808175 4563720 4362113 4195739 4058923 3947384 3857853 3787832 3735408 3699136 3677951 3671107 3678134
819 3678134 3698815 3733171 3781454 3844156 3922031 4016119 4127795 4258833 4411500 4588681 4794064 5032403
818 5032403 5309898 5634773 6018159 6475487 7028735 7710098 8567886 9675125 11137560 13080988 15558196
817 15558196 18348142 20964679 23105455 24781715 26123760 27493472 29487289 32610050 37775825 45832929
816 45832929 52345371 51734575 48546757 48285525 50528845 53783466 56382024 56504820 53778684 49720810
816 49720810 46173025 44069568 43647006 44994053 48266683 53714861 61676015 72525432 86160690 100076707
815 100076707 107941455 104333862 91381881 75949572 62446732 51758553 43553442 37401804 32954921
814 32954921 29966967 28313040 28005658 29196955 32103074 36686816 42055030 46421953 48394790 47608573
813 47608573 44046330 38079385 31118426 24861278 20056347 16615405 14202192 12517751 11355683 10587850
813 10587850 10143120 9993327 10147306 10651519 11594710 13110299 15358551 18401817 21631102 23085028
812 23085028 21341340 17815652 14462252 11882110 10003278 8653480 7683637 6983891 6478377 6116124
811 6116124 5863289 5697675 5605163 5577508 5611084 5706329 5867780 6104713 6432537 6875285 7469789 8272492
810 8272492 9370077 10894108 13032991 16005368 19865613 23891929 26076622 25034096 22217555 19713543
809 19713543 18346649 18202221 19245926 21462719 24252302 26108797 27535746 30266069 34861824 41258177
809 41258177 48334108 53382579 54721668 54413547 55657529 59453308 63932675 64988170 60032252 51289156
808 51289156 42556287 35713597 31001814 28126781 26784165 26809900 28211783 31180254 36086897 43394432
807 43394432 53272126 64770631 75363510 82218486 83729416 79581610 70625644 59099570 47933533
806 47933533 38962178 32486314 28089106 25270490 23655124 23011024 23224754 24278877 26239084 29245276
806 29245276 33489790 39146699 46199315 54170033 61959774 68071115 71097065 70229239 65636932 58375767
805 58375767 49930592 41701629 34567728 28803168 24310328 20865210 18246858 16280641 14844525 13865589
804 13865589 13318088 13227752 13683737 14849672 16918764 19840953 22747432 23875648 22142610 18616337
803 18616337 15043527 12275275 10340909 9021981 8123133 7514293 7115893 6881839 6788603 6829613 7013581
803 7013581 7366208 7935525 8801726 10091481 11989625 14710309 18292756 21977883 23713656 22079310
802 22079310 18497340 15021589 12413125 10634983 9475681 8753626 8346204 8178398 8208930 8421046 8818052
801 8818052 9422815 10280962 11468151 13101910 15357325 18480979 22788691 28583111 35460288 40379748
800 40379748 39370640 33904021 28304402 24227986 21609155 20147515 19596569 19793247 20653090 22157203
799 22157203 24340248 27281999 31104994 35983573 42124640 49488588 57110437 63135068 66630641 68927107
799 68927107 72217248 77415707 83310407 86827932 85004699 77700668 67636148 57720492 49304425 42560021
798 42560021 37302517 33328973 30480767 28657211 27837123 28131271 29938200 34350434 41245877 41489184
797 41489184 42401959 45301429 48214524 50057269 50324709 48842578 45669337 41109355 35751678 30336168
796 30336168 25449325 21355184 18059900 15449626 13384986 11741716 10420995 9347847 8466346 7734886
796 7734886 7122364 6605339 6165968 5790537 5468400 5191226 4952442 4746839 4570270 4419437 4291727
795 4291727 4185089 4097954 4029162 3977930 3943818 3926729 3926910 3944987 3982007 4039516 4119675 4225429 4360750
794 4360750 4531004 4743504 5008349 5339745 5758106 6293440 6990759 7918264 9177511 10906963 13238180
793 13238180 16033543 18288767 18831423 18393696 18426369 19488044 21651586 24863354 28849616 32819031
792 32819031 35569209 36535879 36562710 37066261 38757483 40919048 41496793 39207125 35355203 32137136
791 32137136 30772838 31667647 32089122 28840162 26085493 25380430 26514266 29533704 34654761 42017353
791 42017353 50455581 55628432 53962907 48624082 44350629 42603084 43042489 44736662 46369723 46531295
790 46531295 44367710 40095437 34705964 29235879 24338727 20256373 16971557 14362106 12289367 10632409
789 10632409 9295401 8205271 7307031 6559357 5931044 5398346 4943024 4550933 4211000 3914470 3654359
788 3654359 3425050 3221988 3041452 2880380 2736239 2606920 2490660 2385976 2291620 2206539 2129840 2060769
787 2060769 1998691 1943072 1893468 1849514 1810918 1777455 1748962 1725339 1706547 1692609 1683616 1679731 1681201 1688366
786 1688366 1701679 1721729 1749270 1785268 1830957 1887920 1958209 2044502 2150352 2280541 2441627 2642804 2897262
785 2897262 3224420 3653576 4229776 5022234 6131550 7674443 9685045 11908774 13807212 14995148
784 14995148 15407431 15180043 14753522 14839889 15958728 18212090 21266186 24328823 26440714 26914241 25577186
784 25577186 22831387 19505661 16518440 14453009 13496580 13618781 14571232 15748331 16441496 16353000 15455667
783 15455667 13705298 11317736 8897904 6916003 5456892 4415082 3665324 3113213 2695650 2371618
782 2371618 2114278 1905724 1733715 1589681 1467474 1362593 1271673 1192154 1122059 1059836 1004251 954314
781 954314 909219 868303 831021 796914 765598 736747 710083 685370 662402 641000 621011 602299 584745 568245
780 568245 552707 538047 524194 511081 498650 486849 475630 464950 454771 445057 435777 426902 418404 410260 402447
779 402447 394946 387736 380801 374125 367694 361492 355509 349731 344149 338752 333530 328475 323578 318833 314231 309766 305431
778 305431 301222 297131 293154 289286 285523 281859 278291 274815 271427 268124 264902 261759 258690 255694 252768 249909 247115
776 247115 244384 241713 239100 236543 234041 231591 229192 226842 224540 222284 220073 217904 215778 213693 211647 209639 207668
775 207668 205734 203834 201969 200137 198337 196568 194830 193121 191442 189790 188166 186569 184997 183451 181929 180432 178958
774 178958 177507 176079 174672 173287 171922 170578 169254 167949 166663 165396 164147 162916 161702 160505 159324 158160 157012
772 157012 155879 154762 153660 152572 151498 150439 149394 148362 147343 146337 145344 144363 143395 142439 141494 140561 139640 138729 137830
771 137830 136941 136063 135195 134337 133490 132652 131823 131005 130195 129395 128604 127821 127048 126283 125526 124778 124037 123305 122581 121864 121155 120453 119759
769 119759 119073 118393 117720 117055 116396 115744 115098 114459 113827 113201 112581 111967 111359 110757 110162 109571 108987 108408 107835 107268 106705 106148 105597
767 105597 105050 104509 103972 103441 102914 102393 101876 101364 100856 100353 99855 99361 98871 98386 97905 97428 96956 96487 96023 95563 95106 94654 94206
766 94206 93761 93320 92883 92449 92019 91593 91170 90751 90336 89923 89514 89109 88707 88308 87912 87519 87130 86744 86361 85980 85603 85229 84858
764 84858 84490 84124 83762 83402 83045 82691 82339 81991 81644 81301 80960 80622 80286 79953 79622 79294 78968 78645 78324 78005 77689 77375 77063
762 77063 76754 76447 76142 75839 75538 75240 74944 74650 74358 74068 73780 73494 73210 72928 72648 72370 72094 71820 71548 71277 71009 70742 70477
760 70477 70214 69953 69694 69436 69180 68926 68673 68422 68173 67926 67680 67436 67193 66952 66712 66474 66238 66003 65770 65538 65308 65079 64852
759 64852 64626 64402 64179 63957 63737 63518 63301 63085 62870 62657 62445 62234 62025 61817 61610 61405 61201 60998 60796 60596 60397 60199 60002
757 60002 59806 59612 59419 59226 59036 58846 58657 58470 58283 58098 57914 57731 57549 57368 57188 57009 56832 56655 56479 56305 56131 55958 55787
755 55787 55616 55446 55278 55110 54943 54778 54613 54449 54286 54124 53963 53803 53643 53485 53327 53171 53015 52860 52706 52553 52400 52249 52098
753 52098 51949 51800 51651 51504 51358 51212 51067 50923 50779 50637 50495 50354 50214 50074 49935 49797 49660 49523 49388 49253 49118 48984 48852
752 48852 48719 48588 48457 48327 48197 48068 47940 47813 47686 47560 47434 47310 47185 47062 46939 46817 46695 46574 46454 46334 46215 46096 45978
750 45978 45861 45744 45628 45513 45398 45283 45169 45056 44943 44831 44720 44609 44498 44389 44279 44170 44062 43954 43847 43741 43635 43529 43424
748 43424 43319 43215 43112 43009 42906 42804 42703 42602 42501 42401 42302 42203 42104 42006 41908 41811 41714 41618 41522 41427 41332 41238 41144 41050 40957 40865 40773 40681 40590
746 40590 40499 40408 40318 40229 40139 40051 39962 39874 39787 39700 39613 39527 39441 39356 39271 39186 39102 39018 38934 38851 38768 38686 38604 38522 38441 38360 38280 38200 38120 38041 37962 37883 37805 37727
743 37727 37649 37572 37495 37418 37342 37266 37191 37116 37041 36966 36892 36818 36745 36672 36599 36526 36454 36382 36311 36240 36169 36098 36028 35958 35888 35819 35750 35681 35613 35545 35477 35409 35342 35275
741 35275 35209 35142 35076 35011 34945 34880 34815 34750 34686 34622 34558 34495 34432 34369 34306 34244 34182 34120 34058 33997 33936 33875 33815 33754 33694 33635 33575 33516 33457 33398 33340 33282 33224 33166
738 33166 33108 33051 32994 32937 32881 32825 32769 32713 32657 32602 32547 32492 32438 32383 32329 32275 32222 32168 32115 32062 32009 31957 31904 31852 31800 31749 31697 31646 31595 31544 31494 31443 31393 31343
736 31343 31294 31244 31195 31146 31097 31048 31000 30951 30903 30855 30808 30760 30713 30666 30619 30572 30526 30480 30434 30388 30342 30296 30251 30206 30161 30116 30072 30027 29983 29939 29895 29851 29808 29765
733 29765 29722 29679 29636 29593 29551 29509 29467 29425 29383 29341 29300 29259 29218 29177 29136 29096 29055 29015 28975 28935 28896 28856 28817 28778 28739 28700 28661 28623 28584 28546 28508 28470 28432 28395
730 28395 28357 28320 28283 28246 28209 28172 28136 28100 28063 28027 27991 27956 27920 27885 27849 27814 27779 27744 27710 27675 27641 27606 27572 27538 27504 27470 27437 27403 27370 27337 27304 27271 27238 27206
728 27206 27173 27141 27109 27077 27045 27013 26981 26950 26918 26887 26856 26825 26794 26763 26732 26702 26672 26641 26611 26581 26551 26522 26492 26463 26433 26404 26375 26346 26317 26288 26260 26231 26203 26175
725 26175 26146 26118 26090 26063 26035 26008 25980 25953 25926 25899 25872 25845 25818 25791 25765 25738 25712 25686 25660 25634 25608 25583 25557 25531 25506 25481 25456 25431 25406 25381 25356 25332 25307 25283
723 25283 25258 25234 25210 25186 25162 25139 25115 25091 25068 25045 25021 24998 24975 24952 24929 24907 24884 24862 24839 24817 24795 24772 24750 24729 24707 24685 24663 24642 24620 24599 24578 24557 24536 24515
720 24515 24494 24473 24453 24432 24412 24391 24371 24351 24331 24311 24291 24271 24251 24232 24212 24193 24173 24154 24135 24116 24097 24078 24059 24040 24022 24003 23985 23966 23948 23930 23912 23894 23876 23858
717 23858 23840 23823 23805 23788 23770 23753 23736 23719 23702 23685 23668 23651 23634 23618 23601 23585 23568 23552 23536 23520 23504 23488 23472 23456 23440 23425 23409 23394 23378 23363 23348 23333 23318 23303
715 23303 23288 23273 23258 23244 23229 23214 23200 23186 23171 23157 23143 23129 23115 23101 23087 23074 23060 23046 23033 23020 23006 22993 22980 22967 22954 22941 22928 22915 22902 22889 22877 22864 22852 22840
712 22840 22827 22815 22803 22791 22779 22767 22755 22743 22732 22720 22708 22697 22685 22674 22663 22652 22641 22629 22618 22608 22597 22586 22575 22565 22554 22544 22533 22523 22512 22502 22492 22482 22472 22462
710 22462 22452 22442 22433 22423 22413 22404 22395 22385 22376 22367 22357 22348 22339 22330 22321 22313 22304 22295 22286 22278 22269 22261 22253 22244 22236 22228 22220 22212 22204 22196 22188 22180 22172 22165 22157 22150 22142 22135 22128 22120 22113 22106 22099 22092 22085 22078 22071 22065 22058 22051 22045 22038 22032 22026 22019 22013 22007 22001 21995 21989 21983 21977
705 21977 21971 21966 21960 21954 21949 21943 21938 21933 21927 21922 21917 21912 21907 21902 21897 21892 21887 21883 21878 21873 21869 21864 21860 21856 21851 21847 21843 21839 21835 21831 21827 21823 21819 21816 21812 21808 21805 21801 21798 21794 21791 21788 21785 21782 21779 21776 21773 21770 21767 21764 21761 21759 21756 21754 21751 21749 21747 21744 21742 21740 21738 21736 21734 21732 21730 21728 21726 21725
700 21725 21723 21722 21720 21719 21717 21716 21715 21714 21712 21711 21710 21709 21708 21708 21707 21706 21705 21705 21704 21704 21703 21703 21703 21703 21702 21702 21702 21702 21702 21702 21702 21703 21703 21703 21704 21704 21705 21705 21706 21707 21707 21708 21709 21710 21711 21712 21713 21714 21716 21717 21718 21720 21721 21723 21724 21726 21728 21730 21731 21733 21735 21737 21739 21741 21744 21746 21748 21751
694 21751 21753 21756 21758 21761 21763 21766 21769 21772 21775 21778 21781 21784 21787 21790 21793 21797 21800 21804 21807 21811 21814 21818 21822 21826 21829 21833 21837 21841 21845 21850 21854 21858 21863 21867 21871 21876 21881 21885 21890 21895 21900 21904 21909 21914 21920 21925 21930 21935 21941 21946 21951 21957 21963 21968 21974 21980 21985 21991 21997 22003 22009 22016 22022 22028 22034 22041 22047 22054
689 22054 22060 22067 22074 22080 22087 22094 22101 22108 22115 22122 22130 22137 22144 22152 22159 22167 22174 22182 22189 22197 22205 22213 22221 22229 22237 22245 22254 22262 22270 22279 22287 22296 22304 22313 22322 22331 22340 22348 22357 22367 22376 22385 22394 22404 22413 22423 22432 22442 22451 22461 22471 22481 22491 22501 22511 22521 22531
685 22531 22542 22552 22562 22573 22583 22594 22605 22616 22626 22637 22648 22659 22670 22682 22693 22704 22716 22727 22739 22750 22762 22774 22786 22797 22809 22821 22834 22846 22858 22870 22883 22895 22908 22920
682 22920 22933 22946 22959 22971 22984 22998 23011 23024 23037 23050 23064 23077 23091 23105 23118 23132 23146 23160 23174 23188 23202 23216 23231 23245 23260 23274 23289 23304 23318 23333 23348 23363 23378 23393
680 23393 23409 23424 23439 23455 23470 23486 23502 23518 23534 23550 23566 23582 23598 23614 23631 23647 23664 23680 23697 23714 23731 23747 23765 23782 23799 23816 23833 23851 23868 23886 23904 23922 23939 23957
677 23957 23975 23994 24012 24030 24048 24067 24086 24104 24123 24142 24161 24180 24199 24218 24237 24257 24276 24296 24315 24335 24355 24375 24395 24415 24435 24455 24476 24496 24517 24537 24558 24579 24600 24621
675 24621 24642 24663 24684 24706 24727 24749 24770 24792 24814 24836 24858 24880 24903 24925 24948 24970 24993 25016 25038 25061 25084 25108 25131 25154 25178 25201 25225 25249 25273 25297 25321 25345 25369 25394
672 25394 25418 25443 25468 25493 25518 25543 25568 25593 25618 25644 25670 25695 25721 25747 25773 25799 25826 25852 25878 25905 25932 25959 25986 26013 26040 26067 26095 26122 26150 26178 26205 26233 26262 26290
669 26290 26318 26347 26375 26404 26433 26462 26491 26520 26550 26579 26609 26638 26668 26698 26728 26758 26789 26819 26850 26881 26911 26942 26974 27005 27036 27068 27099 27131 27163 27195 27227 27260 27292 27325
667 27325 27358 27390 27423 27457 27490 27523 27557 27591 27624 27658 27693 27727 27761 27796 27831 27865 27900 27936 27971 28006 28042 28078 28114 28150 28186 28222 28259 28295 28332 28369 28406 28444 28481 28519
664 28519 28557 28594 28633 28671 28709 28748 28786 28825 28864 28904 28943 28983 29022 29062 29102 29143 29183 29223 29264 29305 29346 29388 29429 29471 29512 29554 29597 29639 29681 29724 29767 29810 29853 29897
662 29897 29940 29984 30028 30072 30117 30161 30206 30251 30296 30341 30387 30433 30478 30525 30571 30617 30664 30711 30758 30805 30853 30901 30949 30997 31045 31094 31142 31191 31241 31290 31340 31390 31440 31490
659 31490 31540 31591 31642 31693 31745 31796 31848 31900 31952 32005 32058 32111 32164 32217 32271 32325 32379 32434 32488 32543 32598 32654 32709 32765 32821 32878 32934 32991 33049 33106 33164 33222 33280 33338
656 33338 33397 33456 33515 33575 33634 33694 33755 33815 33876 33937 33999 34061 34123 34185 34247 34310 34373 34437 34501 34565 34629 34693 34758 34824 34889 34955 35021 35087 35154 35221 35289 35356 35424 35493
654 35493 35561 35630 35700 35769 35839 35909 35980 36051 36122 36194 36266 36338 36411 36484 36557 36631 36705 36779 36854 36929 37004 37080 37157 37233 37310 37387 37465 37543 37622 37701 37780 37859 37939 38020
651 38020 38101 38182 38263 38345 38428 38511 38594 38678 38762 38846 38931 39016 39102 39188 39275 39362 39450 39537 39626 39715 39804 39894 39984 40075 40166 40257 40350 40442 40535 40629 40723 40817 40912 41008
649 41008 41104 41200 41297 41394 41492 41591 41690 41790 41890 41990 42091 42193 42295 42398 42501 42605 42710 42815 42920 43026 43133 43240 43348 43457 43566
647 43566 43675 43786 43896 44008 44120 44233 44346 44460 44575 44690 44806 44922 45039 45157 45276 45395 45514 45635 45756 45878 46001 46124 46248
645 46248 46372 46498 46624 46751 46878 47007 47136 47266 47396 47527 47659 47792 47926 48060 48196 48332 48469 48606 48745 48884 49024 49165 49307
643 49307 49450 49593 49738 49883 50029 50176 50324 50473 50623 50774 50925 51078 51231 51386 51541 51698 51855 52014 52173 52334 52495 52657 52821
641 52821 52985 53151 53318 53485 53654 53824 53995 54167 54341 54515 54690 54867 55045 55224 55404 55586 55768 55952 56137 56323 56511 56700 56890
640 56890 57081 57274 57468 57663 57860 58058 58258 58458 58660 58864 59069 59276 59484 59693 59904 60116 60330 60545 60762 60981 61201 61423 61646
638 61646 61871 62097 62325 62555 62787 63020 63255 63492 63730 63971 64213 64457 64702 64950 65200 65451 65704 65960 66217 66476 66737 67001 67266
636 67266 67533 67803 68074 68348 68624 68902 69183 69465 69750 70037 70327 70619 70913 71210 71509 71810 72115 72421 72730 73042 73356 73674 73993
634 73993 74316 74641 74969 75300 75633 75970 76309 76652 76997 77346 77697 78052 78410 78771 79135 79503 79874 80248 80626 81007 81391 81780 82171
633 82171 82567 82966 83369 83776 84186 84601 85019 85442 85868 86299 86734 87173 87616 88064 88517 88973 89435 89901 90371 90847 91327 91812 92302
631 92302 92798 93298 93804 94314 94831 95353 95880 96413 96951 97496 98046 98603 99165 99734 100309 100891 101478 102073 102674 103282 103898 104520 105149
629 105149 105786 106430 107082 107741 108408 109084 109767 110459 111159 111867 112585 113311 114046 114791 115544 116308 117081 117864 118657 119461 120275 121100 121936
627 121936 122782 123641 124511 125392 126286 127192 128111 129042 129987 130945 131917 132903 133902 134917 135946 136991 138051 139127 140220 141329
626 141329 142455 143599 144760 145940 147138 148355 149592 150849 152127 153426 154746 156089 157454 158842 160255 161691 163153
625 163153 164641 166156 167697 169267 170865 172493 174151 175841 177562 179317 181106 182930 184790 186687 188622 190597 192613
623 192613 194670 196771 198917 201109 203349 205637 207977 210370 212817 215320 217882 220504 223189 225939 228756 231643 234603
622 234603 237638 240751 243945 247224 250591 254049 257603 261256 265013 268878 272856 276952 281171 285519 290002 294626 299398
621 299398 304326 309417 314679 320121 325753 331584 337625 343888 350384 357128 364134 371416 378991 386878 395095 403663 412605
619 412605 421945 431711 441931 452636 463862 475646 488029 501057 514780 529254 544538 560700 577816 595967
618 595967 615247 635758 657617 680953 705913 732661 761386 792300 825646 861702 900787 943271 989580 1040212
617 1040212 1095748 1156873 1224395 1299275 1382663 1475944 1580796 1699273 1833901 1987825 2164990 2370399
616 2370399 2610475 2893557 3230629 3636376 4130749 4741343 5507074 6483944 7754230 9441110 11731176
615 11731176 14905032 19360876 25557633 33674293 42841525 50809910 55240157 54944091 49999095 41755474
615 41755474 32636436 24759268 18818691 14565989 11539807 9356473 7748883 6539915 5612568 4888533
614 4888533 4314390 3852935 3477733 3169641 2914558 2701925 2523730 2373807 2247362 2140628 2050615 1974940
613 1974940 1911681 1859291 1816512 1782328 1755911 1736598 1723855 1717266 1716509 1721352 1731637 1747278 1768257 1794618
612 1794618 1826470 1863984 1907399 1957024 2013245 2076532 2147448 2226665 2314976 2413318 2522796 2644713 2780608
611 2780608 2932303 3101967 3292188 3506069 3747356 4020596 4331345 4686448 5094398 5565839 6114230
610 6114230 6756778 7515727 8420202 9508849 10833703 12465949 14504602 17089837 20423656 24802041
609 24802041 30664357 38665651 49769020 65322388 86994563 115991104 148513032 167258375 155392707
609 155392707 124141255 93531833 70112315 53223332 41176713 32528558 26225451 21545165 18002680
608 18002680 15271975 13131386 11427754 10053386 8931205 8005103 7233584 6585498 6037143 5570256
607 5570256 5170601 4826972 4530454 4273904 4051548 3858691 3691493 3546796 3421999 3314949 3223866 3147280
606 3147280 3083982 3032982 2993486 2964864 2946637 2938462 2940121 2951514 2972657 3003682 3044834 3096485 3159132 3233417
605 3233417 3320139 3420271 3534993 3665715 3814127 3982241 4172460 4387657 4631278 4907468 5221243 5578704
604 5578704 5987322 6456307 6997111 7624096 8355450 9214459 10231280 11445478 12909694 14695042 16899189
603 16899189 19658661 23167811 27708320 33694548 41739794 52737042 67892700 88472636 114704058
603 114704058 143670229 168659077 182432157 180794022 164252183 137812195 108959491 83783711 64394231
602 64394231 50200565 39897442 32337376 26690713 22391289 19056567 16425825 14318533 12607400
601 12607400 11201031 10032649 9052662 8223690 7517161 6910963 6387784 5933929 5538456 5192552 4889062
601 4889062 4622132 4386947 4179524 3996554 3835276 3693383 3568943 3460342 3366232 3285493 3217206 3160624
600 3160624 3115157 3080357 3055908 3041614 3037402 3043320 3059533 3086335 3124154 3173567 3235311 3310312 3399705 3504875
599 3504875 3627501 3769611 3933655 4122597 4340040 4590367 4878957 5212439 5599047 6049092 6575609
598 6575609 7195236 7929457 8806357 9863145 11149859 12734878 14713264 17219598 20447881 24682327
597 24682327 30343352 38048246 48658274 63182933 82182249 104302671 125110631 138789019 141194779
596 141194779 131576602 112884950 90584961 70023828 53736752 41698151 32957784 26568366 21819619
596 21819619 18221804 15443857 13260895 11517950 10106325 8948369 7987620 7182337 6501178 5920276
595 5920276 5421220 4989636 4614178 4285801 3997230 3742563 3516972 3316488 3137820 2978227 2835416
594 2835416 2707459 2592729 2489851 2397660 2315171 2241550 2176092 2118209 2067413 2023306 1985574 1953977 1928348
593 1928348 1908591 1894680 1886657 1884643 1888834 1899518 1917077 1942008 1974937 2016644 2068094 2130478 2205262 2294253
592 2294253 2399695 2524376 2671795 2846371 3053741 3301165 3598114 3957101 4394903 4934383 5607258
591 5607258 6458387 7552531 8985143 10899582 13513598 17154975 22287062 29433019 38754985 49153263
590 49153263 57989442 62696398 62083058 56290941 46834065 36469276 27575687 20895032 16120379 12722821
590 12722821 10268539 8457261 7090482 6037321 5210287 4549738 4014156 3574043 3208032 2900371 2639256
589 2639256 2415710 2222814 2055165 1908501 1779420 1665183 1563567 1472748 1391222 1317740 1251255 1190886
588 1190886 1135890 1085631 1039567 997231 958220 922186 888825 857870 829089 802277 777252 753855 731944 711391
587 711391 692082 673918 656806 640665 625421 611007 597363 584434 572169 560524 549457 538930 528909 519361
586 519361 510257 501571 493277 485354 477779 470533 463598 456958 450596 444499 438653 433045 427663 422498 417537 412774 408197
584 408197 403799 399572 395509 391602 387846 384235 380762 377422 374210 371122 368153 365298 362555 359918 357384 354951 352615
583 352615 350372 348220 346157 344180 342286 340474 338740 337084 335503 333995 332559 331194 329896 328667 327503 326403 325368
582 325368 324395 323483 322632 321840 321107 320432 319815 319255 318750 318302 317908 317570 317286 317057 316881 316759 316691 316677 316717 316810 316957 317158 317413 317722
580 317722 318087 318506 318981 319512 320100 320745 321448 322210 323031 323913 324856 325861 326930 328064 329265 330532 331869 333277 334757 336312
578 336312 337943 339652 341443 343316 345275 347323 349462 351696 354027 356460 358999 361647 364408 367288 370292 373424 376690
577 376690 380098 383652 387361 391232 395273 399493 403902 408510 413328 418368 423644 429169 434960 441032 447405 454099 461136
576 461136 468540 476337 484557 493232 502398 512094 522365 533259 544831 557142 570260 584262 599237 615281 632507
575 632507 651043 671034 692648 716079 741550 769323 799701 833043 869773 910392 955504 1005831 1062253 1125841
574 1125841 1197918 1280126 1374524 1483726 1611078 1760926 1938982 2152868 2412917 2733374 3134255 3644249
573 3644249 4305351 5180343 6364882 8006451 10330771 13663341 18377087 24525489 30778520 33662879
572 33662879 30803647 24575836 18452842 13764788 10458294 8160539 6546132 5389474 4543205 3911806
571 3911806 3432646 3063896 2777051 2552301 2375633 2236978 2129013 2046370 1985102 1942321 1915953 1904573
570 1904573 1907286 1923665 1953708 1997832 2056891 2132222 2225727 2339996 2478478 2645743 2847845 3092846 3391585
569 3391585 3758819 4214929 4788549 5520651 6471027 7728646 9428171 11775368 15081615 19791486 26420944
568 26420944 35101195 44064642 48262481 44131965 35236638 26626132 20068920 15434761 12208781 9947653
568 9947653 8341478 7186259 6349491 5744879 5315993 5026149 4852261 4781234 4808033 4935000 5172269
567 5172269 5539381 6068497 6809997 7841863 9285076 11327914 14259903 18499524 24526633 32409326
566 32409326 40431693 44114040 40393197 32331463 24407632 18336654 14049376 11064745 8962894 7452662
565 7452662 6343801 5512921 4879052 4388047 4002937 3697957 3454800 3260227 3104510 2980404 2882450
564 2882450 2806496 2749363 2708610 2682366 2669204 2668057 2678150 2698951 2730145 2771602 2823370 2885662 2958858 3043509
563 3043509 3140349 3250309 3374546 3514473 3671801 3848599 4047363 4271113 4523510 4809020 5133121 5502581
562 5502581 5925844 6413529 6979158 7640142 8419220 9346520 10462634 11823223 13506101 15622248 18333112
562 18333112 21877674 26613198 33069530 41994273 54281483 70354589 87758358 98429360 96518006
561 96518006 88468814 83504049 85610324 96285661 116754470 146668059 178330334 192182689 174752028
560 174752028 139149306 104505932 77957740 59110110 45890463 36500310 29688415 24633269 20799412
560 20799412 17833689 15498746 13631676 12118300 10876993 9848310 8988222 8263611 7649215 7125519
559 7125519 6677281 6292469 5961507 5676709 5431876 5221975 5042914 4891357 4764592 4660422 4577088 4513204
558 4513204 4467711 4439841 4429095 4435226 4458231 4498353 4556087 4632198 4727744 4844116 4983084 5146862 5338195
557 5338195 5560471 5817865 6115534 6459870 6858842 7322456 7863381 8497822 9246736 10137566 11206758
556 11206758 12503456 14095047 16075635 18579207 21800427 26027814 31696439 39468698 50343660 65745311
555 65745311 87337761 115620354 145087459 159476218 146987114 119059896 92174675 72107231 58493443
555 58493443 49767119 44624009 42236705 42196439 44448110 49280320 57382560 69962703 88847413 116190325
554 116190325 152439792 189866449 207000204 188812416 150295734 112881310 84253264 63907365
553 63907365 49617412 39458713 32086364 26613732 22461394 19246727 16712491 14682179 13032164
553 13032164 11674139 10543848 9593733 8788038 8099493 7507028 6994161 6547864 6157731 5815378 5513991
552 5513991 5247992 5012786 4804562 4620144 4456874 4312522 4185207 4073345 3975601 3890849 3818148 3756712
551 3756712 3705896 3665174 3634136 3612470 3599963 3596490 3602013 3616582 3640336 3673504 3716409 3769479 3833253 3908395
550 3908395 3995710 4096159 4210891 4341267 4488901 4655704 4843946 5056328 5296076 5567059 5873941 6222382
549 6222382 6619291 7073170 7594565 8196675 8896193 9714452 10679051 11826166 13203893 14877194 16935308
548 16935308 19503112 22758820 26962032 32498667 39952750 50217267 64645527 85172785 114039613
547 114039613 151772255 190665919 209093781 191896126 154279340 117921149 90586395 71824434
547 71824434 59495068 51801943 47590830 46262408 47676036 52124504 60380214 73745724 93801314
546 93801314 120782337 148649659 161153956 147024847 117463690 88654621 66560549 50846737 39799648
545 39799648 31932153 26207821 21945235 18699866 16178413 14183704 12580387 11273580 10195428 9296489
545 9296489 8540124 7898743 7351286 6881464 6476535 6126434 5823134 5560194 5332405 5135546 4966177
544 4966177 4821506 4699264 4597626 4515139 4450680 4403408 4372746 4358355 4360128 4378186 4412881 4464804 4534809
543 4534809 4624032 4733938 4866358 5023567 5208355 5424141 5675112 5966406 6304350 6696774 7153436 7686587
542 7686587 8311753 9048809 9923481 10969504 12231732 13770733 15669676 18044896 21062337 24963634
541 24963634 30107909 37038576 46586416 60009492 79099972 105895167 140700970 176038814 192242191
540 192242191 176967576 144968427 115553214 95695299 85499267 83755928 88978868 97040961 98561019
540 98561019 87442634 69922362 53936690 41759423 32916938 26515079 21814405 18292041 15595404
539 15595404 13488460 11811582 10454931 9341409 8415816 7637866 6977629 6412508 5925184 5502206 5133001
538 5133001 4809165 4523957 4271925 4048623 3850408 3674282 3517767 3378817 3255742 3147158 3051942 2969197
537 2969197 2898237 2838565 2789866 2752006 2725037 2709209 2704992 2713105 2734566 2770752 2823487 2895162 2988905 3108809
536 3108809 3260267 3450439 3688942 3988865 4368299 4852683 5478472 6298965 7393674 8883353 10953350
535 10953350 13885724 18085207 24018513 31778669 39734419 43428785 39763984 31838515 24110117 18210832
535 18210832 14048506 11157407 9133933 7697347 6663888 5914721 5372699 4987473 4726313 4568553
534 4568553 4502290 4522576 4630660 4834114 5147864 5596346 6217271 7067890 8235206 9852434 12124426
533 12124426 15362318 20011257 26587826 35219887 44130134 48266353 44068524 35095995 26400291 19757985
532 19757985 15040416 11730106 9380879 7680405 6422406 5471949 4739920 4166449 3710516 3343463
531 3343463 3044892 2800040 2598061 2430892 2292479 2178252 2084759 2009414 1950316 1906128 1875997 1859507
530 1859507 1856661 1867888 1894082 1936673 1997735 2080159 2187895 2326320 2502763 2727308 3013993 3382663 3861884
530 3861884 4493584 5340557 6498594 8115481 10417399 13730115 18424800 24545445 30738843 33523153
529 33523153 30579551 24325777 18207717 13525460 10216595 7908578 6278016 5100961 4231134 3573651
528 3573651 3066226 2667184 2348046 2088939 1875713 1698107 1548546 1421353 1312209 1217787 1135489 1063266
527 1063266 999485 942833 892240 846835 805895 768823 735118 704359 676189 650304 626446 604391 583947 564946
526 564946 547244 530713 515241 500731 487095 474258 462150 450710 439885 429624 419886 410629 401818 393422 385410
525 385410 377756 370436 363427 356710 350266 344078 338130 332409 326900 321592 316472 311532 306761 302150 297690 293374 289195
524 289195 285146 281221 277413 273717 270128 266641 263251 259955 256747 253625 250585 247623 244736 241921 239176 236497 233882
522 233882 231329 228835 226398 224016 221687 219409 217180 215000 212865 210775 208727 206722 204757 202831 200942 199090 197274
521 197274 195492 193743 192027 190342 188688 187063 185468 183900 182359 180845 179357 177893 176455 175039 173647 172278 170931
520 170931 169605 168299 167015 165750 164504 163278 162069 160879 159707 158552 157413 156291 155185 154095 153020 151960 150915
518 150915 149884 148868 147865 146875 145899 144936 143985 143047 142121 141207 140305 139414 138534 137665 136807 135960 135123 134296 133479 132672 131875 131087
517 131087 130309 129540 128779 128028 127285 126550 125824 125106 124396 123694 123000 122314 121635 120964 120299 119642 118992 118349 117713 117084 116461 115845 115235
515 115235 114631 114034 113442 112857 112278 111704 111137 110574 110018 109467 108921 108381 107846 107316 106792 106272 105757 105248 104743 104242 103747 103256 102770
513 102770 102288 101811 101338 100869 100404 99944 99488 99036 98588 98145 97705 97268 96836 96408 95983 95562 95145 94731 94321 93914 93511 93111 92714
511 92714 92321 91931 91545 91162 90781 90404 90031 89660 89292 88927 88565 88206 87850 87497 87147 86799 86454 86112 85773 85436 85102 84771 84442
510 84442 84116 83792 83471 83152 82835 82521 82210 81901 81594 81289 80987 80687 80389 80093 79800 79509 79220 78933 78648 78365 78085 77806 77529
508 77529 77255 76982 76711 76442 76176 75911 75648 75386 75127 74869 74614 74360 74108 73857 73608 73361 73116 72873 72631 72390 72152 71915 71679
506 71679 71446 71213 70983 70754 70526 70300 70076 69853 69631 69411 69192 68975 68759 68545 68332 68120 67910 67701 67494 67288 67083 66879 66677
504 66677 66476 66277 66078 65881 65685 65491 65297 65105 64914 64724 64536 64349 64162 63977 63793 63610 63429 63248 63069 62891 62713 62537 62362
503 62362 62188 62015 61843 61672 61502 61334 61166 60999 60833 60668 60504 60342 60180 60019 59859 59700 59542 59384 59228 59073 58918 58765 58612
501 58612 58460 58310 58160 58010 57862 57715 57568 57422 57278 57134 56990 56848 56706 56565 56425 56286 56148 56010 55873 55737 55602 55467 55333
499 55333 55200 55068 54936 54805 54675 54546 54417 54289 54162 54035 53909 53784 53660 53536 53412 53290 53168 53047 52926 52807 52687 52569 52451
497 52451 52334 52217 52101 51986 51871 51757 51643 51530 51418 51306 51195 51084 50974 50865 50756 50648 50540 50433 50326 50220 50115 50010 49906
496 49906 49802 49699 49596 49494 49392 49291 49191 49091 48991 48892 48793 48695 48598 48501 48404 48308 48213 48118 48023 47929 47836 47743 47650 47558 47466 47375 47284 47194 47104 47015
493 47015 46926 46837 46749 46662 46575 46488 46402 46316 46230 46146 46061 45977 45893 45810 45727 45645 45563 45481 45400 45319 45238 45158 45079 45000 44921 44842 44764 44687 44609 44533 44456 44380 44304 44229
491 44229 44154 44079 44005 43931 43857 43784 43711 43639 43567 43495 43424 43353 43282 43211 43141 43072 43002 42933 42865 42796 42728 42661 42593 42526 42460 42393 42327 42262 42196 42131 42066 42002 41938 41874
488 41874 41810 41747 41684 41622 41559 41497 41436 41374 41313 41252 41192 41132 41072 41012 40953 40894 40835 40777 40718 40660 40603 40545 40488 40431 40375 40319 40263 40207 40152 40096 40041 39987 39932 39878
486 39878 39824 39771 39717 39664 39611 39559 39507 39454 39403 39351 39300 39249 39198 39147 39097 39047 38997 38947 38898 38849 38800 38751 38703 38655 38607 38559 38512 38464 38417 38371 38324 38278 38232 38186
483 38186 38140 38094 38049 38004 37959 37915 37871 37826 37783 37739 37695 37652 37609 37566 37524 37481 37439 37397 37355 37313 37272 37231 37190 37149 37109 37068 37028 36988 36948 36909 36869 36830 36791 36752
480 36752 36714 36675 36637 36599 36561 36523 36486 36449 36412 36375 36338 36301 36265 36229 36193 36157 36122 36086 36051 36016 35981 35946 35912 35877 35843 35809 35775 35742 35708 35675 35642 35609 35576 35543
478 35543 35511 35479 35446 35415 35383 35351 35320 35288 35257 35226 35196 35165 35134 35104 35074 35044 35014 34985 34955 34926 34897 34868 34839 34810 34781 34753 34725 34697 34669 34641 34613 34586 34558 34531
475 34531 34504 34477 34451 34424 34398 34371 34345 34319 34293 34268 34242 34217 34192 34167 34142 34117 34092 34068 34043 34019 33995 33971 33947 33923 33900 33876 33853 33830 33807 33784 33761 33739 33716 33694
473 33694 33672 33650 33628 33606 33585 33563 33542 33521 33499 33478 33458 33437 33416 33396 33376 33355 33335 33315 33296 33276 33256 33237 33218 33199 33180 33161 33142 33123 33105 33086 33068 33050 33032 33014
470 33014 32996 32979 32961 32944 32926 32909 32892 32875 32859 32842 32825 32809 32793 32776 32760 32744 32729 32713 32697 32682 32666 32651 32636 32621 32606 32591 32577 32562 32548 32533 32519 32505 32491 32477
467 32477 32463 32450 32436 32423 32410 32396 32383 32370 32358 32345 32332 32320 32307 32295 32283 32271 32259 32247 32235 32224 32212 32201 32190 32178 32167 32156 32145 32135 32124 32114 32103 32093 32083 32073
465 32073 32063 32053 32043 32033 32024 32014 32005 31996 31986 31977 31968 31960 31951 31942 31934 31925 31917 31909 31901 31893 31885 31877 31869 31862 31854 31847 31840 31832 31825 31818 31812 31805 31798 31792 31785 31779 31772 31766 31760 31754 31748 31743 31737 31731 31726 31721 31715 31710 31705 31700 31695 31691 31686 31681 31677 31673 31668 31664 31660 31656 31652 31648
460 31648 31645 31641 31638 31634 31631 31628 31625 31622 31619 31616 31613 31611 31608 31606 31604 31601 31599 31597 31595 31594 31592 31590 31589 31587 31586 31585 31583 31582 31581 31581 31580 31579 31579 31578 31578 31577 31577 31577 31577 31577 31577 31578 31578 31579 31579 31580 31581 31581 31582 31583 31585 31586 31587 31589 31590 31592 31593 31595 31597 31599 31601 31603 31606 31608 31611 31613 31616 31619
455 31619 31621 31624 31627 31631 31634 31637 31640 31644 31648 31651 31655 31659 31663 31667 31671 31675 31680 31684 31689 31693 31698 31703 31708 31713 31718 31723 31729 31734 31740 31745 31751 31757 31763 31768 31775 31781 31787 31793 31800 31806 31813 31820 31826 31833 31840 31848 31855 31862 31869 31877 31885 31892 31900 31908 31916 31924 31932 31940 31949 31957 31966 31974 31983 31992 32001 32010 32019 32028
450 32028 32038 32047 32057 32066 32076 32086 32096 32106 32116 32126 32136 32146 32157 32168 32178 32189 32200 32211 32222 32233 32244 32256 32267 32279 32290 32302 32314 32326 32338 32350 32363 32375 32387 32400 32413
447 32413 32425 32438 32451 32464 32477 32491 32504 32517 32531 32545 32558 32572 32586 32600 32614 32629 32643 32658 32672 32687 32702 32716 32731 32747 32762 32777 32792 32808 32823 32839 32855 32871 32887 32903
444 32903 32919 32936 32952 32969 32985 33002 33019 33036 33053 33070 33087 33105 33122 33140 33158 33175 33193 33211 33229 33248 33266 33285 33303 33322 33341 33359 33378 33398 33417 33436 33456 33475 33495 33515
442 33515 33534 33554 33575 33595 33615 33636 33656 33677 33698 33719 33740 33761 33782 33803 33825 33846 33868 33890 33912 33934 33956 33978 34001 34023 34046 34068 34091 34114 34137 34160 34184 34207 34231 34254
439 34254 34278 34302 34326 34350 34375 34399 34424 34448 34473 34498 34523 34548 34573 34599 34624 34650 34675 34701 34727 34753 34780 34806 34832 34859 34886 34913 34940 34967 34994 35021 35049 35077 35104 35132
437 35132 35160 35188 35217 35245 35274 35302 35331 35360 35389 35418 35448 35477 35507 35536 35566 35596 35626 35657 35687 35718 35748 35779 35810 35841 35872 35904 35935 35967 35999 36031 36063 36095 36127 36160
434 36160 36193 36225 36258 36291 36324 36358 36391 36425 36459 36493 36527 36561 36595 36630 36665 36699 36734 36770 36805 36840 36876 36912 36947 36983 37020 37056 37092 37129 37166 37203 37240 37277 37315 37352
431 37352 37390 37428 37466 37504 37543 37581 37620 37659 37698 37737 37776 37816 37855 37895 37935 37976 38016 38056 38097 38138 38179 38220 38261 38303 38345 38387 38429 38471 38513 38556 38599 38641 38685 38728
429 38728 38771 38815 38859 38903 38947 38991 39036 39080 39125 39170 39216 39261 39307 39353 39399 39445 39491 39538 39585 39631 39679 39726 39774 39821 39869 39917 39966 40014 40063 40112 40161 40210 40260 40309
426 40309 40359 40409 40460 40510 40561 40612 40663 40714 40766 40817 40869 40922 40974 41027 41079 41132 41186 41239 41293 41347 41401 41455 41510 41564 41619 41674 41730 41786 41841 41898 41954 42010 42067 42124
424 42124 42182 42239 42297 42355 42413 42471 42530 42589 42648 42707 42767 42827 42887 42947 43008 43069 43130 43191 43253 43315 43377 43439 43502 43564 43628 43691 43755 43818 43883 43947 44012 44077 44142 44207
421 44207 44273 44339 44405 44472 44539 44606 44673 44741 44809 44877 44945 45014 45083 45153 45222 45292 45362 45433 45503 45575 45646 45718 45789 45862 45934 46007 46080 46154 46227 46302 46376 46451 46526 46601
418 46601 46676 46752 46829 46905 46982 47059 47137 47215 47293 47371 47450 47529 47609 47689 47769 47849 47930 48011 48093 48175 48257 48340 48423 48506 48589 48673 48758 48842 48927 49013 49099 49185 49271 49358
416 49358 49445 49533 49621 49709 49798 49887 49977 50067 50157 50248 50339 50430 50522 50614 50707 50800 50893 50987 51082 51176 51271 51367 51463 51559 51656 51753 51851 51949 52047 52146 52245 52345 52445
413 52445 52546 52647 52749 52851 52953 53056 53159 53263 53367 53472 53577 53683 53789 53896 54003 54111 54219 54327 54436 54546 54656 54766 54877
412 54877 54989 55101 55213 55327 55440 55554 55669 55784 55900 56016 56132 56250 56367 56486 56605 56724 56844 56965 57086 57207 57330 57452 57576
410 57576 57700 57824 57949 58075 58201 58328 58455 58583 58712 58841 58971 59102 59233 59365 59497 59630 59764 59898 60033 60168 60304 60441 60579
408 60579 60717 60856 60995 61135 61276 61418 61560 61703 61846 61991 62136 62281 62428 62575 62723 62871 63021 63171 63322 63473 63626 63779 63932
406 63932 64087 64242 64399 64555 64713 64872 65031 65191 65352 65514 65676 65840 66004 66169 66335 66501 66669 66837 67007 67177 67348 67520 67693
405 67693 67866 68041 68217 68393 68570 68749 68928 69108 69289 69471 69654 69838 70023 70209 70396 70584 70773 70963 71154 71346 71538 71733 71928
403 71928 72124 72321 72519 72718 72919 73120 73323 73527 73731 73937 74144 74353 74562 74773 74984 75197 75411 75626 75843 76061 76279 76500 76721
401 76721 76944 77167 77393 77619 77847 78076 78306 78538 78770 79005 79240 79477 79716 79955 80197 80439 80683 80929 81175 81424 81673 81925 82177
399 82177 82431 82687 82944 83203 83463 83725 83989 84254 84520 84788 85058 85330 85603 85878 86154 86432 86712 86994 87277 87562 87849 88138 88428
398 88428 88720 89014 89310 89608 89908 90209 90513 90818 91125 91435 91746 92059 92374 92692 93011 93332 93656 93981 94309 94639 94971 95305 95641
396 95641 95980 96321 96664 97009 97357 97707 98059 98414 98771 99131 99492 99857 100224 100593 100965 101340 101717 102096 102478 102863 103251 103641 104034
394 104034 104430 104829 105230 105634 106041 106451 106864 107280 107699 108121 108546 108974 109405 109839 110276 110717 111161 111608 112058 112512 112969 113429 113893
392 113893 114360 114831 115306 115784 116265 116751 117240 117732 118229 118729 119233 119742 120254 120770 121290 121814 122342 122875 123411 123952 124497 125047 125601
390 125601 126159 126722 127290 127862 128439 129020 129606 130197 130793 131394 132000 132611 133227 133848 134475 135107 135744 136386 137034 137688 138347 139012 139683
389 139683 140359 141042 141730 142425 143125 143832 144545 145264 145990 146723 147462 148207 148960 149719 150485 151258 152039 152826 153621 154424 155234 156051 156876
387 156876 157709 158550 159399 160256 161121 161995 162877 163768 164668 165576 166493 167419 168355 169300 170254 171218 172192 173175 174169 175172 176186 177211
385 177211 178246 179292 180349 181417 182496 183586 184689 185803 186929 188067 189217 190380 191556 192744 193946 195161 196389
384 196389 197631 198887 200158 201442 202742 204056 205385 206730 208090 209466 210859 212267 213693 215135 216595 218072 219567
383 219567 221080 222612 224162 225731 227320 228929 230558 232207 233877 235569 237282 239017 240774 242555 244358 246186 248037
381 248037 249913 251814 253741 255693 257672 259678 261712 263774 265864 267984 270133 272313 274524 276766 279041 281348 283689
380 283689 286065 288475 290921 293404 295924 298482 301079 303716 306393 309112 311873 314677 317526 320420 323361 326348 329385
379 329385 332470 335607 338795 342037 345333 348684 352093 355560 359087 362675 366326 370041 373823 377671 381590 385579 389641
378 389641 393778 397992 402285 406658 411115 415657 420286 425005 429817 434724 439728 444833 450042 455356 460780 466316 471968
376 471968 477739 483633 489653 495803 502088 508511 515077 521790 528654 535675 542858 550208 557730 565430 573314 581388 589659
375 589659 598133 606817 615719 624847 634208 643810 653663 663776 674159 684820 695772 707024 718589 730479 742707
374 742707 755285 768228 781552 795270 809401 823961 838968 854442 870403 886871 903871 921426 939560 958301
373 958301 977677 997718 1018456 1039924 1062159 1085198 1109081 1133853 1159558 1186247 1213970 1242784 1272748 1303926
372 1303926 1336386 1370202 1405452 1442220 1480597 1520680 1562575 1606395 1652262 1700309 1750680 1803529 1859025 1917353
371 1917353 1978710 2043316 2111408 2183246 2259114 2339326 2424224 2514187 2609632 2711020 2818865 2933731 3056252
370 3056252 3187132 3327159 3477217 3638296 3811518 3998147 4199617 4417562 4653844 4910599 5190284
369 5190284 5495735 5830241 6197635 6602406 7049831 7546159 8098825 8716730 9410609 10193494 11081335
368 11081335 12093809 13255420 14596979 16157638 17987727 20152757 22739175 25862734 29680914 34411595
367 34411595 40361574 47970409 57877816 71024493 88790728 113139802 146595108 191515138 247677877
366 247677877 308373850 360355786 392466771 401701347 388301792 352110345 297495504 236776849 182432101
366 182432101 139743540 108178571 85231345 68459171 56013344 46606024 39361189 33682395 29158759
365 29158759 25502628 22509083 20029574 17954621 16202267 14710287 13430806 12326551 11368188 10532411
364 10532411 9800543 9157509 8591071 8091251 7649897 7260353 6917212 6616128 6353687 6127314 5935227
363 5935227 5776428 5650741 5558900 5502708 5485289 5511475 5588386 5726303 5939987 6250627 6688671 7297650
363 7297650 8138611 9294106 10873793 13018469 15700003 18087592 19236549 19888783 21177301 22934115
362 22934115 24052259 23552232 21729351 19816883 18752828 18604691 18555212 17500221 15168500 12344399
361 12344399 9864370 8014138 6699877 5759297 5068784 4547550 4144003 3824700 3567394 3356872 3182452
360 3182452 3036456 2913241 2808584 2719272 2642820 2577284 2521128 2473122 2432278 2397794 2369016 2345411 2326543
359 2326543 2312056 2301660 2295124 2292262 2292935 2297036 2304497 2315278 2329368 2346787 2367580 2391821 2419611 2451082 2486397
358 2486397 2525753 2569384 2617566 2670621 2728924 2792913 2863094 2940056 3024488 3117191 3219108 3331346 3455219
357 3455219 3592290 3744437 3913928 4103531 4316660 4557570 4831645 5145798 5509071 5933555 6435836
356 6435836 7039379 7778619 8706286 9906910 11521225 13781353 16999906 21245149 25680075 29202850
355 29202850 31607579 33540747 36502495 41458593 47429388 51929393 53749393 54670682 56745003 60052046
355 60052046 63134864 64036087 61454583 55647734 48088774 40383978 33578031 28046341 23733557 20424127
354 20424127 17891493 15948262 14452139 13298473 12411026 11734261 11227600 10861308 10613618 10468717 10415340
353 10415340 10445800 10555328 10741638 11004661 11346439 11771122 12285101 12897269 13619422 14466849 15459156
352 15459156 16621418 17985758 19593558 21498578 23771370 26505674 29827786 33910503 38994216 45419197
351 45419197 53675413 64479121 78886944 98450314 125365672 162407786 212010467 273418708 338483575
351 338483575 392516492 424563620 433082230 418913702 381000881 323005972 257953613 199534839 153687608
350 153687608 119937714 95589624 77987055 65116127 55577242 48423797 43017372 38924698 35849585
349 35849585 33589084 32005434 31008261 30543434 30586417 31138757 32226856 33902289 36242806 39352395
349 39352395 43357158 48390884 54560573 61881539 70184065 79028925 87707126 95368564 101210297 104613883
348 104613883 105227335 103035033 98397620 92062901 85185419 79105158 73929325 67761328 60300981 51538491
347 51538491 42365332 35004638 29662447 25692616 22611913 20138983 18106202 16406410 14966511 13734117
346 13734117 12670284 11745281 10935942 10223924 9594513 9035777 8537948 8092965 7694128 7335836 7013377
346 7013377 6722770 6460640 6224112 6010736 5818417 5645364 5490048 5351165 5227609 5118451 5022913 4940364
345 4940364 4870300 4812338 4766211 4731762 4708945 4697823 4698575 4711495 4737008 4775675 4828211 4895499 4978622 5078882
344 5078882 5197843 5337374 5499709 5687510 5903963 6152888 6438876 6767479 7145432 7580965 8084185
343 8084185 8667600 9346795 10141352 11076065 12182601 13501735 15086386 17005675 19350208 22238562
342 22238562 25824024 30298283 35882895 42788147 51106184 60618539 70580912 79660745 86230430 89131509
341 89131509 88549312 86131691 84240721 85091451 89909119 97157794 100323660 92758053 77331907 61664906
340 61664906 49413736 40904056 35650947 33223218 32816080 31729334 27433348 22022817 17694327 14614219
340 14614219 12413057 10783873 9532462 8540323 7733485 7063968 6499391 6017080 5600648 5237919 4919633
339 4919633 4638608 4389177 4166806 3967819 3789209 3628490 3483592 3352781 3234600 3127812 3031374 2944399
338 2944399 2866135 2795947 2733301 2677752 2628938 2586568 2550418 2520330 2496207 2478015 2465780 2459595 2459618 2466084 2479309
337 2479309 2499701 2527777 2564174 2609678 2665251 2732068 2811563 2905498 3016044 3145888 3298389 3477780 3689444
336 3689444 3940321 4239463 4598862 5034668 5569025 6232918 7070621 8146800 9557813 11449253 14040266
335 14040266 17644416 22630017 29116294 36042394 40445075 40382548 38298169 37749447 40553420 47419997
334 47419997 58153610 69817004 75245363 69584603 57656162 46575117 39192088 35573787 34803790
333 34803790 34612495 31866081 26466540 20933132 16537363 13263228 10843898 9040357 7673512 6617508
333 6617508 5785874 5119176 4576073 4127317 3751839 3434176 3162785 2928909 2725805 2548212 2391971
332 2391971 2253762 2130906 2021219 1922909 1834494 1754737 1682604 1617222 1557852 1503867 1454730 1409985 1369239
331 1369239 1332156 1298450 1267875 1240224 1215321 1193023 1173209 1155788 1140691 1127870 1117302 1108987 1102947 1099228
330 1099228 1097906 1099081 1102889 1109504 1119138 1132057 1148585 1169116 1194132 1224219 1260094 1302637 1352935 1412340 1482544
329 1482544 1565685 1664493 1782492 1924288 2095984 2305795 2564957 2889132 3300578 3831595 4530049 5468233
328 5468233 6756666 8563276 11129607 14737691 19461809 24406747 27091832 25790480 22316716 19356365
327 19356365 18004912 18148705 18673558 17746135 14953938 11713301 9033693 7049285 5615598 4574333
326 4574333 3805118 3224911 2777980 2426878 2146105 1917976 1729982 1573101 1440708 1327853 1230781 1146602
325 1146602 1073060 1008378 951137 900193 854616 813644 776647 743100 712563 684664 659090 635572 613879 593814
324 593814 575204 557901 541775 526710 512608 499380 486947 475241 464199 453766 443892 434534 425652 417209 409174
323 409174 401516 394209 387228 380552 374160 368034 362156 356512 351087 345867 340842 335998 331327 326819 322464 318254 314182
322 314182 310241 306424 302724 299137 295656 292276 288994 285803 282701 279683 276746 273886 271099 268383 265735 263153 260632
320 260632 258172 255769 253422 251129 248886 246694 244549 242450 240396 238385 236415 234485 232594 230741 228924 227142 225394
319 225394 223679 221996 220343 218722 217129 215564 214027 212517 211033 209574 208140 206729 205342 203978 202635 201314 200014
318 200014 198735 197475 196235 195013 193810 192625 191458 190308 189174 188057 186956 185871 184801 183746 182706 181680 180667
317 180667 179669 178684 177712 176754 175807 174873 173952 173042 172143 171256 170381 169516 168662 167818 166985 166162 165349 164546 163752 162968 162193 161428 160671
315 160671 159923 159183 158453 157730 157016 156309 155611 154921 154238 153562 152894 152234 151580 150934 150295 149662 149037 148418 147805 147199 146599 146006 145418
313 145418 144837 144262 143693 143129 142571 142019 141473 140931 140396 139865 139340 138820 138306 137796 137291 136791 136296 135806 135320 134840 134363 133892 133425
311 133425 132962 132503 132049 131599 131154 130712 130275 129842 129412 128987 128565 128148 127734 127324 126918 126515 126116 125721 125329 124941 124556 124174 123796
310 123796 123422 123050 122682 122317 121956 121597 121242 120890 120541 120195 119852 119512 119174 118840 118509 118180 117855 117532 117212 116894 116580 116268 115958
308 115958 115651 115347 115046 114747 114450 114156 113865 113576 113289 113005 112723 112443 112166 111891 111619 111349 111081 110815 110551 110290 110030 109773 109518
306 109518 109266 109015 108766 108519 108275 108032 107792 107553 107316 107082 106849 106618 106389 106162 105937 105713 105492 105272 105054 104838 104623 104411 104200
304 104200 103991 103783 103578 103374 103171 102971 102772 102574 102378 102184 101992 101801 101611 101423 101237 101052 100869 100687 100507 100328 100151 99975 99801
303 99801 99628 99456 99286 99118 98951 98785 98620 98457 98296 98135 97976 97819 97662 97507 97354 97201 97050 96900 96752 96604 96458 96314 96170
301 96170 96028 95887 95747 95608 95471 95334 95199 95065 94932 94801 94670 94541 94413 94286 94160 94035 93912 93789 93668 93547 93428 93310 93193
299 93193 93076 92961 92847 92735 92623 92512 92402 92293 92185 92079 91973 91868 91764 91661 91560 91459 91359 91260 91162 91065 90969 90874 90780 90687 90594 90503
297 90503 90413 90323 90234 90147 90060 89974 89889 89805 89722 89639 89558 89477 89397 89318 89240 89163 89087 89011 88937 88863 88790 88718 88647 88576 88506 88438 88369 88302 88236 88170 88105 88041 87978 87915
294 87915 87854 87793 87733 87673 87615 87557 87500 87444 87388 87333 87279 87226 87173 87122 87070 87020 86971 86922 86873 86826 86779 86733 86688 86644 86600 86557 86514 86473 86432 86391 86352 86313 86274 86237
292 86237 86200 86164 86128 86094 86060 86026 85993 85961 85930 85899 85869 85839 85811 85783 85755 85728 85702 85677 85652 85628 85604 85581 85559 85537 85516 85496 85476 85457 85439 85421 85404 85387 85371 85356
289 85356 85341 85327 85314 85301 85289 85277 85266 85256 85246 85237 85229 85221 85213 85207 85201 85195 85190 85186 85182 85179 85177 85175 85173 85173 85173 85173 85174 85176 85178 85181 85184 85188 85193 85198 85204 85210 85217 85225 85233 85241 85251 85260 85271 85282 85293 85305 85318 85331 85345 85360
285 85360 85375 85390 85406 85423 85440 85458 85476 85495 85515 85535 85556 85577 85599 85621 85644 85667 85691 85716 85741 85767 85793 85820 85847 85875 85904 85933 85963 85993 86024 86055 86087 86119 86152 86186
283 86186 86220 86255 86290 86326 86362 86399 86436 86474 86513 86552 86592 86632 86673 86714 86756 86799 86842 86886 86930 86974 87020 87066 87112 87159 87206 87255 87303 87352 87402 87453 87503 87555 87607 87659
280 87659 87713 87766 87821 87875 87931 87987 88043 88100 88158 88216 88275 88334 88394 88455 88516 88577 88640 88702 88766 88830 88894 88959 89025 89091 89158 89225 89293 89362 89431 89500 89571 89641 89713 89785
278 89785 89857 89930 90004 90078 90153 90229 90305 90382 90459 90537 90615 90694 90774 90854 90935 91016 91098 91181 91264 91347 91432 91517 91602 91689 91775 91863 91951 92039 92129 92218 92309 92400 92492 92584
275 92584 92677 92770 92864 92959 93054 93150 93247 93344 93442 93541 93640 93740 93840 93941 94043 94145 94248 94351 94456 94561 94666 94772 94879 94986 95095 95203 95313
273 95313 95423 95534 95645 95757 95870 95983 96097 96212 96327 96443 96560 96677 96795 96914 97034 97154 97274 97396 97518 97641 97765 97889 98014
271 98014 98139 98266 98393 98521 98649 98778 98908 99039 99170 99302 99435 99568 99702 99837 99973 100109 100246 100384 100523 100662 100802 100943 101085
269 101085 101227 101370 101514 101659 101804 101950 102097 102245 102393 102542 102692 102843 102994 103147 103300 103454 103608 103764 103920 104077 104235 104394 104553
268 104553 104714 104875 105037 105199 105363 105527 105693 105859 106026 106193 106362 106531 106702 106873 107045 107218 107392 107566 107742 107918 108095 108273 108452
266 108452 108632 108813 108995 109177 109361 109545 109730 109917 110104 110292 110481 110670 110861 111053 111246 111439 111634 111829 112026 112223 112422 112621 112821
264 112821 113023 113225 113428 113633 113838 114044 114251 114460 114669 114879 115090 115303 115516 115731 115946 116162 116380 116598 116818 117039 117260 117483 117707
262 117707 117932 118158 118385 118614 118843 119073 119305 119538 119771 120006 120242 120479 120718 120957 121198 121440 121682 121927 122172 122418 122666 122915 123165
261 123165 123416 123668 123922 124177 124433 124690 124949 125209 125470 125732 125996 126260 126527 126794 127063 127333 127604 127876 128150 128426 128702 128980 129259
259 129259 129540 129822 130105 130390 130676 130963 131252 131542 131834 132127 132421 132717 133014 133313 133613 133915 134218 134523 134829 135136 135445 135756 136068
257 136068 136381 136697 137013 137331 137651 137972 138295 138620 138946 139274 139603 139934 140266 140600 140936 141273 141612 141953 142296 142640 142985 143333 143682
255 143682 144033 144386 144740 145096 145454 145814 146176 146539 146904 147271 147640 148010 148383 148757 149133 149511 149891 150273 150657 151042 151430 151819 152211
254 152211 152604 153000 153397 153797 154198 154602 155007 155415 155825 156237 156650 157066 157484 157905 158327 158751 159178 159607 160038 160471 160907 161345 161785
252 161785 162227 162671 163118 163567 164019 164472 164929 165387 165848 166311 166777 167245 167716 168189 168664 169142 169623 170106 170591 171079 171570 172063 172559
250 172559 173058 173559 174062 174569 175078 175590 176104 176622 177142 177665 178190 178719 179250 179784 180321 180861 181404 181950 182499 183050 183605 184163 184724
248 184724 185287 185854 186424 186997 187574 188153 188736 189321 189910 190503 191098 191697 192299 192905 193513 194126 194741 195360 195983 196609 197239 197872 198508
247 198508 199148 199792 200440 201091 201746 202404 203066 203732 204402 205076 205753 206435 207120 207809 208503 209200 209901 210606 211316 212029 212747 213469 214195
245 214195 214925 215660 216398 217142 217889 218641 219397 220158 220924 221694 222468 223247 224031 224819 225612 226410 227213 228020 228833 229650 230472 231299 232132
243 232132 232969 233811 234659 235511 236369 237233 238101 238975 239854 240739 241629 242524 243426 244332 245245 246163 247087 248017 248952 249894 250841 251794 252754
241 252754 253719 254691 255669 256653 257643 258640 259643 260653 261669 262692 263721 264757 265800 266849 267905 268969 270039 271116 272200
240 272200 273292 274391 275497 276610 277731 278859 279995 281138 282289 283448 284614 285789 286971 288161 289360 290566 291781
239 291781 293004 294236 295476 296724 297982 299247 300522 301805 303098 304399 305710 307030 308359 309697 311045 312402 313769
237 313769 315146 316532 317928 319335 320751 322178 323615 325062 326520 327988 329467 330957 332458 333969 335492 337026 338571
236 338571 340128 341696 343276 344868 346472 348088 349715 351355 353008 354673 356350 358041 359744 361460 363190 364932 366689
235 366689 368458 370242 372039 373850 375676 377515 379369 381238 383121 385020 386933 388862 390806 392765 394740 396731 398739
233 398739 400762 402802 404858 406931 409021 411128 413253 415395 417555 419732 421928 424142 426374 428626 430896 433185 435494
232 435494 437822 440170 442538 444926 447335 449764 452215 454687 457180 459695 462231 464790 467372 469976 472604 475254 477928
231 477928 480627 483349 486095 488867 491663 494485 497332 500206 503106 506032 508985 511966 514974 518010 521075 524168 527290
230 527290 530442 533623 536835 540077 543350 546654 549990 553359 556760 560194 563661 567162 570698 574269 577874 581516 585193
228 585193 588908 592660 596449 600276 604143 608048 611994 615980 620006 624075 628185 632338 636535 640775 645060 649390 653765
227 653765 658188 662657 667174 671740 676355 681020 685735 690502 695322 700194 705120 710101 715137 720229 725378 730586 735852
226 735852 741178 746565 752013 757524 763099 768738 774443 780215 786054 791962 797940 803989 810110 816305 822574 828919 835341
224 835341 841842 848422 855083 861827 868654 875566 882565 889652 896829 904097 911458 918913 926464 934113 941861 949711 957664
223 957664 965722 973886 982159 990543 999040 1007652 1016380 1025228 1034197 1043290 1052509 1061856 1071335 1080946 1090694 1100580 1110608
222 1110608 1120780 1131098 1141567 1152189 1162966 1173903 1185002 1196266 1207700 1219306 1231088 1243051 1255196 1267529
221 1267529 1280054 1292774 1305694 1318819 1332151 1345697 1359460 1373447 1387660 1402107 1416791 1431719 1446896 1462327
220 1462327 1478019 1493978 1510209 1526720 1543517 1560607 1577996 1595693 1613704 1632038 1650703 1669705 1689055 1708761
219 1708761 1728832 1749277 1770106 1791329 1812957 1834999 1857467 1880373 1903728 1927544 1951834 1976612 2001889 2027682
217 2027682 2054004 2080870 2108296 2136298 2164893 2194098 2223932 2254412 2285560 2317394 2349936 2383208 2417232 2452033
216 2452033 2487634 2524062 2561343 2599505 2638577 2678588 2719572 2761559 2804585 2848685 2893897 2940259 2987812 3036600
215 3036600 3086666 3138057 3190823 3245014 3300683 3357888 3416686 3477141 3539317 3603282 3669108 3736870 3806648 3878527
214 3878527 3952592 4028938 4107663 4188869 4272666 4359170 4448501 4540789 4636171 4734791 4836803 4942369 5051662
213 5051662 5164865 5282175 5403798 5529956 5660884 5796835 5938077 6084898 6237605 6396526 6562016
212 6562016 6734452 6914240 7101820 7297660 7502269 7716193 7940025 8174404 8420023 8677631 8948048
212 8948048 9232157 9530927 9845411 10176761 10526236 10895217 11285220 11697914 12135135 12598912 13091491
211 13091491 13615360 14173286 14768349 15403984 16084044 16812843 17595240 18436714 19343468 20322538 21381947
210 21381947 22530853 23779765 25140784 26627893 28257328 30048024 32022165 34205874 36630082 39331628
209 39331628 42354638 45752333 49589340 53944732 58916036 64624588 71222766 78903850 87915700 98579928
208 98579928 111319162 126696445 145472902 168693550 197816178 234906482 282931232 346182535 430818564
208 430818564 545269113 699425500 899622802 1135720479 1366763483 1526391815 1554310306 1438610213
207 1438610213 1226037090 985460370 769484075 598624600 470747992 376331638 306173228 253289457
206 253289457 212759822 181181769 156195241 136143859 119847477 106451724 95328392 86008604 78137532
206 78137532 71443172 65714520 60786111 56526890 52832114 49617391 46814215 44366618 42228621 40362269
205 40362269 38736132 37324096 36104468 35059218 34173428 33434816 32833391 32361151 32011885 31780994 31665367
204 31665367 31663311 31774498 31999950 32342084 32804739 33393303 34114829 34978228 35994521 37177132 38542287
203 38542287 40109526 41902301 43948807 46282964 48945737 51986770 55466582 59459372 64056760 69372790
203 69372790 75550673 82772042 91269741 101345898 113397780 127955377 145737246 167734813 195342512
202 195342512 230562167 276329112 337035231 419351831 533415124 694030061 919763184 1222943655
201 1222943655 1581424042 1914587280 2122794179 2147483647 1982230918 1672131113 1310245418 988590006
201 988590006 743509339 568028206 443601933 354200002 288593826 239358572 201616233 172121316
200 172121316 148672046 129742745 114253991 101427021 90689722 81614780 73878205 67230911 61479022
199 61479022 56469855 52081922 48217602 44797766 41757737 39044264 36613173 34427605 32456605 30674039
199 30674039 29057737 27588780 26250980 25030419 23915087 22894592 21959920 21103228 20317692 19597355
198 19597355 18937029 18332192 17778906 17273761 16813820 16396567 16019880 15681997 15381499 15117295 14888613
197 14888613 14694992 14536300 14412732 14324832 14273524 14260142 14286480 14354858 14468194 14630112 14845061 15118488
196 15118488 15457038 15868822 16363761 16954043 17654698 18484395 19466486 20630440 22013813 23665005 25647178
195 25647178 28043917 30967576 34571835 39070986 44770228 52114343 61767123 74741731 92607759
195 92607759 117772963 153624409 203448642 265693131 327193689 366599684 373920552 364954256 363372601
194 363372601 372504981 365814689 320786659 254132914 192568286 145750091 112338821 88655246 71611012
193 71611012 59071182 49630959 42368842 36671895 32124214 28437469 25407525 22886984 20767437 18967822
192 18967822 17426587 16096341 14940134 13928823 13039174 12252489 11553586 10930034 10371584 9869722 9417338
192 9417338 9008454 8638023 8301761 7996017 7717671 7464044 7232836 7022066 6830025 6655242 6496453
191 6496453 6352573 6222676 6105981 6001833 5909697 5829146 5759856 5701603 5654260 5617791 5592262 5577836 5574781
190 5574781 5583479 5604433 5638280 5685813 5747992 5825977 5921157 6035190 6170050 6328090 6512118 6725494 6972250
189 6972250 7257244 7586368 7966794 8407325 8918836 9514868 10212432 11033109 12004553 13162606 14554295
188 14554295 16242122 18310325 20874075 24093163 28192317 33490981 40444559 49692415 62079650 78532264
187 78532264 99492465 123634138 146545921 161347106 162731113 152133273 137059410 124974369 117185573
186 117185573 108497225 94471908 75821257 57630894 43856943 34386443 27832403 23129720 19628363
186 19628363 16938496 14818563 13112546 11715667 10555127 9578860 8748695 8036054 7419144 6881084
185 6881084 6408612 5991181 5620309 5289109 4991934 4724121 4481788 4261679 4061050 3877571 3709256
184 3709256 3554399 3411531 3279384 3156850 3042966 2936887 2837872 2745264 2658486 2577021 2500413 2428253
183 2428253 2360175 2295852 2234988 2177316 2122598 2070615 2021170 1974083 1929192 1886347 1845412 1806262 1768783 1732870
182 1732870 1698426 1665362 1633597 1603054 1573662 1545359 1518081 1491775 1466388 1441871 1418180 1395271 1373107 1351650
181 1351650 1330866 1310722 1291189 1272238 1253843 1235978 1218620 1201747 1185338 1169373 1153834 1138703 1123963 1109600
180 1109600 1095597 1081941 1068619 1055617 1042924 1030529 1018420 1006588 995021 983712 972651 961829 951239 940872
179 940872 930722 920781 911043 901501 892148 882980 873990 865173 856523 848036 839708 831532 823505 815623 807882 800277 792805
178 792805 785462 778245 771151 764176 757316 750570 743934 737405 730981 724659 718437 712311 706280 700342 694494 688734 683060
176 683060 677470 671962 666535 661186 655914 650716 645592 640540 635558 630645 625799 621019 616303 611651 607060 602530 598059
175 598059 593647 589291 584992 580747 576555 572417 568330 564294 560307 556370 552480 548637 544841 541089 537383 533720 530099
174 530099 526521 522985 519489 516033 512616 509238 505898 502595 499329 496099 492905 489745 486620 483529 480470 477445 474451
173 474451 471490 468559 465659 462790 459950 457139 454357 451604 448878 446180 443509 440865 438247 435655 433089 430548 428031
171 428031 425539 423072 420628 418207 415810 413435 411083 408753 406444 404158 401892 399648 397424 395220 393037 390874 388730
170 388730 386605 384500 382413 380345 378295 376264 374250 372254 370275 368314 366369 364442 362530 360636 358757 356894 355047
169 355047 353216 351400 349599 347813 346042 344286 342544 340817 339103 337404 335718 334046 332388 330742 329110 327491 325885
167 325885 324292 322711 321142 319586 318042 316511 314991 313482 311986 310501 309027 307564 306113 304673 303243 301824 300416
166 300416 299019 297632 296255 294889 293532 292186 290849 289522 288205 286898 285600 284311 283032 281762 280501 279249 278006
165 278006 276772 275546 274329 273121 271921 270730 269547 268372 267206 266047 264896 263754 262619 261492 260373 259261 258157
163 258157 257060 255971 254889 253814 252746 251686 250633 249586 248547 247514 246489 245470 244457 243452 242452 241460 240473 239494
162 239494 238520 237553 236592 235637 234688 233745 232808 231877 230953 230033 229120 228212 227310 226414 225523 224638 223758 222884 222015 221151 220293 219440 218592
160 218592 217750 216912 216080 215252 214430 213612 212800 211992 211189 210391 209598 208809 208025 207246 206471 205701 204935 204174 203417 202665 201917 201173 200434
159 200434 199699 198968 198241 197519 196800 196086 195376 194670 193968 193270 192575 191885 191199 190516 189837 189162 188491 187824 187160 186500 185843 185191 184541
157 184541 183896 183254 182615 181980 181348 180720 180095 179474 178856 178241 177630 177021 176417 175815 175216 174621 174029 173440 172854 172272 171692 171115 170542
155 170542 169971 169403 168839 168277 167718 167162 166609 166059 165512 164968 164426 163887 163351 162817 162287 161759 161233 160711 160191 159673 159159 158646 158137
153 158137 157630 157125 156623 156124 155627 155132 154640 154150 153663 153178 152696 152216 151738 151263 150790 150319 149850 149384 148920 148459 147999 147542 147087
152 147087 146634 146183 145735 145289 144844 144402 143962 143524 143088 142655 142223 141793 141366 140940 140516 140094 139675 139257 138841 138427 138015 137605 137197
150 137197 136791 136386 135984 135583 135184 134787 134392 133999 133607 133217 132829 132443 132058 131675 131294 130915 130537 130161 129787 129414 129043 128674 128306
148 128306 127940 127576 127213 126852 126492 126134 125778 125423 125070 124718 124368 124019 123672 123326 122982 122640 122298 121959 121620 121284 120948 120614 120282
146 120282 119951 119621 119293 118966 118641 118317 117994 117673 117353 117035 116717 116401 116087 115774 115462 115151 114842 114534 114227 113921 113617 113314 113013
145 113013 112712 112413 112115 111818 111523 111228 110935 110643 110353 110063 109775 109488 109202 108917 108633 108351 108069 107789 107510 107232 106955 106679 106404
143 106404 106131 105858 105587 105317 105047 104779 104512 104246 103981 103717 103454 103192 102931 102672 102413 102155 101898 101642 101388 101134 100881 100629 100378
141 100378 100128 99879 99632 99384 99138 98893 98649 98406 98164 97922 97682 97442 97204 96966 96729 96493 96258 96024 95791 95558 95327 95096 94867
139 94867 94638 94410 94182 93956 93731 93506 93282 93059 92837 92616 92395 92175 91956 91738 91521 91305 91089 90874 90660 90447 90234 90022 89811
137 89811 89601 89392 89183 88975 88768 88561 88356 88151 87946 87743 87540 87338 87137 86936 86736 86537 86339 86141 85944 85748 85552 85357 85163
136 85163 84969 84776 84584 84392 84202 84011 83822 83633 83445 83257 83070 82884 82698 82514 82329 82146 81962 81780 81598 81417 81237 81057 80877
134 80877 80699 80521 80343 80166 79990 79815 79640 79465 79291 79118 78945 78773 78602 78431 78261 78091 77922 77753 77585 77417 77250 77084 76918
132 76918 76753 76588 76424 76260 76097 75935 75773 75611 75450 75290 75130 74971 74812 74654 74496 74339 74182 74026 73870 73715 73560 73406 73252
130 73252 73099 72946 72794 72642 72491 72340 72190 72040 71891 71742 71594 71446 71299 71152 71006 70860 70714 70569 70424 70280 70137 69994 69851
129 69851 69708 69567 69425 69284 69144 69004 68864 68725 68586 68448 68310 68173 68036 67899 67763 67627 67492 67357 67222 67088 66955 66821 66689
127 66689 66556 66424 66293 66161 66031 65900 65770 65641 65511 65383 65254 65126 64999 64871 64745 64618 64492 64366 64241 64116 63991 63867 63743
125 63743 63620 63497 63374 63252 63130 63008 62887 62766 62646 62526 62406 62286 62167 62049 61930 61812 61694 61577 61460 61344 61227 61111 60996
123 60996 60880 60765 60651 60537 60423 60309 60196 60083 59970 59858 59746 59634 59523 59412 59302 59191 59081 58972 58862 58753 58644 58536 58428
122 58428 58320 58212 58105 57998 57892 57785 57680 57574 57468 57363 57259 57154 57050 56946 56842 56739 56636 56533 56431 56329 56227 56125 56024
120 56024 55923 55822 55722 55622 55522 55422 55323 55224 55125 55027 54929 54831 54733 54635 54538 54441 54345 54249 54152 54057 53961 53866 53771 53676 53582 53487 53393 53300 53206 53113 53020
118 53020 52927 52835 52743 52651 52559 52468 52376 52285 52195 52104 52014 51924 51834 51745 51655 51566 51478 51389 51301 51213 51125 51037 50950 50863 50776 50689 50603 50517 50431 50345 50259 50174 50089 50004
115 50004 49919 49835 49751 49667 49583 49499 49416 49333 49250 49168 49085 49003 48921 48839 48757 48676 48595 48514 48433 48353 48272 48192 48112 48033 47953 47874 47795 47716 47637 47559 47480 47402 47324 47247
112 47247 47169 47092 47015 46938 46861 46785 46708 46632 46556 46481 46405 46330 46255 46180 46105 46030 45956 45882 45808 45734 45660 45587 45513 45440 45367 45295 45222 45150 45077 45005 44934 44862 44790 44719
110 44719 44648 44577 44506 44436 44365 44295 44225 44155 44085 44016 43946 43877 43808 43739 43670 43602 43533 43465 43397 43329 43262 43194 43127 43059 42992 42925 42859 42792 42726 42659 42593 42527 42462 42396
107 42396 42331 42265 42200 42135 42070 42006 41941 41877 41813 41748 41685 41621 41557 41494 41430 41367 41304 41241 41179 41116 41054 40991 40929 40867 40806 40744 40682 40621 40560 40499 40438 40377 40316 40256
105 40256 40195 40135 40075 40015 39955 39895 39836 39776 39717 39658 39599 39540 39481 39423 39364 39306 39248 39190 39132 39074 39017 38959 38902 38844 38787 38730 38673 38617 38560 38504 38447 38391 38335 38279
102 38279 38223 38167 38112 38056 38001 37946 37891 37836 37781 37726 37672 37617 37563 37509 37455 37401 37347 37293 37240 37186 37133 37079 37026 36973 36920 36868 36815 36762 36710 36658 36606 36553 36502 36450
99 36450 36398 36346 36295 36243 36192 36141 36090 36039 35988 35937 35887 35836 35786 35736 35686 35636 35586 35536 35486 35436 35387 35338 35288 35239 35190 35141 35092 35043 34995 34946 34898 34849 34801 34753 34705
97 34705 34657 34609 34562 34514 34466 34419 34372 34325 34277 34230 34184 34137 34090 34043 33997 33951 33904 33858 33812 33766 33720 33674 33628 33583 33537 33492 33447 33401 33356 33311 33266 33221 33177 33132 33087
94 33087 33043 32998 32954 32910 32866 32822 32778 32734 32690 32647 32603 32560 32516 32473 32430 32387 32344 32301 32258 32215 32172 32130 32087 32045 32003 31960 31918 31876 31834 31792 31751 31709 31667 31626 31584
91 31584 31543 31502 31460 31419 31378 31337 31296 31256 31215 31174 31134 31093 31053 31013 30972 30932 30892 30852 30812 30773 30733 30693 30654 30614 30575 30536 30496 30457 30418 30379 30340 30301 30262 30224 30185
89 30185 30147 30108 30070 30031 29993 29955 29917 29879 29841 29803 29765 29728 29690 29652 29615 29578 29540 29503 29466 29429 29392 29355 29318 29281 29244 29207 29171 29134 29098 29061 29025 28989 28953 28916 28880
86 28880 28844 28809 28773 28737 28701 28666 28630 28595 28559 28524 28489 28453 28418 28383 28348 28313 28278 28243 28209 28174 28139 28105 28070 28036 28002 27967 27933 27899 27865 27831 27797 27763 27729 27695 27662
83 27662 27628 27595 27561 27528 27494 27461 27428 27394 27361 27328 27295 27262 27229 27197 27164 27131 27099 27066 27033 27001 26969 26936 26904 26872 26840 26808 26776 26744 26712 26680 26648 26616 26585 26553 26522
81 26522 26490 26459 26427 26396 26365 26333 26302 26271 26240 26209 26178 26147 26117 26086 26055 26025 25994 25964 25933 25903 25872 25842 25812 25782 25751 25721 25691 25661 25631 25602 25572 25542 25512 25483 25453
78 25453 25424 25394 25365 25335 25306 25277 25248 25218 25189 25160 25131 25102 25073 25045 25016 24987 24958 24930 24901 24873 24844 24816 24787 24759 24731 24702 24674 24646 24618 24590 24562 24534 24506 24478 24451
75 24451 24423 24395 24367 24340 24312 24285 24257 24230 24203 24175 24148 24121 24094 24067 24040 24013 23986 23959 23932 23905 23878 23852 23825 23798 23772 23745 23719 23692 23666 23639 23613 23587 23561 23534 23508
73 23508 23482 23456 23430 23404 23378 23353 23327 23301 23275 23250 23224 23198 23173 23147 23122 23096 23071 23046 23020 22995 22970 22945 22920 22895 22870 22845 22820 22795 22770 22745 22720 22696 22671 22646 22622
70 22622 22597 22573 22548 22524 22499 22475 22451 22426 22402 22378 22354 22330 22306 22282 22258 22234 22210 22186 22162 22138 22115 22091 22067 22044 22020 21997 21973 21950 21926 21903 21879 21856 21833 21810 21786
67 21786 21763 21740 21717 21694 21671 21648 21625 21602 21579 21557 21534 21511 21488 21466 21443 21420 21398 21375 21353 21330 21308 21286 21263 21241 21219 21197 21174 21152 21130 21108 21086 21064 21042 21020 20998
65 20998 20976 20955 20933 20911 20889 20868 20846 20824 20803 20781 20760 20738 20717 20696 20674 20653 20632 20610 20589 20568 20547 20526 20504 20483 20462 20441 20420 20399 20379 20358 20337 20316 20295 20275 20254
62 20254 20233 20213 20192 20172 20151 20131 20110 20090 20069 20049 20029 20008 19988 19968 19948 19927 19907 19887 19867 19847 19827 19807 19787 19767 19747 19727 19708 19688 19668 19648 19629 19609 19589 19570 19550
59 19550 19531 19511 19492 19472 19453 19433 19414 19395 19375 19356 19337 19318 19298 19279 19260 19241 19222 19203 19184 19165 19146 19127 19108 19089 19071 19052 19033 19014 18995 18977 18958 18940 18921 18902 18884
57 18884 18865 18847 18828 18810 18792 18773 18755 18737 18718 18700 18682 18664 18645 18627 18609 18591 18573 18555 18537 18519 18501 18483 18465 18447 18429 18412 18394 18376 18358 18341 18323 18305 18288 18270 18252
54 18252 18235 18217 18200 18182 18165 18148 18130 18113 18095 18078 18061 18044 18026 18009 17992 17975 17958 17941 17923 17906 17889 17872 17855 17838 17821 17805 17788 17771 17754 17737 17720 17704 17687 17670 17654
51 17654 17637 17620 17604 17587 17570 17554 17537 17521 17504 17488 17472 17455 17439 17423 17406 17390 17374 17357 17341 17325 17309 17293 17277 17260 17244 17228 17212 17196 17180 17164 17148 17132 17117 17101 17085
49 17085 17069 17053 17037 17022 17006 16990 16975 16959 16943 16928 16912 16896 16881 16865 16850 16834 16819 16803 16788 16773 16757 16742 16727 16711 16696 16681 16665 16650 16635 16620 16605 16590 16574 16559 16544
46 16544 16529 16514 16499 16484 16469 16454 16439 16425 16410 16395 16380 16365 16350 16336 16321 16306 16291 16277 16262 16247 16233 16218 16204 16189 16174 16160 16145 16131 16117 16102 16088 16073 16059 16045 16030
43 16030 16016 16002 15987 15973 15959 15945 15930 15916 15902 15888 15874 15860 15846 15831 15817 15803 15789 15775 15761 15748 15734 15720 15706 15692 15678 15664 15650 15637 15623 15609 15595 15582 15568 15554 15541
41 15541 15527 15513 15500 15486 15473 15459 15446 15432 15419 15405 15392 15378 15365 15351 15338 15325 15311 15298 15285 15271 15258 15245 15232 15218 15205 15192 15179 15166 15153 15139 15126 15113 15100 15087 15074
38 15074 15061 15048 15035 15022 15009 14996 14983 14971 14958 14945 14932 14919 14906 14894 14881 14868 14855 14843 14830 14817 14805 14792 14779 14767 14754 14742 14729 14717 14704 14691 14679 14667 14654 14642 14629
35 14629 14617 14604 14592 14580 14567 14555 14543 14530 14518 14506 14494 14481 14469 14457 14445 14433 14420 14408 14396 14384 14372 14360 14348 14336 14324 14312 14300 14288 14276 14264 14252 14240 14228 14216 14205
33 14205 14193 14181 14169 14157 14145 14134 14122 14110 14098 14087 14075 14063 14052 14040 14028 14017 14005 13994 13982 13970 13959 13947 13936 13924 13913 13901 13890 13879 13867 13856 13844 13833 13822 13810 13799
30 13799 13788 13776 13765 13754 13742 13731 13720 13709 13698 13686 13675 13664 13653 13642 13631 13619 13608 13597 13586 13575 13564 13553 13542 13531 13520 13509 13498 13487 13476 13465 13455 13444 13433 13422 13411
27 13411 13400 13390 13379 13368 13357 13346 13336 13325 13314 13303 13293 13282 13271 13261 13250 13240 13229 13218 13208 13197 13187 13176 13166 13155 13145 13134 13124 13113 13103 13092 13082 13071 13061 13051 13040
25 13040 13030 13020 13009 12999 12989 12978 12968 12958 12947 12937 12927 12917 12907 12896 12886 12876 12866 12856 12846 12835 12825 12815 12805 12795 12785 12775 12765 12755 12745 12735 12725 12715 12705 12695 12685
22 12685 12675 12665 12655 12646 12636 12626 12616 12606 12596 12586 12577 12567 12557 12547 12538 12528 12518 12508 12499 12489 12479 12470 12460 12450 12441 12431 12421 12412 12402 12393 12383 12374 12364 12355 12345 12335 12326 12316 12307 12298 12288
19 12288 12279 12269 12260 12250 12241 12232 12222 12213 12204 12194 12185 12176 12166 12157 12148 12138 12129 12120 12111 12101 12092 12083 12074 12065 12056 12046 12037 12028 12019 12010 12001 11992 11983 11973 11964 11955 11946 11937 11928 11919 11910 11901 11892 11883 11874 11865 11856 11848 11839 11830 11821 11812 11803 11794 11785 11777 11768 11759 11750 11741
14 11741 11733 11724 11715 11706 11697 11689 11680 11671 11663 11654 11645 11637 11628 11619 11611 11602 11593 11585 11576 11567 11559 11550 11542 11533 11525 11516 11508 11499 11491 11482 11474 11465 11457 11448 11440 11431 11423 11414 11406 11398 11389 11381 11373 11364 11356 11347 11339 11331 11323 11314 11306 11298 11289 11281 11273 11265 11256 11248 11240 11232 11224 11215 11207 11199 11191 11183 11175 11166 11158
9 11158 11150 11142 11134 11126 11118 11110 11102 11094 11086 11078 11070 11062 11054 11046 11038 11030 11022 11014 11006 10998 10990 10982 10974 10966 10958 10950 10942 10935 10927 10919 10911 10903 10895 10888 10880 10872 10864 10856 10849 10841 10833 10825 10818 10810 10802 10794 10787 10779 10771 10764 10756 10748 10741 10733 10725 10718 10710 10703 10695 10687 10680 10672 10665 10657 10650 10642 10634 10627 10619 10612
4 10612 10604 10597 10589 10582 10575 10567 10560 10552 10545 10537 10530 10523 10515 10508 10500 10493 10486 10478 10471 10464 10456 10449 10442 10434 10427 10420 10412 10405 10398 10391 10383 10376 10369 10362 10354 10347 10340 10333 10326 10318 10311 10304 10297 10290 10283 10275 10268 10261 10254 10247 10240 10233 10226 10219 10212 10204 10197 10190 10183 10176 10169 10162 10155 10148 10141 10134 10127 10120 10113 10106
-2 10106 10100 10093 10086 10079 10072 10065 10058 10051 10044 10037 10030 10024 10017 10010 10003 9996 9989 9983 9976 9969 9962 9955 9949 9942 9935 9928 9922 9915 9908 9901 9895 9888 9881 9874 9868 9861 9854 9848 9841 9834 9828 9821 9814 9808 9801 9795 9788 9781 9775 9768 9762 9755 9748 9742 9735 9729 9722 9716 9709 9703 9696 9690 9683 9677 9670 9664 9657 9651 9644
-7 9644 9638 9631 9625 9618 9612 9606 9599 9593 9586 9580 9574 9567 9561 9554 9548 9542 9535 9529 9523 9516 9510 9504 9497 9491 9485 9479 9472 9466 9460 9454 9447 9441 9435 9429 9422 9416 9410 9404 9397 9391 9385 9379 9373 9367 9360 9354 9348 9342 9336 9330 9324 9317 9311 9305 9299 9293 9287 9281 9275 9269 9263 9257 9251 9244 9238 9232 9226 9220 9214 9208
-12 9208 9202 9196 9190 9184 9178 9172 9166 9160 9155 9149 9143 9137 9131 9125 9119 9113 9107 9101 9095 9089 9084 9078 9072 9066 9060 9054 9048 9043 9037 9031 9025 9019 9013 9008 9002 8996 8990 8985 8979 8973 8967 8961 8956 8950 8944 8938 8933 8927 8921 8916 8910 8904 8898 8893 8887 8881 8876 8870 8864 8859 8853 8848 8842 8836 8831 8825 8819 8814 8808
-18 8808 8803 8797 8791 8786 8780 8775 8769 8764 8758 8752 8747 8741 8736 8730 8725 8719 8714 8708 8703 8697 8692 8686 8681 8675 8670 8664 8659 8654 8648 8643 8637 8632 8626 8621 8616 8610 8605 8599 8594 8589 8583 8578 8572 8567 8562 8556 8551 8546 8540 8535 8530 8524 8519 8514 8508 8503 8498 8493 8487 8482 8477 8471 8466 8461 8456 8450 8445 8440 8435
-23 8435 8429 8424 8419 8414 8409 8403 8398 8393 8388 8383 8377 8372 8367 8362 8357 8352 8346 8341 8336 8331 8326 8321 8316 8311 8305 8300 8295 8290 8285 8280 8275 8270 8265 8260 8255 8250 8245 8239 8234 8229 8224 8219 8214 8209 8204 8199 8194 8189 8184 8179 8174 8169 8164 8159 8154 8149 8145 8140 8135 8130 8125 8120 8115 8110 8105 8100 8095 8090 8085
-28 8085 8081 8076 8071 8066 8061 8056 8051 8046 8042 8037 8032 8027 8022 8017 8012 8008 8003 7998 7993 7988 7984 7979 7974 7969 7964 7960 7955 7950 7945 7941 7936 7931 7926 7922 7917 7912 7907 7903 7898 7893 7889 7884 7879 7874 7870 7865 7860 7856 7851 7846 7842 7837 7832 7828 7823 7818 7814 7809 7804 7800 7795 7791 7786 7781 7777 7772 7768 7763 7758
-33 7758 7754 7749 7745 7740 7735 7731 7726 7722 7717 7713 7708 7704 7699 7695 7690 7685 7681 7676 7672 7667 7663 7658 7654 7649 7645 7640 7636 7632 7627 7623 7618 7614 7609 7605 7600 7596 7591 7587 7583 7578 7574 7569 7565 7560 7556 7552 7547 7543 7539 7534 7530 7525 7521 7517 7512 7508 7504 7499 7495 7490 7486 7482 7477 7473 7469 7465 7460 7456 7452
-39 7452 7447 7443 7439 7434 7430 7426 7422 7417 7413 7409 7404 7400 7396 7392 7387 7383 7379 7375 7370 7366 7362 7358 7354 7349 7345 7341 7337 7332 7328 7324 7320 7316 7312 7307 7303 7299 7295 7291 7287 7282 7278 7274 7270 7266 7262 7257 7253 7249 7245 7241 7237 7233 7229 7225 7220 7216 7212 7208 7204 7200 7196 7192 7188 7184 7180 7176 7172 7167 7163
-44 7163 7159 7155 7151 7147 7143 7139 7135 7131 7127 7123 7119 7115 7111 7107 7103 7099 7095 7091 7087 7083 7079 7075 7071 7067 7063 7059 7055 7051 7047 7044 7040 7036 7032 7028 7024 7020 7016 7012 7008 7004 7000 6996 6993 6989 6985 6981 6977 6973 6969 6965 6962 6958 6954 6950 6946 6942 6938 6934 6931 6927 6923 6919 6915 6911 6908 6904 6900 6896 6892
-49 6892 6889 6885 6881 6877 6873 6870 6866 6862 6858 6854 6851 6847 6843 6839 6836 6832 6828 6824 6821 6817 6813 6809 6806 6802 6798 6794 6791 6787 6783 6780 6776 6772 6768 6765 6761 6757 6754 6750 6746 6743 6739 6735 6732 6728 6724 6721 6717 6713 6710 6706 6702 6699 6695 6691 6688 6684 6680 6677 6673 6670 6666 6662 6659 6655 6651 6648 6644 6641 6637
-55 6637 6633 6630 6626 6623 6619 6616 6612 6608 6605 6601 6598 6594 6591 6587 6584 6580 6576 6573 6569 6566 6562 6559 6555 6552 6548 6545 6541 6538 6534 6531 6527 6524 6520 6517 6513 6510 6506 6503 6499 6496 6492 6489 6485 6482 6478 6475 6472 6468 6465 6461 6458 6454 6451 6447 6444 6441 6437 6434 6430 6427 6424 6420 6417 6413 6410 6406 6403 6400 6396
-60 6396 6393 6390 6386 6383 6379 6376 6373 6369 6366 6363 6359 6356 6352 6349 6346 6342 6339 6336 6332 6329 6326 6322 6319 6316 6312 6309 6306 6302 6299 6296 6293 6289 6286 6283 6279 6276 6273 6270 6266 6263 6260 6256 6253 6250 6247 6243 6240 6237 6234 6230 6227 6224 6221 6217 6214 6211 6208 6204 6201 6198 6195 6191 6188 6185 6182 6179 6175 6172 6169
-65 6169 6166 6163 6159 6156 6153 6150 6147 6143 6140 6137 6134 6131 6128 6124 6121 6118 6115 6112 6109 6105 6102 6099 6096 6093 6090 6087 6083 6080 6077 6074 6071 6068 6065 6062 6058 6055 6052 6049 6046 6043 6040 6037 6034 6031 6027 6024 6021 6018 6015 6012 6009 6006 6003 6000 5997 5994 5991 5988 5984 5981 5978 5975 5972 5969 5966 5963 5960 5957 5954
-70 5954 5951 5948 5945 5942 5939 5936 5933 5930 5927 5924 5921 5918 5915 5912 5909 5906 5903 5900 5897 5894 5891 5888 5885 5882 5879 5876 5873 5870 5867 5864 5861 5858 5855 5852 5849 5847 5844 5841 5838 5835 5832 5829 5826 5823 5820 5817 5814 5811 5808 5806 5803 5800 5797 5794 5791 5788 5785 5782 5779 5777 5774 5771 5768 5765 5762 5759 5756 5754 5751
-76 5751 5748 5745 5742 5739 5736 5733 5731 5728 5725 5722 5719 5716 5714 5711 5708 5705 5702 5699 5697 5694 5691 5688 5685 5682 5680 5677 5674 5671 5668 5666 5663 5660 5657 5654 5652 5649 5646 5643 5640 5638 5635 5632 5629 5627 5624 5621 5618 5615 5613 5610 5607 5604 5602 5599 5596 5593 5591 5588 5585 5582 5580 5577 5574 5572 5569 5566 5563 5561 5558
-81 5558 5555 5552 5550 5547 5544 5542 5539 5536 5534 5531 5528 5525 5523 5520 5517 5515 5512 5509 5507 5504 5501 5499 5496 5493 5491 5488 5485 5483 5480 5477 5475 5472 5469 5467 5464 5461 5459 5456 5453 5451 5448 5446 5443 5440 5438 5435 5432 5430 5427 5425 5422 5419 5417 5414 5411 5409 5406 5404 5401 5398 5396 5393 5391 5388 5385 5383 5380 5378 5375
-86 5375 5373 5370 5367 5365 5362 5360 5357 5355 5352 5349 5347 5344 5342 5339 5337 5334 5332 5329 5326 5324 5321 5319 5316 5314 5311 5309 5306 5304 5301 5299 5296 5294 5291 5289 5286 5283 5281 5278 5276 5273 5271 5268 5266 5263 5261 5258 5256 5253 5251 5249 5246 5244 5241 5239 5236 5234 5231 5229 5226 5224 5221 5219 5216 5214 5211 5209 5207 5204 5202
-91 5202 5199 5197 5194 5192 5189 5187 5184 5182 5180 5177 5175 5172 5170 5167 5165 5163 5160 5158 5155 5153 5151 5148 5146 5143 5141 5138 5136 5134 5131 5129 5126 5124 5122 5119 5117 5115 5112 5110 5107 5105 5103 5100 5098 5095 5093 5091 5088 5086 5084 5081 5079 5077 5074 5072 5069 5067 5065 5062 5060 5058 5055 5053 5051 5048 5046 5044 5041 5039 5037
-97 5037 5034 5032 5030 5027 5025 5023 5020 5018 5016 5013 5011 5009 5007 5004 5002 5000 4997 4995 4993 4990 4988 4986 4984 4981 4979 4977 4974 4972 4970 4968 4965 4963 4961 4958 4956 4954 4952 4949 4947 4945 4943 4940 4938 4936 4934 4931 4929 4927 4924 4922 4920 4918 4916 4913 4911 4909 4907 4904 4902 4900 4898 4895 4893 4891 4889 4886 4884 4882 4880
-102 4880 4878 4875 4873 4871 4869 4867 4864 4862 4860 4858 4856 4853 4851 4849 4847 4845 4842 4840 4838 4836 4834 4831 4829 4827 4825 4823 4821 4818 4816 4814 4812 4810 4807 4805 4803 4801 4799 4797 4795 4792 4790 4788 4786 4784 4782 4779 4777 4775 4773 4771 4769 4767 4764 4762 4760 4758 4756 4754 4752 4750 4747 4745 4743 4741 4739 4737 4735 4733
-107 4733 4730 4728 4726 4724 4722 4720 4718 4716 4714 4712 4709 4707 4705 4703 4701 4699 4697 4695 4693 4691 4689 4686 4684 4682 4680 4678 4676 4674 4672 4670 4668 4666 4664 4662 4660 4657 4655 4653 4651 4649 4647 4645 4643 4641 4639 4637 4635 4633 4631 4629 4627 4625 4623 4621 4619 4617 4614 4612 4610 4608 4606 4604 4602 4600 4598 4596 4594 4592
-112 4592 4590 4588 4586 4584 4582 4580 4578 4576 4574 4572 4570 4568 4566 4564 4562 4560 4558 4556 4554 4552 4550 4548 4546 4544 4542 4540 4538 4536 4534 4532 4530 4528 4526 4524 4522 4521 4519 4517 4515 4513 4511 4509 4507 4505 4503 4501 4499 4497 4495 4493 4491 4489 4487 4485 4483 4481 4479 4478 4476 4474 4472 4470 4468 4466 4464 4462 4460 4458
-118 4458 4456 4454 4452 4451 4449 4447 4445 4443 4441 4439 4437 4435 4433 4431 4429 4428 4426 4424 4422 4420 4418 4416 4414 4412 4411 4409 4407 4405 4403 4401 4399 4397 4395 4394 4392 4390 4388 4386 4384 4382 4380 4379 4377 4375 4373 4371 4369 4367 4365 4364 4362 4360 4358 4356 4354 4352 4351 4349 4347 4345 4343 4341 4339 4338 4336 4334 4332 4330
-123 4330 4328 4327 4325 4323 4321 4319 4317 4316 4314 4312 4310 4308 4306 4305 4303 4301 4299 4297 4296 4294 4292 4290 4288 4286 4285 4283 4281 4279 4277 4276 4274 4272 4270 4268 4267 4265 4263 4261 4259 4258 4256 4254 4252 4251 4249 4247 4245 4243 4242 4240 4238 4236 4234 4233 4231 4229 4227 4226 4224 4222 4220 4219 4217 4215 4213 4211 4210 4208
-128 4208 4206 4204 4203 4201 4199 4197 4196 4194 4192 4190 4189 4187 4185 4183 4182 4180 4178 4176 4175 4173 4171 4170 4168 4166 4164 4163 4161 4159 4157 4156 4154 4152 4151 4149 4147 4145 4144 4142 4140 4139 4137 4135 4133 4132 4130 4128 4127 4125 4123 4121 4120 4118 4116 4115 4113 4111 4110 4108 4106 4104 4103 4101 4099 4098 4096 4094 4093 4091
-133 4091 4089 4088 4086 4084 4083 4081 4079 4078 4076 4074 4073 4071 4069 4068 4066 4064 4063 4061 4059 4058 4056 4054 4053 4051 4049 4048 4046 4044 4043 4041 4039 4038 4036 4034 4033 4031 4029 4028 4026 4025 4023 4021 4020 4018 4016 4015 4013 4011 4010 4008 4007 4005 4003 4002 4000 3998 3997 3995 3994 3992 3990 3989 3987 3985 3984 3982 3981 3979
-138 3979 3977 3976 3974 3973 3971 3969 3968 3966 3965 3963 3961 3960 3958 3957 3955 3953 3952 3950 3949 3947 3945 3944 3942 3941 3939 3937 3936 3934 3933 3931 3930 3928 3926 3925 3923 3922 3920 3919 3917 3915 3914 3912 3911 3909 3908 3906 3904 3903 3901 3900 3898 3897 3895 3893 3892 3890 3889 3887 3886 3884 3883 3881 3879 3878 3876 3875 3873 3872
-143 3872 3870 3869 3867 3866 3864 3863 3861 3859 3858 3856 3855 3853 3852 3850 3849 3847 3846 3844 3843 3841 3840 3838 3837 3835 3833 3832 3830 3829 3827 3826 3824 3823 3821 3820 3818 3817 3815 3814 3812 3811 3809 3808 3806 3805 3803 3802 3800 3799 3797 3796 3794 3793 3791 3790 3788 3787 3785 3784 3782 3781 3779 3778 3776 3775 3773 3772 3770 3769
-149 3769 3767 3766 3765 3763 3762 3760 3759 3757 3756 3754 3753 3751 3750 3748 3747 3745 3744 3742 3741 3740 3738 3737 3735 3734 3732 3731 3729 3728 3726 3725 3724 3722 3721 3719 3718 3716 3715 3713 3712 3710 3709 3708 3706 3705 3703 3702 3700 3699 3698 3696 3695 3693 3692 3690 3689 3687 3686 3685 3683 3682 3680 3679 3677 3676 3675 3673 3672 3670
-154 3670 3669 3668 3666 3665 3663 3662 3660 3659 3658 3656 3655 3653 3652 3651 3649 3648 3646 3645 3644 3642 3641 3639 3638 3637 3635 3634 3632 3631 3630 3628 3627 3625 3624 3623 3621 3620 3618 3617 3616 3614 3613 3611 3610 3609 3607 3606 3605 3603 3602 3600 3599 3598 3596 3595 3594 3592 3591 3589 3588 3587 3585 3584 3583 3581 3580 3578 3577 3576
-159 3576 3574 3573 3572 3570 3569 3568 3566 3565 3564 3562 3561 3559 3558 3557 3555 3554 3553 3551 3550 3549 3547 3546 3545 3543 3542 3541 3539 3538 3537 3535 3534 3533 3531 3530 3529 3527 3526 3525 3523 3522 3521 3519 3518 3517 3515 3514 3513 3511 3510 3509 3507 3506 3505 3503 3502 3501 3499 3498 3497 3495 3494 3493 3491 3490 3489 3488 3486 3485
-164 3485 3484 3482 3481 3480 3478 3477 3476 3474 3473 3472 3471 3469 3468 3467 3465 3464 3463 3461 3460 3459 3458 3456 3455 3454 3452 3451 3450 3449 3447 3446 3445 3443 3442 3441 3440 3438 3437 3436 3434 3433 3432 3431 3429 3428 3427 3425 3424 3423 3422 3420 3419 3418 3417 3415 3414 3413 3411 3410 3409 3408 3406 3405 3404 3403 3401 3400 3399 3398
-169 3398 3396 3395 3394 3393 3391 3390 3389 3388 3386 3385 3384 3383 3381 3380 3379 3378 3376 3375 3374 3373 3371 3370 3369 3368 3366 3365 3364 3363 3361 3360 3359 3358 3356 3355 3354 3353 3352 3350 3349 3348 3347 3345 3344 3343 3342 3340 3339 3338 3337 3336 3334 3333 3332 3331 3329 3328 3327 3326 3325 3323 3322 3321 3320 3318 3317 3316 3315 3314
-175 3314 3312 3311 3310 3309 3308 3306 3305 3304 3303 3302 3300 3299 3298 3297 3296 3294 3293 3292 3291 3290 3288 3287 3286 3285 3284 3282 3281 3280 3279 3278 3276 3275 3274 3273 3272 3271 3269 3268 3267 3266 3265 3263 3262 3261 3260 3259 3258 3256 3255 3254 3253 3252 3250 3249 3248 3247 3246 3245 3243 3242 3241 3240 3239 3238 3236 3235 3234 3233
-180 3233 3232 3231 3229 3228 3227 3226 3225 3224 3222 3221 3220 3219 3218 3217 3216 3214 3213 3212 3211 3210 3209 3207 3206 3205 3204 3203 3202 3201 3199 3198 3197 3196 3195 3194 3193 3191 3190 3189 3188 3187 3186 3185 3183 3182 3181 3180 3179 3178 3177 3175 3174 3173 3172 3171 3170 3169 3168 3166 3165 3164 3163 3162 3161 3160 3159 3157 3156 3155
-185 3155 3154 3153 3152 3151 3150 3148 3147 3146 3145 3144 3143 3142 3141 3140 3138 3137 3136 3135 3134 3133 3132 3131 3130 3128 3127 3126 3125 3124 3123 3122 3121 3120 3119 3117 3116 3115 3114 3113 3112 3111 3110 3109 3108 3106 3105 3104 3103 3102 3101 3100 3099 3098 3097 3096 3094 3093 3092 3091 3090 3089 3088 3087 3086 3085 3084 3083 3081 3080
-190 3080 3079 3078 3077 3076 3075 3074 3073 3072 3071 3070 3069 3067 3066 3065 3064 3063 3062 3061 3060 3059 3058 3057 3056 3055 3054 3052 3051 3050 3049 3048 3047 3046 3045 3044 3043 3042 3041 3040 3039 3038 3037 3036 3034 3033 3032 3031 3030 3029 3028 3027 3026 3025 3024 3023 3022 3021 3020 3019 3018 3017 3016 3015 3013 3012 3011 3010 3009 3008
-195 3008 3007 3006 3005 3004 3003 3002 3001 3000 2999 2998 2997 2996 2995 2994 2993 2992 2991 2990 2989 2988 2987 2985 2984 2983 2982 2981 2980 2979 2978 2977 2976 2975 2974 2973 2972 2971 2970 2969 2968 2967 2966 2965 2964 2963 2962 2961 2960 2959 2958 2957 2956 2955 2954 2953 2952 2951 2950 2949 2948 2947 2946 2945 2944 2943 2942 2941 2940 2939
-201 2939 2938 2937 2936 2935 2934 2933 2932 2931 2930 2929 2928 2927 2926 2925 2924 2923 2922 2921 2920 2919 2918 2917 2916 2915 2914 2913 2912 2911 2910 2909 2908 2907 2906 2905 2904 2903 2902 2901 2900 2899 2898 2897 2896 2895 2894 2893 2892 2891 2890 2889 2888 2887 2886 2885 2884 2883 2882 2881 2880 2879 2879 2878 2877 2876 2875 2874 2873 2872
-206 2872 2871 2870 2869 2868 2867 2866 2865 2864 2863 2862 2861 2860 2859 2858 2857 2856 2855 2854 2853 2852 2851 2851 2850 2849 2848 2847 2846 2845 2844 2843 2842 2841 2840 2839 2838 2837 2836 2835 2834 2833 2832 2831 2831 2830 2829 2828 2827 2826 2825 2824 2823 2822 2821 2820 2819 2818 2817 2816 2815 2815 2814 2813 2812 2811 2810 2809 2808 2807
-211 2807 2806 2805 2804 2803 2802 2801 2801 2800 2799 2798 2797 2796 2795 2794 2793 2792 2791 2790 2789 2788 2788 2787 2786 2785 2784 2783 2782 2781 2780 2779 2778 2777 2776 2776 2775 2774 2773 2772 2771 2770 2769 2768 2767 2766 2765 2765 2764 2763 2762 2761 2760 2759 2758 2757 2756 2755 2755 2754 2753 2752 2751 2750 2749 2748 2747 2746 2746 2745
-216 2745 2744 2743 2742 2741 2740 2739 2738 2737 2737 2736 2735 2734 2733 2732 2731 2730 2729 2728 2728 2727 2726 2725 2724 2723 2722 2721 2720 2720 2719 2718 2717 2716 2715 2714 2713 2712 2712 2711 2710 2709 2708 2707 2706 2705 2704 2704 2703 2702 2701 2700 2699 2698 2697 2697 2696 2695 2694 2693 2692 2691 2690 2690 2689 2688 2687 2686 2685 2684
-221 2684 2683 2683 2682 2681 2680 2679 2678 2677 2676 2676 2675 2674 2673 2672 2671 2670 2670 2669 2668 2667 2666 2665 2664 2664 2663 2662 2661 2660 2659 2658 2658 2657 2656 2655 2654 2653 2652 2652 2651 2650 2649 2648 2647 2646 2646 2645 2644 2643 2642 2641 2640 2640 2639 2638 2637 2636 2635 2634 2634 2633 2632 2631 2630 2629 2629 2628 2627 2626
-227 2626 2625 2624 2624 2623 2622 2621 2620 2619 2618 2618 2617 2616 2615 2614 2613 2613 2612 2611 2610 2609 2608 2608 2607 2606 2605 2604 2603 2603 2602 2601 2600 2599 2598 2598 2597 2596 2595 2594 2594 2593 2592 2591 2590 2589 2589 2588 2587 2586 2585 2584 2584 2583 2582 2581 2580 2580 2579 2578 2577 2576 2575 2575 2574 2573 2572 2571 2571 2570
-232 2570 2569 2568 2567 2566 2566 2565 2564 2563 2562 2562 2561 2560 2559 2558 2558 2557 2556 2555 2554 2554 2553 2552 2551 2550 2550 2549 2548 2547 2546 2545 2545 2544 2543 2542 2541 2541 2540 2539 2538 2537 2537 2536 2535 2534 2534 2533 2532 2531 2530 2530 2529 2528 2527 2526 2526 2525 2524 2523 2522 2522 2521 2520 2519 2518 2518 2517 2516 2515
-237 2515 2514 2514 2513 2512 2511 2511 2510 2509 2508 2507 2507 2506 2505 2504 2504 2503 2502 2501 2500 2500 2499 2498 2497 2496 2496 2495 2494 2493 2493 2492 2491 2490 2490 2489 2488 2487 2486 2486 2485 2484 2483 2483 2482 2481 2480 2479 2479 2478 2477 2476 2476 2475 2474 2473 2473 2472 2471 2470 2469 2469 2468 2467 2466 2466 2465 2464 2463 2463
-242 2463 2462 2461 2460 2460 2459 2458 2457 2457 2456 2455 2454 2453 2453 2452 2451 2450 2450 2449 2448 2447 2447 2446 2445 2444 2444 2443 2442 2441 2441 2440 2439 2438 2438 2437 2436 2435 2435 2434 2433 2432 2432 2431 2430 2429 2429 2428 2427 2426 2426 2425 2424 2423 2423 2422 2421 2421 2420 2419 2418 2418 2417 2416 2415 2415 2414 2413 2412 2412
-247 2412 2411 2410 2409 2409 2408 2407 2406 2406 2405 2404 2404 2403 2402 2401 2401 2400 2399 2398 2398 2397 2396 2395 2395 2394 2393 2393 2392 2391 2390 2390 2389 2388 2387 2387 2386 2385 2385 2384 2383 2382 2382 2381 2380 2380 2379 2378 2377 2377 2376 2375 2374 2374 2373 2372 2372 2371 2370 2369 2369 2368 2367 2367 2366 2365 2364 2364 2363 2362
-252 2362 2362 2361 2360 2359 2359 2358 2357 2357 2356 2355 2354 2354 2353 2352 2352 2351 2350 2349 2349 2348 2347 2347 2346 2345 2345 2344 2343 2342 2342 2341 2340 2340 2339 2338 2337 2337 2336 2335 2335 2334 2333 2333 2332 2331 2330 2330 2329 2328 2328 2327 2326 2326 2325 2324 2323 2323 2322 2321 2321 2320 2319 2319 2318 2317 2317 2316 2315 2314
-258 2314 2314 2313 2312 2312 2311 2310 2310 2309 2308 2308 2307 2306 2306 2305 2304 2303 2303 2302 2301 2301 2300 2299 2299 2298 2297 2297 2296 2295 2295 2294 2293 2292 2292 2291 2290 2290 2289 2288 2288 2287 2286 2286 2285 2284 2284 2283 2282 2282 2281 2280 2280 2279 2278 2278 2277 2276 2276 2275 2274 2274 2273 2272 2272 2271 2270 2270 2269 2268
-263 2268 2267 2267 2266 2265 2265 2264 2263 2263 2262 2261 2261 2260 2259 2259 2258 2257 2257 2256 2255 2255 2254 2253 2253 2252 2251 2251 2250 2250 2249 2248 2248 2247 2246 2246 2245 2244 2244 2243 2242 2242 2241 2240 2240 2239 2238 2238 2237 2236 2236 2235 2234 2234 2233 2232 2232 2231 2230 2230 2229 2228 2228 2227 2227 2226 2225 2225 2224 2223
-268 2223 2223 2222 2221 2221 2220 2219 2219 2218 2217 2217 2216 2215 2215 2214 2214 2213 2212 2212 2211 2210 2210 2209 2208 2208 2207 2206 2206 2205 2205 2204 2203 2203 2202 2201 2201 2200 2199 2199 2198 2198 2197 2196 2196 2195 2194 2194 2193 2192 2192 2191 2191 2190 2189 2189 2188 2187 2187 2186 2185 2185 2184 2184 2183 2182 2182 2181 2180 2180
-273 2180 2179 2178 2178 2177 2177 2176 2175 2175 2174 2173 2173 2172 2172 2171 2170 2170 2169 2168 2168 2167 2167 2166 2165 2165 2164 2163 2163 2162 2162 2161 2160 2160 2159 2158 2158 2157 2157 2156 2155 2155 2154 2154 2153 2152 2152 2151 2150 2150 2149 2149 2148 2147 2147 2146 2146 2145 2144 2144 2143 2142 2142 2141 2141 2140 2139 2139 2138 2138
-278 2138 2137 2136 2136 2135 2134 2134 2133 2133 2132 2131 2131 2130 2130 2129 2128 2128 2127 2127 2126 2125 2125 2124 2124 2123 2122 2122 2121 2121 2120 2119 2119 2118 2118 2117 2116 2116 2115 2115 2114 2113 2113 2112 2111 2111 2110 2110 2109 2109 2108 2107 2107 2106 2106 2105 2104 2104 2103 2103 2102 2101 2101 2100 2100 2099 2098 2098 2097 2097
-284 2097 2096 2095 2095 2094 2094 2093 2092 2092 2091 2091 2090 2089 2089 2088 2088 2087 2087 2086 2085 2085 2084 2084 2083 2082 2082 2081 2081 2080 2079 2079 2078 2078 2077 2077 2076 2075 2075 2074 2074 2073 2072 2072 2071 2071 2070 2070 2069 2068 2068 2067 2067 2066 2066 2065 2064 2064 2063 2063 2062 2061 2061 2060 2060 2059 2059 2058 2057 2057
-289 2057 2056 2056 2055 2055 2054 2053 2053 2052 2052 2051 2051 2050 2049 2049 2048 2048 2047 2047 2046 2045 2045 2044 2044 2043 2043 2042 2041 2041 2040 2040 2039 2039 2038 2037 2037 2036 2036 2035 2035 2034 2033 2033 2032 2032 2031 2031 2030 2029 2029 2028 2028 2027 2027 2026 2026 2025 2024 2024 2023 2023 2022 2022 2021 2020 2020 2019 2019 2018
-294 2018 2018 2017 2017 2016 2015 2015 2014 2014 2013 2013 2012 2012 2011 2010 2010 2009 2009 2008 2008 2007 2007 2006 2005 2005 2004 2004 2003 2003 2002 2002 2001 2000 2000 1999 1999 1998 1998 1997 1997 1996 1996 1995 1994 1994 1993 1993 1992 1992 1991 1991 1990 1989 1989 1988 1988 1987 1987 1986 1986 1985 1985 1984 1983 1983 1982 1982 1981 1981
-299 1981 1980 1980 1979 1979 1978 1978 1977 1976 1976 1975 1975 1974 1974 1973 1973 1972 1972 1971 1970 1970 1969 1969 1968 1968 1967 1967 1966 1966 1965 1965 1964 1964 1963 1962 1962 1961 1961 1960 1960 1959 1959 1958 1958 1957 1957 1956 1955 1955 1954 1954 1953 1953 1952 1952 1951 1951 1950 1950 1949 1949 1948 1948 1947 1946 1946 1945 1945 1944
-304 1944 1944 1943 1943 1942 1942 1941 1941 1940 1940 1939 1939 1938 1938 1937 1936 1936 1935 1935 1934 1934 1933 1933 1932 1932 1931 1931 1930 1930 1929 1929 1928 1928 1927 1927 1926 1926 1925 1924 1924 1923 1923 1922 1922 1921 1921 1920 1920 1919 1919 1918 1918 1917 1917 1916 1916 1915 1915 1914 1914 1913 1913 1912 1912 1911 1911 1910 1909 1909
-310 1909 1908 1908 1907 1907 1906 1906 1905 1905 1904 1904 1903 1903 1902 1902 1901 1901 1900 1900 1899 1899 1898 1898 1897 1897 1896 1896 1895 1895 1894 1894 1893 1893 1892 1892 1891 1891 1890 1890 1889 1889 1888 1888 1887 1887 1886 1886 1885 1885 1884 1884 1883 1883 1882 1882 1881 1881 1880 1880 1879 1879 1878 1878 1877 1877 1876 1876 1875 1875
-315 1875 1874 1874 1873 1873 1872 1872 1871 1871 1870 1870 1869 1869 1868 1868 1867 1867 1866 1866 1865 1865 1864 1864 1863 1863 1862 1862 1861 1861 1860 1860 1859 1859 1858 1858 1857 1857 1856 1856 1855 1855 1854 1854 1853 1853 1852 1852 1851 1851 1850 1850 1849 1849 1848 1848 1847 1847 1847 1846 1846 1845 1845 1844 1844 1843 1843 1842 1842 1841
-320 1841 1841 1840 1840 1839 1839 1838 1838 1837 1837 1836 1836 1835 1835 1834 1834 1833 1833 1832 1832 1831 1831 1831 1830 1830 1829 1829 1828 1828 1827 1827 1826 1826 1825 1825 1824 1824 1823 1823 1822 1822 1821 1821 1820 1820 1820 1819 1819 1818 1818 1817 1817 1816 1816 1815 1815 1814 1814 1813 1813 1812 1812 1811 1811 1811 1810 1810 1809 1809
-325 1809 1808 1808 1807 1807 1806 1806 1805 1805 1804 1804 1803 1803 1803 1802 1802 1801 1801 1800 1800 1799 1799 1798 1798 1797 1797 1796 1796 1796 1795 1795 1794 1794 1793 1793 1792 1792 1791 1791 1790 1790 1789 1789 1789 1788 1788 1787 1787 1786 1786 1785 1785 1784 1784 1783 1783 1783 1782 1782 1781 1781 1780 1780 1779 1779 1778 1778 1777 1777
-330 1777 1777 1776 1776 1775 1775 1774 1774 1773 1773 1772 1772 1772 1771 1771 1770 1770 1769 1769 1768 1768 1767 1767 1766 1766 1766 1765 1765 1764 1764 1763 1763 1762 1762 1761 1761 1761 1760 1760 1759 1759 1758 1758 1757 1757 1757 1756 1756 1755 1755 1754 1754 1753 1753 1752 1752 1752 1751 1751 1750 1750 1749 1749 1748 1748 1748 1747 1747 1746
-336 1746 1746 1745 1745 1744 1744 1744 1743 1743 1742 1742 1741 1741 1740 1740 1740 1739 1739 1738 1738 1737 1737 1736 1736 1736 1735 1735 1734 1734 1733 1733 1732 1732 1732 1731 1731 1730 1730 1729 1729 1728 1728 1728 1727 1727 1726 1726 1725 1725 1725 1724 1724 1723 1723 1722 1722 1721 1721 1721 1720 1720 1719 1719 1718 1718 1718 1717 1717 1716
-341 1716 1716 1715 1715 1714 1714 1714 1713 1713 1712 1712 1711 1711 1711 1710 1710 1709 1709 1708 1708 1708 1707 1707 1706 1706 1705 1705 1705 1704 1704 1703 1703 1702 1702 1702 1701 1701 1700 1700 1699 1699 1699 1698 1698 1697 1697 1696 1696 1696 1695 1695 1694 1694 1693 1693 1693 1692 1692 1691 1691 1690 1690 1690 1689 1689 1688 1688 1687 1687
-346 1687 1687 1686 1686 1685 1685 1685 1684 1684 1683 1683 1682 1682 1682 1681 1681 1680 1680 1679 1679 1679 1678 1678 1677 1677 1677 1676 1676 1675 1675 1674 1674 1674 1673 1673 1672 1672 1671 1671 1671 1670 1670 1669 1669 1669 1668 1668 1667 1667 1667 1666 1666 1665 1665 1664 1664 1664 1663 1663 1662 1662 1662 1661 1661 1660 1660 1659 1659 1659
-351 1659 1658 1658 1657 1657 1657 1656 1656 1655 1655 1655 1654 1654 1653 1653 1652 1652 1652 1651 1651 1650 1650 1650 1649 1649 1648 1648 1648 1647 1647 1646 1646 1646 1645 1645 1644 1644 1643 1643 1643 1642 1642 1641 1641 1641 1640 1640 1639 1639 1639 1638 1638 1637 1637 1637 1636 1636 1635 1635 1635 1634 1634 1633 1633 1633 1632 1632 1631 1631
-356 1631 1631 1630 1630 1629 1629 1629 1628 1628 1627 1627 1627 1626 1626 1625 1625 1625 1624 1624 1623 1623 1623 1622 1622 1621 1621 1621 1620 1620 1619 1619 1619 1618 1618 1617 1617 1617 1616 1616 1615 1615 1615 1614 1614 1613 1613 1613 1612 1612 1611 1611 1611 1610 1610 1609 1609 1609 1608 1608 1608 1607 1607 1606 1606 1606 1605 1605 1604 1604
-362 1604 1604 1603 1603 1602 1602 1602 1601 1601 1600 1600 1600 1599 1599 1599 1598 1598 1597 1597 1597 1596 1596 1595 1595 1595 1594 1594 1593 1593 1593 1592 1592 1592 1591 1591 1590 1590 1590 1589 1589 1588 1588 1588 1587 1587 1587 1586 1586 1585 1585 1585 1584 1584 1583 1583 1583 1582 1582 1582 1581 1581 1580 1580 1580 1579 1579 1578 1578 1578
-367 1578 1577 1577 1577 1576 1576 1575 1575 1575 1574 1574 1573 1573 1573 1572 1572 1572 1571 1571 1570 1570 1570 1569 1569 1569 1568 1568 1567 1567 1567 1566 1566 1566 1565 1565 1564 1564 1564 1563 1563 1563 1562 1562 1561 1561 1561 1560 1560 1560 1559 1559 1558 1558 1558 1557 1557 1557 1556 1556 1555 1555 1555 1554 1554 1554 1553 1553 1552 1552
-372 1552 1552 1551 1551 1551 1550 1550 1549 1549 1549 1548 1548 1548 1547 1547 1546 1546 1546 1545 1545 1545 1544 1544 1544 1543 1543 1542 1542 1542 1541 1541 1541 1540 1540 1539 1539 1539 1538 1538 1538 1537 1537 1537 1536 1536 1535 1535 1535 1534 1534 1534 1533 1533 1533 1532 1532 1531 1531 1531 1530 1530 1530 1529 1529 1529 1528 1528 1527 1527
-377 1527 1527 1526 1526 1526 1525 1525 1525 1524 1524 1523 1523 1523 1522 1522 1522 1521 1521 1521 1520 1520 1519 1519 1519 1518 1518 1518 1517 1517 1517 1516 1516 1516 1515 1515 1514 1514 1514 1513 1513 1513 1512 1512 1512 1511 1511 1511 1510 1510 1509 1509 1509 1508 1508 1508 1507 1507 1507 1506 1506 1506 1505 1505 1504 1504 1504 1503 1503 1503
-382 1503 1502 1502 1502 1501 1501 1501 1500 1500 1500 1499 1499 1498 1498 1498 1497 1497 1497 1496 1496 1496 1495 1495 1495 1494 1494 1494 1493 1493 1492 1492 1492 1491 1491 1491 1490 1490 1490 1489 1489 1489 1488 1488 1488 1487 1487 1487 1486 1486 1486 1485 1485 1484 1484 1484 1483 1483 1483 1482 1482 1482 1481 1481 1481 1480 1480 1480 1479 1479
-387 1479 1479 1478 1478 1478 1477 1477 1477 1476 1476 1475 1475 1475 1474 1474 1474 1473 1473 1473 1472 1472 1472 1471 1471 1471 1470 1470 1470 1469 1469 1469 1468 1468 1468 1467 1467 1467 1466 1466 1466 1465 1465 1465 1464 1464 1464 1463 1463 1462 1462 1462 1461 1461 1461 1460 1460 1460 1459 1459 1459 1458 1458 1458 1457 1457 1457 1456 1456 1456
-393 1456 1455 1455 1455 1454 1454 1454 1453 1453 1453 1452 1452 1452 1451 1451 1451 1450 1450 1450 1449 1449 1449 1448 1448 1448 1447 1447 1447 1446 1446 1446 1445 1445 1445 1444 1444 1444 1443 1443 1443 1442 1442 1442 1441 1441 1441 1440 1440 1440 1439 1439 1439 1438 1438 1438 1437 1437 1437 1436 1436 1436 1435 1435 1435 1434 1434 1434 1433 1433
-398 1433 1433 1432 1432 1432 1431 1431 1431 1430 1430 1430 1429 1429 1429 1428 1428 1428 1428 1427 1427 1427 1426 1426 1426 1425 1425 1425 1424 1424 1424 1423 1423 1423 1422 1422 1422 1421 1421 1421 1420 1420 1420 1419 1419 1419 1418 1418 1418 1417 1417 1417 1416 1416 1416 1415 1415 1415 1415 1414 1414 1414 1413 1413 1413 1412 1412 1412 1411 1411
-403 1411 1411 1410 1410 1410 1409 1409 1409 1408 1408 1408 1407 1407 1407 1406 1406 1406 1406 1405 1405 1405 1404 1404 1404 1403 1403 1403 1402 1402 1402 1401 1401 1401 1400 1400 1400 1399 1399 1399 1399 1398 1398 1398 1397 1397 1397 1396 1396 1396 1395 1395 1395 1394 1394 1394 1393 1393 1393 1393 1392 1392 1392 1391 1391 1391 1390 1390 1390 1389
-408 1389 1389 1389 1388 1388 1388 1388 1387 1387 1387 1386 1386 1386 1385 1385 1385 1384 1384 1384 1383 1383 1383 1383 1382 1382 1382 1381 1381 1381 1380 1380 1380 1379 1379 1379 1378 1378 1378 1378 1377 1377 1377 1376 1376 1376 1375 1375 1375 1374 1374 1374 1374 1373 1373 1373 1372 1372 1372 1371 1371 1371 1370 1370 1370 1370 1369 1369 1369 1368
-413 1368 1368 1368 1367 1367 1367 1366 1366 1366 1366 1365 1365 1365 1364 1364 1364 1363 1363 1363 1363 1362 1362 1362 1361 1361 1361 1360 1360 1360 1359 1359 1359 1359 1358 1358 1358 1357 1357 1357 1356 1356 1356 1356 1355 1355 1355 1354 1354 1354 1353 1353 1353 1353 1352 1352 1352 1351 1351 1351 1350 1350 1350 1350 1349 1349 1349 1348 1348 1348
-419 1348 1347 1347 1347 1347 1346 1346 1346 1345 1345 1345 1344 1344 1344 1344 1343 1343 1343 1342 1342 1342 1341 1341 1341 1341 1340 1340 1340 1339 1339 1339 1339 1338 1338 1338 1337 1337 1337 1336 1336 1336 1336 1335 1335 1335 1334 1334 1334 1334 1333 1333 1333 1332 1332 1332 1331 1331 1331 1331 1330 1330 1330 1329 1329 1329 1329 1328 1328 1328
-424 1328 1327 1327 1327 1326 1326 1326 1326 1325 1325 1325 1324 1324 1324 1324 1323 1323 1323 1322 1322 1322 1322 1321 1321 1321 1320 1320 1320 1319 1319 1319 1319 1318 1318 1318 1317 1317 1317 1317 1316 1316 1316 1315 1315 1315 1315 1314 1314 1314 1313 1313 1313 1313 1312 1312 1312 1311 1311 1311 1311 1310 1310 1310 1309 1309 1309 1309 1308 1308
-429 1308 1308 1307 1307 1307 1307 1306 1306 1306 1305 1305 1305 1305 1304 1304 1304 1303 1303 1303 1303 1302 1302 1302 1301 1301 1301 1301 1300 1300 1300 1299 1299 1299 1299 1298 1298 1298 1297 1297 1297 1297 1296 1296 1296 1296 1295 1295 1295 1294 1294 1294 1294 1293 1293 1293 1292 1292 1292 1292 1291 1291 1291 1290 1290 1290 1290 1289 1289 1289
-434 1289 1289 1288 1288 1288 1287 1287 1287 1287 1286 1286 1286 1285 1285 1285 1285 1284 1284 1284 1283 1283 1283 1283 1282 1282 1282 1282 1281 1281 1281 1280 1280 1280 1280 1279 1279 1279 1279 1278 1278 1278 1277 1277 1277 1277 1276 1276 1276 1275 1275 1275 1275 1274 1274 1274 1274 1273 1273 1273 1272 1272 1272 1272 1271 1271 1271 1271 1270 1270
-439 1270 1270 1269 1269 1269 1269 1268 1268 1268 1268 1267 1267 1267 1266 1266 1266 1266 1265 1265 1265 1265 1264 1264 1264 1263 1263 1263 1263 1262 1262 1262 1262 1261 1261 1261 1261 1260 1260 1260 1259 1259 1259 1259 1258 1258 1258 1258 1257 1257 1257 1256 1256 1256 1256 1255 1255 1255 1255 1254 1254 1254 1254 1253 1253 1253 1252 1252 1252 1252
-445 1252 1251 1251 1251 1251 1250 1250 1250 1250 1249 1249 1249 1248 1248 1248 1248 1247 1247 1247 1247 1246 1246 1246 1246 1245 1245 1245 1244 1244 1244 1244 1243 1243 1243 1243 1242 1242 1242 1242 1241 1241 1241 1241 1240 1240 1240 1239 1239 1239 1239 1238 1238 1238 1238 1237 1237 1237 1237 1236 1236 1236 1236 1235 1235 1235 1234 1234 1234 1234
-450 1234 1233 1233 1233 1233 1232 1232 1232 1232 1231 1231 1231 1231 1230 1230 1230 1230 1229 1229 1229 1229 1228 1228 1228 1227 1227 1227 1227 1226 1226 1226 1226 1225 1225 1225 1225 1224 1224 1224 1224 1223 1223 1223 1223 1222 1222 1222 1222 1221 1221 1221 1221 1220 1220 1220 1219 1219 1219 1219 1218 1218 1218 1218 1217 1217 1217 1217 1216 1216
-455 1216 1216 1216 1215 1215 1215 1215 1214 1214 1214 1214 1213 1213 1213 1213 1212 1212 1212 1212 1211 1211 1211 1211 1210 1210 1210 1210 1209 1209 1209 1209 1208 1208 1208 1208 1207 1207 1207 1207 1206 1206 1206 1206 1205 1205 1205 1205 1204 1204 1204 1204 1203 1203 1203 1202 1202 1202 1202 1201 1201 1201 1201 1200 1200 1200 1200 1199 1199 1199
-460 1199 1199 1198 1198 1198 1198 1197 1197 1197 1197 1196 1196 1196 1196 1196 1195 1195 1195 1195 1194 1194 1194 1194 1193 1193 1193 1193 1192 1192 1192 1192 1191 1191 1191 1191 1190 1190 1190 1190 1189 1189 1189 1189 1188 1188 1188 1188 1187 1187 1187 1187 1186 1186 1186 1186 1185 1185 1185 1185 1184 1184 1184 1184 1183 1183 1183 1183 1182 1182
-465 1182 1182 1182 1181 1181 1181 1181 1180 1180 1180 1180 1180 1179 1179 1179 1179 1178 1178 1178 1178 1177 1177 1177 1177 1176 1176 1176 1176 1175 1175 1175 1175 1174 1174 1174 1174 1173 1173 1173 1173 1172 1172 1172 1172 1172 1171 1171 1171 1171 1170 1170 1170 1170 1169 1169 1169 1169 1168 1168 1168 1168 1167 1167 1167 1167 1166 1166 1166 1166
-471 1166 1166 1165 1165 1165 1165 1164 1164 1164 1164 1163 1163 1163 1163 1162 1162 1162 1162 1161 1161 1161 1161 1161 1160 1160 1160 1160 1159 1159 1159 1159 1158 1158 1158 1158 1157 1157 1157 1157 1156 1156 1156 1156 1156 1155 1155 1155 1155 1154 1154 1154 1154 1153 1153 1153 1153 1152 1152 1152 1152 1152 1151 1151 1151 1151 1150 1150 1150 1150
-476 1150 1149 1149 1149 1149 1148 1148 1148 1148 1148 1147 1147 1147 1147 1146 1146 1146 1146 1145 1145 1145 1145 1145 1144 1144 1144 1144 1143 1143 1143 1143 1142 1142 1142 1142 1142 1141 1141 1141 1141 1140 1140 1140 1140 1139 1139 1139 1139 1139 1138 1138 1138 1138 1137 1137 1137 1137 1136 1136 1136 1136 1136 1135 1135 1135 1135 1134 1134 1134
-481 1134 1134 1133 1133 1133 1133 1133 1132 1132 1132 1132 1131 1131 1131 1131 1130 1130 1130 1130 1130 1129 1129 1129 1129 1128 1128 1128 1128 1128 1127 1127 1127 1127 1126 1126 1126 1126 1125 1125 1125 1125 1125 1124 1124 1124 1124 1123 1123 1123 1123 1123 1122 1122 1122 1122 1121 1121 1121 1121 1121 1120 1120 1120 1120 1119 1119 1119 1119 1118
-486 1118 1118 1118 1118 1118 1117 1117 1117 1117 1116 1116 1116 1116 1116 1115 1115 1115 1115 1114 1114 1114 1114 1114 1113 1113 1113 1113 1112 1112 1112 1112 1112 1111 1111 1111 1111 1110 1110 1110 1110 1110 1109 1109 1109 1109 1108 1108 1108 1108 1108 1107 1107 1107 1107 1106 1106 1106 1106 1106 1105 1105 1105 1105 1105 1104 1104 1104 1104 1103
-491 1103 1103 1103 1103 1103 1102 1102 1102 1102 1101 1101 1101 1101 1101 1100 1100 1100 1100 1099 1099 1099 1099 1099 1098 1098 1098 1098 1097 1097 1097 1097 1097 1096 1096 1096 1096 1096 1095 1095 1095 1095 1094 1094 1094 1094 1094 1093 1093 1093 1093 1092 1092 1092 1092 1092 1091 1091 1091 1091 1091 1090 1090 1090 1090 1089 1089 1089 1089 1089
-496 1089 1088 1088 1088 1088 1088 1087 1087 1087 1087 1086 1086 1086 1086 1086 1085 1085 1085 1085 1085 1084 1084 1084 1084 1083 1083 1083 1083 1083 1082 1082 1082 1082 1082 1081 1081 1081 1081 1080 1080 1080 1080 1080 1079 1079 1079 1079 1079 1078 1078 1078 1078 1078 1077 1077 1077 1077 1076 1076 1076 1076 1076 1075 1075 1075 1075 1075 1074 1074
-502 1074 1074 1074 1073 1073 1073 1073 1073 1072 1072 1072 1072 1072 1071 1071 1071 1071 1071 1070 1070 1070 1070 1070 1069 1069 1069 1069 1068 1068 1068 1068 1068 1067 1067 1067 1067 1067 1066 1066 1066 1066 1066 1065 1065 1065 1065 1065 1064 1064 1064 1064 1063 1063 1063 1063 1063 1062 1062 1062 1062 1062 1061 1061 1061 1061 1061 1060 1060 1060
-507 1060 1060 1060 1059 1059 1059 1059 1058 1058 1058 1058 1058 1057 1057 1057 1057 1057 1056 1056 1056 1056 1056 1055 1055 1055 1055 1055 1054 1054 1054 1054 1054 1053 1053 1053 1053 1053 1052 1052 1052 1052 1052 1051 1051 1051 1051 1051 1050 1050 1050 1050 1049 1049 1049 1049 1049 1048 1048 1048 1048 1048 1047 1047 1047 1047 1047 1046 1046 1046
-512 1046 1046 1046 1045 1045 1045 1045 1045 1044 1044 1044 1044 1044 1043 1043 1043 1043 1043 1042 1042 1042 1042 1042 1041 1041 1041 1041 1041 1040 1040 1040 1040 1040 1039 1039 1039 1039 1039 1038 1038 1038 1038 1038 1037 1037 1037 1037 1037 1036 1036 1036 1036 1036 1035 1035 1035 1035 1035 1034 1034 1034 1034 1034 1033 1033 1033 1033 1033 1032
-517 1032 1032 1032 1032 1032 1031 1031 1031 1031 1031 1030 1030 1030 1030 1030 1029 1029 1029 1029 1029 1028 1028 1028 1028 1028 1027 1027 1027 1027 1027 1026 1026 1026 1026 1026 1026 1025 1025 1025 1025 1025 1024 1024 1024 1024 1024 1023 1023 1023 1023 1023 1022 1022 1022 1022 1022 1021 1021 1021 1021 1021 1020 1020 1020 1020 1020 1019 1019 1019
-522 1019 1019 1019 1018 1018 1018 1018 1018 1018 1017 1017 1017 1017 1017 1016 1016 1016 1016 1016 1015 1015 1015 1015 1015 1014 1014 1014 1014 1014 1013 1013 1013 1013 1013 1012 1012 1012 1012 1012 1012 1011 1011 1011 1011 1011 1010 1010 1010 1010 1010 1009 1009 1009 1009 1009 1008 1008 1008 1008 1008 1008 1007 1007 1007 1007 1007 1006 1006 1006
-528 1006 1006 1006 1005 1005 1005 1005 1005 1004 1004 1004 1004 1004 1004 1003 1003 1003 1003 1003 1002 1002 1002 1002 1002 1001 1001 1001 1001 1001 1000 1000 1000 1000 1000 1000 999 999 999 999 999 998 998 998 998 998 997 997 997 997 997 997 996 996 996 996 996 995 995 995 995 995 994 994 994 994 994 994 993 993
-533 993 993 993 993 992 992 992 992 992 991 991 991 991 991 991 990 990 990 990 990 989 989 989 989 989 988 988 988 988 988 988 987 987 987 987 987 986 986 986 986 986 986 985 985 985 985 985 984 984 984 984 984 984 983 983 983 983 983 982 982 982 982 982 981 981 981 981 981 981 980
-538 980 980 980 980 980 979 979 979 979 979 979 978 978 978 978 978 977 977 977 977 977 977 976 976 976 976 976 975 975 975 975 975 975 974 974 974 974 974 973 973 973 973 973 973 972 972 972 972 972 971 971 971 971 971 971 970 970 970 970 970 969 969 969 969 969 969 968 968 968 968
-543 968 968 968 967 967 967 967 967 966 966 966 966 966 966 965 965 965 965 965 964 964 964 964 964 964 963 963 963 963 963 963 962 962 962 962 962 961 961 961 961 961 961 960 960 960 960 960 959 959 959 959 959 959 958 958 958 958 958 958 957 957 957 957 957 956 956 956 956 956 956
-549 956 955 955 955 955 955 955 954 954 954 954 954 953 953 953 953 953 953 952 952 952 952 952 952 951 951 951 951 951 951 950 950 950 950 950 949 949 949 949 949 949 948 948 948 948 948 948 947 947 947 947 947 947 946 946 946 946 946 945 945 945 945 945 945 944 944 944 944 944 944
-554 944 943 943 943 943 943 943 942 942 942 942 942 941 941 941 941 941 941 940 940 940 940 940 940 939 939 939 939 939 939 938 938 938 938 938 938 937 937 937 937 937 937 936 936 936 936 936 936 935 935 935 935 935 934 934 934 934 934 934 933 933 933 933 933 933 932 932 932 932 932
-559 932 932 931 931 931 931 931 931 930 930 930 930 930 930 929 929 929 929 929 929 928 928 928 928 928 928 927 927 927 927 927 927 926 926 926 926 926 926 925 925 925 925 925 925 924 924 924 924 924 924 923 923 923 923 923 923 922 922 922 922 922 922 921 921 921 921 921 921 920 920
-564 920 920 920 920 920 919 919 919 919 919 919 918 918 918 918 918 918 917 917 917 917 917 917 916 916 916 916 916 916 915 915 915 915 915 915 914 914 914 914 914 914 913 913 913 913 913 913 912 912 912 912 912 912 911 911 911 911 911 911 910 910 910 910 910 910 909 909 909 909 909
-570 909 909 909 908 908 908 908 908 908 907 907 907 907 907 907 906 906 906 906 906 906 905 905 905 905 905 905 904 904 904 904 904 904 903 903 903 903 903 903 903 902 902 902 902 902 902 901 901 901 901 901 901 900 900 900 900 900 900 899 899 899 899 899 899 898 898 898 898 898 898
-575 898 898 897 897 897 897 897 897 896 896 896 896 896 896 895 895 895 895 895 895 895 894 894 894 894 894 894 893 893 893 893 893 893 892 892 892 892 892 892 891 891 891 891 891 891 891 890 890 890 890 890 890 889 889 889 889 889 889 888 888 888 888 888 888 888 887 887 887 887 887
-580 887 887 886 886 886 886 886 886 886 885 885 885 885 885 885 884 884 884 884 884 884 883 883 883 883 883 883 883 882 882 882 882 882 882 881 881 881 881 881 881 881 880 880 880 880 880 880 879 879 879 879 879 879 879 878 878 878 878 878 878 877 877 877 877 877 877 876 876 876 876
-585 876 876 876 876 875 875 875 875 875 875 874 874 874 874 874 874 874 873 873 873 873 873 873 873 872 872 872 872 872 872 871 871 871 871 871 871 871 870 870 870 870 870 870 869 869 869 869 869 869 869 868 868 868 868 868 868 867 867 867 867 867 867 867 866 866 866 866 866 866 866
-591 866 865 865 865 865 865 865 864 864 864 864 864 864 864 863 863 863 863 863 863 862 862 862 862 862 862 862 861 861 861 861 861 861 861 860 860 860 860 860 860 859 859 859 859 859 859 859 858 858 858 858 858 858 858 857 857 857 857 857 857 857 856 856 856 856 856 856 855 855 855
-596 855 855 855 855 855 854 854 854 854 854 854 854 853 853 853 853 853 853 852 852 852 852 852 852 852 851 851 851 851 851 851 851 850 850 850 850 850 850 850 849 849 849 849 849 849 849 848 848 848 848 848 848 847 847 847 847 847 847 847 846 846 846 846 846 846 846 845 845 845 845
-601 845 845 845 845 844 844 844 844 844 844 844 843 843 843 843 843 843 843 842 842 842 842 842 842 842 841 841 841 841 841 841 841 840 840 840 840 840 840 840 839 839 839 839 839 839 838 838 838 838 838 838 838 837 837 837 837 837 837 837 836 836 836 836 836 836 836 835 835 835 835
-607 835 835 835 835 834 834 834 834 834 834 834 833 833 833 833 833 833 833 832 832 832 832 832 832 832 831 831 831 831 831 831 831 830 830 830 830 830 830 830 829 829 829 829 829 829 829 829 828 828 828 828 828 828 828 827 827 827 827 827 827 827 826 826 826 826 826 826 826 825 825
-612 825 825 825 825 825 825 824 824 824 824 824 824 824 823 823 823 823 823 823 823 822 822 822 822 822 822 822 821 821 821 821 821 821 821 821 820 820 820 820 820 820 820 819 819 819 819 819 819 819 818 818 818 818 818 818 818 817 817 817 817 817 817 817 816 816 816 816 816 816 816
-617 816 816 815 815 815 815 815 815 815 814 814 814 814 814 814 814 813 813 813 813 813 813 813 812 812 812 812 812 812 812 812 811 811 811 811 811 811 811 810 810 810 810 810 810 810 809 809 809 809 809 809 809 809 808 808 808 808 808 808 808 807 807 807 807 807 807 807 806 806 806
-622 806 806 806 806 806 806 805 805 805 805 805 805 805 804 804 804 804 804 804 804 804 803 803 803 803 803 803 803 802 802 802 802 802 802 802 801 801 801 801 801 801 801 801 800 800 800 800 800 800 800 799 799 799 799 799 799 799 799 798 798 798 798 798 798 798 797 797 797 797 797
-628 797 797 797 797 796 796 796 796 796 796 796 795 795 795 795 795 795 795 795 794 794 794 794 794 794 794 793 793 793 793 793 793 793 793 792 792 792 792 792 792 792 792 791 791 791 791 791 791 791 790 790 790 790 790 790 790 790 789 789 789 789 789 789 789 788 788 788 788 788 788
-633 788 788 788 787 787 787 787 787 787 787 787 786 786 786 786 786 786 786 785 785 785 785 785 785 785 785 784 784 784 784 784 784 784 784 783 783 783 783 783 783 783 782 782 782 782 782 782 782 782 781 781 781 781 781 781 781 781 780 780 780 780 780 780 780 780 779 779 779 779 779
-638 779 779 779 778 778 778 778 778 778 778 778 777 777 777 777 777 777 777 777 776 776 776 776 776 776 776 776 775 775 775 775 775 775 775 775 774 774 774 774 774 774 774 773 773 773 773 773 773 773 773 772 772 772 772 772 772 772 772 771 771 771 771 771 771 771 771 770 770 770 770
-643 770 770 770 770 770 769 769 769 769 769 769 769 769 768 768 768 768 768 768 768 768 767 767 767 767 767 767 767 767 766 766 766 766 766 766 766 766 765 765 765 765 765 765 765 765 764 764 764 764 764 764 764 764 763 763 763 763 763 763 763 763 762 762 762 762 762 762 762 762 761
-649 761 761 761 761 761 761 761 761 760 760 760 760 760 760 760 760 759 759 759 759 759 759 759 759 758 758 758 758 758 758 758 758 757 757 757 757 757 757 757 757 756 756 756 756 756 756 756 756 755 755 755 755 755 755 755 755 755 754 754 754 754 754 754 754 754 753 753 753 753 753
-654 753 753 753 753 752 752 752 752 752 752 752 752 751 751 751 751 751 751 751 751 750 750 750 750 750 750 750 750 750 749 749 749 749 749 749 749 749 748 748 748 748 748 748 748 748 747 747 747 747 747 747 747 747 746 746 746 746 746 746 746 746 746 745 745 745 745 745 745 745 745
-659 745 744 744 744 744 744 744 744 744 743 743 743 743 743 743 743 743 743 742 742 742 742 742 742 742 742 741 741 741 741 741 741 741 741 741 740 740 740 740 740 740 740 740 739 739 739 739 739 739 739 739 738 738 738 738 738 738 738 738 738 737 737 737 737 737 737 737 737 736 736
-665 736 736 736 736 736 736 736 736 735 735 735 735 735 735 735 735 734 734 734 734 734 734 734 734 734 733 733 733 733 733 733 733 733 732 732 732 732 732 732 732 732 732 731 731 731 731 731 731 731 731 730 730 730 730 730 730 730 730 730 729 729 729 729 729 729 729 729 729 728 728
-670 728 728 728 728 728 728 728 727 727 727 727 727 727 727 727 727 726 726 726 726 726 726 726 726 726 725 725 725 725 725 725 725 725 724 724 724 724 724 724 724 724 724 723 723 723 723 723 723 723 723 723 722 722 722 722 722 722 722 722 721 721 721 721 721 721 721 721 721 720 720
-675 720 720 720 720 720 720 720 720 719 719 719 719 719 719 719 719 719 718 718 718 718 718 718 718 718 718 717 717 717 717 717 717 717 717 716 716 716 716 716 716 716 716 716 715 715 715 715 715 715 715 715 715 714 714 714 714 714 714 714 714 714 713 713 713 713 713 713 713 713 713
-680 713 712 712 712 712 712 712 712 712 712 711 711 711 711 711 711 711 711 711 710 710 710 710 710 710 710 710 710 709 709 709 709 709 709 709 709 709 708 708 708 708 708 708 708 708 708 707 707 707 707 707 707 707 707 707 706 706 706 706 706 706 706 706 706 705 705 705 705 705 705
-686 705 705 705 705 704 704 704 704 704 704 704 704 704 703 703 703 703 703 703 703 703 703 702 702 702 702 702 702 702 702 702 701 701 701 701 701 701 701 701 701 700 700 700 700 700 700 700 700 700 699 699 699 699 699 699 699 699 699 699 698 698 698 698 698 698 698 698 698 697 697
-691 697 697 697 697 697 697 697 697 696 696 696 696 696 696 696 696 696 695 695 695 695 695 695 695 695 695 694 694 694 694 694 694 694 694 694 694 693 693 693 693 693 693 693 693 693 692 692 692 692 692 692 692 692 692 691 691 691 691 691 691 691 691 691 691 690 690 690 690 690 690
-696 690 690 690 690 689 689 689 689 689 689 689 689 689 688 688 688 688 688 688 688 688 688 688 687 687 687 687 687 687 687 687 687 686 686 686 686 686 686 686 686 686 686 685 685 685 685 685 685 685 685 685 684 684 684 684 684 684 684 684 684 684 683 683 683 683 683 683 683 683 683
-701 683 682 682 682 682 682 682 682 682 682 682 681 681 681 681 681 681 681 681 681 680 680 680 680 680 680 680 680 680 680 679 679 679 679 679 679 679 679 679 678 678 678 678 678 678 678 678 678 678 677 677 677 677 677 677 677 677 677 677 676 676 676 676 676 676 676 676 676 675 675
-707 675 675 675 675 675 675 675 675 675 674 674 674 674 674 674 674 674 674 674 673 673 673 673 673 673 673 673 673 672 672 672 672 672 672 672 672 672 672 671 671 671 671 671 671 671 671 671 671 670 670 670 670 670 670 670 670 670 670 669 669 669 669 669 669 669 669 669 669 668 668
-712 668 668 668 668 668 668 668 668 667 667 667 667 667 667 667 667 667 667 666 666 666 666 666 666 666 666 666 666 665 665 665 665 665 665 665 665 665 665 664 664 664 664 664 664 664 664 664 664 663 663 663 663 663 663 663 663 663 663 662 662 662 662 662 662 662 662 662 662 661 661
-717 661 661 661 661 661 661 661 661 661 660 660 660 660 660 660 660 660 660 660 659 659 659 659 659 659 659 659 659 659 658 658 658 658 658 658 658 658 658 658 657 657 657 657 657 657 657 657 657 657 656 656 656 656 656 656 656 656 656 656 655 655 655 655 655 655 655 655 655 655 654
-722 654 654 654 654 654 654 654 654 654 654 654 653 653 653 653 653 653 653 653 653 653 652 652 652 652 652 652 652 652 652 652 651 651 651 651 651 651 651 651 651 651 650 650 650 650 650 650 650 650 650 650 649 649 649 649 649 649 649 649 649 649 649 648 648 648 648 648 648 648 648
-728 648 648 648 647 647 647 647 647 647 647 647 647 647 646 646 646 646 646 646 646 646 646 646 646 645 645 645 645 645 645 645 645 645 645 644 644 644 644 644 644 644 644 644 644 644 643 643 643 643 643 643 643 643 643 643 642 642 642 642 642 642 642 642 642 642 641 641 641 641 641
-733 641 641 641 641 641 641 641 640 640 640 640 640 640 640 640 640 640 639 639 639 639 639 639 639 639 639 639 639 638 638 638 638 638 638 638 638 638 638 637 637 637 637 637 637 637 637 637 637 637 636 636 636 636 636 636 636 636 636 636 636 635 635 635 635 635 635 635 635 635 635
-738 635 634 634 634 634 634 634 634 634 634 634 634 633 633 633 633 633 633 633 633 633 633 633 632 632 632 632 632 632 632 632 632 632 631 631 631 631 631 631 631 631 631 631 631 630 630 630 630 630 630 630 630 630 630 630 629 629 629 629 629 629 629 629 629 629 629 628 628 628 628
-744 628 628 628 628 628 628 628 627 627 627 627 627 627 627 627 627 627 627 626 626 626 626 626 626 626 626 626 626 626 625 625 625 625 625 625 625 625 625 625 625 624 624 624 624 624 624 624 624 624 624 624 623 623 623 623 623 623 623 623 623 623 623 622 622 622 622 622 622 622 622
-749 622 622 622 622 621 621 621 621 621 621 621 621 621 621 621 620 620 620 620 620 620 620 620 620 620 620 619 619 619 619 619 619 619 619 619 619 619 618 618 618 618 618 618 618 618 618 618 618 617 617 617 617 617 617 617 617 617 617 617 616 616 616 616 616 616 616 616 616 616 616
-754 616 615 615 615 615 615 615 615 615 615 615 615 614 614 614 614 614 614 614 614 614 614 614 614 613 613 613 613 613 613 613 613 613 613 613 612 612 612 612 612 612 612 612 612 612 612 611 611 611 611 611 611 611 611 611 611 611 610 610 610 610 610 610 610 610 610 610 610 610 609
-759 609 609 609 609 609 609 609 609 609 609 609 608 608 608 608 608 608 608 608 608 608 608 607 607 607 607 607 607 607 607 607 607 607 607 606 606 606 606 606 606 606 606 606 606 606 605 605 605 605 605 605 605 605 605 605 605 605 604 604 604 604 604 604 604 604 604 604 604 603 603
-765 603 603 603 603 603 603 603 603 603 603 603 602 602 602 602 602 602 602 602 602 602 602 601 601 601 601 601 601 601 601 601 601 601 601 600 600 600 600 600 600 600 600 600 600 600 599 599 599 599 599 599 599 599 599 599 599 599 598 598 598 598 598 598 598 598 598 598 598 598 597
-770 597 597 597 597 597 597 597 597 597 597 597 596 596 596 596 596 596 596 596 596 596 596 596 595 595 595 595 595 595 595 595 595 595 595 595 594 594 594 594 594 594 594 594 594 594 594 594 593 593 593 593 593 593 593 593 593 593 593 592 592 592 592 592 592 592 592 592 592 592 592
-775 592 591 591 591 591 591 591 591 591 591 591 591 591 590 590 590 590 590 590 590 590 590 590 590 590 589 589 589 589 589 589 589 589 589 589 589 589 588 588 588 588 588 588 588 588 588 588 588 588 587 587 587 587 587 587 587 587 587 587 587 587 586 586 586 586 586 586 586 586 586
-780 586 586 586 586 585 585 585 585 585 585 585 585 585 585 585 585 584 584 584 584 584 584 584 584 584 584 584 584 583 583 583 583 583 583 583 583 583 583 583 583 582 582 582 582 582 582 582 582 582 582 582 582 581 581 581 581 581 581 581 581 581 581 581 581 580 580 580 580 580 580
-786 580 580 580 580 580 580 580 580 579 579 579 579 579 579 579 579 579 579 579 579 578 578 578 578 578 578 578 578 578 578 578 578 577 577 577 577 577 577 577 577 577 577 577 577 576 576 576 576 576 576 576 576 576 576 576 576 576 575 575 575 575 575 575 575 575 575 575 575 575 574
-791 574 574 574 574 574 574 574 574 574 574 574 574 574 573 573 573 573 573 573 573 573 573 573 573 573 572 572 572 572 572 572 572 572 572 572 572 572 571 571 571 571 571 571 571 571 571 571 571 571 571 570 570 570 570 570 570 570 570 570 570 570 570 570 569 569 569 569 569 569 569
-796 569 569 569 569 569 569 568 568 568 568 568 568 568 568 568 568 568 568 568 567 567 567 567 567 567 567 567 567 567 567 567 566 566 566 566 566 566 566 566 566 566 566 566 566 565 565 565 565 565 565 565 565 565 565 565 565 565 564 564 564 564 564 564 564 564 564 564 564 564 563
-801 563 563 563 563 563 563 563 563 563 563 563 563 563 562 562 562 562 562 562 562 562 562 562 562 562 562 561 561 561 561 561 561 561 561 561 561 561 561 561 560 560 560 560 560 560 560 560 560 560 560 560 560 559 559 559 559 559 559 559 559 559 559 559 559 559 558 558 558 558 558
-807 558 558 558 558 558 558 558 558 558 557 557 557 557 557 557 557 557 557 557 557 557 557 556 556 556 556 556 556 556 556 556 556 556 556 556 555 555 555 555 555 555 555 555 555 555 555 555 555 554 554 554 554 554 554 554 554 554 554 554 554 554 553 553 553 553 553 553 553 553 553
-812 553 553 553 553 553 552 552 552 552 552 552 552 552 552 552 552 552 552 551 551 551 551 551 551 551 551 551 551 551 551 551 550 550 550 550 550 550 550 550 550 550 550 550 550 550 549 549 549 549 549 549 549 549 549 549 549 549 549 548 548 548 548 548 548 548 548 548 548 548 548
-817 548 548 547 547 547 547 547 547 547 547 547 547 547 547 547 547 546 546 546 546 546 546 546 546 546 546 546 546 546 545 545 545 545 545 545 545 545 545 545 545 545 545 544 544 544 544 544 544 544 544 544 544 544 544 544 544 543 543 543 543 543 543 543 543 543 543 543 543 543 542
-823 542 542 542 542 542 542 542 542 542 542 542 542 542 542 541 541 541 541 541 541 541 541 541 541 541 541 541 540 540 540 540 540 540 540 540 540 540 540 540 540 540 539 539 539 539 539 539 539 539 539 539 539 539 539 539 538 538 538 538 538 538 538 538 538 538 538 538 538 537 537
-828 537 537 537 537 537 537 537 537 537 537 537 537 537 536 536 536 536 536 536 536 536 536 536 536 536 536 536 535 535 535 535 535 535 535 535 535 535 535 535 535 535 534 534 534 534 534 534 534 534 534 534 534 534 534 534 533 533 533 533 533 533 533 533 533 533 533 533 533 533 532
-833 532 532 532 532 532 532 532 532 532 532 532 532 532 531 531 531 531 531 531 531 531 531 531 531 531 531 531 530 530 530 530 530 530 530 530 530 530 530 530 530 530 529 529 529 529 529 529 529 529 529 529 529 529 529 529 529 528 528 528 528 528 528 528 528 528 528 528 528 528 528
-838 528 527 527 527 527 527 527 527 527 527 527 527 527 527 527 526 526 526 526 526 526 526 526 526 526 526 526 526 526 525 525 525 525 525 525 525 525 525 525 525 525 525 525 524 524 524 524 524 524 524 524 524 524 524 524 524 524 523 523 523 523 523 523 523 523 523 523 523 523 523
-844 523 523 523 522 522 522 522 522 522 522 522 522 522 522 522 522 522 521 521 521 521 521 521 521 521 521 521 521 521 521 521 520 520 520 520 520 520 520 520 520 520 520 520 520 520 520 519 519 519 519 519 519 519 519 519 519 519 519 519 519 518 518 518 518 518 518 518 518 518 518
-849 518 518 518 518 518 518 517 517 517 517 517 517 517 517 517 517 517 517 517 517 516 516 516 516 516 516 516 516 516 516 516 516 516 516 516 515 515 515 515 515 515 515 515 515 515 515 515 515 515 515 514 514 514 514 514 514 514 514 514 514 514 514 514 514 513 513 513 513 513 513
-854 513 513 513 513 513 513 513 513 513 513 512 512 512 512 512 512 512 512 512 512 512 512 512 512 512 511 511 511 511 511 511 511 511 511 511 511 511 511 511 511 510 510 510 510 510 510 510 510 510 510 510 510 510 510 510 509 509 509 509 509 509 509 509 509 509 509 509 509 509 508
-859 508 508 508 508 508 508 508 508 508 508 508 508 508 508 508 507 507 507 507 507 507 507 507 507 507 507 507 507 507 507 506 506 506 506 506 506 506 506 506 506 506 506 506 506 506 505 505 505 505 505 505 505 505 505 505 505 505 505 505 505 504 504 504 504 504 504 504 504 504 504
-865 504 504 504 504 504 504 504 503 503 503 503 503 503 503 503 503 503 503 503 503 503 503 502 502 502 502 502 502 502 502 502 502 502 502 502 502 502 501 501 501 501 501 501 501 501 501 501 501 501 501 501 501 500 500 500 500 500 500 500 500 500 500 500 500 500 500 500 500 499 499
-870 499 499 499 499 499 499 499 499 499 499 499 499 499 499 498 498 498 498 498 498 498 498 498 498 498 498 498 498 498 497 497 497 497 497 497 497 497 497 497 497 497 497 497 497 497 496 496 496 496 496 496 496 496 496 496 496 496 496 496 496 495 495 495 495 495 495 495 495 495 495
-875 495 495 495 495 495 495 495 494 494 494 494 494 494 494 494 494 494 494 494 494 494 494 494 493 493 493 493 493 493 493 493 493 493 493 493 493 493 493 492 492 492 492 492 492 492 492 492 492 492 492 492 492 492 492 491 491 491 491 491 491 491 491 491 491 491 491 491 491 491 491
-880 491 490 490 490 490 490 490 490 490 490 490 490 490 490 490 490 489 489 489 489 489 489 489 489 489 489 489 489 489 489 489 489 488 488 488 488 488 488 488 488 488 488 488 488 488 488 488 488 487 487 487 487 487 487 487 487 487 487 487 487 487 487 487 487 486 486 486 486 486 486
-886 486 486 486 486 486 486 486 486 486 486 486 485 485 485 485 485 485 485 485 485 485 485 485 485 485 485 485 484 484 484 484 484 484 484 484 484 484 484 484 484 484 484 484 483 483 483 483 483 483 483 483 483 483 483 483 483 483 483 483 482 482 482 482 482 482 482 482 482 482 482
-891 482 482 482 482 482 482 482 481 481 481 481 481 481 481 481 481 481 481 481 481 481 481 481 480 480 480 480 480 480 480 480 480 480 480 480 480 480 480 480 479 479 479 479 479 479 479 479 479 479 479 479 479 479 479 479 478 478 478 478 478 478 478 478 478 478 478 478 478 478 478
-896 478 478 478 477 477 477 477 477 477 477 477 477 477 477 477 477 477 477 477 476 476 476 476 476 476 476 476 476 476 476 476 476 476 476 476 476 475 475 475 475 475 475 475 475 475 475 475 475 475 475 475 475 474 474 474 474 474 474 474 474 474 474 474 474 474 474 474 474 474 473
-902 473 473 473 473 473 473 473 473 473 473 473 473 473 473 473 473 473 472 472 472 472 472 472 472 472 472 472 472 472 472 472 472 472 471 471 471 471 471 471 471 471 471 471 471 471 471 471 471 471 471 470 470 470 470 470 470 470 470 470 470 470 470 470 470 470 470 470 469 469 469
-907 469 469 469 469 469 469 469 469 469 469 469 469 469 469 469 468 468 468 468 468 468 468 468 468 468 468 468 468 468 468 468 468 467 467 467 467 467 467 467 467 467 467 467 467 467 467 467 467 467 466 466 466 466 466 466 466 466 466 466 466 466 466 466 466 466 466 465 465 465 465
-912 465 465 465 465 465 465 465 465 465 465 465 465 465 465 464 464 464 464 464 464 464 464 464 464 464 464 464 464 464 464 464 463 463 463 463 463 463 463 463 463 463 463 463 463 463 463 463 463 462 462 462 462 462 462 462 462 462 462 462 462 462 462 462 462 462 462 461 461 461 461
-917 461 461 461 461 461 461 461 461 461 461 461 461 461 461 460 460 460 460 460 460 460 460 460 460 460 460 460 460 460 460 460 459 459 459 459 459 459 459 459 459 459 459 459 459 459 459 459 459 459 458 458 458 458 458 458 458 458 458 458 458 458 458 458 458 458 458 457 457 457 457
-923 457 457 457 457 457 457 457 457 457 457 457 457 457 457 457 456 456 456 456 456 456 456 456 456 456 456 456 456 456 456 456 456 456 455 455 455 455 455 455 455 455 455 455 455 455 455 455 455 455 455 454 454 454 454 454 454 454 454 454 454 454 454 454 454 454 454 454 454 453 453
-928 453 453 453 453 453 453 453 453 453 453 453 453 453 453 453 453 453 452 452 452 452 452 452 452 452 452 452 452 452 452 452 452 452 452 452 451 451 451 451 451 451 451 451 451 451 451 451 451 451 451 451 451 451 450 450 450 450 450 450 450 450 450 450 450 450 450 450 450 450 450
-933 450 450 449 449 449 449 449 449 449 449 449 449 449 449 449 449 449 449 449 449 448 448 448 448 448 448 448 448 448 448 448 448 448 448 448 448 448 448 447 447 447 447 447 447 447 447 447 447 447 447 447 447 447 447 447 447 446 446 446 446 446 446 446 446 446 446 446 446 446 446
-938 446 446 446 446 446 445 445 445 445 445 445 445 445 445 445 445 445 445 445 445 445 445 445 445 444 444 444 444 444 444 444 444 444 444 444 444 444 444 444 444 444 444 443 443 443 443 443 443 443 443 443 443 443 443 443 443 443 443 443 443 442 442 442 442 442 442 442 442 442 442
-944 442 442 442 442 442 442 442 442 442 442 441 441 441 441 441 441 441 441 441 441 441 441 441 441 441 441 441 441 440 440 440 440 440 440 440 440 440 440 440 440 440 440 440 440 440 440 440 439 439 439 439 439 439 439 439 439 439 439 439 439 439 439 439 439 439 439 438 438 438 438
-949 438 438 438 438 438 438 438 438 438 438 438 438 438 438 438 437 437 437 437 437 437 437 437 437 437 437 437 437 437 437 437 437 437 437 436 436 436 436 436 436 436 436 436 436 436 436 436 436 436 436 436 436 436 435 435 435 435 435 435 435 435 435 435 435 435 435 435 435 435 435
-954 435 435 435 434 434 434 434 434 434 434 434 434 434 434 434 434 434 434 434 434 434 434 433 433 433 433 433 433 433 433 433 433 433 433 433 433 433 433 433 433 433 432 432 432 432 432 432 432 432 432 432 432 432 432 432 432 432 432 432 432 431 431 431 431 431 431 431 431 431 431
-960 431 431 431 431 431 431 431 431 431 431 430 430 430 430 430 430 430 430 430 430 430 430 430 430 430 430 430 430 430 430 429 429 429 429 429 429 429 429 429 429 429 429 429 429 429 429 429 429 429 428 428 428 428 428 428 428 428 428 428 428 428 428 428 428 428 428 428 428 427 427
-965 427 427 427 427 427 427 427 427 427 427 427 427 427 427 427 427 427 427 427 426 426 426 426 426 426 426 426 426 426 426 426 426 426 426 426 426 426 426 426 425 425 425 425 425 425 425 425 425 425 425 425 425 425 425 425 425 425 425 424 424 424 424 424 424 424 424 424 424 424 424
-970 424 424 424 424 424 424 424 424 424 423 423 423 423 423 423 423 423 423 423 423 423 423 423 423 423 423 423 423 423 422 422 422 422 422 422 422 422 422 422 422 422 422 422 422 422 422 422 422 421 421 421 421 421 421 421 421 421 421 421 421 421 421 421 421 421 421 421 421 420 420
-975 420 420 420 420 420 420 420 420 420 420 420 420 420 420 420 420 420 420 420 419 419 419 419 419 419 419 419 419 419 419 419 419 419 419 419 419 419 419 419 418 418 418 418 418 418 418 418 418 418 418 418 418 418 418 418 418 418 418 418 418 417 417 417 417 417 417 417 417 417 417
-981 417 417 417 417 417 417 417 417 417 417 417 416 416 416 416 416 416 416 416 416 416 416 416 416 416 416 416 416 416 416 416 415 415 415 415 415 415 415 415 415 415 415 415 415 415 415 415 415 415 415 415 414 414 414 414 414 414 414 414 414 414 414 414 414 414 414 414 414 414 414
-986 414 414 414 413 413 413 413 413 413 413 413 413 413 413 413 413 413 413 413 413 413 413 413 412 412 412 412 412 412 412 412 412 412 412 412 412 412 412 412 412 412 412 412 412 411 411 411 411 411 411 411 411 411 411 411 411 411 411 411 411 411 411 411 411 411 410 410 410 410 410
-991 410 410 410 410 410 410 410 410 410 410 410 410 410 410 410 410 409 409 409 409 409 409 409 409 409 409 409 409 409 409 409 409 409 409 409 409 409 408 408 408 408 408 408 408 408 408 408 408 408 408 408 408 408 408 408 408 408 408 407 407 407 407 407 407 407 407 407 407 407 407
-996 407 407 407 407 407 407 407 407 407 407 406 406 406 406 406 406 406 406 406 406 406 406 406 406 406 406 406 406 406 406 406 405 405 405 405 405 405 405 405 405 405 405 405 405 405 405 405 405 405 405 405 405 404 404 404 0
-1001@
##END=		$$ NMR SPECTRUM
##TITLE=	
##JCAMP-DX=	6.0	$$ MestReNova 15.0.0-34764
##DATA TYPE=	NMR PEAK TABLE
##DATA CLASS=	PEAK TABLE
##BLOCK_ID=	3
##ORIGIN=	Mestrelab Research S.L.
##OWNER=	PC
##CROSS REFERENCE=	NMR SPECTRUM: BLOCK_ID=2                                     
##.OBSERVE FREQUENCY=	200.12849902499999644
##.OBSERVE NUCLEUS=	^Unknown
##NPOINTS=	79
##FIRSTX=	0.93139748673483058194
##LASTX=	4.1472936779447726607
##XFACTOR=	1
##YFACTOR=	1
##FIRSTY=	0.0069304724325196824172
##XUNITS=	PPM
##YUNITS=	ARBITRARY UNITS
##PEAK TABLE=	(XYW..XYW)
0.93139748673483058194,0.0069304724325196824172,0.0022154749012334674571
0.93361596160859050553,0.02023128669967905538,0.0032365758595732682483
0.96810113282880883023,0.036443009211950677662,0.0024736306843594537547
0.97000849576684333719,0.037213529803381037442,0.0026112809366829305494
1.004483414556013976,0.2858496647517057565,0.0030951310446214602701
1.0353600277592485135,0.2064256604198849987,0.0032365758595732682483
1.632394541682700817,0.0017590835195893067371,0.0024736306843594537547
1.6349100777156446718,0.003182864736607513359,0.0024736306843594537547
1.6656431977389598575,0.0028175991237603587904,0.0024736306843594537547
1.6684848036750901112,0.0088526989749024963955,0.0024736306843594537547
1.6715365843759455444,0.0038751626937652701964,0.0024736306843594537547
1.6986211380960358763,0.001873749135908305951,0.0019280406976872714597
1.7019730697702357691,0.0096072942128290639979,0.0025592917932972291187
1.704888237976133647,0.0099224642249665807175,0.0041782336270465118833
1.7350827636827748091,0.0019519136471096486338,0.0020557331945680098334
1.7380251111962747856,0.013133131807623913204,0.0055429455251450607603
1.7516953794211846951,0.056868419447080972851,0.0036334457322258150412
1.7713886179920912411,0.0069916520522256501297,0.0036687601900332270782
1.7738107547737664849,0.003703742615694497007,0.0028305351886708865483
1.7760572985563509718,0.0015975419060331691283,0.0022787288263686356765
1.8048128519857358221,0.0013982413474503550994,0.0024736306843594537547
1.8072216342767313257,0.0022582712529308369281,0.0029727264120302551546
1.8091882113290416179,0.0011733491257409952701,0.0024736306843594537547
1.8295012688072995743,0.053191219169064087036,0.0036041847631850822652
2.6420077163327331249,0.0043706547780848698306,0.0024736306843594537547
2.6606950040406553981,0.0062533121627377638227,0.0024736306843594537547
2.6725206542564694523,0.0055661038084283860627,0.0024736306843594537547
2.6965726642137473057,0.010175913058727217506,0.0024736306843594537547
2.7000043480514412941,0.024141208413528233295,0.0024736306843594537547
2.7270711625239316689,0.020269873610453088136,0.0024736306843594537547
2.7335562682735745632,0.026870029560521591083,0.0024736306843594537547
2.7663629108077687491,0.026659482983649385873,0.0024736306843594537547
2.7732252982978704559,0.020154076068469320426,0.0024736306843594537547
2.7999324985171765157,0.024138455316590676919,0.0024736306843594537547
$$ [...]
Compound,None,,1,-0.026684052101960530068,0,0
Compound,None,,1,-0.05982985610916870256,0,0
Compound,None,,1,0.11816230224574159058,0,0
Compound,None,,1,0.98219113952072589768,0,0
Compound,None,,1,0.40000000000000007772,0,0
Compound,None,,1,0.81906550571652103621,0,0
Compound,None,,1,0.13987118275358254027,0,0
Compound,None,,1,-0.1405641542722209647,0,0
Compound,None,,1,0.56204898347852882967,0,0
Compound,None,,1,0.2000000000000000111,0,0
Compound,None,,1,0,0,0
Compound,None,,1,-0.31479609998113072811,0,0
Compound,None,,1,0.75102579571904537481,0,0
Compound,None,,1,0,0,0
Compound,None,,1,-0.041870883096247230037,0,0
Compound,None,,1,-0.022479344160386504486,0,0
Compound,None,,1,-0.08763381611974208063,0,0
Compound,None,,1,-0.029126553192500403977,0,0
Compound,None,,1,-0.01864933976601473864,0,0
Compound,None,,1,-0.035262607284657687678,0,0
Compound,None,,1,-0.032237055938523516418,0,0
Compound,None,,1,-0.052941158422991574373,0,0
Compound,None,,1,-0.011040347022357455131,0,0
Compound,None,,1,-0.084517615327061035302,0,0
Compound,None,,1,0,0,0
Compound,None,,1,-0.044038282518658183884,0,0
Compound,None,,1,0,0,0
Compound,None,,1,0.51232118613093935444,0,0
Compound,None,,1,0.40000000000000007772,0,0
Compound,None,,1,0.4023923849895691407,0,0
Compound,None,,1,-0.15873925331879396028,0,0
Compound,None,,1,0.49092122781755004324,0,0
Compound,None,,1,0.78218287107359807386,0,0
Compound,None,,1,0.40000000000000007772,0,0
Compound,None,,1,0.60190726034312436177,0,0
Compound,None,,1,0.080302411453112843009,0,0
Compound,None,,1,-0.15991436480541609821,0,0
Compound,None,,1,-0.41513802768672686261,0,0
Compound,None,,1,-0.12986981236996064659,0,0
Compound,None,,1,-0.088990114418413146513,0,0
Compound,None,,1,-0.09267700088542790704,0,0
Compound,None,,1,0.53356325267616444563,0,0
Compound,None,,1,-0.099914813807462518613,0,0
Compound,None,,1,-0.24899304466188099116,0,0
Compound,None,,1,-0.33277934899337852093,0,0
Compound,None,,1,-0.2000000000000000111,0,0
Compound,None,,1,-0.017605061904223062719,0,0
Compound,None,,1,0.13105631407932633037,0,0
Compound,None,,1,0.30675885886063974928,0,0
Compound,None,,1,0.5261395373601809311,0,0
Compound,None,,1,-0.018211972608004643043,0,0
Compound,None,,1,-0.17672980436858953812,0,0
Compound,None,,1,-0.23885022525610050126,0,0
Compound,None,,1,-0.02663565805509672188,0,0
Compound,None,,1,-0.15118930092308868751,0,0
Compound,None,,1,0.68704855793378238893,0,0
Compound,None,,1,-0.24939152407478321072,0,0
Compound,None,,1,-0.27868464758021832539,0,0
Compound,None,,1,-1,0,0
Compound,None,,1,0.66652282620584690775,0,0
Compound,None,,1,0,0,0
Compound,None,,1,-0.23253318767041553095,0,0
Compound,None,,1,0.069033465027370177758,0,0
Compound,None,,1,-0.33825616699237853746,0,0
Compound,None,,1,0.37831236044320321055,0,0
Compound,None,,1,-0.19836046746127727891,0,0
Compound,None,,1,0.077619495303937857678,0,0
Compound,None,,1,0.20336891930370937231,0,0
##END=		$$ NMR PEAK TABLE
##END=		$$ LINK
