##TITLE=	Document 20
##JCAMP-DX=	6.0	$$ MestReNova 15.0.0-34764
##DATA TYPE=	LINK
##BLOCKS=	4    
##ORIGIN=	Mestrelab Research S.L.
##OWNER=	PC
##$MNOVA/METADATA=	(DOCUMENT,BASE64)
ewogICAgIm5hbWUiOiAiRG9jdW1lbnQgMjAiLAogICAgInBhZ2VzIjogWwogICAgICAgIHsKICAgICA
gICAgICAgIml0ZW1zIjogWwogICAgICAgICAgICAgICAgIjMiLCAgICAgICAgICAgICAgICAgICAgIC
AgICAgICAgICAgICAgICAKICAgICAgICAgICAgICAgICIyIiAgICAgICAgICAgICAgICAgICAgICAgI
CAgICAgICAgICAgICAKICAgICAgICAgICAgXQogICAgICAgIH0KICAgIF0KfQo=
##TITLE=	
##JCAMP-CS=	3.7	$$ MestReNova 15.0.0-34764
##BLOCK_ID=	1
##ORIGIN=	Mestrelab Research S.L.
##OWNER=	PC
##NAMES=	
##ATOMLIST=	
$$ AN	AS	NH
	1	Z	 
	2	Z	 
	3	Z	 
	4	Z	 
	5	Z	 
	6	Z	 
	7	Z	 
	8	Z	 
	9	Z	 
	10	Z	 
	11	Z	 
	12	Z	 
##BONDLIST=	
$$ AN1	AN2	BT
	1	2	S
	2	3	S
	2	4	S
	4	5	S
	4	6	S
	4	12	S
	6	12	S
	7	8	S
	8	9	S
	9	10	S
	10	11	S
##MAXRASTER=	32768
##XY_RASTER=	
$$ AN	X	Y	Z
	1	0	-32768	0
	2	16383	-28377	0
	3	28377	-16384	0
	4	32768	0	0
	5	28377	16383	0
	6	16384	28377	0
	7	0	32768	0
	8	-16383	28377	0
	9	-28377	16384	0
	10	-32768	0	0
	11	-28377	-16383	0
	12	-16384	-28377	0
##END=		$$ JCAMP-CS
##TITLE=	H NMR calculated spectrum
##JCAMP-CS=	3.7	$$ MestReNova 15.0.0-34764
##BLOCK_ID=	2
##ORIGIN=	Mestrelab Research S.L.
##OWNER=	PC
##$MNOVA/METADATA=	(ITEM,BASE64)
ewogICAgImFuZ2xlIjogMCwKICAgICJwb2ludHMiOiBbCiAgICAgICAgewogICAgICAgICAgICAieCI
6IDU1NTcsCiAgICAgICAgICAgICJ5IjogNjA3MQogICAgICAgIH0sCiAgICAgICAgewogICAgICAgIC
AgICAieCI6IDYxODcuNjU2ODA3MjU1NzQzLAogICAgICAgICAgICAieSI6IDYwNzEKICAgICAgICB9L
AogICAgICAgIHsKICAgICAgICAgICAgIngiOiA2MTg3LjY1NjgwNzI1NTc0MywKICAgICAgICAgICAg
InkiOiA2NjczLjAxOTg4NjA5NjU1OQogICAgICAgIH0sCiAgICAgICAgewogICAgICAgICAgICAieCI
6IDU1NTcsCiAgICAgICAgICAgICJ5IjogNjY3My4wMTk4ODYwOTY1NTkKICAgICAgICB9LAogICAgIC
AgIHsKICAgICAgICAgICAgIngiOiA1NTU3LAogICAgICAgICAgICAieSI6IDYwNzEKICAgICAgICB9C
iAgICBdLAogICAgInoiOiAxCn0K
##NAMES=	H NMR calculated spectrum
##ATOMLIST=	
$$ AN	AS	NH
	1	C	3
	2	C	1
	3	C	3
	4	O	 
	5	P	 
	6	C	3
	7	O	 
	8	O	 
	9	C	2
	10	C	 
	11	C	1
	12	C	1
	13	C	1
	14	C	1
	15	C	1
##BONDLIST=	
$$ AN1	AN2	BT
	1	2	S
	2	3	S
	2	4	S
	4	5	S
	5	6	S
	5	7	D
	5	8	S
	8	9	S
	9	10	S
	10	11	S
	10	15	D
	11	12	D
	12	13	S
	13	14	D
	14	15	S
##MAXRASTER=	32768
##XY_RASTER=	
$$ AN	X	Y	Z
	1	32768	1582	0
	2	30025	6328	0
	3	32768	11110	0
	4	24540	6328	0
	5	21692	11110	0
	6	16946	8367	0
	7	26474	13852	0
	8	18950	15856	0
	9	13500	15856	0
	10	10758	20603	0
	11	13500	25490	0
	12	10758	30271	0
	13	5168	30271	0
	14	2425	25490	0
	15	5168	20603	0
##END=		$$ JCAMP-CS
##TITLE=	
##JCAMP-DX=	6.0	$$ MestReNova 15.0.0-34764
##DATA TYPE=	NMR SPECTRUM
##DATA CLASS=	XYDATA
##BLOCK_ID=	3
##ORIGIN=	Mnova: Peaks
##OWNER=	PC
##NUMDIM=	1
##$MNOVA/METADATA=	(ITEM,BASE64)
ewogICAgImFuZ2xlIjogMCwKICAgICJheGVzIjogewogICAgICAgICJ4IjogewogICAgICAgICAgICA
ibWF4IjogMTQuMDAwMDg0MDAwNTA0MDAxLAogICAgICAgICAgICAibWluIjogLTEuOTk5NzY3ODU3OT
gyMTQ3OAogICAgICAgIH0sCiAgICAgICAgInkiOiB7CiAgICAgICAgICAgICJtYXgiOiAwLjEyODQ4O
$$ [...]
CAgICAieCI6IDg3MjIsCiAgICAgICAgICAgICJ5IjogODIwOAogICAgICAgIH0sCiAgICAgICAgewog
ICAgICAgICAgICAieCI6IDUzMjEsCiAgICAgICAgICAgICJ5IjogODIwOAogICAgICAgIH0sCiAgICA
gICAgewogICAgICAgICAgICAieCI6IDUzMjEsCiAgICAgICAgICAgICJ5IjogNTgzNQogICAgICAgIH
0KICAgIF0sCiAgICAieiI6IDAKfQo=
##.OBSERVE FREQUENCY=	500.12699922000001607
##.OBSERVE NUCLEUS=	^Unknown
##.SOLVENT NAME=	
##.PULSE SEQUENCE=	
##.ACQUISITIONMODE=	SIMULTANEOUS
##$ORIGINAL FORMAT=	MNova
##$MNOVA/SCALES_VERSION=	9
##$PARAMETER FILE=	(originalData.xml, ASCII, , 0)
$$ <?xml version="1.0" encoding="UTF-8"?>
$$ <MnovaSpectrumParams>
$$     <itemId>{da3f307b-05ea-4f4c-b031-eba2bd4e35b4}</itemId>
$$     <spectrumIndex>0</spectrumIndex>
$$     <DataFileName/>
$$     <Title>
$$         <dim0>Simulated Unknown NMR Spectrum</dim0>
$$     </Title>
$$     <Comment/>
$$     <Origin>
$$         <dim0>Mnova: Spin Simulation</dim0>
$$     </Origin>
$$     <Owner/>
$$     <Site/>
$$     <Instrument/>
$$     <Author/>
$$     <Solvent/>
$$     <Temperature/>
$$     <PulseSequence/>
$$     <Experiment>
$$         <dim0>1D</dim0>
$$     </Experiment>
$$     <Probe/>
$$     <NumberofScans/>
$$     <ReceiverGain/>
$$     <RelaxationDelay/>
$$     <PulseWidth/>
$$     <PresaturationFrequency/>
$$     <AcquisitionTime/>
$$     <AcquisitionDate/>
$$     <ModificationDate/>
$$     <Class/>
$$     <Purity>
$$         <dim0>99.9699750907766</dim0>
$$     </Purity>
$$     <SpectrumQuality>
$$         <dim0>-0.717715099280616</dim0>
$$     </SpectrumQuality>
$$     <Version/>
$$     <Algorithm/>
$$     <UseDB/>
$$     <GMMXCycles/>
$$     <LineWidth>
$$         <dim0>0</dim0>
$$     </LineWidth>
$$     <SpectrometerFrequency>
$$         <dim0>500.13</dim0>
$$     </SpectrometerFrequency>
$$     <SpectralWidth>
$$         <dim0>8002.08</dim0>
$$     </SpectralWidth>
$$     <LowestFrequency>
$$         <dim0>-1000.26</dim0>
$$     </LowestFrequency>
$$     <Nucleus>
$$         <dim0>Unknown</dim0>
$$     </Nucleus>
$$     <AcquiredSize/>
$$     <SpectralSize>
$$         <dim0>65536</dim0>
$$     </SpectralSize>
$$     <DigitalResolution>
$$         <dim0>0.12210205078125</dim0>
$$     </DigitalResolution>
$$     <AbsoluteReference/>
$$ </MnovaSpectrumParams>
$$ 
##$PARAMETER FILE=	(parameters, ASCII, , 0)
$$ <MnovaSpectrumParams>
$$ <SpecCount>1</SpecCount>
$$ <Dimensions>1</Dimensions>
$$ <Origin>Mnova: Peaks</Origin>
$$ <Window Dim="f1">
$$ <Nucleus>Unknown</Nucleus>
$$ <Points>65536</Points>
$$ <Width>8002.07999999999993</Width>
$$ <MHz>500.126999220000016</MHz>
$$ <Hz>-1000.25999999999999</Hz>
$$ </Window>
$$ <Window Dim="f0">
$$ <Points>1</Points>
$$ </Window>
$$ </MnovaSpectrumParams>
##$PARAMETER FILE=	(title, ASCII, , 0)
$$ 
##XUNITS=	HZ
##YUNITS=	ARBITRARY UNITS
##FIRSTX=	7001.819999999999709
##LASTX=	-1000.1378979492187682
##DELTAX=	-0.12210205078124998501
##XFACTOR=	1
##YFACTOR=	5.4392924217843190977E-11
##FIRSTY=	5.2071724709890077065E-09
##MINY=	0
##MAXY=	0.11680791527032852173
##NPOINTS=	65536
##XYDATA=	(X++(Y..Y))
$$ [...]
1808A847%%%j%%j%%%j%%j%%%j%%%j%%j%%%j%%%j%%j%%%j%%%j%%j%%%j%%%j%%%j%%j%%%j%%
$$ 1847 1847 1847 1847 1846 1846 1846 1845 1845 1845 1845 1844 1844 1844 1843 1843 1843 1843 1842 1842 1842 1842 1841 1841 1841 1840 1840 1840 1840 1839 1839 1839 1839 1838 1838 1838 1837 1837 1837 1837 1836 1836 1836 1836 1835 1835 1835 1834 1834 1834 1834 1833 1833 1833 1833 1832 1832 1832 1832 1831 1831 1831 1830 1830 1830 1830 1829 1829 1829
1799A829%j%%%j%%%j%%%j%%j%%%j%%%j%%%j%%%j%%%j%%%j%%%j%%%j%%%j%%%j%%%j%%%j%%%
$$ 1829 1829 1828 1828 1828 1828 1827 1827 1827 1827 1826 1826 1826 1826 1825 1825 1825 1824 1824 1824 1824 1823 1823 1823 1823 1822 1822 1822 1822 1821 1821 1821 1821 1820 1820 1820 1820 1819 1819 1819 1819 1818 1818 1818 1818 1817 1817 1817 1817 1816 1816 1816 1816 1815 1815 1815 1815 1814 1814 1814 1814 1813 1813 1813 1813 1812 1812 1812 1812
1791A812j%%%j%%%j%%%%j%%%j%%%j%%%j%%%j%%%%j%%%j%%%j%%%j%%%%j%%%j%%%j%%%%j%%%
$$ 1812 1811 1811 1811 1811 1810 1810 1810 1810 1809 1809 1809 1809 1809 1808 1808 1808 1808 1807 1807 1807 1807 1806 1806 1806 1806 1805 1805 1805 1805 1804 1804 1804 1804 1804 1803 1803 1803 1803 1802 1802 1802 1802 1801 1801 1801 1801 1800 1800 1800 1800 1800 1799 1799 1799 1799 1798 1798 1798 1798 1797 1797 1797 1797 1797 1796 1796 1796 1796
1783A796j%%%%j%%%j%%%j%%%%j%%%j%%%%j%%%j%%%%j%%%%j%%%j%%%%j%%%j%%%%j%%%%j%%%
$$ 1796 1795 1795 1795 1795 1795 1794 1794 1794 1794 1793 1793 1793 1793 1792 1792 1792 1792 1792 1791 1791 1791 1791 1790 1790 1790 1790 1790 1789 1789 1789 1789 1788 1788 1788 1788 1788 1787 1787 1787 1787 1787 1786 1786 1786 1786 1785 1785 1785 1785 1785 1784 1784 1784 1784 1783 1783 1783 1783 1783 1782 1782 1782 1782 1782 1781 1781 1781 1781
1774A781%j%%%j%%%%j%%%%j%%%%j%%%%j%%%%j%%%j%%%%j%%%%j%%%%j%%%%j%%%%j%%%%%j%%
$$ 1781 1781 1780 1780 1780 1780 1779 1779 1779 1779 1779 1778 1778 1778 1778 1778 1777 1777 1777 1777 1777 1776 1776 1776 1776 1776 1775 1775 1775 1775 1775 1774 1774 1774 1774 1773 1773 1773 1773 1773 1772 1772 1772 1772 1772 1771 1771 1771 1771 1771 1770 1770 1770 1770 1770 1769 1769 1769 1769 1769 1768 1768 1768 1768 1768 1768 1767 1767 1767
1766A767%%j%%%%j%%%%j%%%%j%%%%%j%%%%j%%%%j%%%%j%%%%%j%%%%j%%%%%j%%%%j%%%%%j%
$$ 1767 1767 1767 1766 1766 1766 1766 1766 1765 1765 1765 1765 1765 1764 1764 1764 1764 1764 1763 1763 1763 1763 1763 1763 1762 1762 1762 1762 1762 1761 1761 1761 1761 1761 1760 1760 1760 1760 1760 1759 1759 1759 1759 1759 1759 1758 1758 1758 1758 1758 1757 1757 1757 1757 1757 1757 1756 1756 1756 1756 1756 1755 1755 1755 1755 1755 1755 1754 1754
1758A754%%%j%%%%%j%%%%%j%%%%j%%%%%j%%%%%j%%%%%j%%%%%j%%%%j%%%%%j%%%%%j%%%%%%
$$ 1754 1754 1754 1754 1753 1753 1753 1753 1753 1753 1752 1752 1752 1752 1752 1752 1751 1751 1751 1751 1751 1750 1750 1750 1750 1750 1750 1749 1749 1749 1749 1749 1749 1748 1748 1748 1748 1748 1748 1747 1747 1747 1747 1747 1747 1746 1746 1746 1746 1746 1745 1745 1745 1745 1745 1745 1744 1744 1744 1744 1744 1744 1743 1743 1743 1743 1743 1743 1743
1749A743j%%%%%j%%%%%j%%%%%j%%%%%j%%%%%%j%%%%%j%%%%%j%%%%%%j%%%%%j%%%%%%j%%%%
$$ 1743 1742 1742 1742 1742 1742 1742 1741 1741 1741 1741 1741 1741 1740 1740 1740 1740 1740 1740 1739 1739 1739 1739 1739 1739 1738 1738 1738 1738 1738 1738 1738 1737 1737 1737 1737 1737 1737 1736 1736 1736 1736 1736 1736 1735 1735 1735 1735 1735 1735 1735 1734 1734 1734 1734 1734 1734 1733 1733 1733 1733 1733 1733 1733 1732 1732 1732 1732 1732
1741A732%%j%%%%%j%%%%%%j%%%%%%j%%%%%%j%%%%%%j%%%%%%j%%%%%%j%%%%%%j%%%%%%%j%%
$$ 1732 1732 1732 1731 1731 1731 1731 1731 1731 1730 1730 1730 1730 1730 1730 1730 1729 1729 1729 1729 1729 1729 1729 1728 1728 1728 1728 1728 1728 1728 1727 1727 1727 1727 1727 1727 1727 1726 1726 1726 1726 1726 1726 1726 1725 1725 1725 1725 1725 1725 1725 1724 1724 1724 1724 1724 1724 1724 1723 1723 1723 1723 1723 1723 1723 1723 1722 1722 1722
1733A722%%%%j%%%%%%j%%%%%%%j%%%%%%%j%%%%%%j%%%%%%%j%%%%%%%j%%%%%%%j%%%%%%%j%
$$ 1722 1722 1722 1722 1722 1721 1721 1721 1721 1721 1721 1721 1720 1720 1720 1720 1720 1720 1720 1720 1719 1719 1719 1719 1719 1719 1719 1719 1718 1718 1718 1718 1718 1718 1718 1717 1717 1717 1717 1717 1717 1717 1717 1716 1716 1716 1716 1716 1716 1716 1716 1715 1715 1715 1715 1715 1715 1715 1715 1714 1714 1714 1714 1714 1714 1714 1714 1713 1713
1725A713%%%%%%%j%%%%%%%j%%%%%%%j%%%%%%%%j%%%%%%%%j%%%%%%%%j%%%%%%%%j%%%%%%%%
$$ 1713 1713 1713 1713 1713 1713 1713 1713 1712 1712 1712 1712 1712 1712 1712 1712 1711 1711 1711 1711 1711 1711 1711 1711 1710 1710 1710 1710 1710 1710 1710 1710 1710 1709 1709 1709 1709 1709 1709 1709 1709 1709 1708 1708 1708 1708 1708 1708 1708 1708 1708 1707 1707 1707 1707 1707 1707 1707 1707 1707 1706 1706 1706 1706 1706 1706 1706 1706 1706
1716A706j%%%%%%%%j%%%%%%%%%j%%%%%%%%j%%%%%%%%%j%%%%%%%%%j%%%%%%%%%%j%%%%%%%%
$$ 1706 1705 1705 1705 1705 1705 1705 1705 1705 1705 1704 1704 1704 1704 1704 1704 1704 1704 1704 1704 1703 1703 1703 1703 1703 1703 1703 1703 1703 1702 1702 1702 1702 1702 1702 1702 1702 1702 1702 1701 1701 1701 1701 1701 1701 1701 1701 1701 1701 1700 1700 1700 1700 1700 1700 1700 1700 1700 1700 1700 1699 1699 1699 1699 1699 1699 1699 1699 1699
1708A699%j%%%%%%%%%%j%%%%%%%%%%j%%%%%%%%%%j%%%%%%%%%%j%%%%%%%%%%%j%%%%%%%%%%
$$ 1699 1699 1698 1698 1698 1698 1698 1698 1698 1698 1698 1698 1698 1697 1697 1697 1697 1697 1697 1697 1697 1697 1697 1697 1696 1696 1696 1696 1696 1696 1696 1696 1696 1696 1696 1695 1695 1695 1695 1695 1695 1695 1695 1695 1695 1695 1694 1694 1694 1694 1694 1694 1694 1694 1694 1694 1694 1694 1693 1693 1693 1693 1693 1693 1693 1693 1693 1693 1693
1700A693%j%%%%%%%%%%%%j%%%%%%%%%%%%j%%%%%%%%%%%%j%%%%%%%%%%%%%j%%%%%%%%%%%%%
$$ 1693 1693 1692 1692 1692 1692 1692 1692 1692 1692 1692 1692 1692 1692 1692 1691 1691 1691 1691 1691 1691 1691 1691 1691 1691 1691 1691 1691 1690 1690 1690 1690 1690 1690 1690 1690 1690 1690 1690 1690 1690 1689 1689 1689 1689 1689 1689 1689 1689 1689 1689 1689 1689 1689 1689 1688 1688 1688 1688 1688 1688 1688 1688 1688 1688 1688 1688 1688 1688
1691A688j%%%%%%%%%%%%%%j%%%%%%%%%%%%%%j%%%%%%%%%%%%%%%j%%%%%%%%%%%%%%%%j%%%%
$$ 1688 1687 1687 1687 1687 1687 1687 1687 1687 1687 1687 1687 1687 1687 1687 1687 1686 1686 1686 1686 1686 1686 1686 1686 1686 1686 1686 1686 1686 1686 1686 1685 1685 1685 1685 1685 1685 1685 1685 1685 1685 1685 1685 1685 1685 1685 1685 1684 1684 1684 1684 1684 1684 1684 1684 1684 1684 1684 1684 1684 1684 1684 1684 1684 1683 1683 1683 1683 1683
1683A683%%%%%%%%%%%%%j%%%%%%%%%%%%%%%%%%%j%%%%%%%%%%%%%%%%%%%j%%%%%%%%%%%%%%
$$ 1683 1683 1683 1683 1683 1683 1683 1683 1683 1683 1683 1683 1683 1683 1682 1682 1682 1682 1682 1682 1682 1682 1682 1682 1682 1682 1682 1682 1682 1682 1682 1682 1682 1682 1681 1681 1681 1681 1681 1681 1681 1681 1681 1681 1681 1681 1681 1681 1681 1681 1681 1681 1681 1681 1680 1680 1680 1680 1680 1680 1680 1680 1680 1680 1680 1680 1680 1680 1680
1675A680%%%%%%%%j%%%%%%%%%%%%%%%%%%%%%%%%j%%%%%%%%%%%%%%%%%%%%%%%%%%%j%%%%%%
$$ 1680 1680 1680 1680 1680 1680 1680 1680 1680 1679 1679 1679 1679 1679 1679 1679 1679 1679 1679 1679 1679 1679 1679 1679 1679 1679 1679 1679 1679 1679 1679 1679 1679 1679 1678 1678 1678 1678 1678 1678 1678 1678 1678 1678 1678 1678 1678 1678 1678 1678 1678 1678 1678 1678 1678 1678 1678 1678 1678 1678 1678 1678 1677 1677 1677 1677 1677 1677 1677
1666A677%%%%%%%%%%%%%%%%%%%%%%%%%%%j%%%%%%%%%%%%%%%%%%%%%%%%%%%%%%%%%%%%%%%%
$$ 1677 1677 1677 1677 1677 1677 1677 1677 1677 1677 1677 1677 1677 1677 1677 1677 1677 1677 1677 1677 1677 1677 1677 1677 1677 1677 1677 1677 1676 1676 1676 1676 1676 1676 1676 1676 1676 1676 1676 1676 1676 1676 1676 1676 1676 1676 1676 1676 1676 1676 1676 1676 1676 1676 1676 1676 1676 1676 1676 1676 1676 1676 1676 1676 1676 1676 1676 1676 1676
1658A676%%%j%%%%%%%%%%%%%%%%%%%%%%%%%%%%%%%%%%%%%%%%%%%%%%%%%%%%%%%%%%%%%%%%
$$ 1676 1676 1676 1676 1675 1675 1675 1675 1675 1675 1675 1675 1675 1675 1675 1675 1675 1675 1675 1675 1675 1675 1675 1675 1675 1675 1675 1675 1675 1675 1675 1675 1675 1675 1675 1675 1675 1675 1675 1675 1675 1675 1675 1675 1675 1675 1675 1675 1675 1675 1675 1675 1675 1675 1675 1675 1675 1675 1675 1675 1675 1675 1675 1675 1675 1675 1675 1675 1675
1650A675%%%%%%%%%%%%%%%%%%%%%%%%%%%%%%%%%%%%%%%%%%%%%%%%%%%%%%%%%%%%%%%%%%%%
$$ 1675 1675 1675 1675 1675 1675 1675 1675 1675 1675 1675 1675 1675 1675 1675 1675 1675 1675 1675 1675 1675 1675 1675 1675 1675 1675 1675 1675 1675 1675 1675 1675 1675 1675 1675 1675 1675 1675 1675 1675 1675 1675 1675 1675 1675 1675 1675 1675 1675 1675 1675 1675 1675 1675 1675 1675 1675 1675 1675 1675 1675 1675 1675 1675 1675 1675 1675 1675 1675
1642A675%%%%%%%%%%%%%%%%%%%%%%%%%%%%%%%%%%%%%%%%%%%%%%%%%%%%%%%%%%%%%%%%%%%%
$$ 1675 1675 1675 1675 1675 1675 1675 1675 1675 1675 1675 1675 1675 1675 1675 1675 1675 1675 1675 1675 1675 1675 1675 1675 1675 1675 1675 1675 1675 1675 1675 1675 1675 1675 1675 1675 1675 1675 1675 1675 1675 1675 1675 1675 1675 1675 1675 1675 1675 1675 1675 1675 1675 1675 1675 1675 1675 1675 1675 1675 1675 1675 1675 1675 1675 1675 1675 1675 1675
1633A675%%%%%%%%%%%J%%%%%%%%%%%%%%%%%%%%%%%%%%%%%%%%%%%%%%%%%%%%J%%%%%%%%%%%
$$ 1675 1675 1675 1675 1675 1675 1675 1675 1675 1675 1675 1675 1676 1676 1676 1676 1676 1676 1676 1676 1676 1676 1676 1676 1676 1676 1676 1676 1676 1676 1676 1676 1676 1676 1676 1676 1676 1676 1676 1676 1676 1676 1676 1676 1676 1676 1676 1676 1676 1676 1676 1676 1676 1676 1676 1676 1676 1677 1677 1677 1677 1677 1677 1677 1677 1677 1677 1677 1677
1625A677%%%%%%%%%%%%%%%%%%%%%%J%%%%%%%%%%%%%%%%%%%%%%%%%%%J%%%%%%%%%%%%%%%%%
$$ 1677 1677 1677 1677 1677 1677 1677 1677 1677 1677 1677 1677 1677 1677 1677 1677 1677 1677 1677 1677 1677 1677 1677 1678 1678 1678 1678 1678 1678 1678 1678 1678 1678 1678 1678 1678 1678 1678 1678 1678 1678 1678 1678 1678 1678 1678 1678 1678 1678 1678 1678 1679 1679 1679 1679 1679 1679 1679 1679 1679 1679 1679 1679 1679 1679 1679 1679 1679 1679
1617A679%%%%%%%J%%%%%%%%%%%%%%%%%%%%%%J%%%%%%%%%%%%%%%%%%%%J%%%%%%%%%%%%%%%%
$$ 1679 1679 1679 1679 1679 1679 1679 1679 1680 1680 1680 1680 1680 1680 1680 1680 1680 1680 1680 1680 1680 1680 1680 1680 1680 1680 1680 1680 1680 1680 1680 1681 1681 1681 1681 1681 1681 1681 1681 1681 1681 1681 1681 1681 1681 1681 1681 1681 1681 1681 1681 1681 1682 1682 1682 1682 1682 1682 1682 1682 1682 1682 1682 1682 1682 1682 1682 1682 1682
1608A682%%%J%%%%%%%%%%%%%%%%%J%%%%%%%%%%%%%%%%J%%%%%%%%%%%%%%%%J%%%%%%%%%%%%
$$ 1682 1682 1682 1682 1683 1683 1683 1683 1683 1683 1683 1683 1683 1683 1683 1683 1683 1683 1683 1683 1683 1683 1684 1684 1684 1684 1684 1684 1684 1684 1684 1684 1684 1684 1684 1684 1684 1684 1684 1685 1685 1685 1685 1685 1685 1685 1685 1685 1685 1685 1685 1685 1685 1685 1685 1685 1686 1686 1686 1686 1686 1686 1686 1686 1686 1686 1686 1686 1686
1600A686%%%J%%%%%%%%%%%%%%J%%%%%%%%%%%%%J%%%%%%%%%%%%%J%%%%%%%%%%%%%J%%%%%%%
$$ 1686 1686 1686 1686 1687 1687 1687 1687 1687 1687 1687 1687 1687 1687 1687 1687 1687 1687 1687 1688 1688 1688 1688 1688 1688 1688 1688 1688 1688 1688 1688 1688 1688 1689 1689 1689 1689 1689 1689 1689 1689 1689 1689 1689 1689 1689 1689 1690 1690 1690 1690 1690 1690 1690 1690 1690 1690 1690 1690 1690 1690 1691 1691 1691 1691 1691 1691 1691 1691
1592A691%%%%%J%%%%%%%%%%%%J%%%%%%%%%%%J%%%%%%%%%%%J%%%%%%%%%%%J%%%%%%%%%%%J%
$$ 1691 1691 1691 1691 1691 1691 1692 1692 1692 1692 1692 1692 1692 1692 1692 1692 1692 1692 1692 1693 1693 1693 1693 1693 1693 1693 1693 1693 1693 1693 1693 1694 1694 1694 1694 1694 1694 1694 1694 1694 1694 1694 1694 1695 1695 1695 1695 1695 1695 1695 1695 1695 1695 1695 1695 1696 1696 1696 1696 1696 1696 1696 1696 1696 1696 1696 1696 1697 1697
1583A697%%%%%%%%%J%%%%%%%%%%J%%%%%%%%%%J%%%%%%%%%J%%%%%%%%%%J%%%%%%%%%J%%%%%
$$ 1697 1697 1697 1697 1697 1697 1697 1697 1697 1697 1698 1698 1698 1698 1698 1698 1698 1698 1698 1698 1698 1699 1699 1699 1699 1699 1699 1699 1699 1699 1699 1699 1700 1700 1700 1700 1700 1700 1700 1700 1700 1700 1701 1701 1701 1701 1701 1701 1701 1701 1701 1701 1701 1702 1702 1702 1702 1702 1702 1702 1702 1702 1702 1703 1703 1703 1703 1703 1703
1575A703%%%%J%%%%%%%%%J%%%%%%%%J%%%%%%%%%J%%%%%%%%J%%%%%%%%J%%%%%%%%J%%%%%%%
$$ 1703 1703 1703 1703 1703 1704 1704 1704 1704 1704 1704 1704 1704 1704 1704 1705 1705 1705 1705 1705 1705 1705 1705 1705 1706 1706 1706 1706 1706 1706 1706 1706 1706 1706 1707 1707 1707 1707 1707 1707 1707 1707 1707 1708 1708 1708 1708 1708 1708 1708 1708 1708 1709 1709 1709 1709 1709 1709 1709 1709 1709 1710 1710 1710 1710 1710 1710 1710 1710
1567A710%J%%%%%%%%J%%%%%%%%J%%%%%%%J%%%%%%%%J%%%%%%%J%%%%%%%J%%%%%%%J%%%%%%%
$$ 1710 1710 1711 1711 1711 1711 1711 1711 1711 1711 1711 1712 1712 1712 1712 1712 1712 1712 1712 1712 1713 1713 1713 1713 1713 1713 1713 1713 1714 1714 1714 1714 1714 1714 1714 1714 1714 1715 1715 1715 1715 1715 1715 1715 1715 1716 1716 1716 1716 1716 1716 1716 1716 1717 1717 1717 1717 1717 1717 1717 1717 1718 1718 1718 1718 1718 1718 1718 1718
1559A718J%%%%%%%J%%%%%%%J%%%%%%%J%%%%%%%J%%%%%%J%%%%%%%J%%%%%%J%%%%%%J%%%%%%
$$ 1718 1719 1719 1719 1719 1719 1719 1719 1719 1720 1720 1720 1720 1720 1720 1720 1720 1721 1721 1721 1721 1721 1721 1721 1721 1722 1722 1722 1722 1722 1722 1722 1722 1723 1723 1723 1723 1723 1723 1723 1724 1724 1724 1724 1724 1724 1724 1724 1725 1725 1725 1725 1725 1725 1725 1726 1726 1726 1726 1726 1726 1726 1727 1727 1727 1727 1727 1727 1727
1550A727%J%%%%%%J%%%%%%J%%%%%%J%%%%%%J%%%%%%J%%%%%%J%%%%%%J%%%%%%J%%%%%J%%%%
$$ 1727 1727 1728 1728 1728 1728 1728 1728 1728 1729 1729 1729 1729 1729 1729 1729 1730 1730 1730 1730 1730 1730 1730 1731 1731 1731 1731 1731 1731 1731 1732 1732 1732 1732 1732 1732 1732 1733 1733 1733 1733 1733 1733 1733 1734 1734 1734 1734 1734 1734 1734 1735 1735 1735 1735 1735 1735 1735 1736 1736 1736 1736 1736 1736 1737 1737 1737 1737 1737
1542A737%%J%%%%%%J%%%%%J%%%%%%J%%%%%J%%%%%%J%%%%%J%%%%%J%%%%%%J%%%%%J%%%%%J%
$$ 1737 1737 1737 1738 1738 1738 1738 1738 1738 1738 1739 1739 1739 1739 1739 1739 1740 1740 1740 1740 1740 1740 1740 1741 1741 1741 1741 1741 1741 1742 1742 1742 1742 1742 1742 1742 1743 1743 1743 1743 1743 1743 1744 1744 1744 1744 1744 1744 1745 1745 1745 1745 1745 1745 1745 1746 1746 1746 1746 1746 1746 1747 1747 1747 1747 1747 1747 1748 1748
1534A748%%%%J%%%%%J%%%%%J%%%%%J%%%%%J%%%%%J%%%%%J%%%%%J%%%%J%%%%%J%%%%%J%%%%
$$ 1748 1748 1748 1748 1748 1749 1749 1749 1749 1749 1749 1750 1750 1750 1750 1750 1750 1751 1751 1751 1751 1751 1751 1752 1752 1752 1752 1752 1752 1753 1753 1753 1753 1753 1753 1754 1754 1754 1754 1754 1754 1755 1755 1755 1755 1755 1755 1756 1756 1756 1756 1756 1757 1757 1757 1757 1757 1757 1758 1758 1758 1758 1758 1758 1759 1759 1759 1759 1759
1525A759%J%%%%J%%%%%J%%%%J%%%%%J%%%%%J%%%%J%%%%J%%%%%J%%%%J%%%%%J%%%%J%%%%J%
$$ 1759 1759 1760 1760 1760 1760 1760 1761 1761 1761 1761 1761 1761 1762 1762 1762 1762 1762 1763 1763 1763 1763 1763 1763 1764 1764 1764 1764 1764 1764 1765 1765 1765 1765 1765 1766 1766 1766 1766 1766 1767 1767 1767 1767 1767 1767 1768 1768 1768 1768 1768 1769 1769 1769 1769 1769 1769 1770 1770 1770 1770 1770 1771 1771 1771 1771 1771 1772 1772
1517A772%%%J%%%%%J%%%%J%%%%J%%%%J%%%%J%%%%J%%%%%J%%%%J%%%%J%%%%J%%%%J%%%%J%%
$$ 1772 1772 1772 1772 1773 1773 1773 1773 1773 1773 1774 1774 1774 1774 1774 1775 1775 1775 1775 1775 1776 1776 1776 1776 1776 1777 1777 1777 1777 1777 1778 1778 1778 1778 1778 1779 1779 1779 1779 1779 1779 1780 1780 1780 1780 1780 1781 1781 1781 1781 1781 1782 1782 1782 1782 1782 1783 1783 1783 1783 1783 1784 1784 1784 1784 1784 1785 1785 1785
1509A785%J%%%%J%%%%J%%%%J%%%%J%%%%J%%%J%%%%J%%%%J%%%%J%%%J%%%%J%%%%J%%%J%%%%
$$ 1785 1785 1786 1786 1786 1786 1786 1787 1787 1787 1787 1787 1788 1788 1788 1788 1788 1789 1789 1789 1789 1789 1790 1790 1790 1790 1790 1791 1791 1791 1791 1792 1792 1792 1792 1792 1793 1793 1793 1793 1793 1794 1794 1794 1794 1794 1795 1795 1795 1795 1796 1796 1796 1796 1796 1797 1797 1797 1797 1797 1798 1798 1798 1798 1799 1799 1799 1799 1799
1500A799J%%%%J%%%J%%%%J%%%J%%%%J%%%J%%%%J%%%J%%%%J%%%J%%%J%%%%J%%%J%%%%J%%%J
$$ 1799 1800 1800 1800 1800 1800 1801 1801 1801 1801 1802 1802 1802 1802 1802 1803 1803 1803 1803 1804 1804 1804 1804 1804 1805 1805 1805 1805 1806 1806 1806 1806 1806 1807 1807 1807 1807 1808 1808 1808 1808 1808 1809 1809 1809 1809 1810 1810 1810 1810 1811 1811 1811 1811 1811 1812 1812 1812 1812 1813 1813 1813 1813 1813 1814 1814 1814 1814 1815
1492A815%%%J%%%J%%%%J%%%J%%%J%%%J%%%%J%%%J%%%J%%%J%%%J%%%%J%%%J%%%J%%%J%%%J%
$$ 1815 1815 1815 1815 1816 1816 1816 1816 1817 1817 1817 1817 1817 1818 1818 1818 1818 1819 1819 1819 1819 1820 1820 1820 1820 1821 1821 1821 1821 1821 1822 1822 1822 1822 1823 1823 1823 1823 1824 1824 1824 1824 1825 1825 1825 1825 1826 1826 1826 1826 1826 1827 1827 1827 1827 1828 1828 1828 1828 1829 1829 1829 1829 1830 1830 1830 1830 1831 1831
1484A831%%J%%%J%%%J%%%J%%%J%%%J%%%J%%%J%%%J%%%J%%%J%%%J%%%J%%%J%%J%%%J%%%J%%
$$ 1831 1831 1831 1832 1832 1832 1832 1833 1833 1833 1833 1834 1834 1834 1834 1835 1835 1835 1835 1836 1836 1836 1836 1837 1837 1837 1837 1838 1838 1838 1838 1839 1839 1839 1839 1840 1840 1840 1840 1841 1841 1841 1841 1842 1842 1842 1842 1843 1843 1843 1843 1844 1844 1844 1844 1845 1845 1845 1846 1846 1846 1846 1847 1847 1847 1847 1848 1848 1848
1475A848%J%%%J%%%J%%J%%%J%%%J%%%J%%J%%%J%%%J%%%J%%J%%%J%%%J%%J%%%J%%%J%%J%%%
$$ 1848 1848 1849 1849 1849 1849 1850 1850 1850 1850 1851 1851 1851 1852 1852 1852 1852 1853 1853 1853 1853 1854 1854 1854 1854 1855 1855 1855 1856 1856 1856 1856 1857 1857 1857 1857 1858 1858 1858 1858 1859 1859 1859 1860 1860 1860 1860 1861 1861 1861 1861 1862 1862 1862 1863 1863 1863 1863 1864 1864 1864 1864 1865 1865 1865 1866 1866 1866 1866
1467A866J%%J%%%J%%%J%%J%%%J%%J%%%J%%J%%%J%%J%%%J%%J%%%J%%J%%%J%%J%%%J%%J%%%J
$$ 1866 1867 1867 1867 1868 1868 1868 1868 1869 1869 1869 1869 1870 1870 1870 1871 1871 1871 1871 1872 1872 1872 1873 1873 1873 1873 1874 1874 1874 1875 1875 1875 1875 1876 1876 1876 1877 1877 1877 1877 1878 1878 1878 1879 1879 1879 1879 1880 1880 1880 1881 1881 1881 1881 1882 1882 1882 1883 1883 1883 1883 1884 1884 1884 1885 1885 1885 1885 1886
1459A886%%J%%J%%%J%%J%%%J%%J%%J%%%J%%J%%J%%%J%%J%%J%%%J%%J%%J%%%J%%J%%J%%J%%
$$ 1886 1886 1886 1887 1887 1887 1888 1888 1888 1888 1889 1889 1889 1890 1890 1890 1890 1891 1891 1891 1892 1892 1892 1893 1893 1893 1893 1894 1894 1894 1895 1895 1895 1896 1896 1896 1896 1897 1897 1897 1898 1898 1898 1899 1899 1899 1899 1900 1900 1900 1901 1901 1901 1902 1902 1902 1902 1903 1903 1903 1904 1904 1904 1905 1905 1905 1906 1906 1906
1451A906%J%%J%%J%%J%%J%%%J%%J%%J%%J%%J%%%J%%J%%J%%J%%J%%J%%J%%J%%%J%%J%%J%%J
$$ 1906 1906 1907 1907 1907 1908 1908 1908 1909 1909 1909 1910 1910 1910 1911 1911 1911 1911 1912 1912 1912 1913 1913 1913 1914 1914 1914 1915 1915 1915 1916 1916 1916 1916 1917 1917 1917 1918 1918 1918 1919 1919 1919 1920 1920 1920 1921 1921 1921 1922 1922 1922 1923 1923 1923 1924 1924 1924 1924 1925 1925 1925 1926 1926 1926 1927 1927 1927 1928
1442A928%%J%%J%%J%%J%%J%%J%%J%%J%%J%%J%%J%%J%%J%%J%%J%%J%%J%%J%%J%%J%%J%%J%%
$$ 1928 1928 1928 1929 1929 1929 1930 1930 1930 1931 1931 1931 1932 1932 1932 1933 1933 1933 1934 1934 1934 1935 1935 1935 1936 1936 1936 1937 1937 1937 1938 1938 1938 1939 1939 1939 1940 1940 1940 1941 1941 1941 1942 1942 1942 1943 1943 1943 1944 1944 1944 1945 1945 1945 1946 1946 1946 1947 1947 1947 1948 1948 1948 1949 1949 1949 1950 1950 1950
1434A950J%%J%J%%J%%J%%J%%J%%J%%J%%J%J%%J%%J%%J%%J%%J%J%%J%%J%%J%%J%%J%J%%J%%
$$ 1950 1951 1951 1951 1952 1952 1953 1953 1953 1954 1954 1954 1955 1955 1955 1956 1956 1956 1957 1957 1957 1958 1958 1958 1959 1959 1959 1960 1960 1961 1961 1961 1962 1962 1962 1963 1963 1963 1964 1964 1964 1965 1965 1965 1966 1966 1967 1967 1967 1968 1968 1968 1969 1969 1969 1970 1970 1970 1971 1971 1971 1972 1972 1973 1973 1973 1974 1974 1974
1426A974J%%J%J%%J%%J%%J%J%%J%%J%%J%J%%J%%J%J%%J%%J%J%%J%%J%J%%J%%J%J%%J%%J%J
$$ 1974 1975 1975 1975 1976 1976 1977 1977 1977 1978 1978 1978 1979 1979 1979 1980 1980 1981 1981 1981 1982 1982 1982 1983 1983 1983 1984 1984 1985 1985 1985 1986 1986 1986 1987 1987 1988 1988 1988 1989 1989 1989 1990 1990 1991 1991 1991 1992 1992 1992 1993 1993 1994 1994 1994 1995 1995 1995 1996 1996 1997 1997 1997 1998 1998 1998 1999 1999 2000
1417B000%%J%%J%J%%J%%J%J%%J%J%%J%%J%J%%J%J%%J%J%%J%J%%J%%J%J%%J%J%%J%J%%J%J%
$$ 2000 2000 2000 2001 2001 2001 2002 2002 2003 2003 2003 2004 2004 2004 2005 2005 2006 2006 2006 2007 2007 2008 2008 2008 2009 2009 2009 2010 2010 2011 2011 2011 2012 2012 2013 2013 2013 2014 2014 2015 2015 2015 2016 2016 2017 2017 2017 2018 2018 2018 2019 2019 2020 2020 2020 2021 2021 2022 2022 2022 2023 2023 2024 2024 2024 2025 2025 2026 2026
1409B026%J%J%%J%J%%J%J%%J%J%%J%J%%J%J%%J%J%J%%J%J%%J%J%%J%J%J%%J%J%%J%J%J%%J
$$ 2026 2026 2027 2027 2028 2028 2028 2029 2029 2030 2030 2030 2031 2031 2032 2032 2032 2033 2033 2034 2034 2034 2035 2035 2036 2036 2036 2037 2037 2038 2038 2038 2039 2039 2040 2040 2041 2041 2041 2042 2042 2043 2043 2043 2044 2044 2045 2045 2045 2046 2046 2047 2047 2048 2048 2048 2049 2049 2050 2050 2050 2051 2051 2052 2052 2053 2053 2053 2054
1401B054%J%%J%J%J%%J%J%J%%J%J%%J%J%J%%J%J%J%%J%J%J%%J%J%J%J%%J%J%J%%J%J%J%J%
$$ 2054 2054 2055 2055 2055 2056 2056 2057 2057 2058 2058 2058 2059 2059 2060 2060 2061 2061 2061 2062 2062 2063 2063 2063 2064 2064 2065 2065 2066 2066 2066 2067 2067 2068 2068 2069 2069 2069 2070 2070 2071 2071 2072 2072 2072 2073 2073 2074 2074 2075 2075 2076 2076 2076 2077 2077 2078 2078 2079 2079 2079 2080 2080 2081 2081 2082 2082 2083 2083
1392B083%J%J%J%%J%J%J%J%%J%J%J%J%%J%J%J%J%J%%J%J%J%J%%J%J%J%J%J%J%%J%J%J%J%J
$$ 2083 2083 2084 2084 2085 2085 2086 2086 2086 2087 2087 2088 2088 2089 2089 2090 2090 2090 2091 2091 2092 2092 2093 2093 2094 2094 2094 2095 2095 2096 2096 2097 2097 2098 2098 2099 2099 2099 2100 2100 2101 2101 2102 2102 2103 2103 2103 2104 2104 2105 2105 2106 2106 2107 2107 2108 2108 2109 2109 2109 2110 2110 2111 2111 2112 2112 2113 2113 2114
1384B114%%J%J%J%J%J%J%J%%J%J%J%J%J%J%J%%J%J%J%J%J%J%J%J%J%%J%J%J%J%J%J%J%J%J
$$ 2114 2114 2114 2115 2115 2116 2116 2117 2117 2118 2118 2119 2119 2120 2120 2121 2121 2121 2122 2122 2123 2123 2124 2124 2125 2125 2126 2126 2127 2127 2128 2128 2128 2129 2129 2130 2130 2131 2131 2132 2132 2133 2133 2134 2134 2135 2135 2136 2136 2137 2137 2137 2138 2138 2139 2139 2140 2140 2141 2141 2142 2142 2143 2143 2144 2144 2145 2145 2146
1376B146%J%J%J%J%J%%J%J%J%J%J%J%J%J%J%J%J%J%J%J%J%J%J%J%J%J%J%J%J%J%J%J%J%J%
$$ 2146 2146 2147 2147 2148 2148 2149 2149 2150 2150 2151 2151 2151 2152 2152 2153 2153 2154 2154 2155 2155 2156 2156 2157 2157 2158 2158 2159 2159 2160 2160 2161 2161 2162 2162 2163 2163 2164 2164 2165 2165 2166 2166 2167 2167 2168 2168 2169 2169 2170 2170 2171 2171 2172 2172 2173 2173 2174 2174 2175 2175 2176 2176 2177 2177 2178 2178 2179 2179
1368B179J%J%J%J%J%J%J%J%JJ%J%J%J%J%J%J%J%J%J%J%J%J%J%JJ%J%J%J%J%J%J%J%J%JJ%J
$$ 2179 2180 2180 2181 2181 2182 2182 2183 2183 2184 2184 2185 2185 2186 2186 2187 2187 2188 2189 2189 2190 2190 2191 2191 2192 2192 2193 2193 2194 2194 2195 2195 2196 2196 2197 2197 2198 2198 2199 2199 2200 2200 2201 2201 2202 2202 2203 2204 2204 2205 2205 2206 2206 2207 2207 2208 2208 2209 2209 2210 2210 2211 2211 2212 2212 2213 2214 2214 2215
1359B215%J%J%J%J%J%JJ%J%J%J%J%J%JJ%J%J%J%J%JJ%J%J%J%J%JJ%J%J%J%J%JJ%J%J%J%JJ
$$ 2215 2215 2216 2216 2217 2217 2218 2218 2219 2219 2220 2220 2221 2222 2222 2223 2223 2224 2224 2225 2225 2226 2226 2227 2227 2228 2229 2229 2230 2230 2231 2231 2232 2232 2233 2233 2234 2235 2235 2236 2236 2237 2237 2238 2238 2239 2239 2240 2241 2241 2242 2242 2243 2243 2244 2244 2245 2245 2246 2247 2247 2248 2248 2249 2249 2250 2250 2251 2252
1351B252%J%J%J%JJ%J%J%JJ%J%J%J%JJ%J%J%JJ%J%J%JJ%J%J%JJ%J%J%JJ%J%JJ%J%J%JJ%J%
$$ 2252 2252 2253 2253 2254 2254 2255 2255 2256 2257 2257 2258 2258 2259 2259 2260 2261 2261 2262 2262 2263 2263 2264 2264 2265 2266 2266 2267 2267 2268 2268 2269 2270 2270 2271 2271 2272 2272 2273 2274 2274 2275 2275 2276 2276 2277 2278 2278 2279 2279 2280 2280 2281 2282 2282 2283 2283 2284 2285 2285 2286 2286 2287 2287 2288 2289 2289 2290 2290
1343B290JJ%J%J%JJ%J%JJ%J%J%JJ%J%JJ%J%JJ%J%JJ%J%JJ%J%JJ%J%JJ%J%JJ%J%JJ%JJ%J%J
$$ 2290 2291 2292 2292 2293 2293 2294 2294 2295 2296 2296 2297 2297 2298 2299 2299 2300 2300 2301 2301 2302 2303 2303 2304 2304 2305 2306 2306 2307 2307 2308 2309 2309 2310 2310 2311 2312 2312 2313 2313 2314 2315 2315 2316 2316 2317 2318 2318 2319 2319 2320 2321 2321 2322 2322 2323 2324 2324 2325 2325 2326 2327 2327 2328 2329 2329 2330 2330 2331
1334B331J%J%JJ%J%JJ%JJ%J%JJ%J%JJ%JJ%J%JJ%JJ%J%JJ%JJ%JJ%J%JJ%JJ%J%JJ%JJ%JJ%J%
$$ 2331 2332 2332 2333 2333 2334 2335 2335 2336 2336 2337 2338 2338 2339 2340 2340 2341 2341 2342 2343 2343 2344 2344 2345 2346 2346 2347 2348 2348 2349 2349 2350 2351 2351 2352 2353 2353 2354 2354 2355 2356 2356 2357 2358 2358 2359 2360 2360 2361 2361 2362 2363 2363 2364 2365 2365 2366 2366 2367 2368 2368 2369 2370 2370 2371 2372 2372 2373 2373
1326B373JJ%JJ%JJ%JJ%J%JJ%JJ%JJ%JJ%JJ%JJ%JJ%J%JJ%JJ%JJ%JJ%JJ%JJ%JJ%JJ%JJ%JJ%J
$$ 2373 2374 2375 2375 2376 2377 2377 2378 2379 2379 2380 2381 2381 2382 2382 2383 2384 2384 2385 2386 2386 2387 2388 2388 2389 2390 2390 2391 2392 2392 2393 2394 2394 2395 2396 2396 2397 2397 2398 2399 2399 2400 2401 2401 2402 2403 2403 2404 2405 2405 2406 2407 2407 2408 2409 2409 2410 2411 2411 2412 2413 2413 2414 2415 2415 2416 2417 2417 2418
1318B418J%JJ%JJ%JJ%JJ%JJJ%JJ%JJ%JJ%JJ%JJ%JJJ%JJ%JJ%JJ%JJ%JJJ%JJ%JJ%JJJ%JJ%JJ
$$ 2418 2419 2419 2420 2421 2421 2422 2423 2423 2424 2425 2425 2426 2427 2427 2428 2429 2430 2430 2431 2432 2432 2433 2434 2434 2435 2436 2436 2437 2438 2438 2439 2440 2440 2441 2442 2443 2443 2444 2445 2445 2446 2447 2447 2448 2449 2449 2450 2451 2451 2452 2453 2454 2454 2455 2456 2456 2457 2458 2458 2459 2460 2461 2461 2462 2463 2463 2464 2465
1309B465%JJJ%JJ%JJJ%JJ%JJ%JJJ%JJ%JJJ%JJ%JJJ%JJJ%JJ%JJJ%JJJ%JJ%JJJ%JJJ%JJ%JJJ
$$ 2465 2465 2466 2467 2468 2468 2469 2470 2470 2471 2472 2473 2473 2474 2475 2475 2476 2477 2477 2478 2479 2480 2480 2481 2482 2482 2483 2484 2485 2485 2486 2487 2487 2488 2489 2490 2490 2491 2492 2493 2493 2494 2495 2495 2496 2497 2498 2498 2499 2500 2501 2501 2502 2503 2503 2504 2505 2506 2506 2507 2508 2509 2509 2510 2511 2511 2512 2513 2514
1301B514%JJJ%JJJ%JJJ%JJJ%JJJ%JJJ%JJJ%JJJ%JJJ%JJJ%JJJ%JJJ%JJJ%JJJJ%JJJ%JJJ%JJ
$$ 2514 2514 2515 2516 2517 2517 2518 2519 2520 2520 2521 2522 2523 2523 2524 2525 2526 2526 2527 2528 2529 2529 2530 2531 2532 2532 2533 2534 2535 2535 2536 2537 2538 2538 2539 2540 2541 2541 2542 2543 2544 2544 2545 2546 2547 2547 2548 2549 2550 2550 2551 2552 2553 2553 2554 2555 2556 2557 2557 2558 2559 2560 2560 2561 2562 2563 2563 2564 2565
1293B565JJ%JJJ%JJJ%JJJJ%JJJJ%JJJ%JJJJ%JJJJ%JJJ%JJJJ%JJJJ%JJJJ%JJJJ%JJJJ%JJJJ
$$ 2565 2566 2567 2567 2568 2569 2570 2570 2571 2572 2573 2573 2574 2575 2576 2577 2577 2578 2579 2580 2581 2581 2582 2583 2584 2584 2585 2586 2587 2588 2588 2589 2590 2591 2592 2592 2593 2594 2595 2595 2596 2597 2598 2599 2599 2600 2601 2602 2603 2603 2604 2605 2606 2607 2607 2608 2609 2610 2611 2611 2612 2613 2614 2615 2615 2616 2617 2618 2619
1285B619J%JJJJ%JJJJ%JJJJJ%JJJJ%JJJJJ%JJJJJ%JJJJJ%JJJJJ%JJJJJ%JJJJJ%JJJJJJ%JJ
$$ 2619 2620 2620 2621 2622 2623 2624 2624 2625 2626 2627 2628 2628 2629 2630 2631 2632 2633 2633 2634 2635 2636 2637 2637 2638 2639 2640 2641 2642 2642 2643 2644 2645 2646 2647 2647 2648 2649 2650 2651 2652 2652 2653 2654 2655 2656 2657 2657 2658 2659 2660 2661 2662 2662 2663 2664 2665 2666 2667 2667 2668 2669 2670 2671 2672 2673 2673 2674 2675
1276B675JJJ%JJJJJJ%JJJJJJ%JJJJJJ%JJJJJJJ%JJJJJJJ%JJJJJJJ%JJJJJJJ%JJJJJJJJ%JJ
$$ 2675 2676 2677 2678 2678 2679 2680 2681 2682 2683 2684 2684 2685 2686 2687 2688 2689 2690 2690 2691 2692 2693 2694 2695 2696 2696 2697 2698 2699 2700 2701 2702 2703 2703 2704 2705 2706 2707 2708 2709 2710 2710 2711 2712 2713 2714 2715 2716 2717 2717 2718 2719 2720 2721 2722 2723 2724 2724 2725 2726 2727 2728 2729 2730 2731 2732 2732 2733 2734
1268B734JJJJJJ%JJJJJJJJJ%JJJJJJJJJ%JJJJJJJJJJ%JJJJJJJJJJJ%JJJJJJJJJJJJJ%JJJJ
$$ 2734 2735 2736 2737 2738 2739 2740 2740 2741 2742 2743 2744 2745 2746 2747 2748 2749 2749 2750 2751 2752 2753 2754 2755 2756 2757 2758 2758 2759 2760 2761 2762 2763 2764 2765 2766 2767 2768 2768 2769 2770 2771 2772 2773 2774 2775 2776 2777 2778 2779 2779 2780 2781 2782 2783 2784 2785 2786 2787 2788 2789 2790 2791 2792 2792 2793 2794 2795 2796
1260B796JJJJJJJJJJ%JJJJJJJJJJJJJJJJJJ%JJJJJJJJJJJJJJJJJJJJJJJJJJ%JJJJJJJJJJJ
$$ 2796 2797 2798 2799 2800 2801 2802 2803 2804 2805 2806 2806 2807 2808 2809 2810 2811 2812 2813 2814 2815 2816 2817 2818 2819 2820 2821 2822 2823 2824 2824 2825 2826 2827 2828 2829 2830 2831 2832 2833 2834 2835 2836 2837 2838 2839 2840 2841 2842 2843 2844 2845 2846 2847 2848 2849 2850 2850 2851 2852 2853 2854 2855 2856 2857 2858 2859 2860 2861
1251B861JJJJJJJJJJJJJJJJJJJJJJJJJJJJJJJJJJJJJJJJJJJJJJJJJJJJJJJJJJJJJJJJJJJK
$$ 2861 2862 2863 2864 2865 2866 2867 2868 2869 2870 2871 2872 2873 2874 2875 2876 2877 2878 2879 2880 2881 2882 2883 2884 2885 2886 2887 2888 2889 2890 2891 2892 2893 2894 2895 2896 2897 2898 2899 2900 2901 2902 2903 2904 2905 2906 2907 2908 2909 2910 2911 2912 2913 2914 2915 2916 2917 2918 2919 2920 2921 2922 2923 2924 2925 2926 2927 2928 2930
1243B930JJJJJJJJJJJJJJJJJJJJJJJJJKJJJJJJJJJJJJJJJJJKJJJJJJJJJJJJJJKJJJJJJJJJ
$$ 2930 2931 2932 2933 2934 2935 2936 2937 2938 2939 2940 2941 2942 2943 2944 2945 2946 2947 2948 2949 2950 2951 2952 2953 2954 2955 2957 2958 2959 2960 2961 2962 2963 2964 2965 2966 2967 2968 2969 2970 2971 2972 2973 2974 2976 2977 2978 2979 2980 2981 2982 2983 2984 2985 2986 2987 2988 2989 2990 2992 2993 2994 2995 2996 2997 2998 2999 3000 3001
1235C001JJJKJJJJJJJJJJKJJJJJJJJJJKJJJJJJJJKJJJJJJJJKJJJJJJJJKJJJJJJKJJJJJJJK
$$ 3001 3002 3003 3004 3006 3007 3008 3009 3010 3011 3012 3013 3014 3015 3016 3018 3019 3020 3021 3022 3023 3024 3025 3026 3027 3028 3030 3031 3032 3033 3034 3035 3036 3037 3038 3040 3041 3042 3043 3044 3045 3046 3047 3048 3050 3051 3052 3053 3054 3055 3056 3057 3058 3060 3061 3062 3063 3064 3065 3066 3068 3069 3070 3071 3072 3073 3074 3075 3077
1226C077JJJJJJKJJJJJJKJJJJJJKJJJJJKJJJJJJKJJJJJKJJJJKJJJJJKJJJJJKJJJJKJJJJKJ
$$ 3077 3078 3079 3080 3081 3082 3083 3085 3086 3087 3088 3089 3090 3091 3093 3094 3095 3096 3097 3098 3099 3101 3102 3103 3104 3105 3106 3108 3109 3110 3111 3112 3113 3114 3116 3117 3118 3119 3120 3121 3123 3124 3125 3126 3127 3129 3130 3131 3132 3133 3134 3136 3137 3138 3139 3140 3141 3143 3144 3145 3146 3147 3149 3150 3151 3152 3153 3155 3156
1218C156JJJKJJJJKJJJJKJJJJKJJJJKJJJKJJJJKJJJKJJJJKJJJKJJJKJJJKJJJKJJJKJJJKJJ
$$ 3156 3157 3158 3159 3161 3162 3163 3164 3165 3167 3168 3169 3170 3171 3173 3174 3175 3176 3177 3179 3180 3181 3182 3183 3185 3186 3187 3188 3190 3191 3192 3193 3194 3196 3197 3198 3199 3201 3202 3203 3204 3205 3207 3208 3209 3210 3212 3213 3214 3215 3217 3218 3219 3220 3222 3223 3224 3225 3227 3228 3229 3230 3232 3233 3234 3235 3237 3238 3239
1210C239JKJJJKJJJKJJJKJJKJJJKJJJKJJKJJJKJJKJJJKJJKJJJKJJKJJKJJKJJJKJJKJJKJJK
$$ 3239 3240 3242 3243 3244 3245 3247 3248 3249 3250 3252 3253 3254 3255 3257 3258 3259 3261 3262 3263 3264 3266 3267 3268 3269 3271 3272 3273 3275 3276 3277 3278 3280 3281 3282 3284 3285 3286 3287 3289 3290 3291 3293 3294 3295 3296 3298 3299 3300 3302 3303 3304 3306 3307 3308 3310 3311 3312 3313 3315 3316 3317 3319 3320 3321 3323 3324 3325 3327
1201C327JJKJJKJJKJJKJJKJJKJJKJJKJJKJJKJJKJKJJKJJKJJKJKJJKJJKJJKJKJJKJKJJKJJK
$$ 3327 3328 3329 3331 3332 3333 3335 3336 3337 3339 3340 3341 3343 3344 3345 3347 3348 3349 3351 3352 3353 3355 3356 3357 3359 3360 3361 3363 3364 3365 3367 3368 3369 3371 3372 3374 3375 3376 3378 3379 3380 3382 3383 3384 3386 3387 3389 3390 3391 3393 3394 3395 3397 3398 3399 3401 3402 3404 3405 3406 3408 3409 3411 3412 3413 3415 3416 3417 3419
1193C419JKJJKJKJJKJKJJKJKJKJJKJKJJKJKJKJJKJKJKJJKJKJKJKJJKJKJKJKJJKJKJKJKJKJ
$$ 3419 3420 3422 3423 3424 3426 3427 3429 3430 3431 3433 3434 3436 3437 3438 3440 3441 3443 3444 3446 3447 3448 3450 3451 3453 3454 3455 3457 3458 3460 3461 3463 3464 3465 3467 3468 3470 3471 3473 3474 3475 3477 3478 3480 3481 3483 3484 3486 3487 3488 3490 3491 3493 3494 3496 3497 3499 3500 3501 3503 3504 3506 3507 3509 3510 3512 3513 3515 3516
1185C516KJJKJKJKJKJKJKJKJKJKJKJKJKJKJKJKJKJKJKJKJKJKJKJKJKJKJKJKKJKJKJKJKJKK
$$ 3516 3518 3519 3520 3522 3523 3525 3526 3528 3529 3531 3532 3534 3535 3537 3538 3540 3541 3543 3544 3546 3547 3549 3550 3552 3553 3555 3556 3558 3559 3561 3562 3564 3565 3567 3568 3570 3571 3573 3574 3576 3577 3579 3580 3582 3583 3585 3586 3588 3589 3591 3592 3594 3595 3597 3598 3600 3602 3603 3605 3606 3608 3609 3611 3612 3614 3615 3617 3619
1177C619JKJKJKJKJKKJKJKJKKJKJKJKKJKJKJKKJKJKKJKJKKJKJKKJKJKKJKJKKJKKJKJKKJKK
$$ 3619 3620 3622 3623 3625 3626 3628 3629 3631 3632 3634 3636 3637 3639 3640 3642 3643 3645 3647 3648 3650 3651 3653 3654 3656 3658 3659 3661 3662 3664 3665 3667 3669 3670 3672 3673 3675 3677 3678 3680 3681 3683 3685 3686 3688 3689 3691 3693 3694 3696 3697 3699 3701 3702 3704 3705 3707 3709 3710 3712 3714 3715 3717 3718 3720 3722 3723 3725 3727
1168C727JKJKKJKKJKKJKKJKKJKJKKJKKJKKJKKJKKKJKKJKKJKKJKKJKKKJKKJKKJKKKJKKJKKK
$$ 3727 3728 3730 3731 3733 3735 3736 3738 3740 3741 3743 3745 3746 3748 3750 3751 3753 3755 3756 3758 3759 3761 3763 3764 3766 3768 3769 3771 3773 3774 3776 3778 3779 3781 3783 3785 3786 3788 3790 3791 3793 3795 3796 3798 3800 3801 3803 3805 3806 3808 3810 3812 3813 3815 3817 3818 3820 3822 3823 3825 3827 3829 3830 3832 3834 3835 3837 3839 3841
1160C841JKKKJKKJKKKJKKKJKKKJKKKJKKKJKKKKJKKKJKKKKJKKKJKKKKJKKKKJKKKKJKKKKKJK
$$ 3841 3842 3844 3846 3848 3849 3851 3853 3854 3856 3858 3860 3861 3863 3865 3867 3868 3870 3872 3874 3875 3877 3879 3881 3882 3884 3886 3888 3889 3891 3893 3895 3897 3898 3900 3902 3904 3905 3907 3909 3911 3913 3914 3916 3918 3920 3921 3923 3925 3927 3929 3930 3932 3934 3936 3938 3939 3941 3943 3945 3947 3948 3950 3952 3954 3956 3958 3959 3961
1152C961KKKJKKKKKJKKKKKKJKKKKKJKKKKKKKJKKKKKKKJKKKKKKKJKKKKKKKKKKJKKKKKKKKKK
$$ 3961 3963 3965 3967 3968 3970 3972 3974 3976 3978 3979 3981 3983 3985 3987 3989 3991 3992 3994 3996 3998 4000 4002 4003 4005 4007 4009 4011 4013 4015 4017 4018 4020 4022 4024 4026 4028 4030 4032 4033 4035 4037 4039 4041 4043 4045 4047 4048 4050 4052 4054 4056 4058 4060 4062 4064 4066 4068 4069 4071 4073 4075 4077 4079 4081 4083 4085 4087 4089
1143D089KJKKKKKKKKKKKKKKKKKJKKKKKKKKKKKKKKKKKKKKKKKKKKKKKKKKKKKKKKKKKKKKKKKK
$$ 4089 4091 4092 4094 4096 4098 4100 4102 4104 4106 4108 4110 4112 4114 4116 4118 4120 4122 4124 4126 4127 4129 4131 4133 4135 4137 4139 4141 4143 4145 4147 4149 4151 4153 4155 4157 4159 4161 4163 4165 4167 4169 4171 4173 4175 4177 4179 4181 4183 4185 4187 4189 4191 4193 4195 4197 4199 4201 4203 4205 4207 4209 4211 4213 4215 4217 4219 4221 4223
1135D223LKKKKKKKKKKKKKKKKKLKKKKKKKKKKKLKKKKKKKKLKKKKKKKKLKKKKKKLKKKKKKLKKKKK
$$ 4223 4226 4228 4230 4232 4234 4236 4238 4240 4242 4244 4246 4248 4250 4252 4254 4256 4258 4260 4263 4265 4267 4269 4271 4273 4275 4277 4279 4281 4283 4285 4288 4290 4292 4294 4296 4298 4300 4302 4304 4307 4309 4311 4313 4315 4317 4319 4321 4323 4326 4328 4330 4332 4334 4336 4338 4341 4343 4345 4347 4349 4351 4353 4356 4358 4360 4362 4364 4366
1127D366LKKKKKLKKKKKLKKKKLKKKKLKKKKLKKKLKKKKLKKKLKKKLKKKLKKKLKKKLKKLKKKLKKLK
$$ 4366 4369 4371 4373 4375 4377 4379 4382 4384 4386 4388 4390 4392 4395 4397 4399 4401 4403 4406 4408 4410 4412 4414 4417 4419 4421 4423 4425 4428 4430 4432 4434 4437 4439 4441 4443 4445 4448 4450 4452 4454 4457 4459 4461 4463 4466 4468 4470 4472 4475 4477 4479 4481 4484 4486 4488 4490 4493 4495 4497 4500 4502 4504 4506 4509 4511 4513 4516 4518
1118D518KKLKKLKKLKKKLKKLKKLKKLKKLKLKKLKKLKKLKKLKLKKLKLKKLKKLKLKLKKLKLKKLKLKL
$$ 4518 4520 4522 4525 4527 4529 4532 4534 4536 4539 4541 4543 4545 4548 4550 4552 4555 4557 4559 4562 4564 4566 4569 4571 4573 4576 4578 4581 4583 4585 4588 4590 4592 4595 4597 4599 4602 4604 4606 4609 4611 4614 4616 4618 4621 4623 4626 4628 4630 4633 4635 4637 4640 4642 4645 4647 4650 4652 4654 4657 4659 4662 4664 4666 4669 4671 4674 4676 4679
1110D679KKLKLKLKLKLKKLKLKLKLKLKLKLKLKLKLKLKLKLKLKLKLKLLKLKLKLKLLKLKLKLKLLKLK
$$ 4679 4681 4683 4686 4688 4691 4693 4696 4698 4701 4703 4706 4708 4710 4713 4715 4718 4720 4723 4725 4728 4730 4733 4735 4738 4740 4743 4745 4748 4750 4753 4755 4758 4760 4763 4765 4768 4770 4773 4775 4778 4780 4783 4785 4788 4790 4793 4796 4798 4801 4803 4806 4808 4811 4813 4816 4819 4821 4824 4826 4829 4831 4834 4836 4839 4842 4844 4847 4849
1102D849LLKLKLLKLKLLKLLKLKLLKLLKLLKLLKLLKLLKLLKLLKLLKLLKLLLKLLKLLLKLLLKLLLKL
$$ 4849 4852 4855 4857 4860 4862 4865 4868 4870 4873 4875 4878 4881 4883 4886 4889 4891 4894 4896 4899 4902 4904 4907 4910 4912 4915 4918 4920 4923 4926 4928 4931 4934 4936 4939 4942 4944 4947 4950 4952 4955 4958 4960 4963 4966 4968 4971 4974 4976 4979 4982 4985 4987 4990 4993 4995 4998 5001 5004 5006 5009 5012 5015 5017 5020 5023 5026 5028 5031
1094E031LLKLLLKLLLLKLLLLKLLLLKLLLLKLLLLLKLLLLLLKLLLLLLLKLLLLLLLLKLLLLLLLLLLL
$$ 5031 5034 5037 5039 5042 5045 5048 5050 5053 5056 5059 5062 5064 5067 5070 5073 5076 5078 5081 5084 5087 5090 5092 5095 5098 5101 5104 5106 5109 5112 5115 5118 5121 5123 5126 5129 5132 5135 5138 5141 5143 5146 5149 5152 5155 5158 5161 5164 5166 5169 5172 5175 5178 5181 5184 5187 5190 5192 5195 5198 5201 5204 5207 5210 5213 5216 5219 5222 5225
1085E225LKLLLLLLLLLLLLLLLLLLLLLLLLLLLLLLLLLLLLLLLLMLLLLLLLLLLLLMLLLLLLLLMLLL
$$ 5225 5228 5230 5233 5236 5239 5242 5245 5248 5251 5254 5257 5260 5263 5266 5269 5272 5275 5278 5281 5284 5287 5290 5293 5296 5299 5302 5305 5308 5311 5314 5317 5320 5323 5326 5329 5332 5335 5338 5341 5344 5347 5350 5354 5357 5360 5363 5366 5369 5372 5375 5378 5381 5384 5387 5390 5394 5397 5400 5403 5406 5409 5412 5415 5418 5422 5425 5428 5431
1077E431LLLMLLLLLLMLLLLLMLLLLMLLLLMLLLMLLLMLLLMLLLMLLLMLLMLLLMLLMLLMLLMLLMLL
$$ 5431 5434 5437 5440 5444 5447 5450 5453 5456 5459 5462 5466 5469 5472 5475 5478 5481 5485 5488 5491 5494 5497 5501 5504 5507 5510 5513 5517 5520 5523 5526 5530 5533 5536 5539 5543 5546 5549 5552 5556 5559 5562 5565 5569 5572 5575 5578 5582 5585 5588 5592 5595 5598 5601 5605 5608 5611 5615 5618 5621 5625 5628 5631 5635 5638 5641 5645 5648 5651
1069E651MLLMLLMLMLLMLLMLMLLMLMLMLLMLMLMLMLLMLMLMLMLMLMLMLMLMLMMLMLMLMLMLMMLM
$$ 5651 5655 5658 5661 5665 5668 5671 5675 5678 5682 5685 5688 5692 5695 5698 5702 5705 5709 5712 5715 5719 5722 5726 5729 5733 5736 5739 5743 5746 5750 5753 5757 5760 5764 5767 5770 5774 5777 5781 5784 5788 5791 5795 5798 5802 5805 5809 5812 5816 5819 5823 5826 5830 5833 5837 5841 5844 5848 5851 5855 5858 5862 5865 5869 5872 5876 5880 5883 5887
1060E887LMMLMLMMLMLMMLMMLMMLMLMMLMMMLMMLMMLMMMLMMMLMMLMMMMLMMMLMMMMLMMMMLMMM
$$ 5887 5890 5894 5898 5901 5905 5908 5912 5916 5919 5923 5926 5930 5934 5937 5941 5945 5948 5952 5956 5959 5963 5966 5970 5974 5977 5981 5985 5989 5992 5996 6000 6003 6007 6011 6014 6018 6022 6026 6029 6033 6037 6041 6044 6048 6052 6055 6059 6063 6067 6071 6074 6078 6082 6086 6089 6093 6097 6101 6105 6108 6112 6116 6120 6124 6127 6131 6135 6139
1052F139MMMLMMMMMMLMMMMMMMMMLMMMMMMMMMMMMMMMMMMMMMMMMMMMMMMMMMMMMMNMMMMMMMMM
$$ 6139 6143 6147 6151 6154 6158 6162 6166 6170 6174 6178 6181 6185 6189 6193 6197 6201 6205 6209 6213 6217 6220 6224 6228 6232 6236 6240 6244 6248 6252 6256 6260 6264 6268 6272 6276 6280 6284 6288 6292 6296 6300 6304 6308 6312 6316 6320 6324 6328 6332 6336 6340 6344 6348 6352 6356 6360 6364 6368 6373 6377 6381 6385 6389 6393 6397 6401 6405 6409
1044F409NMMMMMMNMMMMMNMMMMNMMMMNMMMNMMMNMMMNMMNMMMNMMNMMNMMNMMNMNMMNMMNMNMNM
$$ 6409 6414 6418 6422 6426 6430 6434 6438 6443 6447 6451 6455 6459 6463 6468 6472 6476 6480 6484 6489 6493 6497 6501 6505 6510 6514 6518 6522 6527 6531 6535 6539 6544 6548 6552 6556 6561 6565 6569 6574 6578 6582 6586 6591 6595 6599 6604 6608 6612 6617 6621 6625 6630 6634 6638 6643 6647 6652 6656 6660 6665 6669 6673 6678 6682 6687 6691 6696 6700
1035F700MNMNMNMNMNMMNMNMNMNNMNMNMNMNMNNMNMNNMNMNNMNNMNNMNNMNNMNNMNNNMNNNMNNN
$$ 6700 6704 6709 6713 6718 6722 6727 6731 6736 6740 6745 6749 6753 6758 6762 6767 6771 6776 6780 6785 6790 6794 6799 6803 6808 6812 6817 6821 6826 6830 6835 6840 6844 6849 6853 6858 6863 6867 6872 6876 6881 6886 6890 6895 6900 6904 6909 6914 6918 6923 6928 6932 6937 6942 6946 6951 6956 6960 6965 6970 6975 6979 6984 6989 6994 6998 7003 7008 7013
1027G013MNNNMNNNNNMNNNNNMNNNNNNNNMNNNNNNNNNNNNNNNNNNNNNNNNNNNNNNNNNONNNNNNNO
$$ 7013 7017 7022 7027 7032 7036 7041 7046 7051 7056 7061 7065 7070 7075 7080 7085 7090 7094 7099 7104 7109 7114 7119 7124 7129 7134 7138 7143 7148 7153 7158 7163 7168 7173 7178 7183 7188 7193 7198 7203 7208 7213 7218 7223 7228 7233 7238 7243 7248 7253 7258 7263 7268 7273 7278 7283 7288 7293 7298 7303 7309 7314 7319 7324 7329 7334 7339 7344 7350
1019G350NNNNNONNNNONNNNONNNONNNONNONNONNONNONNONONNONONNONONONONONONONONONON
$$ 7350 7355 7360 7365 7370 7375 7381 7386 7391 7396 7401 7407 7412 7417 7422 7427 7433 7438 7443 7448 7454 7459 7464 7469 7475 7480 7485 7491 7496 7501 7507 7512 7517 7523 7528 7533 7539 7544 7549 7555 7560 7566 7571 7576 7582 7587 7593 7598 7603 7609 7614 7620 7625 7631 7636 7642 7647 7653 7658 7664 7669 7675 7680 7686 7691 7697 7702 7708 7713
1011G713OONONOONONOONOONOONOOONOONOOONOOOONOOOONOOOOONOOOOOOOOOOONOOOOOOOOOO
$$ 7713 7719 7725 7730 7736 7741 7747 7753 7758 7764 7769 7775 7781 7786 7792 7798 7803 7809 7815 7820 7826 7832 7838 7843 7849 7855 7860 7866 7872 7878 7883 7889 7895 7901 7907 7912 7918 7924 7930 7936 7941 7947 7953 7959 7965 7971 7976 7982 7988 7994 8000 8006 8012 8018 8024 8030 8036 8042 8047 8053 8059 8065 8071 8077 8083 8089 8095 8101 8107
1002H107OOPOOOOOOOOOOPOOOOOOPOOOOPOOOPOOOPOOOPOOPOOPOPOOPOOPOPOPOPOPOOPPOPOP
$$ 8107 8113 8119 8126 8132 8138 8144 8150 8156 8162 8168 8174 8180 8186 8193 8199 8205 8211 8217 8223 8229 8236 8242 8248 8254 8260 8267 8273 8279 8285 8292 8298 8304 8310 8317 8323 8329 8335 8342 8348 8354 8361 8367 8373 8380 8386 8393 8399 8405 8412 8418 8424 8431 8437 8444 8450 8457 8463 8470 8476 8483 8489 8495 8502 8509 8515 8522 8528 8535
994H535OPOPOPPOPPOPOPPOPPOPPPOPPPOPPPPOPPPPOPPPPPPPPPOPPPPPPPPPPPPPPQPPPPPPP
$$ 8535 8541 8548 8554 8561 8567 8574 8581 8587 8594 8601 8607 8614 8620 8627 8634 8640 8647 8654 8660 8667 8674 8681 8687 8694 8701 8708 8714 8721 8728 8735 8742 8748 8755 8762 8769 8776 8782 8789 8796 8803 8810 8817 8824 8831 8838 8845 8851 8858 8865 8872 8879 8886 8893 8900 8907 8914 8921 8928 8935 8942 8949 8957 8964 8971 8978 8985 8992 8999 9006
985I006PQPPPPPQPPPQPPPQPPPQPPQPPQPQPPQPQPQPQPQPQPQPQPQPQQPQPQQPQQPQQQPQQQPQQ
$$ 9006 9013 9021 9028 9035 9042 9049 9056 9064 9071 9078 9085 9093 9100 9107 9114 9122 9129 9136 9143 9151 9158 9165 9173 9180 9187 9195 9202 9210 9217 9224 9232 9239 9247 9254 9262 9269 9277 9284 9292 9299 9307 9314 9322 9329 9337 9344 9352 9359 9367 9375 9382 9390 9397 9405 9413 9420 9428 9436 9443 9451 9459 9467 9474 9482 9490 9498 9505 9513 9521
977I521QQPQQQQQQPQQQQQQQQQQQQQQQQQQQQRQQQQQRQQQQRQQQRQQRQQRQQRQQRQRQRQRQRQRQ
$$ 9521 9529 9537 9544 9552 9560 9568 9576 9584 9592 9599 9607 9615 9623 9631 9639 9647 9655 9663 9671 9679 9687 9695 9703 9711 9719 9727 9735 9743 9751 9759 9768 9776 9784 9792 9800 9808 9817 9825 9833 9841 9849 9858 9866 9874 9882 9891 9899 9907 9916 9924 9932 9941 9949 9957 9966 9974 9982 9991 9999 10008 10016 10025 10033 10042 10050 10059 10067 10076 10084
969A0084RQRQRRQRQRRQRRRQRRRQRRRRQRRRRRRRQRRRRRRRRRRRJ0RRRRRRRJ0RRRRJ0RRJ0RRR
$$ 10084 10093 10101 10110 10118 10127 10136 10144 10153 10161 10170 10179 10187 10196 10205 10214 10222 10231 10240 10249 10257 10266 10275 10284 10293 10301 10310 10319 10328 10337 10346 10355 10364 10372 10381 10390 10399 10408 10417 10426 10435 10444 10453 10462 10471 10481 10490 10499 10508 10517 10526 10535 10544 10554 10563 10572 10581 10590 10600 10609 10618 10628 10637 10646 10655
961A0655J0RRJ0RJ0RRJ0RJ0RJ0RJ0RJ0RJ0J0RJ0RJ0J0RJ0J0RJ0J0J0RJ0J0J0J0RJ0J0J0J0
$$ 10655 10665 10674 10683 10693 10702 10712 10721 10730 10740 10749 10759 10768 10778 10787 10797 10806 10816 10825 10835 10845 10854 10864 10873 10883 10893 10902 10912 10922 10931 10941 10951 10961 10970 10980 10990 11000 11010 11019 11029 11039 11049 11059
956A1059J0J0J0J0J0RJ0J0J0J1J0J0J0J0J0J0J0J0J0J1J0J0J0J0J1J0J0J0J1J0J0J1J0J1J0
$$ 11059 11069 11079 11089 11099 11109 11118 11128 11138 11148 11159 11169 11179 11189 11199 11209 11219 11229 11239 11249 11260 11270 11280 11290 11300 11311 11321 11331 11341 11352 11362 11372 11383 11393 11404 11414
951A1414J0J1J0J1J0J1J0J1J0J1J0J1J0J1J1J0J1J1J0J1J1J0J1J1J1J1J0J1J1J1J1J1J1J0
$$ 11414 11424 11435 11445 11456 11466 11477 11487 11498 11508 11519 11529 11540 11550 11561 11572 11582 11593 11604 11614 11625 11636 11646 11657 11668 11679 11690 11700 11711 11722 11733 11744 11755 11766 11776
947A1776J1J1J1J1J1J1J1J1J1J2J1J1J1J1J1J1J2J1J1J1J2J1J1J1J2J1J2J1J1J2J1J2J1J2
$$ 11776 11787 11798 11809 11820 11831 11842 11853 11864 11875 11887 11898 11909 11920 11931 11942 11953 11965 11976 11987 11998 12010 12021 12032 12043 12055 12066 12078 12089 12100 12112 12123 12135 12146 12158
943A2158J1J2J1J2J1J2J1J2J2J1J2J2J1J2J2J2J1J2J2J2J2J2J2J1J2J2J2J2J2J2J2J2J2J3
$$ 12158 12169 12181 12192 12204 12215 12227 12238 12250 12262 12273 12285 12297 12308 12320 12332 12344 12355 12367 12379 12391 12403 12415 12427 12438 12450 12462 12474 12486 12498 12510 12522 12534 12546 12559
939A2559J2J2J2J2J2J3J2J2J2J3J2J2J2J3J2J3J2J2J3J2J3J2J3J2J3J3J2J3J2J3J3J2J3J3
$$ 12559 12571 12583 12595 12607 12619 12632 12644 12656 12668 12681 12693 12705 12717 12730 12742 12755 12767 12779 12792 12804 12817 12829 12842 12854 12867 12880 12892 12905 12917 12930 12943 12955 12968 12981
935A2981J3J2J3J3J3J3J3J3J3J2J3J3J3J3J3J4J3J3J3J3J3J3J4J3J3J3J4J3J3J4J3J3J4J3
$$ 12981 12994 13006 13019 13032 13045 13058 13071 13084 13097 13109 13122 13135 13148 13161 13174 13188 13201 13214 13227 13240 13253 13266 13280 13293 13306 13319 13333 13346 13359 13373 13386 13399 13413 13426
931A3426J4J3J4J3J4J3J4J4J3J4J4J3J4J4J3J4J4J4J4J4J4J3J4J4J4J4J4J4J4J5J4J4J4J4
$$ 13426 13440 13453 13467 13480 13494 13507 13521 13535 13548 13562 13576 13589 13603 13617 13630 13644 13658 13672 13686 13700 13714 13727 13741 13755 13769 13783 13797 13811 13825 13840 13854 13868 13882 13896
927A3896J4J5J4J4J5J4J4J5J4J4J5J4J5J4J5J4J5J5J4J5J5J4J5J5J5J4J5J5J5J5J5J5J5J5
$$ 13896 13910 13925 13939 13953 13968 13982 13996 14011 14025 14039 14054 14068 14083 14097 14112 14126 14141 14156 14170 14185 14200 14214 14229 14244 14259 14273 14288 14303 14318 14333 14348 14363 14378 14393
922A4393J5J5J5J5J5J5J5J6J5J5J5J6J5J5J6J5J6J5J6J5J6J5J6J5J6J6J5J6J6J6J5J6J6J6
$$ 14393 14408 14423 14438 14453 14468 14483 14498 14514 14529 14544 14559 14575 14590 14605 14621 14636 14652 14667 14683 14698 14714 14729 14745 14760 14776 14792 14807 14823 14839 14855 14870 14886 14902 14918
918A4918J6J6J6J6J6J6J6J6J6J6J6J7J6J6J6J7J6J6J7J6J7J6J7J6J7J6J7J7J6J7J7J6J7J7
$$ 14918 14934 14950 14966 14982 14998 15014 15030 15046 15062 15078 15094 15111 15127 15143 15159 15176 15192 15208 15225 15241 15258 15274 15291 15307 15324 15340 15357 15374 15390 15407 15424 15440 15457 15474
914A5474J7J7J7J7J7J7J7J7J7J7J7J7J7J8J7J7J8J7J7J8J7J8J7J8J7J8J7J8J8J8J7J8J8J8
$$ 15474 15491 15508 15525 15542 15559 15576 15593 15610 15627 15644 15661 15678 15695 15713 15730 15747 15765 15782 15799 15817 15834 15852 15869 15887 15904 15922 15939 15957 15975 15993 16010 16028 16046 16064
910A6064J8J8J7J8J8J8J9J8J8J8J8J8J9J8J8J9J8J8J9J8J9J8J9J9J8J9J9J8J9J9J9J9J9J9
$$ 16064 16082 16100 16117 16135 16153 16171 16190 16208 16226 16244 16262 16280 16299 16317 16335 16354 16372 16390 16409 16427 16446 16464 16483 16502 16520 16539 16558 16576 16595 16614 16633 16652 16671 16690
906A6690J9J9J9J9J9J9J9K0J9J9K0J9J9K0J9K0J9K0K0J9K0K0J9K0K0K0K0K0K0K0K0K0K0K0
$$ 16690 16709 16728 16747 16766 16785 16804 16823 16843 16862 16881 16901 16920 16939 16959 16978 16998 17017 17037 17057 17076 17096 17116 17135 17155 17175 17195 17215 17235 17255 17275 17295 17315 17335 17355
902A7355K0K1K0K0K1K0K0K1K0K1K1K0K1K1K0K1K1K1K1K1K0K2K1K1K1K1K1K1K2K1K1K2K1K2
$$ 17355 17375 17396 17416 17436 17457 17477 17497 17518 17538 17559 17580 17600 17621 17642 17662 17683 17704 17725 17746 17767 17787 17809 17830 17851 17872 17893 17914 17935 17957 17978 17999 18021 18042 18064
897A8064K1K2K1K2K2K1K2K2K2K2K2K2K2K2K2K2K2K2K3K2K2K3K2K3K2K3K2K3K3K3K2K3K3K3
$$ 18064 18085 18107 18128 18150 18172 18193 18215 18237 18259 18281 18303 18325 18347 18369 18391 18413 18435 18457 18480 18502 18524 18547 18569 18592 18614 18637 18659 18682 18705 18728 18750 18773 18796 18819
893A8819K3K3K3K3K3K4K3K3K3K4K3K4K3K4K3K4K4K3K4K4K4K4K4K4K4K4K4K4K5K4K4K5K4K5
$$ 18819 18842 18865 18888 18911 18934 18958 18981 19004 19027 19051 19074 19098 19121 19145 19168 19192 19216 19239 19263 19287 19311 19335 19359 19383 19407 19431 19455 19479 19504 19528 19552 19577 19601 19626
889A9626K4K5K4K5K5K5K5K4K5K5K5K6K5K5K5K5K6K5K6K5K6K5K6K6K5K6K6K6K6K6K6K6K6K6
$$ 19626 19650 19675 19699 19724 19749 19774 19799 19823 19848 19873 19898 19924 19949 19974 19999 20024 20050 20075 20101 20126 20152 20177 20203 20229 20254 20280 20306 20332 20358 20384 20410 20436 20462 20488
885B0488K7K6K7K6K6K7K7K6K7K7K7K6K7K7K7K8K7K7K7K7K8K7K8K7K8K8K7K8K8K8K8K8K8K8
$$ 20488 20515 20541 20568 20594 20620 20647 20674 20700 20727 20754 20781 20807 20834 20861 20888 20916 20943 20970 20997 21024 21052 21079 21107 21134 21162 21190 21217 21245 21273 21301 21329 21357 21385 21413
881B1413K8K8K9K8K9K8K9K8K9K9K8K9K9K9K9K9K9L0K9K9L0K9L0K9L0L0K9L0L0L0L0L0L0L1
$$ 21413 21441 21469 21498 21526 21555 21583 21612 21640 21669 21698 21726 21755 21784 21813 21842 21871 21900 21930 21959 21988 22018 22047 22077 22106 22136 22166 22195 22225 22255 22285 22315 22345 22375 22406
877B2406L0L0L1L0L1L0L1L1L1L0L1L1L2L1L1L1L2L1L1L2L2L1L2L2L2L2L2L2L2L2L3L2L3L2
$$ 22406 22436 22466 22497 22527 22558 22588 22619 22650 22681 22711 22742 22773 22805 22836 22867 22898 22930 22961 22992 23024 23056 23087 23119 23151 23183 23215 23247 23279 23311 23343 23376 23408 23441 23473
873B3473L3L3L2L3L3L3L3L3L3L4L3L3L4L4L3L4L4L4L4L4L4L4L4L4L5L4L5L5L4L5L5L5L5L5
$$ 23473 23506 23539 23571 23604 23637 23670 23703 23736 23769 23803 23836 23869 23903 23937 23970 24004 24038 24072 24106 24140 24174 24208 24242 24276 24311 24345 24380 24415 24449 24484 24519 24554 24589 24624
868B4624L5L6L5L5L6L6L5L6L6L6L6L6L6L6L7L6L7L6L7L7L7L6L7L8L7L7L7L8L7L8L8L8L7L8
$$ 24624 24659 24695 24730 24765 24801 24837 24872 24908 24944 24980 25016 25052 25088 25124 25161 25197 25234 25270 25307 25344 25381 25417 25454 25492 25529 25566 25603 25641 25678 25716 25754 25792 25829 25867
864B5867L9L8L8L8L9L8L9L9L8L9L9L9L9M0L9M0L9M0L9M0M0M0M0M1M0M0M1M0M1M1M1M1M1M1
$$ 25867 25906 25944 25982 26020 26059 26097 26136 26175 26213 26252 26291 26330 26369 26409 26448 26488 26527 26567 26606 26646 26686 26726 26766 26807 26847 26887 26928 26968 27009 27050 27091 27132 27173 27214
860B7214M1M2M1M2M1M2M2M2M2M2M3M2M3M2M3M3M3M3M3M3M3M4M3M4M4M4M4M4M4M4M5M4M5M5
$$ 27214 27255 27297 27338 27380 27421 27463 27505 27547 27589 27631 27674 27716 27759 27801 27844 27887 27930 27973 28016 28059 28102 28146 28189 28233 28277 28321 28365 28409 28453 28497 28542 28586 28631 28676
856B8676M5M5M5M5M5M6M5M6M6M6M6M6M6M7M6M7M6M7M7M7M8M7M7M8M8M7M8M8M9M8M8M9M9M8
$$ 28676 28721 28766 28811 28856 28901 28947 28992 29038 29084 29130 29176 29222 29268 29315 29361 29408 29454 29501 29548 29595 29643 29690 29737 29785 29833 29880 29928 29976 30025 30073 30121 30170 30219 30267
852C0267M9M9N0M9M9N0N0M9N0N1N0N0N1N0N1N1N1N1N1N2N1N2N2N2N2N2N3N2N3N3N3N3N3N3
$$ 30267 30316 30365 30415 30464 30513 30563 30613 30662 30712 30763 30813 30863 30914 30964 31015 31066 31117 31168 31219 31271 31322 31374 31426 31478 31530 31582 31635 31687 31740 31793 31846 31899 31952 32005
848C2005N4N3N4N4N4N5N4N4N5N5N5N5N5N6N5N6N6N6N6N7N6N7N7N6N8N7N7N8N8N8N8N8N8N9
$$ 32005 32059 32112 32166 32220 32274 32329 32383 32437 32492 32547 32602 32657 32712 32768 32823 32879 32935 32991 33047 33104 33160 33217 33274 33330 33388 33445 33502 33560 33618 33676 33734 33792 33850 33909
843C3909N9N8N9O0N9O0N9O0O0O0O1O0O1O1O1O1O2O1O2O2O2O3O2O3O2O3O4O3O4O3O4O4O5O4
$$ 33909 33968 34026 34085 34145 34204 34264 34323 34383 34443 34503 34564 34624 34685 34746 34807 34868 34930 34991 35053 35115 35177 35240 35302 35365 35427 35490 35554 35617 35681 35744 35808 35872 35937 36001
839C6001O5O5O5O5O5O6O6O6O6O6O7O7O7O7O7O8O7O8O8O9O8O9O9O9P0O9P0P0P0P1P0P1P1P1
$$ 36001 36066 36131 36196 36261 36326 36392 36458 36524 36590 36656 36723 36790 36857 36924 36991 37059 37126 37194 37262 37331 37399 37468 37537 37606 37676 37745 37815 37885 37955 38026 38096 38167 38238 38309
835C8309P2P2P1P3P2P2P3P3P4P3P4P4P4P4P5P4P5P6P5P6P6P6P7P6P7P7P8P7P8P8P9P8P9P9
$$ 38309 38381 38453 38524 38597 38669 38741 38814 38887 38961 39034 39108 39182 39256 39330 39405 39479 39554 39630 39705 39781 39857 39933 40010 40086 40163 40240 40318 40395 40473 40551 40630 40708 40787 40866
831D0866Q0P9Q0Q0Q0Q1Q1Q1Q1Q2Q2Q2Q3Q2Q3Q3Q4Q4Q4Q4Q4Q5Q5Q6Q5Q6Q7Q6Q7Q7Q7Q8Q8Q8
$$ 40866 40946 41025 41105 41185 41265 41346 41427 41508 41589 41671 41753 41835 41918 42000 42083 42166 42250 42334 42418 42502 42586 42671 42756 42842 42927 43013 43100 43186 43273 43360 43447 43535 43623 43711
827D3711Q8Q9Q9R0Q9R0R1R0R1R1R2R1R2R3R2R3R4R3R4R5R4R5R5R6R6R6R6R7R7R8R8R8R8R9
$$ 43711 43799 43888 43977 44067 44156 44246 44337 44427 44518 44609 44701 44792 44884 44977 45069 45162 45256 45349 45443 45538 45632 45727 45822 45918 46014 46110 46206 46303 46400 46498 46596 46694 46792 46891
823D6891R9J00J00J00J01J01J01J01J02J03J02J03J04J04J04J04J05J05J06J06J06J07J07
$$ 46891 46990 47090 47190 47290 47391 47492 47593 47694 47796 47899 48001 48104 48208 48312 48416 48520 48625 48730 48836 48942 49048 49155 49262
820D9262J08J07J09J08J09J10J10J10J10J11J12J12J12J12J13J14J14J14J15J15J15J16J17
$$ 49262 49370 49477 49586 49694 49803 49913 50023 50133 50243 50354 50466 50578 50690 50802 50915 51029 51143 51257 51372 51487 51602 51718 51835
817E1835J16J18J17J18J19J19J19J20J20J21J21J22J22J23J23J23J24J25J25J25J26J26J27
$$ 51835 51951 52069 52186 52304 52423 52542 52661 52781 52901 53022 53143 53265 53387 53510 53633 53756 53880 54005 54130 54255 54381 54507 54634
814E4634J27J28J28J29J29J30J30J31J31J32J32J33J33J34J34J35J36J36J36J37J38J38J38
$$ 54634 54761 54889 55017 55146 55275 55405 55535 55666 55797 55929 56061 56194 56327 56461 56595 56730 56866 57002 57138 57275 57413 57551 57689
811E7689J39J40J40J41J42J42J42J43J44J44J45J45J46J47J47J48J48J49J50J50J51J51J52
$$ 57689 57828 57968 58108 58249 58391 58533 58675 58818 58962 59106 59251 59396 59542 59689 59836 59984 60132 60281 60431 60581 60732 60883 61035
809F1035J53J53J54J54J56J55J57J57J58J58J59J60J61J61J62J62J63J64J65J65J66J67J67
$$ 61035 61188 61341 61495 61649 61805 61960 62117 62274 62432 62590 62749 62909 63070 63231 63393 63555 63718 63882 64047 64212 64378 64545 64712
806F4712J68J69J69J71J71J71J73J73J74J75J75J76J78J77J79J79J80J81J82J83J83J84J85
$$ 64712 64880 65049 65218 65389 65560 65731 65904 66077 66251 66426 66601 66777 66955 67132 67311 67490 67670 67851 68033 68216 68399 68583 68768
803F8768J86J87J87J89J89J90J91J91J93J93J95J95J96J97J98J99K00K00K02K03K03K05K05
$$ 68768 68954 69141 69328 69517 69706 69896 70087 70278 70471 70664 70859 71054 71250 71447 71645 71844 72044 72244 72446 72649 72852 73057 73262
800G3262K06K08K08K09K10K11K13K13K14K15K17K17K18K19K21K21K23K23K25K26K27K28K29
$$ 73262 73468 73676 73884 74093 74303 74514 74727 74940 75154 75369 75586 75803 76021 76240 76461 76682 76905 77128 77353 77579 77806 78034 78263
797G8263K30K31K33K33K35K36K37K38K40K40K42K43K44K46K46K48K49K51K52K53K54K55K57
$$ 78263 78493 78724 78957 79190 79425 79661 79898 80136 80376 80616 80858 81101 81345 81591 81837 82085 82334 82585 82837 83090 83344 83599 83856
795H3856K58K60K61K62K63K65K66K68K69K70K72K74K74K76K78K79K81K82K83K85K87K88K90
$$ 83856 84114 84374 84635 84897 85160 85425 85691 85959 86228 86498 86770 87044 87318 87594 87872 88151 88432 88714 88997 89282 89569 89857 90147
792I0147K91K93K94K96K97L00L00L03L04L06L07L09L11L13L14L16L18L20L21L23L25L27L29
$$ 90147 90438 90731 91025 91321 91618 91918 92218 92521 92825 93131 93438 93747 94058 94371 94685 95001 95319 95639 95960 96283 96608 96935 97264
789I7264L31L32L34L37L38L40L42L44L46L48L50L52L55L56L58L61L62L65L67L69L71L74L75
$$ 97264 97595 97927 98261 98598 98936 99276 99618 99962 100308 100656 101006 101358 101713 102069 102427 102788 103150 103515 103882 104251 104622 104996 105371
786A05371L78L81L82L85L87L90L91L95L96M00M01M04M07M09M12M14M17M19M22M25M27M30M33
$$ 105371 105749 106130 106512 106897 107284 107674 108065 108460 108856 109256 109657 110061 110468 110877 111289 111703 112120 112539 112961 113386 113813 114243 114676
783A14676M36M38M41M44M47M50M52M56M58M62M65M67M71M74M76M81M83M86M90M93M96N00N03
$$ 114676 115112 115550 115991 116435 116882 117332 117784 118240 118698 119160 119625 120092 120563 121037 121513 121994 122477 122963 123453 123946 124442 124942 125445
781A25445N07N09N14N17N20N24N28N31N35N39N42N47N50N54N57N62N66N70N74N78N82N86N91
$$ 125445 125952 126461 126975 127492 128012 128536 129064 129595 130130 130669 131211 131758 132308 132862 133419 133981 134547 135117 135691 136269 136851 137437 138028
778A38028N95N99O04O08O12O17O21O27O30O36O40O45O50O55O60O64O70O75O80O85O91O96P01
$$ 138028 138623 139222 139826 140434 141046 141663 142284 142911 143541 144177 144817 145462 146112 146767 147427 148091 148761 149436 150116 150801 151492 152188 152889
775A52889P07P13P18P23P30P35P41P46P53P59P65P71P77P84P90P97Q03Q10Q16Q23Q30Q37Q44
$$ 152889 153596 154309 155027 155750 156480 157215 157956 158702 159455 160214 160979 161750 162527 163311 164101 164898 165701 166511 167327 168150 168980 169817 170661
772A70661Q51Q59Q65Q73Q80Q88Q96R03R11R19R27R35R43R52R60R69R77R86R94J004J013J022
$$ 170661 171512 172371 173236 174109 174989 175877 176773 177676 178587 179506 180433 181368 182311 183263 184223 185192 186169 187155 188149 189153 190166 191188
769A91188J031J041J050J060J070J079J090J100J110J121J131J142J153J164J176J186J198
$$ 191188 192219 193260 194310 195370 196440 197519 198609 199709 200819 201940 203071 204213 205366 206530 207706 208892 210090
767B10090J210J221J234J245J258J271J283J296J308J323J335J349J363J377J391J405J420
$$ 210090 211300 212521 213755 215000 216258 217529 218812 220108 221416 222739 224074 225423 226786 228163 229554 230959 232379
765B32379J435J450J465J481J496J512J529J544J562J578J596J613J631J649J667J686J704
$$ 232379 233814 235264 236729 238210 239706 241218 242747 244291 245853 247431 249027 250640 252271 253920 255587 257273 258977
763B58977J724J743J763J783J804J824J845J867J889J910J934J956J979K003K027K052K076
$$ 258977 260701 262444 264207 265990 267794 269618 271463 273330 275219 277129 279063 281019 282998 285001 287028 289080 291156
761B91156K102K127K154K180K207K235K263K291K321K350K380K411K442K474K506K540K572
$$ 291156 293258 295385 297539 299719 301926 304161 306424 308715 311036 313386 315766 318177 320619 323093 325599 328139 330711
759C30711K607K642K677K714K750K788K826K865K905K946K987L029L072L116L160L207L252
$$ 330711 333318 335960 338637 341351 344101 346889 349715 352580 355485 358431 361418 364447 367519 370635 373795 377002 380254
757C80254L301L349L398L449L500L553L607L662L718L775L834L894L955M017M081M147M213
$$ 380254 383555 386904 390302 393751 397251 400804 404411 408073 411791 415566 419400 423294 427249 431266 435347 439494 443707
755D43707M281M351M423M496M570M647M726M805M888M971N058N146N236N328N423N521N620
$$ 443707 447988 452339 456762 461258 465828 470475 475201 480006 484894 489865 494923 500069 505305 510633 516056 521577 527197
753E27197N722N827N934O044O157O274O392O514O640O769O901P037P177P320P468P619P776
$$ 527197 532919 538746 544680 550724 556881 563155 569547 576061 582701 589470 596371 603408 610585 617905 625373 632992 640768
751F40768P936Q101Q271Q446Q626Q811R003R199R402R610R826J0049J0277J0514J0758J1010
$$ 640768 648704 656805 665076 673522 682148 690959 699962 709161 718563 728173 737999 748048 758325 768839 779597 790607
749G90607J1270J1539J1816J2103J2400J2706J3024J3352J3692J4044J4408J4785J5177J5582
$$ 790607 801877 813416 825232 837335 849735 862441 875465 888817 902509 916553 930961 945746 960923 976505
747I76505J6004J6439J6893J7363J7851J8359J8887J9435K0006K0600K1218K1863K2534K3233
$$ 976505 992509 1008948 1025841 1043204 1061055 1079414 1098301 1117736 1137742 1158342 1179560 1201423 1223957 1247190
745A247190K3964K4725K5520K6350K7219K8126K9075L0069L1109L2200L3343L4542L5801L7123
$$ 1247190 1271154 1295879 1321399 1347749 1374968 1403094 1432169 1462238 1493347 1525547 1558890 1593432 1629233 1666356
744A666356L8513L9974M1513M3131M4839M6638M8539N0544N2665N4909N7283N9800O2469O5302
$$ 1666356 1704869 1744843 1786356 1829487 1874326 1920964 1969503 2020047 2072712 2127621 2184904 2244704 2307173 2372475
742B372475O8313P1513P4920P8552Q2425Q6561R0984R5716J00788J06229J12074J18363J25135
$$ 2372475 2440788 2512301 2587221 2665773 2748198 2834759 2925743 3021459 3122247 3228476 3340550 3458913 3584048
740C584048J32443J40335J48876J58132J68178J79104J91005K03995K18201K33768K50864
$$ 3584048 3716491 3856826 4005702 4163834 4332012 4511116 4702121 4906116 5124317 5358085 5608949
739E608949K69682K90444L13406L38872L67190L98770M34098M73745N18394N68858O26114
$$ 5608949 5878631 6169075 6482481 6821353 7188543 7587313 8021411 8495156 9013550 9582408 10208522
738A0208522O91343P65986Q51797R50947J066126J200706J358939J546250J769619K038137
$$ 10208522 10899865 11665851 12517648 13468595 14534721 15735427 17094366 18640616 20410235 22448372
737B2448372K363769K762501L255951L873879M657912N667484O989248Q752729J1156902J4517201
$$ 22448372 24812141 27574642 30830593 34704472 39362384 45029868 52019116 60771845 71928747 86445948
735H6445948J9351857K6547704L7694492N5791065Q6791310J42878023K46941313M15009478
$$ 86445948 105797805 132345509 170040001 225831066 312622376 455500399 702441712 1117451190
734A117451190N19093247K54338106k70169910n20197555m08831747k42315667j40344736
$$ 1117451190 1636544437 1890882543 1620712633 1100515078 691683331 449367664 309022928
733C09022928q5413304n5000725l7213437k6238444j9143087j4370019j1048986q670722o924856
$$ 309022928 223609624 168608899 131395462 105157018 86013931 71643912 60594926 51924204 44999348
732D4999348n615369m614550l836863l223622k733667k337582k013958j746981j524790j338382
$$ 44999348 39383979 34769429 30932566 27708944 24975277 22637695 20623737 18876756 17351966 16013584
731A6013584j180834j046769r31964q33079p47437o72889o07685n50399m99855m55084m15271
$$ 16013584 14832750 13785981 12854017 12020938 11273501 10600612 9992927 9442528 8942673 8487589 8072318
730H072318l79745l47931l19348k93589k70302k49190k29993k12491j96489j81823j68345
$$ 8072318 7692573 7344642 7025294 6731705 6461403 6212213 5982220 5769729 5573240 5391417 5223072
728E223072j55924j44452j33829j23964j14783j06216r8200r0680q3609p6938p0630o4647
$$ 5223072 5067148 4922696 4788867 4664903 4550120 4443904 4345704 4255024 4171415 4094477 4023847 3959200
727C959200n8956n3526m8330m3342l8536l3893k9389k5008k0728j6534j2407q332m292k71
$$ 3959200 3900244 3846718 3798388 3755046 3716510 3682617 3653228 3628220 3607492 3590958 3578551 3570219 3565927 3565656
725C565656L744P771J1824J5921K0075K4305K8627L3059L7620M2331M7212N2286N7576O3112
$$ 3565656 3569400 3577171 3588995 3604916 3624991 3649296 3677923 3710982 3748602 3790933 3838145 3890431 3948007 4011119
724D011119O8919P5032Q1480Q8307R5550J03257J11478J20270J29699J39833J50754J62551
$$ 4011119 4080038 4155070 4236550 4324857 4420407 4523664 4635142 4755412 4885111 5024944 5175698 5338249
722E338249J75330J89202K04303K20783K38815K58597K80360L04369L30936L60418L93241
$$ 5338249 5513579 5702781 5907084 6127867 6366682 6625279 6905639 7210008 7540944 7901362 8294603
721H294603M29904M70994N17214N69401O28559O95910P72924Q61417R63613J082286J220896
$$ 8294603 8724507 9195501 9712715 10282116 10910675 11606585 12379509 13240926 14204539 15286825 16507721
719A6507721J383821J576638J806523K082819K417837K827996L335527L971013M777236N815266
$$ 16507721 17891542 19468180 21274703 23357522 25775359 28603355 31938882 35909895 40687131 46502397
718D6502397P174132Q986891J1457893J4911018J9878199K7269445L8715108N7289199Q9091446
$$ 46502397 53676529 62663420 74121313 89032331 108910530 136179975 174895083 232184282 321275728
717C21275728J46602941K53337729M26342272N35822593K64328662k79811997n36824853m20343432
$$ 321275728 467878669 721216398 1147558670 1683381263 1947709925 1667897928 1131073075 710729643
716G10729643k48881318j44175264q7781260n6547504l8272800k6993564j9699778j4792397
$$ 710729643 461848325 317673061 229891801 173344297 135071497 108077933 88378155 73585758
715G3585758j1377478q931758p136263n789500m760174l960340l329646k825774k418464k085700
$$ 73585758 62208280 53276522 46140259 40350759 35590585 31630245 28300599 25474825 23056361 20970661
714B0970661j811215j582814j391233j229350j091638r73751q72253p84390p07954o41143
$$ 20970661 19159446 17576632 16185399 14956049 13864411 12890660 12018407 11234017 10526063 9884920
713I884920n82493n30793m85044m44414m08208l75838l46809l20703k97158k75869k56573
$$ 9884920 9302427 8771634 8286590 7842176 7433968 7058130 6711321 6390618 6093460 5817591 5561018
711E561018k39039k23073k08502j95176j82967j71758j61449j51952j43188j35088j27589
$$ 5561018 5321979 5098906 4890404 4695228 4512261 4340503 4179054 4027102 3883914 3748826 3621237
710C621237j20636j14183j08181j02596r7389r2529q7988q3741p9763p6033p2533o9245o6153
$$ 3621237 3500601 3386418 3278237 3175641 3078252 2985723 2897735 2813994 2734231 2658198 2585665 2516420 2450267
708B450267o3242o0499n7913n5472n3166n0986m8924m6970m5119m3363m1698m0115l8611l7181
$$ 2450267 2387025 2326526 2268613 2213141 2159975 2108989 2060065 2013095 1967976 1924613 1882915 1842800 1804189 1767008
707A767008l5820l4525l3289l2112l0989k9916k8893k7914k6978k6083k5226k4406k3619k2866
$$ 1767008 1731188 1696663 1663374 1631262 1600273 1570357 1541464 1513550 1486572 1460489 1435263 1410857 1387238 1364372
705A364372k2143k1449k0784k0144j9530j8939j8371j7824j7299j6791j6304j5834j5381j4943
$$ 1364372 1342229 1320780 1299996 1279852 1260322 1241383 1223012 1205188 1187889 1171098 1154794 1138960 1123579 1108636
703A108636j4522j4115j3721j3342j2976j2621j2278j1946j1626j1316j1015j0724j0441j0169
$$ 1108636 1094114 1079999 1066278 1052936 1039960 1027339 1015061 1003115 991489 980173 969158 958434 947993 937824
702I37824r904r647r397r156q921q693q472q257q048p845p647p456p268p087o910o737o570
$$ 937824 927920 918273 908876 899720 890799 882106 873634 865377 857329 849484 841837 834381 827113 820026 813116 806379 799809
700G99809o406o247o091n940n793n648n507n371n236n105m978m853m730m612m494m381m269
$$ 799809 793403 787156 781065 775125 769332 763684 758177 752806 747570 742465 737487 732634 727904 723292 718798 714417 710148
697G10148m159m053l947l846l744l646l550l455l362l270l182l094l007k924k840k758k678
$$ 710148 705989 701936 697989 694143 690399 686753 683203 679748 676386 673116 669934 666840 663833 660909 658069 655311 652633
695F52633k600k521k446k370k297k224k152k081k013j943j876j810j744j679j615j552j489
$$ 652633 650033 647512 645066 642696 640399 638175 636023 633942 631929 629986 628110 626300 624556 622877 621262 619710 618221
693F18221j428j368j307j247j189j130j073j016r59r04q48p93p39o85o31n79n25m73m21l70
$$ 618221 616793 615425 614118 612871 611682 610552 609479 608463 607504 606600 605752 604959 604220 603535 602904 602325 601800 601327 600906 600536
691F00536l18k67k17j65j16o6j6L4Q3J33J81K30K80L27L77M25M74N22N70O19O67P16P64Q13
$$ 600536 600218 599951 599734 599569 599453 599387 599371 599405 599488 599621 599802 600032 600312 600639 601016 601441 601915 602437 603007 603626 604293 605009 605773 606586
688F06586Q61R10R58J008J056J105J155J204J253J304J353J403J454J504J556J606J658J710
$$ 606586 607447 608357 609315 610323 611379 612484 613639 614843 616096 617400 618753 620156 621610 623114 624670 626276 627934 629644
686F29644J762J815J868J920J975K028K083K138K194K249K306K362K421K478K537K596K656
$$ 629644 631406 633221 635089 637009 638984 641012 643095 645233 647427 649676 651982 654344 656765 659243 661780 664376 667032
684F67032K716K778K839K902K966L029L094L160L226L294L362L431L501L572L644L717L791
$$ 667032 669748 672526 675365 678267 681233 684262 687356 690516 693742 697036 700398 703829 707330 710902 714546 718263 722054
682G22054L866L943M020M098M178M260M342M425M510M597M685M774M865M957N051N148N244
$$ 722054 725920 729863 733883 737981 742159 746419 750761 755186 759696 764293 768978 773752 778617 783574 788625 793773 799017
679G99017N344N445N547N653N759N868N979O092O208O325O445O567O693O820O950P083P218
$$ 799017 804361 809806 815353 821006 826765 832633 838612 844704 850912 857237 863682 870249 876942 883762 890712 897795 905013
677I05013P358P499P644P792P943Q097Q257Q418Q583Q753Q927R104R286R473R663R859J0059
$$ 905013 912371 919870 927514 935306 943249 951346 959603 968021 976604 985357 994284 1003388 1012674 1022147 1031810 1041669 1051728
675A051728J0265J0476J0692J0913J1142J1374J1615J1861J2113J2374J2640J2915J3197J3487
$$ 1051728 1061993 1072469 1083161 1094074 1105216 1116590 1128205 1140066 1152179 1164553 1177193 1190108 1203305 1216792
674A216792J3786J4093J4409J4734J5069J5415J5770J6137J6515J6905J7306J7722J8150J8592
$$ 1216792 1230578 1244671 1259080 1273814 1288883 1304298 1320068 1336205 1352720 1369625 1386931 1404653 1422803 1441395
672A441395J9049J9521K0008K0513K1035K1575K2133K2711K3311K3931K4575K5242K5935K6653
$$ 1441395 1460444 1479965 1499973 1520486 1541521 1563096 1585229 1607940 1631251 1655182 1679757 1704999 1730934 1757587
670A757587K7399K8174K8979K9816L0687L1593L2536L3519L4542L5610L6724L7885L9100M0368
$$ 1757587 1784986 1813160 1842139 1871955 1902642 1934235 1966771 2000290 2034832 2070442 2107166 2145051 2184151 2224519
669B224519M1693M3081M4532M6054M7646M9318N1071N2913N4849N6883N9025O1280O3658O6165
$$ 2224519 2266212 2309293 2353825 2399879 2447525 2496843 2547914 2600827 2655676 2712559 2771584 2832864 2896522 2962687
667B962687O8812P1610P4568P7699Q1016Q4535Q8269R2237R6459J00954J05747J10863J16329
$$ 2962687 3031499 3103109 3177677 3255376 3336392 3420927 3509196 3601433 3697892 3798846 3904593 4015456 4131785
665D131785J22179J28445J35170J42391J50163J58537J67572J77341J87916J99389K11855
$$ 4131785 4253964 4382409 4517579 4659970 4810133 4968670 5136242 5313583 5501499 5700888 5912743
664E912743K25428K40236K56425K74163K93641L15086L38752L64941L94003M26349M62463
$$ 5912743 6138171 6378407 6634832 6908995 7202636 7517722 7856474 8221415 8615418 9041767 9504230
663I504230N02916N48389N99696O57813P23919P99454Q86173R86244J102365J237903J397129
$$ 9504230 10007146 10555535 11155231 11813044 12536963 13336417 14222590 15208834 16311199 17549102 18946231
661A8946231J585483J809980K079770K406921K807588L303700L925517M715571N734860P072864
$$ 18946231 20531714 22341694 24421464 26828385 29635973 32939673 36865190 41580761 47315621 54388485
660E4388485Q864275J1317811J4767758J9770056K7289598L9082043N8501669R2211953J53289646
$$ 54388485 63252760 74570571 89338329 109108385 136397983 175480026 233981695 326193648 479483294
659D79483294K61788115M08500947M37346937K05380739j24308699m00452999m36628287k97298517
$$ 479483294 741271409 1149772356 1587119293 1792500032 1668191333 1267738334 831110047 533811530
658E33811530j74985505j03957869o4936284m2735974k9425463k1030981j5496338j1705281
$$ 533811530 358826025 254868156 189931872 147195898 117770435 96739454 81243116 69537835
657F9537835r021829p067364n607479m491926l621390k928397k365919j900368j507194j168007
$$ 69537835 60516006 53448642 47841163 43349237 39727847 36799450 34433531 32533163 31025969 29857962
656B9857962q68644n97867l46414j06307J29700L68583O17488Q84172J177549J508303J889776
$$ 29857962 28989318 28391451 28045037 27938730 28068430 28437013 29054501 29938673 31116222 32624525 34514301
654C4514301K339143K879125L540522M366074N416430O779802Q587847J1042741J4465184
$$ 34514301 36853444 39732569 43273091 47639165 53055595 59835397 68423244 79465985 93931169
653I3931169J9382676K6699937L8044031N6500966Q8255440J46205811K55799206M41140105
$$ 93931169 113313845 140013782 178057813 234558779 322814219 469020030 724819236 1165959341
652A165959341N74593116K93658181l00676062n74951995m38548568k54023607j45329159
$$ 1165959341 1740552457 2034210638 1733534576 1158582581 720034013 466010406 320681247
651C20681247q7856905n6344709l8017989k6750105j9481984j4599653j1205200q774842o990142
$$ 320681247 232824342 176479633 138461644 111711539 92229555 77629902 66424702 57649860 50659718
650E0659718n650332m624803l826166l194514k687835k276113j937502j655834j418981j217704
$$ 50659718 45009386 40384583 36558417 33363903 30676068 28399955 26462453 24806619 23387638 22169934
649B2169934j044872q94915p63433o46889n42412m47647l60617k79636k03245j30147n9151
$$ 22169934 21125062 20230147 19466714 18819825 18277413 17829766 17469149 17189513 16986268 16856121 16796970
648A6796970J0853Q0948J52216K25775L02822L84672M72800N68919O75027P93532R27343J080048
$$ 16796970 16807823 16888771 17040987 17266762 17569584 17954256 18427056 18995975 19671002 20464534 21391877 22471925
646B2471925J256135J461250J702630J989649K334596K753818L269391L911584M722656N762747
$$ 22471925 23728060 25189310 26891940 28881589 31216185 33970003 37239394 41150978 45873634 51636381
645E1636381P119269Q922426J1371361J4780129J9661450K6885721L7997733N5876830Q6170616
$$ 51636381 58755650 67678076 79049437 93829566 113491016 140376737 178374470 234251300 320421916
644C20421916J40421374K41847515M23765939O25904776L95122127l74959932o28654795m30700127
$$ 320421916 460843290 702690805 1126456744 1752361520 2147483647 1772523715 1143868920 713168793
643G13168793k46037162j42576536q7272014n6438813l8269050k6989729j9662067j4711828
$$ 713168793 467131631 324555095 237283081 180844268 142575218 115585489 95923422 81211594
642H1211594j1253257q765185o928610n541354m471217l629326k954406k403219j944523j555272
$$ 81211594 69958337 61193152 54264542 48723188 44251971 40622645 37668239 35265020 33320497 31765225
641C1765225j218025r19251o48111l95611j53940Q4046L25269N76846Q46559J143326J477890
$$ 31765225 30547200 29627949 28979838 28584227 28430287 28514333 28839602 29416448 30263007 31406333 32884223
639C2884223J863645K317822K863197L530604M362705N419911O789814Q602597J1057256J4467470
$$ 32884223 34747868 37065690 39928887 43459491 47822196 53242107 60031921 68634518 79691774 94159244
638I4159244J9345264K6559844L7653810N5501855Q5738505J39859152K40886141M21378293
$$ 94159244 113504508 140064352 177718162 233220017 318958522 458817674 699703815 1121082108
637A121082108O19385697L81515515l81803715o19674992m21669985k41181464j40159303
$$ 1121082108 1740467805 2121983320 1740179605 1120504613 698834628 457653164 317493861
636C17493861q6044803n5815686l7976665k6893271j9690961j4827317j1433266q997031p205167
$$ 317493861 231449058 175633372 137656707 110763436 91072475 76245158 64811892 55814861 48609694
635D8609694n858987m828636m026969l394038k887770k478035k142889j866103j635495j441817
$$ 48609694 42750707 37922071 33895102 30501064 27613294 25135259 22992370 21126267 19490772 18048955
634A8048955j277944j138346j018675r15487q26026p48074o79830o19817n66825n19849m78052
$$ 18048955 16771011 15632665 14613990 13698503 12872477 12124403 11444573 10824756 10257931 9738082 9260030
633I260030m40734m07306l77269l50200l25738l03572k83436k65102k48367k33061k19032
$$ 9260030 8819296 8411990 8034721 7684521 7358783 7055211 6771775 6506673 6258306 6025245 5806213
631E806213k06146j94289j83360j73265j63927j55275j47246j39785j32838j26365j20323
$$ 5806213 5600067 5405778 5222418 5049153 4885226 4729951 4582705 4442920 4310082 4183717 4063394
630D063394j14678j09395j04447r9805r5447r1351q7497q3866q0444p7213p4161p1277o8546
$$ 4063394 3948716 3839321 3734874 3635069 3539622 3448271 3360774 3276908 3196464 3119251 3045090 2973813 2905267
628B905267o5961o3510o1185n8977n6881n4886n2990n1183m9462m7821m6256m4762m3334m1971
$$ 2905267 2839306 2775796 2714611 2655634 2598753 2543867 2490877 2439694 2390232 2342411 2296155 2251393 2208059 2166088
627B166088m0665l9418l8222l7078l5980l4928l3919l2951l2020l1126l0268k9441k8646k7881
$$ 2166088 2125423 2086005 2047783 2010705 1974725 1939797 1905878 1872927 1840907 1809781 1779513 1750072 1721426 1693545
625A693545k7145k6436k5752k5093k4457k3844k3252k2681k2129k1596k1081k0583k0100j9635
$$ 1693545 1666400 1639964 1614212 1589119 1564662 1540818 1517566 1494885 1472756 1451160 1430079 1409496 1389396 1369761
623A369761j9184j8747j8325j7915j7518j7134j6761j6399j6049j5709j5378j5058j4747j4445
$$ 1369761 1350577 1331830 1313505 1295590 1278072 1260938 1244177 1227778 1211729 1196020 1180642 1165584 1150837 1136392
622A136392j4151j3865j3589j3318j3057j2802j2553j2312j2078j1848j1626j1409j1198j0992
$$ 1136392 1122241 1108376 1094787 1081469 1068412 1055610 1043057 1030745 1018667 1006819 995193 983784 972586 961594
620I61594j0792j0596j0406j0220j0039r862r690r521r358r197r041q889q739q594q451q313
$$ 961594 950802 940206 929800 919580 909541 899679 889989 880468 871110 861913 852872 843983 835244 826650 818199 809886
618H09886q176q044p914p788p663p542p424p307p194p083o975o868o764o662o562o464o369
$$ 809886 801710 793666 785752 777964 770301 762759 755335 748028 740834 733751 726776 719908 713144 706482 699920 693456 687087
616F87087o275o183o094o005n918n835n751n670n590n512n435n360n286n214n143n073n005
$$ 687087 680812 674629 668535 662530 656612 650777 645026 639356 633766 628254 622819 617459 612173 606959 601816 596743 591738
614E91738m938m872m808m744m682m621m560m502m444m387m331m276m223m169m118m066m016
$$ 591738 586800 581928 577120 572376 567694 563073 558513 554011 549567 545180 540849 536573 532350 528181 524063 519997 515981
612E15981l966l918l871l823l777l732l687l643l600l558l515l475l434l395l355l317l279
$$ 515981 512015 508097 504226 500403 496626 492894 489207 485564 481964 478406 474891 471416 467982 464587 461232 457915 454636
610D54636l242l204l169l133l098l064l030k996k963k931k899k867k836k806k776k746k717
$$ 454636 451394 448190 445021 441888 438790 435726 432696 429700 426737 423806 420907 418040 415204 412398 409622 406876 404159
608D04159k688k660k632k604k577k551k524k498k472k447k423k397k374k350k326k303k280
$$ 404159 401471 398811 396179 393575 390998 388447 385923 383425 380953 378506 376083 373686 371312 368962 366636 364333 362053
606C62053k257k235k213k192k170k149k128k108k087k067k048k028k009j990j971j953j935
$$ 362053 359796 357561 355348 353156 350986 348837 346709 344601 342514 340447 338399 336371 334362 332372 330401 328448 326513
603C26513j916j899j881j864j847j830j813j796j781j764j749j733j717j702j687j672j658
$$ 326513 324597 322698 320817 318953 317106 315276 313463 311667 309886 308122 306373 304640 302923 301221 299534 297862 296204
601B96204j643j628j614j600j587j572j560j545j533j519j507j493j482j468j457j444j432
$$ 296204 294561 292933 291319 289719 288132 286560 285000 283455 281922 280403 278896 277403 275921 274453 272996 271552 270120
599B70120j420j409j397j385j374j363j351j341j329j319j309j298j287j277j267j257j247
$$ 270120 268700 267291 265894 264509 263135 261772 260421 259080 257751 256432 255123 253825 252538 251261 249994 248737 247490
597B47490j237j228j218j208j199j189j181j171j162j153j145j135j127j119j110j101j093
$$ 247490 246253 245025 243807 242599 241400 240211 239030 237859 236697 235544 234399 233264 232137 231018 229908 228807 227714
595B27714j085j077j069j061j053j045j038j030j022j015j007j000r93r86r78r72r64r57r51
$$ 227714 226629 225552 224483 223422 222369 221324 220286 219256 218234 217219 216212 215212 214219 213233 212255 211283 210319 209362 208411
593B08411r44r37r31r24r17r11r05q98q92q86q79q74q67q62q55q50q44q38q32q27q21q16q10
$$ 208411 207467 206530 205599 204675 203758 202847 201942 201044 200152 199266 198387 197513 196646 195784 194929 194079 193235 192397 191565 190738 189917 189101 188291
590A88291q05p99p94p89p83p78p74p68p62p58p53p48p43p39p33p29p24p19p15p10p06p01o96
$$ 188291 187486 186687 185893 185104 184321 183543 182769 182001 181239 180481 179728 178980 178237 177498 176765 176036 175312 174593 173878 173168 172462 171761 171065
587A71065o93o87o84o79o75o71o66o62o58o54o50o46o42o38o34o31o26o23o18o15o11o08o04
$$ 171065 170372 169685 169001 168322 167647 166976 166310 165648 164990 164336 163686 163040 162398 161760 161126 160495 159869 159246 158628 158013 157402 156794 156190
584A56190o00n97n93n89n86n82n79n76n72n69n65n62n59n56n52n49n46n43n39n36n34n30n27
$$ 156190 155590 154993 154400 153811 153225 152643 152064 151488 150916 150347 149782 149220 148661 148105 147553 147004 146458 145915 145376 144840 144306 143776 143249
582A43249n24n22n18n15n12n10n06n04n01m98m95m92m90m87m84m82m79m76m74m71m68m66m63
$$ 143249 142725 142203 141685 141170 140658 140148 139642 139138 138637 138139 137644 137152 136662 136175 135691 135209 134730 134254 133780 133309 132841 132375 131912
579A31912m61m58m56m53m51m48m46m44m41m39m36m34m32m29m28m24m23m21m18m16m14m11m10
$$ 131912 131451 130993 130537 130084 129633 129185 128739 128295 127854 127415 126979 126545 126113 125684 125256 124832 124409 123988 123570 123154 122740 122329 121919
576A21919m07m05m04m01l99l96l95l93l91l89l86l85l83l81l79l77l75l73l72l69l68l65l64
$$ 121919 121512 121107 120703 120302 119903 119507 119112 118719 118328 117939 117553 117168 116785 116404 116025 115648 115273 114900 114528 114159 113791 113426 113062
573A13062l62l61l58l57l55l53l51l50l48l46l45l43l41l39l38l37l34l33l31l30l28l27l25
$$ 113062 112700 112339 111981 111624 111269 110916 110565 110215 109867 109521 109176 108833 108492 108153 107815 107478 107144 106811 106480 106150 105822 105495 105170
570A05170l23l22l21l18l18l15l15l13l11l10l08l07l06l04l02l01l00k99k97k95k95k92k92
$$ 105170 104847 104525 104204 103886 103568 103253 102938 102625 102314 102004 101696 101389 101083 100779 100477 100176 99876 99577 99280 98985 98690 98398 98106
568I8106k90k89k88k86k85k83k83k81k79k79k77k76k75k73k72k71k70k69k67k66k65k64k63
$$ 98106 97816 97527 97239 96953 96668 96385 96102 95821 95542 95263 94986 94710 94435 94162 93890 93619 93349 93080 92813 92547 92282 92018 91755
565I1755k61k61k59k58k57k55k55k54k52k51k50k49k48k47k46k45k44k42k42k41k39k39k37
$$ 91755 91494 91233 90974 90716 90459 90204 89949 89695 89443 89192 88942 88693 88445 88198 87952 87707 87463 87221 86979 86738 86499 86260 86023
562H6023k37k35k35k33k33k31k31k29k29k27k27k26k24k24k23k22k21k20k19k18k18k16k16
$$ 86023 85786 85551 85316 85083 84850 84619 84388 84159 83930 83703 83476 83250 83026 82802 82579 82357 82136 81916 81697 81479 81261 81045 80829
559H0829k14k14k13k12k11k10k10k08k08k07k06k05k04k04k03k01k01k01j99j99j98j97j96
$$ 80829 80615 80401 80188 79976 79765 79555 79345 79137 78929 78722 78516 78311 78107 77903 77700 77499 77298 77097 76898 76699 76501 76304 76108
556G6108j95j95j94j93j92j92j91j90j89j89j88j87j86j86j85j84j84j82j82j82j80j80j80
$$ 76108 75913 75718 75524 75331 75139 74947 74756 74566 74377 74188 74000 73813 73627 73441 73256 73072 72888 72706 72524 72342 72162 71982 71802
553G1802j78j78j77j77j76j75j74j74j73j73j71j72j70j70j69j69j68j67j67j66j65j65j64
$$ 71802 71624 71446 71269 71092 70916 70741 70567 70393 70220 70047 69876 69704 69534 69364 69195 69026 68858 68691 68524 68358 68193 68028 67864
551F7864j64j63j62j62j61j61j60j59j59j58j57j57j57j56j55j55j54j54j53j52j52j51j51
$$ 67864 67700 67537 67375 67213 67052 66891 66731 66572 66413 66255 66098 65941 65784 65628 65473 65318 65164 65010 64857 64705 64553 64402 64251
548F4251j50j50j49j49j48j48j47j46j46j46j44j45j44j43j43j42j42j42j40j41j40j39j39
$$ 64251 64101 63951 63802 63653 63505 63357 63210 63064 62918 62772 62628 62483 62339 62196 62053 61911 61769 61627 61487 61346 61206 61067 60928
545F0928j38j38j38j36j37j36j35j35j35j34j34j33j32j33j31j32j31j30j30j30j29j28j28
$$ 60928 60790 60652 60514 60378 60241 60105 59970 59835 59700 59566 59432 59299 59167 59034 58903 58771 58640 58510 58380 58250 58121 57993 57865
542E7865j28j27j27j27j26j25j25j25j25j23j24j23j23j22j22j21j21j21j20j19j20j19j18
$$ 57865 57737 57610 57483 57356 57230 57105 56980 56855 56730 56607 56483 56360 56237 56115 55993 55872 55751 55630 55510 55391 55271 55152 55034
539E5034j19j17j18j17j16j17j16j15j15j15j14j14j14j13j13j12j12j12j11j12j10j10j10
$$ 55034 54915 54798 54680 54563 54447 54330 54214 54099 53984 53869 53755 53641 53527 53414 53301 53189 53077 52965 52854 52742 52632 52522 52412
537E2412j10j09j09j09j08j08j07j07j07j06j07j05j06j05j05j04j04j04j03j03j03j03j02
$$ 52412 52302 52193 52084 51975 51867 51759 51652 51545 51438 51332 51225 51120 51014 50909 50804 50700 50596 50492 50389 50286 50183 50080 49978
534D9978j02j01j01j01j01j00j00r9j00r9r8r9r8r7r8r7r7r6r6r6r6r5r5r5r5r4r4r3r4r3
$$ 49978 49876 49775 49674 49573 49472 49372 49272 49173 49073 48974 48876 48777 48679 48582 48484 48387 48290 48194 48098 48002 47906 47811 47716 47621 47526 47432 47338 47245 47151 47058
530D7058r2r3r2r2r2r1r1r1r0r1r0q9r0q9q9q8q9q8q8q7q8q7q6q7q6q6q6q6q5q5q5q4q4q4
$$ 47058 46966 46873 46781 46689 46597 46506 46415 46324 46234 46143 46053 45964 45874 45785 45696 45608 45519 45431 45343 45256 45168 45081 44995 44908 44822 44736 44650 44564 44479 44394 44309 44225 44141 44057
526D4057q4q4q3q3q3q2q3q2q1q2q1q2q0q1q0q1q0p9q0p9p9p9p8p9p8p8p7p8p7p7p7p6p7p6
$$ 44057 43973 43889 43806 43723 43640 43558 43475 43393 43312 43230 43149 43067 42987 42906 42826 42745 42665 42586 42506 42427 42348 42269 42191 42112 42034 41956 41879 41801 41724 41647 41570 41494 41417 41341
522D1341p6p6p5p5p5p5p5p4p5p4p3p4p3p3p3p3p3p2p2p2p2p2p1p1p1p1p0p1p0p0p0o9p0o9
$$ 41341 41265 41189 41114 41039 40964 40889 40814 40740 40665 40591 40518 40444 40371 40298 40225 40152 40079 40007 39935 39863 39791 39719 39648 39577 39506 39435 39365 39294 39224 39154 39084 39015 38945 38876
518C8876o9o9o9o8o8o9o7o8o8o7o7o7o7o7o6o6o7o5o6o6o5o5o5o5o5o4o5o4o4o4o3o4o3o3
$$ 38876 38807 38738 38669 38601 38533 38464 38397 38329 38261 38194 38127 38060 37993 37926 37860 37794 37727 37662 37596 37530 37465 37400 37335 37270 37205 37141 37076 37012 36948 36884 36821 36757 36694 36631
514C6631o3o3o3o2o3o2o2o2o1o2o1o1o1o1o1o0o1o0o0o0o0n9o0n9n9n9n9n9n8n9n8n8n8n8
$$ 36631 36568 36505 36442 36380 36317 36255 36193 36131 36070 36008 35947 35886 35825 35764 35703 35643 35582 35522 35462 35402 35342 35283 35223 35164 35105 35046 34987 34928 34870 34811 34753 34695 34637 34579
509C4579n7n8n7n7n7n7n7n6n7n6n6n6n6n6n6n5n5n6n5n4n5n5n4n5n4n4n4n4n3n4n3n4n3n3
$$ 34579 34522 34464 34407 34350 34293 34236 34179 34123 34066 34010 33954 33898 33842 33786 33730 33675 33620 33564 33509 33455 33400 33345 33291 33236 33182 33128 33074 33020 32967 32913 32860 32806 32753 32700
505C2700n3n2n3n2n3n2n2n2n2n1n2n1n2n1n1n1n1n0n1n0n1n0n0n0n0m9n0m9n0m9m9m9m9m9
$$ 32700 32647 32595 32542 32490 32437 32385 32333 32281 32229 32178 32126 32075 32023 31972 31921 31870 31819 31769 31718 31668 31617 31567 31517 31467 31417 31368 31318 31269 31219 31170 31121 31072 31023 30974
501C0974m8m9m8m9m8m8m8m7m8m8m7m8m7m7m7m7m7m6m7m6m7m6m6m6m6m6m5m6m6m5m5m5m5m5
$$ 30974 30926 30877 30829 30780 30732 30684 30636 30589 30541 30493 30446 30398 30351 30304 30257 30210 30163 30117 30070 30024 29977 29931 29885 29839 29793 29747 29702 29656 29610 29565 29520 29475 29430 29385
497B9385m5m5m4m5m4m5m4m4m4m4m4m3m4m3m4m3m3m3m3m3m3m3m2m3m2m3m2m2m2m2m2m1m2m1
$$ 29385 29340 29295 29251 29206 29162 29117 29073 29029 28985 28941 28897 28854 28810 28767 28723 28680 28637 28594 28551 28508 28465 28422 28380 28337 28295 28252 28210 28168 28126 28084 28042 28001 27959 27918
493B7918m2m1m1m2m1m1m1m0m1m1m0m0m1m0m0m0m0m0m0l9m0m0l9l9m0l9l9l9l9l8l9l9l8l9
$$ 27918 27876 27835 27794 27752 27711 27670 27629 27589 27548 27507 27467 27427 27386 27346 27306 27266 27226 27186 27146 27107 27067 27027 26988 26949 26909 26870 26831 26792 26753 26715 26676 26637 26599 26560
489B6560l8l8l9l8l8l8l8l7l8l8l7l8l7l7l8l7l7l7l6l7l7l7l6l7l6l6l7l6l6l6l6l6l5l6
$$ 26560 26522 26484 26445 26407 26369 26331 26293 26256 26218 26180 26143 26105 26068 26031 25993 25956 25919 25882 25846 25809 25772 25735 25699 25662 25626 25590 25553 25517 25481 25445 25409 25373 25338 25302
485B5302l6l5l6l5l5l6l5l5l5l5l5l4l5l5l4l5l4l4l5l4l4l4l4l4l4l3l4l4l3l4l3l3l4l3
$$ 25302 25266 25231 25195 25160 25125 25089 25054 25019 24984 24949 24914 24880 24845 24810 24776 24741 24707 24673 24638 24604 24570 24536 24502 24468 24434 24401 24367 24333 24300 24266 24233 24200 24166 24133
480B4133l3l3l3l3l3l2l3l3l2l3l2l3l2l2l2l2l2l2l2l2l2l1l2l2l1l2l1l1l1l2l1l1l1l1
$$ 24133 24100 24067 24034 24001 23968 23936 23903 23870 23838 23805 23773 23740 23708 23676 23644 23612 23580 23548 23516 23484 23452 23421 23389 23357 23326 23294 23263 23232 23201 23169 23138 23107 23076 23045
476B3045l0l1l1l1l0l1l0l1l0l0l0l1l0l0l0l0k9l0l0l0k9l0k9l0k9k9l0k9k9k9k9k9k9k9
$$ 23045 23015 22984 22953 22922 22892 22861 22831 22800 22770 22740 22710 22679 22649 22619 22589 22559 22530 22500 22470 22440 22411 22381 22352 22322 22293 22264 22234 22205 22176 22147 22118 22089 22060 22031
472B2031k8k9k9k8k9k8k9k8k9k8k8k8k8k8k8k8k8k8k8k7k8k8k7k8k7k8k7k7k7k8k7k7k7k7
$$ 22031 22003 21974 21945 21917 21888 21860 21831 21803 21774 21746 21718 21690 21662 21634 21606 21578 21550 21522 21494 21467 21439 21411 21384 21356 21329 21301 21274 21247 21220 21192 21165 21138 21111 21084
468B1084k7k6k7k7k7k6k7k6k7k6k7k6k6k6k7k6k6k6k6k6k6k5k6k6k6k5k6k5k6k5k6k5k5k5
$$ 21084 21057 21031 21004 20977 20950 20924 20897 20871 20844 20818 20791 20765 20739 20713 20686 20660 20634 20608 20582 20556 20530 20505 20479 20453 20427 20402 20376 20351 20325 20300 20274 20249 20224 20199
464B0199k6k5k5k5k5k5k5k5k4k5k5k4k5k5k4k5k4k4k5k4k4k5k4k4k4k4k4k4k4k3k4k4k4k3
$$ 20199 20173 20148 20123 20098 20073 20048 20023 19998 19974 19949 19924 19900 19875 19850 19826 19801 19777 19753 19728 19704 19680 19655 19631 19607 19583 19559 19535 19511 19487 19464 19440 19416 19392 19369
460A9369k4k4k3k4k3k3k4k3k3k3k4k3k3k3k3k3k3k3k2k3k3k3k2k3k3k2k3k2k2k3k2k2k3k2
$$ 19369 19345 19321 19298 19274 19251 19228 19204 19181 19158 19135 19111 19088 19065 19042 19019 18996 18973 18950 18928 18905 18882 18859 18837 18814 18791 18769 18746 18724 18702 18679 18657 18635 18612 18590
455A8590k2k2k2k2k2k2k2k2k2k2k2k1k2k2k1k2k1k2k1k2k1k1k2k1k1k1k1k2k1k1k1k1k1k0
$$ 18590 18568 18546 18524 18502 18480 18458 18436 18414 18392 18370 18348 18327 18305 18283 18262 18240 18219 18197 18176 18154 18133 18112 18090 18069 18048 18027 18006 17984 17963 17942 17921 17900 17879 17859
451A7859k1k1k1k1k0k1k1k0k1k0k1k0k0k1k0k0k1k0k0k0k0k0k1k0j9k0k0k0k0k0k0j9k0k0
$$ 17859 17838 17817 17796 17775 17755 17734 17713 17693 17672 17652 17631 17611 17591 17570 17550 17530 17509 17489 17469 17449 17429 17409 17388 17368 17349 17329 17309 17289 17269 17249 17229 17210 17190 17170
447A7170j9k0j9k0j9k0j9k0j9j9k0j9j9j9j9j9k0j9j9j9j9j8j9j9j9j9j9j8j9j9j8j9j8j9
$$ 17170 17151 17131 17112 17092 17073 17053 17034 17014 16995 16976 16956 16937 16918 16899 16880 16861 16841 16822 16803 16784 16765 16747 16728 16709 16690 16671 16652 16634 16615 16596 16578 16559 16541 16522
443A6522j8j9j8j9j8j8j9j8j8j8j9j8j8j8j8j8j8j8j8j8j8j8j7j8j8j8j7j8j8j7j8j7j8j7
$$ 16522 16504 16485 16467 16448 16430 16412 16393 16375 16357 16339 16320 16302 16284 16266 16248 16230 16212 16194 16176 16158 16140 16122 16105 16087 16069 16051 16034 16016 15998 15981 15963 15946 15928 15911
439A5911j8j7j8j7j7j8j7j7j7j8j7j7j7j7j7j7j7j7j7j7j7j7j6j7j7j7j6j7j7j6j7j7j6j7
$$ 15911 15893 15876 15858 15841 15824 15806 15789 15772 15755 15737 15720 15703 15686 15669 15652 15635 15618 15601 15584 15567 15550 15533 15517 15500 15483 15466 15450 15433 15416 15400 15383 15366 15350 15333
435A5333j6j7j6j6j7j6j7j6j6j6j7j6j6j6j6j6j6j6j6j6j6j6j6j6j6j6j6j5j6j6j5j6j6j5
$$ 15333 15317 15300 15284 15268 15251 15235 15218 15202 15186 15170 15153 15137 15121 15105 15089 15073 15057 15041 15025 15009 14993 14977 14961 14945 14929 14913 14897 14882 14866 14850 14835 14819 14803 14788
431A4788j6j6j5j6j5j6j5j6j5j5j6j5j5j6j5j5j5j5j6j5j5j5j5j5j5j5j5j5j5j5j5j4j5j5
$$ 14788 14772 14756 14741 14725 14710 14694 14679 14663 14648 14633 14617 14602 14587 14571 14556 14541 14526 14511 14495 14480 14465 14450 14435 14420 14405 14390 14375 14360 14345 14330 14315 14301 14286 14271
426A4271j5j4j5j5j5j4j5j4j5j5j4j5j4j5j4j4j5j4j5j4j4j5j4j4j4j4j5j4j4j4j4j4j4j4
$$ 14271 14256 14242 14227 14212 14197 14183 14168 14154 14139 14124 14110 14095 14081 14066 14052 14038 14023 14009 13994 13980 13966 13951 13937 13923 13909 13895 13880 13866 13852 13838 13824 13810 13796 13782
422A3782j4j4j4j4j4j4j4j4j3j4j4j4j4j3j4j4j3j4j4j3j4j3j4j3j4j3j4j3j4j3j3j4j3j3
$$ 13782 13768 13754 13740 13726 13712 13698 13684 13670 13657 13643 13629 13615 13601 13588 13574 13560 13547 13533 13519 13506 13492 13479 13465 13452 13438 13425 13411 13398 13384 13371 13358 13344 13331 13318
418A3318j4j3j3j3j3j4j3j3j3j3j3j3j3j3j3j3j3j3j3j3j3j3j3j3j2j3j3j3j2j3j3j2j3j3
$$ 13318 13304 13291 13278 13265 13252 13238 13225 13212 13199 13186 13173 13160 13147 13134 13121 13108 13095 13082 13069 13056 13043 13030 13017 13004 12992 12979 12966 12953 12941 12928 12915 12903 12890 12877
414A2877j2j3j3j2j3j2j3j2j3j2j2j3j2j3j2j2j3j2j2j2j3j2j2j2j3j2j2j2j2j2j2j2j2j2
$$ 12877 12865 12852 12839 12827 12814 12802 12789 12777 12764 12752 12740 12727 12715 12702 12690 12678 12665 12653 12641 12629 12616 12604 12592 12580 12567 12555 12543 12531 12519 12507 12495 12483 12471 12459
410A2459j2j2j2j2j2j2j2j2j2j1j2j2j2j1j2j2j2j1j2j2j1j2j2j1j2j1j2j1j2j1j2j1j2j1
$$ 12459 12447 12435 12423 12411 12399 12387 12375 12363 12351 12340 12328 12316 12304 12293 12281 12269 12257 12246 12234 12222 12211 12199 12187 12176 12164 12153 12141 12130 12118 12107 12095 12084 12072 12061
406A2061j2j1j1j2j1j1j2j1j1j2j1j1j1j1j2j1j1j1j1j1j1j1j1j1j1j1j1j1j1j1j1j1j1j1
$$ 12061 12049 12038 12027 12015 12004 11993 11981 11970 11959 11947 11936 11925 11914 11903 11891 11880 11869 11858 11847 11836 11825 11814 11803 11792 11781 11770 11759 11748 11737 11726 11715 11704 11693 11682
401A1682j1j1j0j1j1j1j1j0j1j1j1j0j1j1j0j1j1j0j1j0j1j0j1j0j1j0j1j0j1j0j1j0j0j1
$$ 11682 11671 11660 11650 11639 11628 11617 11606 11596 11585 11574 11563 11553 11542 11531 11521 11510 11499 11489 11478 11468 11457 11447 11436 11426 11415 11405 11394 11384 11373 11363 11352 11342 11332 11321
397A1321j0j0j1j0j0j1j0j0j0j1j0j0j0j0j1j0j0j0j0j0j0j0j0j0j0j0j0j0j0j0j0j0j0j0
$$ 11321 11311 11301 11290 11280 11270 11259 11249 11239 11229 11218 11208 11198 11188 11178 11167 11157 11147 11137 11127 11117 11107 11097 11087 11077 11067 11057 11047 11037 11027 11017 11007 10997 10987 10977
393A0977j0rj0j0j0j0j0rj0j0j0rj0j0rj0j0rj0j0rj0rj0j0rj0rj0rj0rj0rrj0rj0rrj0rr
$$ 10977 10967 10958 10948 10938 10928 10918 10908 10899 10889 10879 10869 10860 10850 10840 10831 10821 10811 10802 10792 10782 10773 10763 10754 10744 10734 10725 10715 10706 10696 10687 10677 10668 10658 10649 10640 10630 10621 10611 10602 10593 10583 10574 10565
388A0565j0rrrj0rrrj0rrrrrj0rrrrrrrrrrrrrrrrrrrrrrqrrrrrqrrrqrrrqrrqrrqrqrrqr
$$ 10565 10555 10546 10537 10528 10518 10509 10500 10491 10481 10472 10463 10454 10445 10436 10426 10417 10408 10399 10390 10381 10372 10363 10354 10345 10336 10327 10318 10309 10300 10291 10282 10273 10264 10255 10246 10237 10228 10220 10211 10202 10193 10184 10175 10167 10158 10149 10140 10132 10123 10114 10105 10097 10088 10079 10071 10062 10053 10045 10036 10028 10019 10010 10002 9993
380I993qrqrqrqrqrqqrqrqqrqrqqqrqqrqqqrqqqqqrqqqqqqqqrqqqqqqqqqqqpqqqqqqqqpqq
$$ 9993 9985 9976 9968 9959 9951 9942 9934 9925 9917 9908 9900 9892 9883 9875 9866 9858 9850 9841 9833 9824 9816 9808 9800 9791 9783 9775 9766 9758 9750 9742 9733 9725 9717 9709 9701 9693 9684 9676 9668 9660 9652 9644 9636 9628 9620 9611 9603 9595 9587 9579 9571 9563 9555 9547 9539 9531 9523 9516 9508 9500 9492 9484 9476 9468 9460 9452 9445 9437 9429
372I429qqqpqqqpqqqpqqpqqpqqpqpqqpqpqpqpqpqpqpqpqpqppqppqpqpppqppqpppqpppqppp
$$ 9429 9421 9413 9405 9398 9390 9382 9374 9367 9359 9351 9343 9336 9328 9320 9313 9305 9297 9290 9282 9274 9267 9259 9252 9244 9236 9229 9221 9214 9206 9199 9191 9184 9176 9169 9161 9154 9146 9139 9131 9124 9116 9109 9101 9094 9087 9079 9072 9065 9057 9050 9042 9035 9028 9021 9013 9006 8999 8991 8984 8977 8970 8962 8955 8948 8941 8933 8926 8919 8912
363H912ppqpppppppqpppppppppppppppppoppppppppopppppoppppopppoppoppoppoppoppop
$$ 8912 8905 8898 8890 8883 8876 8869 8862 8855 8848 8841 8833 8826 8819 8812 8805 8798 8791 8784 8777 8770 8763 8756 8749 8742 8735 8728 8721 8714 8708 8701 8694 8687 8680 8673 8666 8659 8652 8646 8639 8632 8625 8618 8611 8605 8598 8591 8584 8577 8571 8564 8557 8550 8544 8537 8530 8524 8517 8510 8504 8497 8490 8484 8477 8470 8464 8457 8450 8444 8437
355H437oppopopopopopopopopopoopopoopopoopoopooopoopooopoooopooooopooooooopoo
$$ 8437 8431 8424 8417 8411 8404 8398 8391 8385 8378 8372 8365 8359 8352 8346 8339 8333 8326 8320 8313 8307 8300 8294 8288 8281 8275 8268 8262 8256 8249 8243 8236 8230 8224 8217 8211 8205 8198 8192 8186 8180 8173 8167 8161 8154 8148 8142 8136 8129 8123 8117 8111 8105 8098 8092 8086 8080 8074 8068 8061 8055 8049 8043 8037 8031 8025 8019 8012 8006 8000
346H000ooooooooooooooooooooooooonooooooonooooonooonoooonoonooonoonoonoonoono
$$ 8000 7994 7988 7982 7976 7970 7964 7958 7952 7946 7940 7934 7928 7922 7916 7910 7904 7898 7892 7886 7880 7874 7868 7862 7856 7850 7845 7839 7833 7827 7821 7815 7809 7803 7798 7792 7786 7780 7774 7768 7763 7757 7751 7745 7740 7734 7728 7722 7716 7711 7705 7699 7694 7688 7682 7676 7671 7665 7659 7654 7648 7642 7637 7631 7625 7620 7614 7608 7603 7597
338G597noononoonononononononononononnonononnonnononnonnnonnonnonnnonnnonnnno
$$ 7597 7592 7586 7580 7575 7569 7564 7558 7552 7547 7541 7536 7530 7525 7519 7514 7508 7503 7497 7492 7486 7481 7475 7470 7464 7459 7453 7448 7442 7437 7432 7426 7421 7415 7410 7404 7399 7394 7388 7383 7378 7372 7367 7361 7356 7351 7345 7340 7335 7330 7324 7319 7314 7308 7303 7298 7292 7287 7282 7277 7271 7266 7261 7256 7250 7245 7240 7235 7230 7224
330G224nnnnnonnnnnonnnnnnnnnonnnnnnnnnnnnnnnnnnnnnnnnnnmnnnnnnnnnmnnnnnnmnnn
$$ 7224 7219 7214 7209 7204 7199 7193 7188 7183 7178 7173 7168 7162 7157 7152 7147 7142 7137 7132 7127 7122 7117 7111 7106 7101 7096 7091 7086 7081 7076 7071 7066 7061 7056 7051 7046 7041 7036 7031 7026 7021 7016 7011 7006 7001 6996 6991 6986 6981 6977 6972 6967 6962 6957 6952 6947 6942 6937 6932 6928 6923 6918 6913 6908 6903 6898 6894 6889 6884 6879
321F879nnmnnnnmnnnmnnnmnnnmnnmnnnmnnmnnmnmnnmnnmnmnnmnmnnmnmnmnmnnmnmnmnmnmn
$$ 6879 6874 6869 6865 6860 6855 6850 6845 6841 6836 6831 6826 6822 6817 6812 6807 6803 6798 6793 6788 6784 6779 6774 6770 6765 6760 6755 6751 6746 6741 6737 6732 6727 6723 6718 6714 6709 6704 6700 6695 6690 6686 6681 6677 6672 6667 6663 6658 6654 6649 6644 6640 6635 6631 6626 6622 6617 6613 6608 6603 6599 6594 6590 6585 6581 6576 6572 6567 6563 6558
313F558mmnmnmnmnmnmmnmnmmnmnmmnmmnmmnmmnmmnmmnmmnmmmnmmmnmmmnmmmnmmmmnmmmmnm
$$ 6558 6554 6550 6545 6541 6536 6532 6527 6523 6518 6514 6509 6505 6501 6496 6492 6487 6483 6479 6474 6470 6465 6461 6457 6452 6448 6444 6439 6435 6431 6426 6422 6418 6413 6409 6405 6400 6396 6392 6387 6383 6379 6374 6370 6366 6362 6357 6353 6349 6345 6340 6336 6332 6328 6323 6319 6315 6311 6306 6302 6298 6294 6290 6285 6281 6277 6273 6269 6264 6260
304F260mmmmnmmmmmmmnmmmmmmmmmnmmmmmmmmmmmmmmmmmmmmmmmmmmmmmmmmmmmlmmmmmmmmmm
$$ 6260 6256 6252 6248 6244 6239 6235 6231 6227 6223 6219 6215 6211 6206 6202 6198 6194 6190 6186 6182 6178 6174 6170 6165 6161 6157 6153 6149 6145 6141 6137 6133 6129 6125 6121 6117 6113 6109 6105 6101 6097 6093 6089 6085 6081 6077 6073 6069 6065 6061 6057 6053 6049 6045 6041 6037 6033 6029 6025 6022 6018 6014 6010 6006 6002 5998 5994 5990 5986 5982
296E982lmmmmmmmlmmmmmlmmmmmlmmmmlmmmlmmmmlmmmlmmmlmmlmmmlmmlmmlmmlmmlmmlmmlm
$$ 5982 5979 5975 5971 5967 5963 5959 5955 5951 5948 5944 5940 5936 5932 5928 5925 5921 5917 5913 5909 5905 5902 5898 5894 5890 5886 5883 5879 5875 5871 5868 5864 5860 5856 5852 5849 5845 5841 5837 5834 5830 5826 5822 5819 5815 5811 5808 5804 5800 5796 5793 5789 5785 5782 5778 5774 5771 5767 5763 5760 5756 5752 5749 5745 5741 5738 5734 5730 5727 5723
287E723mlmlmmlmlmmlmlmmlmlmlmlmmlmlmlmlmlmlmlmlmlmlmlmlmlmlmllmlmlmllmlmllml
$$ 5723 5719 5716 5712 5709 5705 5701 5698 5694 5691 5687 5683 5680 5676 5673 5669 5665 5662 5658 5655 5651 5648 5644 5641 5637 5633 5630 5626 5623 5619 5616 5612 5609 5605 5602 5598 5595 5591 5588 5584 5581 5577 5574 5570 5567 5563 5560 5556 5553 5549 5546 5542 5539 5535 5532 5529 5525 5522 5518 5515 5511 5508 5505 5501 5498 5494 5491 5488 5484 5481
279E481mllmlmllmllmlmllmllmllmllmlllmllmllmlllmlllmlllmlllmlllmllllmllllmlll
$$ 5481 5477 5474 5471 5467 5464 5460 5457 5454 5450 5447 5444 5440 5437 5433 5430 5427 5423 5420 5417 5413 5410 5407 5403 5400 5397 5393 5390 5387 5384 5380 5377 5374 5370 5367 5364 5360 5357 5354 5351 5347 5344 5341 5338 5334 5331 5328 5325 5321 5318 5315 5312 5308 5305 5302 5299 5295 5292 5289 5286 5283 5279 5276 5273 5270 5267 5263 5260 5257 5254
271E254lmlllllmlllllmlllllllmllllllllmlllllllllllllmllllllllllllllllllllllll
$$ 5254 5251 5247 5244 5241 5238 5235 5232 5228 5225 5222 5219 5216 5213 5209 5206 5203 5200 5197 5194 5191 5188 5184 5181 5178 5175 5172 5169 5166 5163 5160 5156 5153 5150 5147 5144 5141 5138 5135 5132 5129 5126 5123 5120 5117 5113 5110 5107 5104 5101 5098 5095 5092 5089 5086 5083 5080 5077 5074 5071 5068 5065 5062 5059 5056 5053 5050 5047 5044 5041
262E041lllllllllllllllklllllllllllllklllllllllkllllllkllllllklllllklllllklll
$$ 5041 5038 5035 5032 5029 5026 5023 5020 5017 5014 5011 5008 5005 5002 4999 4996 4994 4991 4988 4985 4982 4979 4976 4973 4970 4967 4964 4961 4958 4955 4953 4950 4947 4944 4941 4938 4935 4932 4929 4926 4924 4921 4918 4915 4912 4909 4906 4904 4901 4898 4895 4892 4889 4886 4884 4881 4878 4875 4872 4869 4867 4864 4861 4858 4855 4852 4850 4847 4844 4841
254D841lkllllkllllklllklllklllklllklllklllkllklllkllkllkllklllkllkllklkllkll
$$ 4841 4838 4836 4833 4830 4827 4824 4822 4819 4816 4813 4810 4808 4805 4802 4799 4797 4794 4791 4788 4786 4783 4780 4777 4775 4772 4769 4766 4764 4761 4758 4755 4753 4750 4747 4744 4742 4739 4736 4734 4731 4728 4725 4723 4720 4717 4715 4712 4709 4707 4704 4701 4699 4696 4693 4690 4688 4685 4682 4680 4677 4674 4672 4669 4667 4664 4661 4659 4656 4653
245D653kllkllklkllklkllklkllklkllklklkllklklkllklklklklklklkllklklklklklklkl
$$ 4653 4651 4648 4645 4643 4640 4637 4635 4632 4630 4627 4624 4622 4619 4617 4614 4611 4609 4606 4604 4601 4598 4596 4593 4591 4588 4585 4583 4580 4578 4575 4573 4570 4567 4565 4562 4560 4557 4555 4552 4549 4547 4544 4542 4539 4537 4534 4532 4529 4527 4524 4522 4519 4517 4514 4511 4509 4506 4504 4501 4499 4496 4494 4491 4489 4486 4484 4481 4479 4476
237D476klkklklklklklklklkklklklklkklklkklklklkklklkklklkklkklklkklkklkklklkk
$$ 4476 4474 4471 4469 4467 4464 4462 4459 4457 4454 4452 4449 4447 4444 4442 4439 4437 4434 4432 4430 4427 4425 4422 4420 4417 4415 4412 4410 4408 4405 4403 4400 4398 4396 4393 4391 4388 4386 4383 4381 4379 4376 4374 4371 4369 4367 4364 4362 4359 4357 4355 4352 4350 4348 4345 4343 4340 4338 4336 4333 4331 4329 4326 4324 4322 4319 4317 4314 4312 4310
228D310lkklkklkklkklkklkkklkklkklkkklkklkkklkklkkklkkklkkklkkklkkklkkkklkkkl
$$ 4310 4307 4305 4303 4300 4298 4296 4293 4291 4289 4286 4284 4282 4279 4277 4275 4272 4270 4268 4266 4263 4261 4259 4256 4254 4252 4249 4247 4245 4243 4240 4238 4236 4233 4231 4229 4227 4224 4222 4220 4217 4215 4213 4211 4208 4206 4204 4202 4199 4197 4195 4193 4190 4188 4186 4184 4181 4179 4177 4175 4172 4170 4168 4166 4164 4161 4159 4157 4155 4152
220D152kkkklkkkklkkkklkkkklkkkkklkkkkklkkkkkklkkkkkklkkkkkkklkkkkkkkklkkkkkk
$$ 4152 4150 4148 4146 4144 4141 4139 4137 4135 4133 4130 4128 4126 4124 4122 4119 4117 4115 4113 4111 4108 4106 4104 4102 4100 4098 4095 4093 4091 4089 4087 4085 4082 4080 4078 4076 4074 4072 4070 4067 4065 4063 4061 4059 4057 4055 4052 4050 4048 4046 4044 4042 4040 4038 4035 4033 4031 4029 4027 4025 4023 4021 4019 4016 4014 4012 4010 4008 4006 4004
212D004kkklkkkkkkkkkkkklkkkkkkkkkkkkkkkkkkklkkkkkkkkkkkkkkkkkkkkkkkkkkkkkkkk
$$ 4004 4002 4000 3998 3995 3993 3991 3989 3987 3985 3983 3981 3979 3977 3975 3973 3971 3968 3966 3964 3962 3960 3958 3956 3954 3952 3950 3948 3946 3944 3942 3940 3938 3936 3934 3932 3930 3927 3925 3923 3921 3919 3917 3915 3913 3911 3909 3907 3905 3903 3901 3899 3897 3895 3893 3891 3889 3887 3885 3883 3881 3879 3877 3875 3873 3871 3869 3867 3865 3863
203C863kkkkkkkkkjkkkkkkkkkkkkkkkkkkkjkkkkkkkkkkkkkjkkkkkkkkkkjkkkkkkkkjkkkkk
$$ 3863 3861 3859 3857 3855 3853 3851 3849 3847 3845 3844 3842 3840 3838 3836 3834 3832 3830 3828 3826 3824 3822 3820 3818 3816 3814 3812 3810 3808 3806 3805 3803 3801 3799 3797 3795 3793 3791 3789 3787 3785 3783 3781 3779 3778 3776 3774 3772 3770 3768 3766 3764 3762 3760 3758 3757 3755 3753 3751 3749 3747 3745 3743 3741 3740 3738 3736 3734 3732 3730
195C730kkjkkkkkkkjkkkkkkjkkkkkjkkkkkjkkkkkjkkkkkjkkkkjkkkkjkkkkjkkkkjkkkkjkk
$$ 3730 3728 3726 3725 3723 3721 3719 3717 3715 3713 3711 3710 3708 3706 3704 3702 3700 3698 3697 3695 3693 3691 3689 3687 3686 3684 3682 3680 3678 3676 3675 3673 3671 3669 3667 3665 3664 3662 3660 3658 3656 3654 3653 3651 3649 3647 3645 3644 3642 3640 3638 3636 3635 3633 3631 3629 3627 3626 3624 3622 3620 3618 3617 3615 3613 3611 3609 3608 3606 3604
186C604kkjkkkjkkkjkkkkjkkkjkkkjkkkjkkjkkkjkkkjkkkjkkjkkkjkkjkkkjkkjkkjkkkjkk
$$ 3604 3602 3600 3599 3597 3595 3593 3592 3590 3588 3586 3585 3583 3581 3579 3577 3576 3574 3572 3570 3569 3567 3565 3563 3562 3560 3558 3556 3555 3553 3551 3550 3548 3546 3544 3543 3541 3539 3537 3536 3534 3532 3530 3529 3527 3525 3524 3522 3520 3518 3517 3515 3513 3512 3510 3508 3506 3505 3503 3501 3500 3498 3496 3495 3493 3491 3489 3488 3486 3484
178C484jkkjkkjkkjkkjkkjkkjkkjkkjkkjkkjkkjkkjkkjkjkkjkkjkkjkjkkjkkjkjkkjkjkkj
$$ 3484 3483 3481 3479 3478 3476 3474 3473 3471 3469 3468 3466 3464 3463 3461 3459 3458 3456 3454 3453 3451 3449 3448 3446 3444 3443 3441 3439 3438 3436 3434 3433 3431 3429 3428 3426 3424 3423 3421 3419 3418 3416 3415 3413 3411 3410 3408 3406 3405 3403 3401 3400 3398 3397 3395 3393 3392 3390 3388 3387 3385 3384 3382 3380 3379 3377 3376 3374 3372 3371
169C371kjkkjkjkkjkjkkjkjkkjkjkjkkjkjkjkkjkjkjkjkkjkjkjkjkkjkjkjkjkjkkjkjkjkj
$$ 3371 3369 3368 3366 3364 3363 3361 3360 3358 3356 3355 3353 3352 3350 3348 3347 3345 3344 3342 3340 3339 3337 3336 3334 3333 3331 3329 3328 3326 3325 3323 3322 3320 3318 3317 3315 3314 3312 3311 3309 3308 3306 3304 3303 3301 3300 3298 3297 3295 3294 3292 3290 3289 3287 3286 3284 3283 3281 3280 3278 3277 3275 3273 3272 3270 3269 3267 3266 3264 3263
161C263kjkjkjkjkjkjkjkkjkjkjkjkjkjkjkjkjjkjkjkjkjkjkjkjkjkjkjkjjkjkjkjkjkjkj
$$ 3263 3261 3260 3258 3257 3255 3254 3252 3251 3249 3248 3246 3245 3243 3242 3240 3238 3237 3235 3234 3232 3231 3229 3228 3226 3225 3223 3222 3220 3219 3217 3216 3214 3213 3212 3210 3209 3207 3206 3204 3203 3201 3200 3198 3197 3195 3194 3192 3191 3189 3188 3186 3185 3183 3182 3180 3179 3178 3176 3175 3173 3172 3170 3169 3167 3166 3164 3163 3161 3160
153C160jkjkjkjkjjkjkjkjjkjkjkjkjjkjkjjkjkjkjjkjkjjkjkjjkjkjkjjkjjkjkjjkjkjjk
$$ 3160 3159 3157 3156 3154 3153 3151 3150 3148 3147 3146 3144 3143 3141 3140 3138 3137 3136 3134 3133 3131 3130 3128 3127 3125 3124 3123 3121 3120 3118 3117 3116 3114 3113 3111 3110 3108 3107 3106 3104 3103 3101 3100 3099 3097 3096 3094 3093 3092 3090 3089 3087 3086 3084 3083 3082 3080 3079 3078 3076 3075 3073 3072 3071 3069 3068 3066 3065 3064 3062
144C062jkjjkjjkjkjjkjjkjkjjkjjkjjkjjkjkjjkjjkjjkjjkjjkjjkjjkjjkjjkjjkjjkjjkj
$$ 3062 3061 3059 3058 3057 3055 3054 3053 3051 3050 3048 3047 3046 3044 3043 3042 3040 3039 3037 3036 3035 3033 3032 3031 3029 3028 3027 3025 3024 3023 3021 3020 3018 3017 3016 3014 3013 3012 3010 3009 3008 3006 3005 3004 3002 3001 3000 2998 2997 2996 2994 2993 2992 2990 2989 2988 2986 2985 2984 2982 2981 2980 2978 2977 2976 2974 2973 2972 2970 2969
136B969jkjjkjjjkjjkjjkjjkjjjkjjkjjkjjjkjjkjjjkjjkjjjkjjjkjjkjjjkjjjkjjkjjjkj
$$ 2969 2968 2966 2965 2964 2962 2961 2960 2959 2957 2956 2955 2953 2952 2951 2949 2948 2947 2945 2944 2943 2942 2940 2939 2938 2936 2935 2934 2932 2931 2930 2929 2927 2926 2925 2923 2922 2921 2920 2918 2917 2916 2914 2913 2912 2911 2909 2908 2907 2906 2904 2903 2902 2900 2899 2898 2897 2895 2894 2893 2892 2890 2889 2888 2886 2885 2884 2883 2881 2880
127B880jjkjjjkjjjkjjjkjjjkjjjkjjjjkjjjkjjjkjjjjkjjjkjjjjkjjjkjjjjkjjjjkjjjjk
$$ 2880 2879 2878 2876 2875 2874 2873 2871 2870 2869 2868 2866 2865 2864 2863 2861 2860 2859 2858 2856 2855 2854 2853 2851 2850 2849 2848 2847 2845 2844 2843 2842 2840 2839 2838 2837 2835 2834 2833 2832 2831 2829 2828 2827 2826 2824 2823 2822 2821 2820 2818 2817 2816 2815 2813 2812 2811 2810 2809 2807 2806 2805 2804 2803 2801 2800 2799 2798 2797 2795
119B795jjjjkjjjjkjjjjkjjjjkjjjjjkjjjjjkjjjjkjjjjjkjjjjjkjjjjjkjjjjjjkjjjjjjk
$$ 2795 2794 2793 2792 2791 2789 2788 2787 2786 2785 2783 2782 2781 2780 2779 2777 2776 2775 2774 2773 2771 2770 2769 2768 2767 2766 2764 2763 2762 2761 2760 2759 2757 2756 2755 2754 2753 2751 2750 2749 2748 2747 2746 2744 2743 2742 2741 2740 2739 2737 2736 2735 2734 2733 2732 2730 2729 2728 2727 2726 2725 2724 2722 2721 2720 2719 2718 2717 2716 2714
111B714jjjjjkjjjjjjjkjjjjjjkjjjjjjjkjjjjjjjkjjjjjjjkjjjjjjjjkjjjjjjjjjkjjjjj
$$ 2714 2713 2712 2711 2710 2709 2707 2706 2705 2704 2703 2702 2701 2700 2698 2697 2696 2695 2694 2693 2692 2690 2689 2688 2687 2686 2685 2684 2683 2681 2680 2679 2678 2677 2676 2675 2674 2672 2671 2670 2669 2668 2667 2666 2665 2663 2662 2661 2660 2659 2658 2657 2656 2655 2653 2652 2651 2650 2649 2648 2647 2646 2645 2644 2642 2641 2640 2639 2638 2637
102B637jjjjkjjjjjjjjjjkjjjjjjjjjjjkjjjjjjjjjjjjjkjjjjjjjjjjjjjjjkjjjjjjjjjjj
$$ 2637 2636 2635 2634 2633 2631 2630 2629 2628 2627 2626 2625 2624 2623 2622 2621 2619 2618 2617 2616 2615 2614 2613 2612 2611 2610 2609 2608 2606 2605 2604 2603 2602 2601 2600 2599 2598 2597 2596 2595 2594 2593 2591 2590 2589 2588 2587 2586 2585 2584 2583 2582 2581 2580 2579 2578 2577 2576 2574 2573 2572 2571 2570 2569 2568 2567 2566 2565 2564 2563
94B563jjjjjjjjkjjjjjjjjjjjjjjjjjjjjjjjjjjjjkjjjjjjjjjjjjjjjjjjjjjjjjjjjjjjjj
$$ 2563 2562 2561 2560 2559 2558 2557 2556 2555 2553 2552 2551 2550 2549 2548 2547 2546 2545 2544 2543 2542 2541 2540 2539 2538 2537 2536 2535 2534 2533 2532 2531 2530 2529 2528 2527 2526 2525 2523 2522 2521 2520 2519 2518 2517 2516 2515 2514 2513 2512 2511 2510 2509 2508 2507 2506 2505 2504 2503 2502 2501 2500 2499 2498 2497 2496 2495 2494 2493 2492 2491
85B491jjjjjjjjjjjjjjjjjjjjjjjjjjjjjjjjjjjjjjjjjjjjjj%jjjjjjjjjjjjjjjjjjjjjjj
$$ 2491 2490 2489 2488 2487 2486 2485 2484 2483 2482 2481 2480 2479 2478 2477 2476 2475 2474 2473 2472 2471 2470 2469 2468 2467 2466 2465 2464 2463 2462 2461 2460 2459 2458 2457 2456 2455 2454 2453 2452 2451 2450 2449 2448 2447 2446 2445 2445 2444 2443 2442 2441 2440 2439 2438 2437 2436 2435 2434 2433 2432 2431 2430 2429 2428 2427 2426 2425 2424 2423 2422
77B422jjjjjj%jjjjjjjjjjjjjjjjjjjj%jjjjjjjjjjjjjjjj%jjjjjjjjjjjjj%jjjjjjjjjjj
$$ 2422 2421 2420 2419 2418 2417 2416 2416 2415 2414 2413 2412 2411 2410 2409 2408 2407 2406 2405 2404 2403 2402 2401 2400 2399 2398 2397 2396 2396 2395 2394 2393 2392 2391 2390 2389 2388 2387 2386 2385 2384 2383 2382 2381 2380 2380 2379 2378 2377 2376 2375 2374 2373 2372 2371 2370 2369 2368 2367 2367 2366 2365 2364 2363 2362 2361 2360 2359 2358 2357 2356
68B356j%jjjjjjjjjjj%jjjjjjjjjj%jjjjjjjjjj%jjjjjjjjj%jjjjjjjj%jjjjjjjj%jjjjjj
$$ 2356 2355 2355 2354 2353 2352 2351 2350 2349 2348 2347 2346 2345 2344 2344 2343 2342 2341 2340 2339 2338 2337 2336 2335 2334 2334 2333 2332 2331 2330 2329 2328 2327 2326 2325 2324 2324 2323 2322 2321 2320 2319 2318 2317 2316 2315 2315 2314 2313 2312 2311 2310 2309 2308 2307 2307 2306 2305 2304 2303 2302 2301 2300 2299 2299 2298 2297 2296 2295 2294 2293
59B293jj%jjjjjjj%jjjjjjj%jjjjjjj%jjjjjj%jjjjjjj%jjjjjj%jjjjjj%jjjjjj%jjjjj%j
$$ 2293 2292 2291 2291 2290 2289 2288 2287 2286 2285 2284 2284 2283 2282 2281 2280 2279 2278 2277 2277 2276 2275 2274 2273 2272 2271 2270 2270 2269 2268 2267 2266 2265 2264 2264 2263 2262 2261 2260 2259 2258 2257 2257 2256 2255 2254 2253 2252 2251 2251 2250 2249 2248 2247 2246 2245 2245 2244 2243 2242 2241 2240 2239 2239 2238 2237 2236 2235 2234 2234 2233
51B233jjjjj%jjjjj%jjjjj%jjjjjj%jjjjj%jjjj%jjjjj%jjjjj%jjjjj%jjjj%jjjjj%jjjj%
$$ 2233 2232 2231 2230 2229 2228 2228 2227 2226 2225 2224 2223 2223 2222 2221 2220 2219 2218 2218 2217 2216 2215 2214 2213 2212 2212 2211 2210 2209 2208 2207 2207 2206 2205 2204 2203 2203 2202 2201 2200 2199 2198 2198 2197 2196 2195 2194 2193 2193 2192 2191 2190 2189 2188 2188 2187 2186 2185 2184 2184 2183 2182 2181 2180 2179 2179 2178 2177 2176 2175 2175
42B175jjjj%jjjjj%jjjj%jjjj%jjjj%jjjj%jjjj%jjjj%jjjj%jjj%jjjj%jjjj%jjj%jjjj%j
$$ 2175 2174 2173 2172 2171 2171 2170 2169 2168 2167 2166 2166 2165 2164 2163 2162 2162 2161 2160 2159 2158 2158 2157 2156 2155 2154 2154 2153 2152 2151 2150 2150 2149 2148 2147 2146 2146 2145 2144 2143 2142 2142 2141 2140 2139 2138 2138 2137 2136 2135 2135 2134 2133 2132 2131 2131 2130 2129 2128 2127 2127 2126 2125 2124 2124 2123 2122 2121 2120 2120 2119
34B119jjj%jjj%jjjj%jjj%jjj%jjjj%jjj%jjj%jjjj%jjj%jjj%jjj%jjj%jjj%jjj%jjjj%jj
$$ 2119 2118 2117 2116 2116 2115 2114 2113 2113 2112 2111 2110 2109 2109 2108 2107 2106 2106 2105 2104 2103 2103 2102 2101 2100 2099 2099 2098 2097 2096 2096 2095 2094 2093 2093 2092 2091 2090 2089 2089 2088 2087 2086 2086 2085 2084 2083 2083 2082 2081 2080 2080 2079 2078 2077 2077 2076 2075 2074 2074 2073 2072 2071 2071 2070 2069 2068 2067 2067 2066 2065
25B065j%jjj%jj%jjj%jjj%jjj%jjj%jjj%jjj%jj%jjj%jjj%jjj%jj%jjj%jjj%jj%jjj%jjj%
$$ 2065 2064 2064 2063 2062 2061 2061 2060 2059 2059 2058 2057 2056 2056 2055 2054 2053 2053 2052 2051 2050 2050 2049 2048 2047 2047 2046 2045 2044 2044 2043 2042 2041 2041 2040 2039 2039 2038 2037 2036 2036 2035 2034 2033 2033 2032 2031 2030 2030 2029 2028 2028 2027 2026 2025 2025 2024 2023 2022 2022 2021 2020 2020 2019 2018 2017 2017 2016 2015 2014 2014
17B014jj%jjj%jj%jjj%jj%jjj%jj%jjj%jj%jjj%jj%jj%jjj%jj%jjj%jj%jj%jjj%jj%jj%jj
$$ 2014 2013 2012 2012 2011 2010 2009 2009 2008 2007 2007 2006 2005 2004 2004 2003 2002 2002 2001 2000 1999 1999 1998 1997 1997 1996 1995 1994 1994 1993 1992 1992 1991 1990 1989 1989 1988 1987 1987 1986 1985 1985 1984 1983 1982 1982 1981 1980 1980 1979 1978 1977 1977 1976 1975 1975 1974 1973 1973 1972 1971 1970 1970 1969 1968 1968 1967 1966 1966 1965 1964
8A964%jjj%jj%jj%jj%jjj%jj%jj%jj%jj%jj%jjj%jj%jj%jj%jj%jj%jj%jj%jj%jj%jj%jj%j
$$ 1964 1964 1963 1962 1961 1961 1960 1959 1959 1958 1957 1957 1956 1955 1955 1954 1953 1952 1952 1951 1950 1950 1949 1948 1948 1947 1946 1946 1945 1944 1944 1943 1942 1942 1941 1940 1939 1939 1938 1937 1937 1936 1935 1935 1934 1933 1933 1932 1931 1931 1930 1929 1929 1928 1927 1927 1926 1925 1925 1924 1923 1923 1922 1921 1921 1920 1919 1919 1918 1917 1917 1916
0A916j%jj%jj%jj%jj%jj%jj%jj%jj%jj%jj%jj%jj%j%jj%jj%jj%jj%jj%jj%j%jj%jj%jj%jj
$$ 1916 1915 1915 1914 1913 1913 1912 1911 1911 1910 1909 1909 1908 1907 1907 1906 1905 1905 1904 1903 1903 1902 1901 1901 1900 1899 1899 1898 1897 1897 1896 1895 1895 1894 1893 1893 1892 1891 1891 1890 1890 1889 1888 1888 1887 1886 1886 1885 1884 1884 1883 1882 1882 1881 1880 1880 1879 1878 1878 1877 1877 1876 1875 1875 1874 1873 1873 1872 1871 1871 1870 1869
-9A869%j%jj%jj%jj%jj%j%jj%jj%jj%j%jj%jj%j%jj%jj%jj%j%jj%jj%j%jj%jj%j%jj%j%jj
$$ 1869 1869 1868 1868 1867 1866 1866 1865 1864 1864 1863 1862 1862 1861 1860 1860 1859 1859 1858 1857 1857 1856 1855 1855 1854 1853 1853 1852 1852 1851 1850 1850 1849 1848 1848 1847 1847 1846 1845 1845 1844 1843 1843 1842 1841 1841 1840 1840 1839 1838 1838 1837 1836 1836 1835 1835 1834 1833 1833 1832 1831 1831 1830 1830 1829 1828 1828 1827 1827 1826 1825
-18A825%jj%j%jj%j%jj%jj%j%jj%j%jj%jj%j%jj%j%jj%j%jj%j%jj%j%jj%j%jj%j%jj%j%jj
$$ 1825 1825 1824 1823 1823 1822 1822 1821 1820 1820 1819 1819 1818 1817 1817 1816 1815 1815 1814 1814 1813 1812 1812 1811 1811 1810 1809 1809 1808 1807 1807 1806 1806 1805 1804 1804 1803 1803 1802 1801 1801 1800 1800 1799 1798 1798 1797 1797 1796 1795 1795 1794 1794 1793 1792 1792 1791 1791 1790 1789 1789 1788 1788 1787 1786 1786 1785 1785 1784 1783
-26A783%j%jj%j%jj%j%jj%j%jj%j%j%jj%j%jj%j%jj%j%j%jj%j%jj%j%j%jj%j%j%jj%j%jj%
$$ 1783 1783 1782 1782 1781 1780 1780 1779 1779 1778 1777 1777 1776 1776 1775 1774 1774 1773 1773 1772 1771 1771 1770 1770 1769 1769 1768 1767 1767 1766 1766 1765 1764 1764 1763 1763 1762 1761 1761 1760 1760 1759 1759 1758 1757 1757 1756 1756 1755 1754 1754 1753 1753 1752 1752 1751 1750 1750 1749 1749 1748 1748 1747 1746 1746 1745 1745 1744 1743 1743
-35A743j%j%jj%j%j%jj%j%j%jj%j%j%jj%j%j%j%jj%j%j%jj%j%j%j%jj%j%j%jj%j%j%j%jj%
$$ 1743 1742 1742 1741 1741 1740 1739 1739 1738 1738 1737 1737 1736 1735 1735 1734 1734 1733 1733 1732 1731 1731 1730 1730 1729 1729 1728 1727 1727 1726 1726 1725 1725 1724 1724 1723 1722 1722 1721 1721 1720 1720 1719 1718 1718 1717 1717 1716 1716 1715 1715 1714 1713 1713 1712 1712 1711 1711 1710 1709 1709 1708 1708 1707 1707 1706 1706 1705 1704 1704
-43A704j%j%j%jj%j%j%j%jj%j%j%j%j%jj%j%j%j%j%jj%j%j%j%j%jj%j%j%j%j%j%jj%j%j%j
$$ 1704 1703 1703 1702 1702 1701 1701 1700 1699 1699 1698 1698 1697 1697 1696 1696 1695 1694 1694 1693 1693 1692 1692 1691 1691 1690 1690 1689 1688 1688 1687 1687 1686 1686 1685 1685 1684 1684 1683 1682 1682 1681 1681 1680 1680 1679 1679 1678 1678 1677 1676 1676 1675 1675 1674 1674 1673 1673 1672 1672 1671 1671 1670 1669 1669 1668 1668 1667 1667 1666
-51A666%j%j%jj%j%j%j%j%j%j%jj%j%j%j%j%j%j%j%jj%j%j%j%j%j%j%j%j%j%jj%j%j%j%j%
$$ 1666 1666 1665 1665 1664 1664 1663 1662 1662 1661 1661 1660 1660 1659 1659 1658 1658 1657 1657 1656 1656 1655 1654 1654 1653 1653 1652 1652 1651 1651 1650 1650 1649 1649 1648 1648 1647 1647 1646 1645 1645 1644 1644 1643 1643 1642 1642 1641 1641 1640 1640 1639 1639 1638 1638 1637 1637 1636 1636 1635 1634 1634 1633 1633 1632 1632 1631 1631 1630 1630
-60A630j%j%j%j%j%j%j%j%j%j%jj%j%j%j%j%j%j%j%j%j%j%j%j%j%j%j%j%j%j%j%j%j%j%j%
$$ 1630 1629 1629 1628 1628 1627 1627 1626 1626 1625 1625 1624 1624 1623 1623 1622 1622 1621 1621 1620 1620 1619 1618 1618 1617 1617 1616 1616 1615 1615 1614 1614 1613 1613 1612 1612 1611 1611 1610 1610 1609 1609 1608 1608 1607 1607 1606 1606 1605 1605 1604 1604 1603 1603 1602 1602 1601 1601 1600 1600 1599 1599 1598 1598 1597 1597 1596 1596 1595 1595
-68A595j%j%j%j%j%j%j%j%j%j%j%j%j%j%j%j%j%j%j%j%j%j%j%j%j%j%j%j%j%%j%j%j%j%j%
$$ 1595 1594 1594 1593 1593 1592 1592 1591 1591 1590 1590 1589 1589 1588 1588 1587 1587 1586 1586 1585 1585 1584 1584 1583 1583 1582 1582 1581 1581 1580 1580 1579 1579 1578 1578 1577 1577 1576 1576 1575 1575 1574 1574 1573 1573 1572 1572 1571 1571 1570 1570 1569 1569 1568 1568 1567 1567 1566 1566 1566 1565 1565 1564 1564 1563 1563 1562 1562 1561 1561
-77A561j%j%j%j%j%j%j%j%j%j%%j%j%j%j%j%j%j%j%j%j%%j%j%j%j%j%j%j%j%j%%j%j%j%j%
$$ 1561 1560 1560 1559 1559 1558 1558 1557 1557 1556 1556 1555 1555 1554 1554 1553 1553 1552 1552 1551 1551 1551 1550 1550 1549 1549 1548 1548 1547 1547 1546 1546 1545 1545 1544 1544 1543 1543 1542 1542 1541 1541 1541 1540 1540 1539 1539 1538 1538 1537 1537 1536 1536 1535 1535 1534 1534 1533 1533 1532 1532 1532 1531 1531 1530 1530 1529 1529 1528 1528
-85A528j%j%j%%j%j%j%j%j%j%j%%j%j%j%j%j%j%%j%j%j%j%j%j%%j%j%j%j%j%%j%j%j%j%j%
$$ 1528 1527 1527 1526 1526 1525 1525 1525 1524 1524 1523 1523 1522 1522 1521 1521 1520 1520 1519 1519 1518 1518 1518 1517 1517 1516 1516 1515 1515 1514 1514 1513 1513 1512 1512 1512 1511 1511 1510 1510 1509 1509 1508 1508 1507 1507 1506 1506 1506 1505 1505 1504 1504 1503 1503 1502 1502 1501 1501 1501 1500 1500 1499 1499 1498 1498 1497 1497 1496 1496
-94A496%j%j%j%j%j%%j%j%j%j%%j%j%j%j%j%%j%j%j%j%%j%j%j%j%%j%j%j%j%%j%j%j%%j%j
$$ 1496 1496 1495 1495 1494 1494 1493 1493 1492 1492 1491 1491 1491 1490 1490 1489 1489 1488 1488 1487 1487 1487 1486 1486 1485 1485 1484 1484 1483 1483 1482 1482 1482 1481 1481 1480 1480 1479 1479 1478 1478 1478 1477 1477 1476 1476 1475 1475 1474 1474 1474 1473 1473 1472 1472 1471 1471 1470 1470 1470 1469 1469 1468 1468 1467 1467 1467 1466 1466 1465
-102A465%j%j%%j%j%j%%j%j%j%j%%j%j%j%%j%j%j%%j%j%j%%j%j%j%%j%j%j%%j%j%j%%j%j%
$$ 1465 1465 1464 1464 1463 1463 1463 1462 1462 1461 1461 1460 1460 1460 1459 1459 1458 1458 1457 1457 1456 1456 1456 1455 1455 1454 1454 1453 1453 1453 1452 1452 1451 1451 1450 1450 1450 1449 1449 1448 1448 1447 1447 1447 1446 1446 1445 1445 1444 1444 1444 1443 1443 1442 1442 1441 1441 1441 1440 1440 1439 1439 1438 1438 1438 1437 1437 1436 1436
-110A436j%%j%j%j%%j%j%j%%j%j%%j%j%j%%j%j%j%%j%j%%j%j%j%%j%j%%j%j%%j%j%j%%j%j
$$ 1436 1435 1435 1435 1434 1434 1433 1433 1432 1432 1432 1431 1431 1430 1430 1429 1429 1429 1428 1428 1427 1427 1427 1426 1426 1425 1425 1424 1424 1424 1423 1423 1422 1422 1421 1421 1421 1420 1420 1419 1419 1419 1418 1418 1417 1417 1416 1416 1416 1415 1415 1414 1414 1414 1413 1413 1412 1412 1412 1411 1411 1410 1410 1409 1409 1409 1408 1408 1407
-119A407%%j%j%%j%j%j%%j%j%%j%j%%j%j%%j%j%j%%j%j%%j%j%%j%j%%j%j%%j%j%%j%j%%j%
$$ 1407 1407 1407 1406 1406 1405 1405 1405 1404 1404 1403 1403 1402 1402 1402 1401 1401 1400 1400 1400 1399 1399 1398 1398 1398 1397 1397 1396 1396 1396 1395 1395 1394 1394 1393 1393 1393 1392 1392 1391 1391 1391 1390 1390 1389 1389 1389 1388 1388 1387 1387 1387 1386 1386 1385 1385 1385 1384 1384 1383 1383 1383 1382 1382 1381 1381 1381 1380 1380
-127A380j%%j%j%%j%j%%j%j%%j%j%%j%j%%j%%j%j%%j%j%%j%j%%j%j%%j%j%%j%%j%j%%j%j%
$$ 1380 1379 1379 1379 1378 1378 1377 1377 1377 1376 1376 1375 1375 1375 1374 1374 1373 1373 1373 1372 1372 1371 1371 1371 1370 1370 1369 1369 1369 1368 1368 1368 1367 1367 1366 1366 1366 1365 1365 1364 1364 1364 1363 1363 1362 1362 1362 1361 1361 1360 1360 1360 1359 1359 1358 1358 1358 1357 1357 1357 1356 1356 1355 1355 1355 1354 1354 1353 1353
-135A353%j%%j%j%%j%j%%j%j%%j%%j%j%%j%%j%j%%j%j%%j%%j%j%%j%%j%j%%j%%j%j%%j%j%
$$ 1353 1353 1352 1352 1352 1351 1351 1350 1350 1350 1349 1349 1348 1348 1348 1347 1347 1346 1346 1346 1345 1345 1345 1344 1344 1343 1343 1343 1342 1342 1342 1341 1341 1340 1340 1340 1339 1339 1338 1338 1338 1337 1337 1337 1336 1336 1335 1335 1335 1334 1334 1334 1333 1333 1332 1332 1332 1331 1331 1331 1330 1330 1329 1329 1329 1328 1328 1327 1327
-143A327%j%%j%j%%j%%j%j%%j%%j%%j%j%%j%%j%j%%j%%j%j%%j%%j%%j%j%%j%%j%%j%j%%j%
$$ 1327 1327 1326 1326 1326 1325 1325 1324 1324 1324 1323 1323 1323 1322 1322 1321 1321 1321 1320 1320 1320 1319 1319 1319 1318 1318 1317 1317 1317 1316 1316 1316 1315 1315 1314 1314 1314 1313 1313 1313 1312 1312 1311 1311 1311 1310 1310 1310 1309 1309 1309 1308 1308 1307 1307 1307 1306 1306 1306 1305 1305 1305 1304 1304 1303 1303 1303 1302 1302
-152A302%j%j%%j%%j%%j%j%%j%%j%%j%%j%j%%j%%j%%j%j%%j%%j%%j%%j%j%%j%%j%%j%%j%%
$$ 1302 1302 1301 1301 1300 1300 1300 1299 1299 1299 1298 1298 1298 1297 1297 1296 1296 1296 1295 1295 1295 1294 1294 1294 1293 1293 1293 1292 1292 1291 1291 1291 1290 1290 1290 1289 1289 1289 1288 1288 1287 1287 1287 1286 1286 1286 1285 1285 1285 1284 1284 1284 1283 1283 1282 1282 1282 1281 1281 1281 1280 1280 1280 1279 1279 1279 1278 1278 1278
-160A278j%j%%j%%j%%j%%j%%j%j%%j%%j%%j%%j%%j%%j%j%%j%%j%%j%%j%%j%%j%%j%%j%j%%
$$ 1278 1277 1277 1276 1276 1276 1275 1275 1275 1274 1274 1274 1273 1273 1273 1272 1272 1272 1271 1271 1270 1270 1270 1269 1269 1269 1268 1268 1268 1267 1267 1267 1266 1266 1266 1265 1265 1265 1264 1264 1263 1263 1263 1262 1262 1262 1261 1261 1261 1260 1260 1260 1259 1259 1259 1258 1258 1258 1257 1257 1257 1256 1256 1256 1255 1255 1254 1254 1254
-168A254j%%j%%j%%j%%j%%j%%j%%j%%j%%j%%j%%j%%j%%j%j%%j%%j%%j%%j%%j%%j%%j%%j%%
$$ 1254 1253 1253 1253 1252 1252 1252 1251 1251 1251 1250 1250 1250 1249 1249 1249 1248 1248 1248 1247 1247 1247 1246 1246 1246 1245 1245 1245 1244 1244 1244 1243 1243 1243 1242 1242 1242 1241 1241 1241 1240 1240 1239 1239 1239 1238 1238 1238 1237 1237 1237 1236 1236 1236 1235 1235 1235 1234 1234 1234 1233 1233 1233 1232 1232 1232 1231 1231 1231
-177A231j%%j%%j%%j%%j%%j%%j%%j%%j%%j%%j%%%j%%j%%j%%j%%j%%j%%j%%j%%j%%j%%j%%j
$$ 1231 1230 1230 1230 1229 1229 1229 1228 1228 1228 1227 1227 1227 1226 1226 1226 1225 1225 1225 1224 1224 1224 1223 1223 1223 1222 1222 1222 1221 1221 1221 1220 1220 1220 1220 1219 1219 1219 1218 1218 1218 1217 1217 1217 1216 1216 1216 1215 1215 1215 1214 1214 1214 1213 1213 1213 1212 1212 1212 1211 1211 1211 1210 1210 1210 1209 1209 1209 1208
-185A208%%j%%j%%j%%%j%%j%%j%%j%%j%%j%%j%%j%%j%%%j%%j%%j%%j%%j%%j%%%j%%j%%j%%
$$ 1208 1208 1208 1207 1207 1207 1206 1206 1206 1205 1205 1205 1205 1204 1204 1204 1203 1203 1203 1202 1202 1202 1201 1201 1201 1200 1200 1200 1199 1199 1199 1198 1198 1198 1197 1197 1197 1196 1196 1196 1196 1195 1195 1195 1194 1194 1194 1193 1193 1193 1192 1192 1192 1191 1191 1191 1190 1190 1190 1190 1189 1189 1189 1188 1188 1188 1187 1187 1187
-193A187j%%j%%j%%%j%%j%%j%%j%%j%%%j%%j%%j%%j%%j%%%j%%j%%j%%j%%%j%%j%%j%%j%%%
$$ 1187 1186 1186 1186 1185 1185 1185 1184 1184 1184 1184 1183 1183 1183 1182 1182 1182 1181 1181 1181 1180 1180 1180 1179 1179 1179 1179 1178 1178 1178 1177 1177 1177 1176 1176 1176 1175 1175 1175 1174 1174 1174 1174 1173 1173 1173 1172 1172 1172 1171 1171 1171 1170 1170 1170 1170 1169 1169 1169 1168 1168 1168 1167 1167 1167 1166 1166 1166 1166
-202A166j%%j%%j%%j%%%j%%j%%j%%%j%%j%%j%%j%%%j%%j%%j%%%j%%j%%j%%%j%%j%%j%%%j%
$$ 1166 1165 1165 1165 1164 1164 1164 1163 1163 1163 1162 1162 1162 1162 1161 1161 1161 1160 1160 1160 1159 1159 1159 1159 1158 1158 1158 1157 1157 1157 1156 1156 1156 1155 1155 1155 1155 1154 1154 1154 1153 1153 1153 1152 1152 1152 1152 1151 1151 1151 1150 1150 1150 1149 1149 1149 1149 1148 1148 1148 1147 1147 1147 1146 1146 1146 1146 1145 1145
-210A145%j%%j%%%j%%j%%%j%%j%%j%%%j%%j%%%j%%j%%j%%%j%%j%%%j%%j%%j%%%j%%j%%%j%
$$ 1145 1145 1144 1144 1144 1143 1143 1143 1143 1142 1142 1142 1141 1141 1141 1141 1140 1140 1140 1139 1139 1139 1138 1138 1138 1138 1137 1137 1137 1136 1136 1136 1136 1135 1135 1135 1134 1134 1134 1133 1133 1133 1133 1132 1132 1132 1131 1131 1131 1131 1130 1130 1130 1129 1129 1129 1128 1128 1128 1128 1127 1127 1127 1126 1126 1126 1126 1125 1125
-218A125%j%%%j%%j%%%j%%j%%%j%%j%%%j%%j%%%j%%j%%%j%%j%%%j%%j%%%j%%j%%%j%%j%%%
$$ 1125 1125 1124 1124 1124 1124 1123 1123 1123 1122 1122 1122 1122 1121 1121 1121 1120 1120 1120 1120 1119 1119 1119 1118 1118 1118 1118 1117 1117 1117 1116 1116 1116 1116 1115 1115 1115 1114 1114 1114 1114 1113 1113 1113 1112 1112 1112 1112 1111 1111 1111 1110 1110 1110 1110 1109 1109 1109 1108 1108 1108 1108 1107 1107 1107 1106 1106 1106 1106
-226A106j%%j%%%j%%j%%%j%%%j%%j%%%j%%j%%%j%%j%%%j%%%j%%j%%%j%%%j%%j%%%j%%j%%%
$$ 1106 1105 1105 1105 1104 1104 1104 1104 1103 1103 1103 1102 1102 1102 1102 1101 1101 1101 1101 1100 1100 1100 1099 1099 1099 1099 1098 1098 1098 1097 1097 1097 1097 1096 1096 1096 1095 1095 1095 1095 1094 1094 1094 1094 1093 1093 1093 1092 1092 1092 1092 1091 1091 1091 1091 1090 1090 1090 1089 1089 1089 1089 1088 1088 1088 1087 1087 1087 1087
-235A087j%%%j%%j%%%j%%%j%%j%%%j%%%j%%j%%%j%%%j%%j%%%j%%%j%%%j%%j%%%j%%%j%%%j
$$ 1087 1086 1086 1086 1086 1085 1085 1085 1084 1084 1084 1084 1083 1083 1083 1083 1082 1082 1082 1081 1081 1081 1081 1080 1080 1080 1080 1079 1079 1079 1078 1078 1078 1078 1077 1077 1077 1077 1076 1076 1076 1075 1075 1075 1075 1074 1074 1074 1074 1073 1073 1073 1073 1072 1072 1072 1071 1071 1071 1071 1070 1070 1070 1070 1069 1069 1069 1069 1068
-243A068%%j%%%j%%%j%%%j%%j%%%j%%%j%%%j%%j%%%j%%%j%%%j%%%j%%j%%%j%%%j%%%j%%%j
$$ 1068 1068 1068 1067 1067 1067 1067 1066 1066 1066 1066 1065 1065 1065 1065 1064 1064 1064 1063 1063 1063 1063 1062 1062 1062 1062 1061 1061 1061 1061 1060 1060 1060 1059 1059 1059 1059 1058 1058 1058 1058 1057 1057 1057 1057 1056 1056 1056 1056 1055 1055 1055 1054 1054 1054 1054 1053 1053 1053 1053 1052 1052 1052 1052 1051 1051 1051 1051 1050
-251A050%%%j%%j%%%j%%%j%%%j%%%j%%%j%%%j%%%j%%%j%%j%%%j%%%j%%%j%%%j%%%j%%%j%%
$$ 1050 1050 1050 1050 1049 1049 1049 1048 1048 1048 1048 1047 1047 1047 1047 1046 1046 1046 1046 1045 1045 1045 1045 1044 1044 1044 1044 1043 1043 1043 1043 1042 1042 1042 1042 1041 1041 1041 1041 1040 1040 1040 1039 1039 1039 1039 1038 1038 1038 1038 1037 1037 1037 1037 1036 1036 1036 1036 1035 1035 1035 1035 1034 1034 1034 1034 1033 1033 1033
-260A033%j%%%j%%%j%%%j%%%j%%%j%%%j%%%j%%%j%%%j%%%j%%%j%%%j%%%j%%%j%%%j%%%j%%
$$ 1033 1033 1032 1032 1032 1032 1031 1031 1031 1031 1030 1030 1030 1030 1029 1029 1029 1029 1028 1028 1028 1028 1027 1027 1027 1027 1026 1026 1026 1026 1025 1025 1025 1025 1024 1024 1024 1024 1023 1023 1023 1023 1022 1022 1022 1022 1021 1021 1021 1021 1020 1020 1020 1020 1019 1019 1019 1019 1018 1018 1018 1018 1017 1017 1017 1017 1016 1016 1016
-268A016%j%%%j%%%j%%%j%%%j%%%j%%%j%%%%j%%%j%%%j%%%j%%%j%%%j%%%j%%%j%%%%j%%%j
$$ 1016 1016 1015 1015 1015 1015 1014 1014 1014 1014 1013 1013 1013 1013 1012 1012 1012 1012 1011 1011 1011 1011 1010 1010 1010 1010 1009 1009 1009 1009 1009 1008 1008 1008 1008 1007 1007 1007 1007 1006 1006 1006 1006 1005 1005 1005 1005 1004 1004 1004 1004 1003 1003 1003 1003 1002 1002 1002 1002 1001 1001 1001 1001 1001 1000 1000 1000 1000 999
-276I99%%%j%%%j%%%j%%%j%%%%j%%%j%%%j%%%j%%%j%%%%j%%%j%%%j%%%j%%%%j%%%j%%%j%%
$$ 999 999 999 999 998 998 998 998 997 997 997 997 996 996 996 996 995 995 995 995 995 994 994 994 994 993 993 993 993 992 992 992 992 991 991 991 991 990 990 990 990 990 989 989 989 989 988 988 988 988 987 987 987 987 986 986 986 986 986 985 985 985 985 984 984 984 984 983 983 983
-285I83%j%%%%j%%%j%%%j%%%j%%%%j%%%j%%%j%%%%j%%%j%%%j%%%%j%%%j%%%j%%%%j%%%j%%
$$ 983 983 982 982 982 982 982 981 981 981 981 980 980 980 980 979 979 979 979 978 978 978 978 978 977 977 977 977 976 976 976 976 975 975 975 975 975 974 974 974 974 973 973 973 973 972 972 972 972 972 971 971 971 971 970 970 970 970 969 969 969 969 969 968 968 968 968 967 967 967
-293I67%%j%%%j%%%j%%%%j%%%j%%%%j%%%j%%%j%%%%j%%%j%%%%j%%%j%%%%j%%%j%%%%j%%%j
$$ 967 967 967 966 966 966 966 965 965 965 965 964 964 964 964 964 963 963 963 963 962 962 962 962 962 961 961 961 961 960 960 960 960 959 959 959 959 959 958 958 958 958 957 957 957 957 957 956 956 956 956 955 955 955 955 955 954 954 954 954 953 953 953 953 953 952 952 952 952 951
-302I51%%%%j%%%j%%%%j%%%j%%%%j%%%j%%%%j%%%j%%%%j%%%j%%%%j%%%%j%%%j%%%%j%%%j%
$$ 951 951 951 951 951 950 950 950 950 949 949 949 949 949 948 948 948 948 947 947 947 947 947 946 946 946 946 945 945 945 945 945 944 944 944 944 943 943 943 943 943 942 942 942 942 941 941 941 941 941 940 940 940 940 940 939 939 939 939 938 938 938 938 938 937 937 937 937 936 936
-310I36%%%j%%%%j%%%j%%%%j%%%j%%%%j%%%%j%%%j%%%%j%%%%j%%%%j%%%j%%%%j%%%%j%%%j
$$ 936 936 936 936 935 935 935 935 935 934 934 934 934 933 933 933 933 933 932 932 932 932 931 931 931 931 931 930 930 930 930 930 929 929 929 929 928 928 928 928 928 927 927 927 927 927 926 926 926 926 926 925 925 925 925 924 924 924 924 924 923 923 923 923 923 922 922 922 922 921
-318I21%%%%j%%%%j%%%%j%%%j%%%%j%%%%j%%%%j%%%j%%%%j%%%%j%%%%j%%%%j%%%j%%%%j%%
$$ 921 921 921 921 921 920 920 920 920 920 919 919 919 919 919 918 918 918 918 917 917 917 917 917 916 916 916 916 916 915 915 915 915 915 914 914 914 914 913 913 913 913 913 912 912 912 912 912 911 911 911 911 911 910 910 910 910 910 909 909 909 909 908 908 908 908 908 907 907 907
-327I07%%j%%%%j%%%%j%%%%j%%%%j%%%%j%%%j%%%%j%%%%j%%%%j%%%%j%%%%j%%%%j%%%%j%%
$$ 907 907 907 906 906 906 906 906 905 905 905 905 905 904 904 904 904 904 903 903 903 903 903 902 902 902 902 902 901 901 901 901 900 900 900 900 900 899 899 899 899 899 898 898 898 898 898 897 897 897 897 897 896 896 896 896 896 895 895 895 895 895 894 894 894 894 894 893 893 893
-335H93%%j%%%%j%%%%j%%%%j%%%%j%%%%j%%%%j%%%%j%%%%j%%%%j%%%%j%%%%j%%%%j%%%%j%
$$ 893 893 893 892 892 892 892 892 891 891 891 891 891 890 890 890 890 890 889 889 889 889 889 888 888 888 888 888 887 887 887 887 887 886 886 886 886 886 885 885 885 885 885 884 884 884 884 884 883 883 883 883 883 882 882 882 882 882 881 881 881 881 881 880 880 880 880 880 879 879
-344H79%%%j%%%%j%%%%%j%%%%j%%%%j%%%%j%%%%j%%%%j%%%%j%%%%%j%%%%j%%%%j%%%%j%%%
$$ 879 879 879 879 878 878 878 878 878 877 877 877 877 877 877 876 876 876 876 876 875 875 875 875 875 874 874 874 874 874 873 873 873 873 873 872 872 872 872 872 871 871 871 871 871 870 870 870 870 870 870 869 869 869 869 869 868 868 868 868 868 867 867 867 867 867 866 866 866 866
-352H66%j%%%%%j%%%%j%%%%j%%%%j%%%%%j%%%%j%%%%j%%%%j%%%%%j%%%%j%%%%j%%%%%j%%%
$$ 866 866 865 865 865 865 865 865 864 864 864 864 864 863 863 863 863 863 862 862 862 862 862 861 861 861 861 861 861 860 860 860 860 860 859 859 859 859 859 858 858 858 858 858 857 857 857 857 857 857 856 856 856 856 856 855 855 855 855 855 854 854 854 854 854 854 853 853 853 853
-361H53%j%%%%j%%%%%j%%%%j%%%%%j%%%%j%%%%j%%%%%j%%%%j%%%%%j%%%%j%%%%j%%%%%j%%
$$ 853 853 852 852 852 852 852 851 851 851 851 851 851 850 850 850 850 850 849 849 849 849 849 849 848 848 848 848 848 847 847 847 847 847 846 846 846 846 846 846 845 845 845 845 845 844 844 844 844 844 844 843 843 843 843 843 842 842 842 842 842 841 841 841 841 841 841 840 840 840
-369H40%%j%%%%%j%%%%j%%%%%j%%%%j%%%%%j%%%%j%%%%%j%%%%%j%%%%j%%%%%j%%%%j%%%%%
$$ 840 840 840 839 839 839 839 839 839 838 838 838 838 838 837 837 837 837 837 837 836 836 836 836 836 835 835 835 835 835 835 834 834 834 834 834 833 833 833 833 833 833 832 832 832 832 832 832 831 831 831 831 831 830 830 830 830 830 830 829 829 829 829 829 828 828 828 828 828 828
-377H28j%%%%j%%%%%j%%%%%j%%%%j%%%%%j%%%%%j%%%%j%%%%%j%%%%%j%%%%j%%%%%j%%%%%j
$$ 828 827 827 827 827 827 826 826 826 826 826 826 825 825 825 825 825 825 824 824 824 824 824 823 823 823 823 823 823 822 822 822 822 822 822 821 821 821 821 821 820 820 820 820 820 820 819 819 819 819 819 819 818 818 818 818 818 817 817 817 817 817 817 816 816 816 816 816 816 815
-386H15%%%%%j%%%%j%%%%%j%%%%%j%%%%%j%%%%j%%%%%j%%%%%j%%%%%j%%%%%j%%%%%j%%%%j
$$ 815 815 815 815 815 815 814 814 814 814 814 813 813 813 813 813 813 812 812 812 812 812 812 811 811 811 811 811 811 810 810 810 810 810 809 809 809 809 809 809 808 808 808 808 808 808 807 807 807 807 807 807 806 806 806 806 806 806 805 805 805 805 805 805 804 804 804 804 804 803
-394H03%%%%%j%%%%%j%%%%%j%%%%%j%%%%%j%%%%%j%%%%%j%%%%%j%%%%%j%%%%%j%%%%%j%%%
$$ 803 803 803 803 803 803 802 802 802 802 802 802 801 801 801 801 801 801 800 800 800 800 800 800 799 799 799 799 799 799 798 798 798 798 798 798 797 797 797 797 797 797 796 796 796 796 796 796 795 795 795 795 795 795 794 794 794 794 794 794 793 793 793 793 793 793 792 792 792 792
-403G92%%j%%%%%j%%%%%j%%%%%j%%%%%j%%%%%j%%%%%j%%%%%j%%%%%j%%%%%j%%%%%j%%%%%%
$$ 792 792 792 791 791 791 791 791 791 790 790 790 790 790 790 789 789 789 789 789 789 788 788 788 788 788 788 787 787 787 787 787 787 786 786 786 786 786 786 785 785 785 785 785 785 784 784 784 784 784 784 783 783 783 783 783 783 782 782 782 782 782 782 781 781 781 781 781 781 781
-411G81j%%%%%j%%%%%j%%%%%j%%%%%j%%%%%j%%%%%%j%%%%%j%%%%%j%%%%%j%%%%%%j%%%%%j
$$ 781 780 780 780 780 780 780 779 779 779 779 779 779 778 778 778 778 778 778 777 777 777 777 777 777 776 776 776 776 776 776 775 775 775 775 775 775 775 774 774 774 774 774 774 773 773 773 773 773 773 772 772 772 772 772 772 771 771 771 771 771 771 771 770 770 770 770 770 770 769
-420G69%%%%%j%%%%%%j%%%%%j%%%%%j%%%%%%j%%%%%j%%%%%j%%%%%%j%%%%%j%%%%%j%%%%%%
$$ 769 769 769 769 769 769 768 768 768 768 768 768 768 767 767 767 767 767 767 766 766 766 766 766 766 765 765 765 765 765 765 765 764 764 764 764 764 764 763 763 763 763 763 763 762 762 762 762 762 762 762 761 761 761 761 761 761 760 760 760 760 760 760 759 759 759 759 759 759 759
-428G59j%%%%%j%%%%%%j%%%%%j%%%%%%j%%%%%j%%%%%%j%%%%%j%%%%%%j%%%%%j%%%%%%j%%%
$$ 759 758 758 758 758 758 758 757 757 757 757 757 757 757 756 756 756 756 756 756 755 755 755 755 755 755 755 754 754 754 754 754 754 753 753 753 753 753 753 753 752 752 752 752 752 752 751 751 751 751 751 751 751 750 750 750 750 750 750 749 749 749 749 749 749 749 748 748 748 748
-436G48%%j%%%%%%j%%%%%%j%%%%%j%%%%%%j%%%%%%j%%%%%j%%%%%%j%%%%%%j%%%%%j%%%%%%
$$ 748 748 748 747 747 747 747 747 747 747 746 746 746 746 746 746 746 745 745 745 745 745 745 744 744 744 744 744 744 744 743 743 743 743 743 743 743 742 742 742 742 742 742 741 741 741 741 741 741 741 740 740 740 740 740 740 740 739 739 739 739 739 739 738 738 738 738 738 738 738
-445G38j%%%%%%j%%%%%j%%%%%%j%%%%%%j%%%%%%j%%%%%%j%%%%%j%%%%%%j%%%%%%j%%%%%%j
$$ 738 737 737 737 737 737 737 737 736 736 736 736 736 736 735 735 735 735 735 735 735 734 734 734 734 734 734 734 733 733 733 733 733 733 733 732 732 732 732 732 732 732 731 731 731 731 731 731 730 730 730 730 730 730 730 729 729 729 729 729 729 729 728 728 728 728 728 728 728 727
-453G27%%%%%%j%%%%%%j%%%%%%j%%%%%j%%%%%%j%%%%%%j%%%%%%j%%%%%%j%%%%%%j%%%%%%j
$$ 727 727 727 727 727 727 727 726 726 726 726 726 726 726 725 725 725 725 725 725 725 724 724 724 724 724 724 723 723 723 723 723 723 723 722 722 722 722 722 722 722 721 721 721 721 721 721 721 720 720 720 720 720 720 720 719 719 719 719 719 719 719 718 718 718 718 718 718 718 717
-462G17%%%%%%j%%%%%%j%%%%%%j%%%%%%%j%%%%%%j%%%%%%j%%%%%%j%%%%%%j%%%%%%j%%%%%
$$ 717 717 717 717 717 717 717 716 716 716 716 716 716 716 715 715 715 715 715 715 715 714 714 714 714 714 714 714 714 713 713 713 713 713 713 713 712 712 712 712 712 712 712 711 711 711 711 711 711 711 710 710 710 710 710 710 710 709 709 709 709 709 709 709 708 708 708 708 708 708
-470G08%j%%%%%%%j%%%%%%j%%%%%%j%%%%%%j%%%%%%j%%%%%%%j%%%%%%j%%%%%%j%%%%%%%j%
$$ 708 708 707 707 707 707 707 707 707 707 706 706 706 706 706 706 706 705 705 705 705 705 705 705 704 704 704 704 704 704 704 703 703 703 703 703 703 703 702 702 702 702 702 702 702 702 701 701 701 701 701 701 701 700 700 700 700 700 700 700 699 699 699 699 699 699 699 699 698 698
-479F98%%%%%j%%%%%%j%%%%%%%j%%%%%%j%%%%%%j%%%%%%%j%%%%%%j%%%%%%%j%%%%%%j%%%%
$$ 698 698 698 698 698 698 697 697 697 697 697 697 697 696 696 696 696 696 696 696 696 695 695 695 695 695 695 695 694 694 694 694 694 694 694 693 693 693 693 693 693 693 693 692 692 692 692 692 692 692 691 691 691 691 691 691 691 691 690 690 690 690 690 690 690 689 689 689 689 689
-487F89%%%j%%%%%%j%%%%%%%j%%%%%%j%%%%%%%j%%%%%%j%%%%%%%j%%%%%%%j%%%%%%j%%%%%
$$ 689 689 689 689 688 688 688 688 688 688 688 687 687 687 687 687 687 687 687 686 686 686 686 686 686 686 685 685 685 685 685 685 685 685 684 684 684 684 684 684 684 683 683 683 683 683 683 683 683 682 682 682 682 682 682 682 682 681 681 681 681 681 681 681 680 680 680 680 680 680
-495F80%%j%%%%%%%j%%%%%%j%%%%%%%j%%%%%%%j%%%%%%j%%%%%%%j%%%%%%%j%%%%%%%j%%%%
$$ 680 680 680 679 679 679 679 679 679 679 679 678 678 678 678 678 678 678 677 677 677 677 677 677 677 677 676 676 676 676 676 676 676 676 675 675 675 675 675 675 675 674 674 674 674 674 674 674 674 673 673 673 673 673 673 673 673 672 672 672 672 672 672 672 672 671 671 671 671 671
-504F71%%%j%%%%%%j%%%%%%%j%%%%%%%j%%%%%%%j%%%%%%%j%%%%%%%j%%%%%%%j%%%%%%%j%%
$$ 671 671 671 671 670 670 670 670 670 670 670 669 669 669 669 669 669 669 669 668 668 668 668 668 668 668 668 667 667 667 667 667 667 667 667 666 666 666 666 666 666 666 666 665 665 665 665 665 665 665 665 664 664 664 664 664 664 664 664 663 663 663 663 663 663 663 663 662 662 662
-512F62%%%%%j%%%%%%%j%%%%%%%j%%%%%%%j%%%%%%%j%%%%%%%j%%%%%%%j%%%%%%%j%%%%%%%
$$ 662 662 662 662 662 662 661 661 661 661 661 661 661 661 660 660 660 660 660 660 660 660 659 659 659 659 659 659 659 659 658 658 658 658 658 658 658 658 657 657 657 657 657 657 657 657 656 656 656 656 656 656 656 656 655 655 655 655 655 655 655 655 654 654 654 654 654 654 654 654
-521F54j%%%%%%%j%%%%%%%j%%%%%%%%j%%%%%%%j%%%%%%%j%%%%%%%j%%%%%%%%j%%%%%%%j%%
$$ 654 653 653 653 653 653 653 653 653 652 652 652 652 652 652 652 652 651 651 651 651 651 651 651 651 651 650 650 650 650 650 650 650 650 649 649 649 649 649 649 649 649 648 648 648 648 648 648 648 648 647 647 647 647 647 647 647 647 647 646 646 646 646 646 646 646 646 645 645 645
-529F45%%%%%j%%%%%%%%j%%%%%%%j%%%%%%%j%%%%%%%%j%%%%%%%j%%%%%%%%j%%%%%%%j%%%%
$$ 645 645 645 645 645 645 644 644 644 644 644 644 644 644 644 643 643 643 643 643 643 643 643 642 642 642 642 642 642 642 642 641 641 641 641 641 641 641 641 641 640 640 640 640 640 640 640 640 639 639 639 639 639 639 639 639 639 638 638 638 638 638 638 638 638 637 637 637 637 637
-537F37%%%j%%%%%%%%j%%%%%%%j%%%%%%%%j%%%%%%%%j%%%%%%%j%%%%%%%%j%%%%%%%j%%%%%
$$ 637 637 637 637 636 636 636 636 636 636 636 636 636 635 635 635 635 635 635 635 635 634 634 634 634 634 634 634 634 634 633 633 633 633 633 633 633 633 633 632 632 632 632 632 632 632 632 631 631 631 631 631 631 631 631 631 630 630 630 630 630 630 630 630 629 629 629 629 629 629
-546F29%%%j%%%%%%%%j%%%%%%%j%%%%%%%%j%%%%%%%%j%%%%%%%%j%%%%%%%j%%%%%%%%j%%%%
$$ 629 629 629 629 628 628 628 628 628 628 628 628 628 627 627 627 627 627 627 627 627 626 626 626 626 626 626 626 626 626 625 625 625 625 625 625 625 625 625 624 624 624 624 624 624 624 624 624 623 623 623 623 623 623 623 623 622 622 622 622 622 622 622 622 622 621 621 621 621 621
-554F21%%%%j%%%%%%%%j%%%%%%%%j%%%%%%%%j%%%%%%%%j%%%%%%%%j%%%%%%%%j%%%%%%%%j%
$$ 621 621 621 621 621 620 620 620 620 620 620 620 620 620 619 619 619 619 619 619 619 619 619 618 618 618 618 618 618 618 618 618 617 617 617 617 617 617 617 617 617 616 616 616 616 616 616 616 616 616 615 615 615 615 615 615 615 615 615 614 614 614 614 614 614 614 614 614 613 613
-563F13%%%%%%%j%%%%%%%%j%%%%%%%%j%%%%%%%%j%%%%%%%%j%%%%%%%%j%%%%%%%%j%%%%%%%
$$ 613 613 613 613 613 613 613 613 612 612 612 612 612 612 612 612 612 611 611 611 611 611 611 611 611 611 610 610 610 610 610 610 610 610 610 609 609 609 609 609 609 609 609 609 608 608 608 608 608 608 608 608 608 607 607 607 607 607 607 607 607 607 606 606 606 606 606 606 606 606
-571F06%j%%%%%%%%j%%%%%%%%%j%%%%%%%%j%%%%%%%%j%%%%%%%%%j%%%%%%%%j%%%%%%%%j%%
$$ 606 606 605 605 605 605 605 605 605 605 605 604 604 604 604 604 604 604 604 604 604 603 603 603 603 603 603 603 603 603 602 602 602 602 602 602 602 602 602 601 601 601 601 601 601 601 601 601 601 600 600 600 600 600 600 600 600 600 599 599 599 599 599 599 599 599 599 598 598 598
-580E98%%%%%%%j%%%%%%%%j%%%%%%%%j%%%%%%%%%j%%%%%%%%j%%%%%%%%%j%%%%%%%%j%%%%%
$$ 598 598 598 598 598 598 598 598 597 597 597 597 597 597 597 597 597 596 596 596 596 596 596 596 596 596 595 595 595 595 595 595 595 595 595 595 594 594 594 594 594 594 594 594 594 593 593 593 593 593 593 593 593 593 593 592 592 592 592 592 592 592 592 592 591 591 591 591 591 591
-588E91%%%%j%%%%%%%%j%%%%%%%%%j%%%%%%%%%j%%%%%%%%j%%%%%%%%%j%%%%%%%%%j%%%%%%
$$ 591 591 591 591 591 590 590 590 590 590 590 590 590 590 589 589 589 589 589 589 589 589 589 589 588 588 588 588 588 588 588 588 588 588 587 587 587 587 587 587 587 587 587 586 586 586 586 586 586 586 586 586 586 585 585 585 585 585 585 585 585 585 585 584 584 584 584 584 584 584
-596E84%%j%%%%%%%%%j%%%%%%%%%j%%%%%%%%%j%%%%%%%%%j%%%%%%%%%j%%%%%%%%j%%%%%%%
$$ 584 584 584 583 583 583 583 583 583 583 583 583 583 582 582 582 582 582 582 582 582 582 582 581 581 581 581 581 581 581 581 581 581 580 580 580 580 580 580 580 580 580 580 579 579 579 579 579 579 579 579 579 579 578 578 578 578 578 578 578 578 578 577 577 577 577 577 577 577 577
-605E77%%j%%%%%%%%%j%%%%%%%%%j%%%%%%%%%j%%%%%%%%%j%%%%%%%%%j%%%%%%%%%j%%%%%%
$$ 577 577 577 576 576 576 576 576 576 576 576 576 576 575 575 575 575 575 575 575 575 575 575 574 574 574 574 574 574 574 574 574 574 573 573 573 573 573 573 573 573 573 573 572 572 572 572 572 572 572 572 572 572 571 571 571 571 571 571 571 571 571 571 570 570 570 570 570 570 570
-613E70%%%%j%%%%%%%%%j%%%%%%%%%j%%%%%%%%%j%%%%%%%%%j%%%%%%%%%%j%%%%%%%%%j%%%
$$ 570 570 570 570 570 569 569 569 569 569 569 569 569 569 569 568 568 568 568 568 568 568 568 568 568 567 567 567 567 567 567 567 567 567 567 566 566 566 566 566 566 566 566 566 566 565 565 565 565 565 565 565 565 565 565 565 564 564 564 564 564 564 564 564 564 564 563 563 563 563
-622E63%%%%%%j%%%%%%%%%%j%%%%%%%%%j%%%%%%%%%j%%%%%%%%%%j%%%%%%%%%j%%%%%%%%%%
$$ 563 563 563 563 563 563 563 562 562 562 562 562 562 562 562 562 562 562 561 561 561 561 561 561 561 561 561 561 560 560 560 560 560 560 560 560 560 560 559 559 559 559 559 559 559 559 559 559 559 558 558 558 558 558 558 558 558 558 558 557 557 557 557 557 557 557 557 557 557 557
-630E57j%%%%%%%%%j%%%%%%%%%%j%%%%%%%%%j%%%%%%%%%%j%%%%%%%%%%j%%%%%%%%%j%%%%%
$$ 557 556 556 556 556 556 556 556 556 556 556 555 555 555 555 555 555 555 555 555 555 555 554 554 554 554 554 554 554 554 554 554 553 553 553 553 553 553 553 553 553 553 553 552 552 552 552 552 552 552 552 552 552 552 551 551 551 551 551 551 551 551 551 551 550 550 550 550 550 550
-639E50%%%%%j%%%%%%%%%%j%%%%%%%%%%j%%%%%%%%%j%%%%%%%%%%j%%%%%%%%%%j%%%%%%%%%
$$ 550 550 550 550 550 550 549 549 549 549 549 549 549 549 549 549 549 548 548 548 548 548 548 548 548 548 548 548 547 547 547 547 547 547 547 547 547 547 546 546 546 546 546 546 546 546 546 546 546 545 545 545 545 545 545 545 545 545 545 545 544 544 544 544 544 544 544 544 544 544
-647E44%j%%%%%%%%%%j%%%%%%%%%%j%%%%%%%%%%j%%%%%%%%%%j%%%%%%%%%%j%%%%%%%%%%j%
$$ 544 544 543 543 543 543 543 543 543 543 543 543 543 542 542 542 542 542 542 542 542 542 542 542 541 541 541 541 541 541 541 541 541 541 541 540 540 540 540 540 540 540 540 540 540 540 539 539 539 539 539 539 539 539 539 539 539 538 538 538 538 538 538 538 538 538 538 538 537 537
-655E37%%%%%%%%%j%%%%%%%%%%j%%%%%%%%%%j%%%%%%%%%%%j%%%%%%%%%%j%%%%%%%%%%j%%%
$$ 537 537 537 537 537 537 537 537 537 537 536 536 536 536 536 536 536 536 536 536 536 535 535 535 535 535 535 535 535 535 535 535 534 534 534 534 534 534 534 534 534 534 534 534 533 533 533 533 533 533 533 533 533 533 533 532 532 532 532 532 532 532 532 532 532 532 531 531 531 531
-664E31%%%%%%%%j%%%%%%%%%%j%%%%%%%%%%j%%%%%%%%%%%j%%%%%%%%%%j%%%%%%%%%%%j%%%
$$ 531 531 531 531 531 531 531 531 531 530 530 530 530 530 530 530 530 530 530 530 529 529 529 529 529 529 529 529 529 529 529 528 528 528 528 528 528 528 528 528 528 528 528 527 527 527 527 527 527 527 527 527 527 527 526 526 526 526 526 526 526 526 526 526 526 526 525 525 525 525
-672E25%%%%%%%j%%%%%%%%%%%j%%%%%%%%%%j%%%%%%%%%%%j%%%%%%%%%%%j%%%%%%%%%%j%%%
$$ 525 525 525 525 525 525 525 525 524 524 524 524 524 524 524 524 524 524 524 524 523 523 523 523 523 523 523 523 523 523 523 522 522 522 522 522 522 522 522 522 522 522 522 521 521 521 521 521 521 521 521 521 521 521 521 520 520 520 520 520 520 520 520 520 520 520 519 519 519 519
-681E19%%%%%%%%j%%%%%%%%%%%j%%%%%%%%%%%j%%%%%%%%%%%j%%%%%%%%%%j%%%%%%%%%%%j%
$$ 519 519 519 519 519 519 519 519 519 518 518 518 518 518 518 518 518 518 518 518 518 517 517 517 517 517 517 517 517 517 517 517 517 516 516 516 516 516 516 516 516 516 516 516 516 515 515 515 515 515 515 515 515 515 515 515 514 514 514 514 514 514 514 514 514 514 514 514 513 513
-689E13%%%%%%%%%%j%%%%%%%%%%%j%%%%%%%%%%%j%%%%%%%%%%%j%%%%%%%%%%%%j%%%%%%%%%
$$ 513 513 513 513 513 513 513 513 513 513 513 512 512 512 512 512 512 512 512 512 512 512 512 511 511 511 511 511 511 511 511 511 511 511 511 510 510 510 510 510 510 510 510 510 510 510 510 509 509 509 509 509 509 509 509 509 509 509 509 509 508 508 508 508 508 508 508 508 508 508
-698E08%%j%%%%%%%%%%%j%%%%%%%%%%%j%%%%%%%%%%%j%%%%%%%%%%%%j%%%%%%%%%%%j%%%%%
$$ 508 508 508 507 507 507 507 507 507 507 507 507 507 507 507 506 506 506 506 506 506 506 506 506 506 506 506 505 505 505 505 505 505 505 505 505 505 505 505 504 504 504 504 504 504 504 504 504 504 504 504 504 503 503 503 503 503 503 503 503 503 503 503 503 502 502 502 502 502 502
-706E02%%%%%%j%%%%%%%%%%%%j%%%%%%%%%%%j%%%%%%%%%%%%j%%%%%%%%%%%j%%%%%%%%%%%%
$$ 502 502 502 502 502 502 502 501 501 501 501 501 501 501 501 501 501 501 501 501 500 500 500 500 500 500 500 500 500 500 500 500 499 499 499 499 499 499 499 499 499 499 499 499 499 498 498 498 498 498 498 498 498 498 498 498 498 497 497 497 497 497 497 497 497 497 497 497 497 497
-714D97j%%%%%%%%%%%j%%%%%%%%%%%%j%%%%%%%%%%%%j%%%%%%%%%%%%j%%%%%%%%%%%j%%%%%
$$ 497 496 496 496 496 496 496 496 496 496 496 496 496 495 495 495 495 495 495 495 495 495 495 495 495 495 494 494 494 494 494 494 494 494 494 494 494 494 494 493 493 493 493 493 493 493 493 493 493 493 493 493 492 492 492 492 492 492 492 492 492 492 492 492 491 491 491 491 491 491
-723D91%%%%%%%j%%%%%%%%%%%%j%%%%%%%%%%%%j%%%%%%%%%%%%j%%%%%%%%%%%%j%%%%%%%%%
$$ 491 491 491 491 491 491 491 491 490 490 490 490 490 490 490 490 490 490 490 490 490 489 489 489 489 489 489 489 489 489 489 489 489 489 488 488 488 488 488 488 488 488 488 488 488 488 488 487 487 487 487 487 487 487 487 487 487 487 487 487 486 486 486 486 486 486 486 486 486 486
-731D86%%%j%%%%%%%%%%%%j%%%%%%%%%%%%j%%%%%%%%%%%%j%%%%%%%%%%%%%j%%%%%%%%%%%%
$$ 486 486 486 486 485 485 485 485 485 485 485 485 485 485 485 485 485 484 484 484 484 484 484 484 484 484 484 484 484 484 483 483 483 483 483 483 483 483 483 483 483 483 483 482 482 482 482 482 482 482 482 482 482 482 482 482 482 481 481 481 481 481 481 481 481 481 481 481 481 481
$$ [...]
-1000@
##END=		$$ NMR SPECTRUM
##TITLE=	
##JCAMP-DX=	6.0	$$ MestReNova 15.0.0-34764
##DATA TYPE=	NMR PEAK TABLE
##DATA CLASS=	PEAK TABLE
##BLOCK_ID=	4
##ORIGIN=	Mestrelab Research S.L.
##OWNER=	PC
##CROSS REFERENCE=	NMR SPECTRUM: BLOCK_ID=3                                     
##.OBSERVE FREQUENCY=	500.12699922000001607
##.OBSERVE NUCLEUS=	^Unknown
##NPOINTS=	110
##FIRSTX=	1.273689282760696484
##LASTX=	7.4348545876264475751
##XFACTOR=	1
##YFACTOR=	1
##FIRSTY=	0.11518548798944024114
##XUNITS=	PPM
##YUNITS=	ARBITRARY UNITS
##PEAK TABLE=	(XYW..XYW)
1.273689282760696484,0.11518548798944024114,0.0010301859679792606337
1.2863808369235418816,0.11649924178147781639,0.0010301859679792606337
1.3037203554827356822,0.11033250874363867422,0.0011108275492135747872
1.3163835208864302917,0.097410072764697250292,0.00131681931211408902
1.4326296790558832317,0.1059161084796836072,0.0011421151353047573861
1.467786375056174597,0.10282719211946281246,0.0011450632088702537587
4.6443173119499450152,0.00061469097348385601069,0.0010301859679792606337
4.6567695828324469076,0.0035156722881635620905,0.0011153851305122962703
4.6604252914986989964,0.00062536064695123644123,0.0010301859679792606337
4.6694689049368154343,0.00847416247420234095,0.0011721023757551842989
4.6729200487067119596,0.0036485332098242086001,0.0011689483012619495805
4.6820173887112694899,0.012257235775678857956,0.0010656098381645316177
4.6855809301567479253,0.008869142360464132499,0.0011396646398145779226
4.6946091361542752196,0.0087619024721304339387,0.0011511543679496357567
4.6982703771222622535,0.011459731210636144721,0.0011506098741431629393
4.7073038664120829822,0.003528697823858172565,0.0011209317481703157723
4.7107548695059486832,0.0085779916326987563219,0.0011388787783920650658
4.7197512286008302951,0.00062126580537895945491,0.0010301859679792606337
4.7234161642876815179,0.0035535482810469900573,0.0010301859679792606337
4.7361105913972023629,0.00056492634978299205873,0.0011002523643939374643
4.9204467817210382208,6.7662575292531860989e-06,0.0011318314049436773577
4.9372924152562580602,6.7793844188410832424e-06,0.0011320022935620956475
4.960484530853104701,8.5573163425574453331e-05,0.001097258504177258797
4.9780550592190291326,0.0028968073541141086368,0.0011119619338243052781
4.9897760324061950499,0.0045671903799761638665,0.0010301859679792606337
4.9942086104875968999,0.0046414711422488085305,0.0014108127695355882503
5.0063776945161677645,0.0046550320458110267668,0.0010301859679792606337
5.0103463976102613486,0.011393517671641392383,0.0011074299122608706296
5.0117488204929232509,0.018226053519922926632,0.0011426200439828637992
5.0261894399495101737,0.018848371487665320501,0.0010301859679792606337
5.0283225783503890938,0.018804035618454846557,0.0011979929269537454694
5.0298182279768059999,0.021969766236848421032,0.0010301859679792606337
5.0427548659041949719,0.014767546272826458792,0.00099289320971536801884
5.0437452303542196219,0.020464562809132301469,0.0014130740458824584804
$$ [...]
Compound,None,,1,0.070643991632320268792,0,0
Compound,None,,1,0.17723213650255803531,0,0
Impurity,None,,1,0.27702646707403166815,0,0
Impurity,None,,1,0.38424726676482440224,0,0
Impurity,None,,1,0.39448170024308676362,0,0
Impurity,None,,1,-0.24300350266124742804,0,0
Impurity,None,,1,0.0043443140937380296529,0,0
Impurity,None,,1,-0.17791160730598953865,0,0
Impurity,None,,1,-0.1883333922466286503,0,0
Impurity,None,,1,0.0088214028776920916375,0,0
Impurity,None,,1,-0.094399756657155567408,0,0
Compound,None,,1,-0.029739817938337166636,0,0
Compound,None,,1,0.40000000000000007772,0,0
Compound,None,,1,-0.052243992398366578822,0,0
Compound,None,,1,0.40000000000000007772,0,0
Compound,None,,1,0.40000000000000007772,0,0
Compound,None,,1,-0.44629375077501232116,0,0
Compound,None,,1,-0.59424919176021906431,0,0
Compound,None,,1,0.40000000000000007772,0,0
Compound,None,,1,0.72861003479754149481,0,0
Compound,None,,1,-0.19712720806147643327,0,0
Impurity,None,,1,-0.89603274728781090452,0,0
Compound,None,,1,0.13274533661093196324,0,0
Compound,None,,1,-0.22639336528640222057,0,0
Compound,None,,1,-0.2000000000000000111,0,0
Compound,None,,1,0.98491854630173536478,0,0
Compound,None,,1,0.30316554391207800601,0,0
Compound,None,,1,0,0,0
Compound,None,,1,0,0,0
Compound,None,,1,-0.017111046037757204896,0,0
Compound,None,,1,-0.13135885822513809762,0,0
Compound,None,,1,-0.12603189316849588986,0,0
Compound,None,,1,0.68695522985614432265,0,0
Compound,None,,1,0.51954915662380662944,0,0
Compound,None,,1,0.043989695144045395936,0,0
Compound,None,,1,0.69426901724972478469,0,0
Compound,None,,1,-0.87889862957702580282,0,0
Compound,None,,1,0.79762475413887090614,0,0
Compound,None,,1,0.01884202870653081674,0,0
Compound,None,,1,0.20776323586464373605,0,0
Compound,None,,1,0.43280224191467692174,0,0
Compound,None,,1,-0.40000000000000007772,0,0
Compound,None,,1,0.4337695277731019039,0,0
Compound,None,,1,0.090724902043905319982,0,0
Compound,None,,1,0.078370412542913769904,0,0
Compound,None,,1,-0.66109051230047977121,0,0
Compound,None,,1,0.25642349899775246369,0,0
Compound,None,,1,0.80000000000000004441,0,0
Compound,None,,1,0.14933052997671344975,0,0
Compound,None,,1,-0.068418329155125412466,0,0
Compound,None,,1,-0.12253475885121395406,0,0
Compound,None,,1,1.8338796882707173452,0,0
Compound,None,,1,1.1852874150914254336,0,0
Compound,None,,1,-0.03213288345123641726,0,0
Compound,None,,1,-0.80000000000000004441,0,0
Compound,None,,1,0.00085666379705240380815,0,0
Compound,None,,1,0.23031757837629990293,0,0
Compound,None,,1,0.31598978083546230833,0,0
Compound,None,,1,0.69606008452013523602,0,0
Compound,None,,1,0.24020783588059546609,0,0
Compound,None,,1,0.37835970840715527075,0,0
Compound,None,,1,1.6280702752042024439,0,0
Compound,None,,1,0.60000000000000008882,0,0
Compound,None,,1,0.84444595238060105036,0,0
Compound,None,,1,0.2000000000000000111,0,0
Impurity,None,,1,-0.10992921723838135206,0,0
Impurity,None,,1,0.019696778509202678142,0,0
##END=		$$ NMR PEAK TABLE
##END=		$$ LINK
