##TITLE=	Document 29
##JCAMP-DX=	6.0	$$ MestReNova 15.0.0-34764
##DATA TYPE=	LINK
##BLOCKS=	3    
##ORIGIN=	Mestrelab Research S.L.
##OWNER=	PC
##$MNOVA/METADATA=	(DOCUMENT,BASE64)
ewogICAgIm5hbWUiOiAiRG9jdW1lbnQgMjkiLAogICAgInBhZ2VzIjogWwogICAgICAgIHsKICAgICA
gICAgICAgIml0ZW1zIjogWwogICAgICAgICAgICAgICAgIjIiLCAgICAgICAgICAgICAgICAgICAgIC
AgICAgICAgICAgICAgICAKICAgICAgICAgICAgICAgICIxIiAgICAgICAgICAgICAgICAgICAgICAgI
CAgICAgICAgICAgICAKICAgICAgICAgICAgXQogICAgICAgIH0KICAgIF0KfQo=
##TITLE=	H NMR calculated spectrum
##JCAMP-CS=	3.7	$$ MestReNova 15.0.0-34764
##BLOCK_ID=	1
##ORIGIN=	Mestrelab Research S.L.
##OWNER=	PC
##$MNOVA/METADATA=	(ITEM,BASE64)
ewogICAgImFuZ2xlIjogMCwKICAgICJwb2ludHMiOiBbCiAgICAgICAgewogICAgICAgICAgICAieCI
6IDU1NTcsCiAgICAgICAgICAgICJ5IjogNjA3MQogICAgICAgIH0sCiAgICAgICAgewogICAgICAgIC
AgICAieCI6IDYyODIuOTQwNzIxMzk3NzYyLAogICAgICAgICAgICAieSI6IDYwNzEKICAgICAgICB9L
AogICAgICAgIHsKICAgICAgICAgICAgIngiOiA2MjgyLjk0MDcyMTM5Nzc2MiwKICAgICAgICAgICAg
InkiOiA2NjczLjQ1Nzg4NTg4MDcxNgogICAgICAgIH0sCiAgICAgICAgewogICAgICAgICAgICAieCI
6IDU1NTcsCiAgICAgICAgICAgICJ5IjogNjY3My40NTc4ODU4ODA3MTYKICAgICAgICB9LAogICAgIC
AgIHsKICAgICAgICAgICAgIngiOiA1NTU3LAogICAgICAgICAgICAieSI6IDYwNzEKICAgICAgICB9C
iAgICBdLAogICAgInoiOiAxCn0K
##NAMES=	H NMR calculated spectrum
##ATOMLIST=	
$$ AN	AS	NH
	1	C	3
	2	C	2
	3	C	2
	4	O	 
	5	P	 
	6	C	3
	7	O	 
	8	O	 
	9	C	2
	10	C	 
	11	C	1
	12	C	1
	13	C	1
	14	C	1
	15	C	1
##BONDLIST=	
$$ AN1	AN2	BT
	1	2	S
	2	3	S
	3	4	S
	4	5	S
	5	6	S
	5	7	D
	5	8	S
	8	9	S
	9	10	S
	10	11	S
	10	15	D
	11	12	D
	12	13	S
	13	14	D
	14	15	S
##MAXRASTER=	32768
##XY_RASTER=	
$$ AN	X	Y	Z
	1	32767	1351	0
	2	28068	1351	0
	3	25686	5439	0
	4	20986	5439	0
	5	18572	9527	0
	6	14484	7113	0
	7	22660	11941	0
	8	16287	13615	0
	9	11491	13615	0
	10	9173	17703	0
	11	11491	21791	0
	12	9173	25879	0
	13	4506	25879	0
	14	2092	21791	0
	15	4506	17703	0
##END=		$$ JCAMP-CS
##TITLE=	
##JCAMP-DX=	6.0	$$ MestReNova 15.0.0-34764
##DATA TYPE=	NMR SPECTRUM
##DATA CLASS=	XYDATA
##BLOCK_ID=	2
##ORIGIN=	Mnova: Peaks
##OWNER=	PC
##NUMDIM=	1
##$MNOVA/METADATA=	(ITEM,BASE64)
ewogICAgImFuZ2xlIjogMCwKICAgICJheGVzIjogewogICAgICAgICJ4IjogewogICAgICAgICAgICA
ibWF4IjogMjAuMDAwMTUwMDAxMTI1MDA3LAogICAgICAgICAgICAibWluIjogLTQuOTk5NjU2MDI3Nj
kzNjQ1NQogICAgICAgIH0sCiAgICAgICAgInkiOiB7CiAgICAgICAgICAgICJtYXgiOiAwLjA4ODM0N
jc3MTg5NTg4NTQ3LAogICAgICAgICAgICAibWluIjogLTAuMDA4MDMxNTI0NzE3ODA3NzcKICAgICAg
ICB9CiAgICB9LAogICAgInBvaW50cyI6IFsKICAgICAgICB7CiAgICAgICAgICAgICJ4IjogNTMyMSw
KICAgICAgICAgICAgInkiOiA1ODM1CiAgICAgICAgfSwKICAgICAgICB7CiAgICAgICAgICAgICJ4Ij
ogODcyMiwKICAgICAgICAgICAgInkiOiA1ODM1CiAgICAgICAgfSwKICAgICAgICB7CiAgICAgICAgI
CAgICJ4IjogODcyMiwKICAgICAgICAgICAgInkiOiA4MjA4CiAgICAgICAgfSwKICAgICAgICB7CiAg
ICAgICAgICAgICJ4IjogNTMyMSwKICAgICAgICAgICAgInkiOiA4MjA4CiAgICAgICAgfSwKICAgICA
gICB7CiAgICAgICAgICAgICJ4IjogNTMyMSwKICAgICAgICAgICAgInkiOiA1ODM1CiAgICAgICAgfQ
ogICAgXSwKICAgICJ6IjogMAp9Cg==
##.OBSERVE FREQUENCY=	360.12729902500001344
##.OBSERVE NUCLEUS=	^Unknown
##.SOLVENT NAME=	
##.PULSE SEQUENCE=	
##.ACQUISITIONMODE=	SIMULTANEOUS
##$ORIGINAL FORMAT=	MNova
##$MNOVA/SCALES_VERSION=	9
##$PARAMETER FILE=	(originalData.xml, ASCII, , 0)
$$ <?xml version="1.0" encoding="UTF-8"?>
$$ <MnovaSpectrumParams>
$$     <itemId>{d29182a1-a7f7-458f-98f8-7f7616f0378a}</itemId>
$$     <spectrumIndex>0</spectrumIndex>
$$     <DataFileName/>
$$     <Title>
$$         <dim0>Simulated Unknown NMR Spectrum</dim0>
$$     </Title>
$$     <Comment/>
$$     <Origin>
$$         <dim0>Mnova: Spin Simulation</dim0>
$$     </Origin>
$$     <Owner/>
$$     <Site/>
$$     <Instrument/>
$$     <Author/>
$$     <Solvent/>
$$     <Temperature/>
$$     <PulseSequence/>
$$     <Experiment>
$$         <dim0>1D</dim0>
$$     </Experiment>
$$     <Probe/>
$$     <NumberofScans/>
$$     <ReceiverGain/>
$$     <RelaxationDelay/>
$$     <PulseWidth/>
$$     <PresaturationFrequency/>
$$     <AcquisitionTime/>
$$     <AcquisitionDate/>
$$     <ModificationDate/>
$$     <Class/>
$$     <Purity>
$$         <dim0>99.9641697084667</dim0>
$$     </Purity>
$$     <SpectrumQuality>
$$         <dim0>-0.713065515402963</dim0>
$$     </SpectrumQuality>
$$     <Version/>
$$     <Algorithm/>
$$     <UseDB/>
$$     <GMMXCycles/>
$$     <LineWidth>
$$         <dim0>0</dim0>
$$     </LineWidth>
$$     <SpectrometerFrequency>
$$         <dim0>360.13</dim0>
$$     </SpectrometerFrequency>
$$     <SpectralWidth>
$$         <dim0>9003.25</dim0>
$$     </SpectralWidth>
$$     <LowestFrequency>
$$         <dim0>-1800.65</dim0>
$$     </LowestFrequency>
$$     <Nucleus>
$$         <dim0>Unknown</dim0>
$$     </Nucleus>
$$     <AcquiredSize>
$$         <dim0>65536</dim0>
$$     </AcquiredSize>
$$     <SpectralSize>
$$         <dim0>65536</dim0>
$$     </SpectralSize>
$$     <DigitalResolution>
$$         <dim0>0.137378692626953</dim0>
$$     </DigitalResolution>
$$     <AbsoluteReference/>
$$ </MnovaSpectrumParams>
$$ 
##$PARAMETER FILE=	(parameters, ASCII, , 0)
$$ <MnovaSpectrumParams>
$$ <SpecCount>1</SpecCount>
$$ <Dimensions>1</Dimensions>
$$ <Origin>Mnova: Peaks</Origin>
$$ <Window Dim="f1">
$$ <Nucleus>Unknown</Nucleus>
$$ <Points>65536</Points>
$$ <Width>9003.25</Width>
$$ <MHz>360.127299025000013</MHz>
$$ <Hz>-1800.65000000000009</Hz>
$$ </Window>
$$ <Window Dim="f0">
$$ <Points>1</Points>
$$ </Window>
$$ </MnovaSpectrumParams>
##$PARAMETER FILE=	(title, ASCII, , 0)
$$ 
##XUNITS=	HZ
##YUNITS=	ARBITRARY UNITS
##FIRSTX=	7202.6000000000003638
##LASTX=	-1800.5126213073731378
##DELTAX=	-0.137378692626953125
##XFACTOR=	1
##YFACTOR=	3.7399701408798529806E-11
##FIRSTY=	8.4104136988116806606E-09
##MINY=	0
##MAXY=	0.080315247178077697754
##NPOINTS=	65536
##XYDATA=	(X++(Y..Y))
$$ [...]
1425A85008096K4035648M0213112K6405322j3429006k6365978j1465693q385780k5301498
1424A90714223l7336435l4037061k4856295j7002002j1688677q235106n941200m353504l200386
1423D4063557k317732j602068r83310m08668J68041P94831J529940K450870L661923N292476
1421E2649860P493471J0445999J2962053R046265k82449k282220K767918R785751J8842736
1420A21429384L0877300M3460254M6083180K8993822j864602k9330546l8922671l0834594
1419A69891527j7430215o421109J113761N530170P110531O884172P664958J3763402K5751723
1418B13858920K6593032P259992q150458k5931016k7667698j2946122o026228j0088097j7847745
1416A39054580k2079456k0268518j4959930r532623n046601j208202K534625O664917J1433583
$$ plain form
1425 185008096 209043744 249256856 275662178 262233172 235867194 224401501 216015721 190714223
1424 190714223 153377788 119340727 94484432 77482430 65793753 57558647 51617447 47263943 44063557
1423 44063557 41745825 40143757 39160447 38751779 38919820 39714651 41244591 43695461 47357384 52649860
1421 52649860 60143331 70589330 83551383 92597648 92315199 90032979 92800897 102586648 121429384
1420 121429384 152306684 195766938 241850118 270843940 268979338 239648792 200726121 169891527
1419 169891527 152461312 146040203 147153964 152684134 159794665 166678837 174343795 188107197 213858920
1418 213858920 240451952 247711944 239561486 213630470 185962772 173016650 166990422 156902325 139054580
1416 139054580 116975124 96706606 81746676 72214053 67167452 65959250 68493875 75158792 86592375
1415H6592375J4716882P611182r466322j7588939j4928124j0652162p302686m819122k969987
1414D1193097j530217l09163Q49172K081486L518205N281590P475402J0311460J4441841J7807067
1413A01119940R663458q450170j5756155j1949767p525825m173423j162930J842340N158578
1411F8766046R201285J4434215K1139025K6356514J8146156M16708j302492J0843395K4883283
1410A92884135L1679452J5880148j6891513l3052454k6735023j2441523M222885J9965910
1409A75512017J8224049j294001r80885J5366609K7449022K6935234J1438899j1040070k4453140
1408B37157734k1789861j6300503j9715684k3379210k6224024j6409786n733693n131323j2096738
1407I0376912j5283630j2823499r175811o306116m322152k955208j975132j231330o28962
$$ plain form
1415 86592375 101309257 108920439 99454117 81865178 66937054 56284892 48982206 44163084 41193097
1414 41193097 39662880 39353717 40202889 42284375 45802580 51084170 58559572 68871032 83312873 101119940
1413 101119940 110783398 102333228 86577073 74627306 67101481 62928058 61765128 63607468 68766046
1411 68766046 77967331 92401546 113540571 139897085 158043241 158459949 157157457 168000852 192884135
1410 192884135 224563587 240443735 223552222 190499768 163764745 151323222 155546107 175512017
1409 175512017 193736066 192442065 191461180 206827789 234276811 261212045 272650944 261610874 237157734
1408 237157734 215367873 199067370 179351686 155972476 129748452 113338666 107604973 102473650 90376912
1407 90376912 75093282 62269783 53093972 46787856 42465704 39510496 37535364 36304034 35675072
1405C5675072j06072L81297Q68468J388600J978090K682507L564227M713439O263341Q407226
1404F5816195J1404858J5558397K1133192K6863392K3900904O829749l944332N56694J0201787
1403A78320836K3456791L4718140J8969001j4804661k2616328q625560M407083J5153237K5915877
1402B54894416L5197077L8906336L2348503J4204476r041720k5932087k9825968k1895992
1400B88855041q143186l111340k2294571m2594378m0444799k8938428j7868786q377438m144655
1399A12937460r952606j2024871o792316k270005l115946p752762q951463o864102m455265
1398E0758124k441865p06495J008922L025792N765972R672728J4275564J5896316R543306
1397A06798364j509726o261918j969719O419428J4997688K0758325J9067625P506968p651374
$$ plain form
1405 35675072 35569000 35950297 36818765 38207365 40185455 42867962 46432189 51145628 57408969 65816195
1404 65816195 77221053 92779450 113912642 140776034 164676938 171506687 167562355 168119049 178320836
1403 178320836 201777627 236495767 255464768 240660107 218043779 209418219 213825302 228978539 254894416
1402 254894416 290091493 328997829 361346332 375550808 366509088 340577001 310751033 288855041
1400 288855041 280711855 277600515 255305944 212711566 172266767 143328339 125459553 117082115 112937460
1399 112937460 102984854 90959983 84167667 81897662 78781716 71028954 62077491 55213389 50758124
1398 50758124 48316259 47609764 48618686 51644478 57410450 67083178 81358742 97255058 106798364
1397 106798364 105288638 99026720 97057001 103476429 118474117 139232442 158300067 165807035 158155661
1395A58155661j5736626j3940678o359988K870489J2105858K0071432K3444091J8542880R354040
1394B08507159P524001J6833516K8302596K7662593P540361k2561195m2664875m4115708l3037339
1393A53991109j8651166m613221P357196R423541l425340j3745099r627923k932120m984683
1392A12792294j2014885j4104420j0668398o470727k898802K94969R97245k924587m771280
1391F0231409j772995K701841O381852M828410j290850k037254K268623P940765J2626289
1389I1878090Q133617m779080r243425l788104J592163J25151p870965j0815356p644047l566714
1388E4021330j36194K793498N563688Q509163J2149343J6226738J5654786M050750j1123765
1387A07709337j6554217j3308737q570633m129496P07275N176938L666458m820654o779080
$$ plain form
1395 158155661 142419035 128478357 122118369 124988858 137094716 157166148 180610239 199153119 208507159
1394 208507159 216031160 232864676 261167272 288829865 296370226 273809031 231144156 187028448 153991109
1393 153991109 135339943 130726722 138083918 147507459 144082119 130337020 120709097 117776977 112792294
1392 112792294 100777409 86672989 76004591 69533864 66635062 66930031 67927276 65002689 60231409
1391 60231409 58458414 61160255 67542107 72370517 71079667 69042413 71311036 79251801 91878090
1389 91878090 100011707 95232627 85989202 82201098 83793261 83918412 76047447 65232091 57588044 54021330
1388 54021330 53885136 56678634 62242322 70751485 82900828 99127566 114782352 118833102 107709337
1387 107709337 91155120 77846383 69275750 65146254 65853529 71030467 74696925 69876271 63097191
1385F3097191k445912J157819L84859l068341l719194n74841M008162P965636P297201j127956
1384G2974624j0614516j2937780j0113487o567194l837907j814214j01170J667679L814197
1383C2470232O468844Q452729N228795k444832m471772j261753J743119J171823k198250l053094
1381D2105841m78979L318418O750163O445790j154694r296401j0603126q327952n964655m203141
1380A8591264k981147k145778j567478j155631q50510o12749m15274k37766o2666J28269L57783
1379I048317O58400J080415J702916K640239L996545N581622O068800K873673l090699o287917
1377B4272311n804994m226494k879331j954087j347096r44706o68755m70207l18256j92514
1376E465871p7999L8311J70443L36865N65700R03487J428972K262881L497874M781192M691669
$$ plain form
1385 63097191 60651279 61809098 62193957 59125616 55406422 54831581 58839743 66805379 74102580 72974624
1384 72974624 62360108 49422328 39308841 32741647 28903740 27089526 26988356 28656035 32470232
1383 32470232 38939076 47391805 52620600 50175768 45703996 44442243 46185362 47357185 45158935 42105841
1381 42105841 41626862 44945280 51695443 58141233 56986539 47690138 37087012 28759060 22794405 18591264
1380 18591264 15610117 13464339 11896861 10741230 9890720 9277971 8862697 8624931 8562265 8690534 9048317
1379 9048317 9706717 10787132 12490048 15130287 19126832 24708454 30777254 33650927 30560228 24272311
1377 24272311 18467317 14240823 11361492 9407405 8060309 7115603 6446848 5976641 5658385 5465871
1376 5465871 5387872 5426183 5596626 5933491 6499191 7402678 8831650 11094531 14592405 19373597 24065266
1374B4065266J897074k356592m938144m853586l541776k343784j549058j054815p43774n41037
1373D039774m02757l02550k22826j50966r0036r5091j73324j85283j44651j07073p8477n3264
1371B033476l2648l9405p5391q4453p0103n6376m7317m1354l7151l3982l1460k9373k7594
1370A426869k6047k4678k3454k2347k1339k0413j9557j8762j8019j7319j6658j6026j5419
1368A166831j4830j4251j3677j3093j2490j1848j1143j0340r380q176o581m352j073L939J1611
1366A051147K2280L0528J5566k1795l4919k2497m238J5900L7745M9884K0484m4151p4527o4602
1364I76805m6780l3316k4621j9120j5564j3181j1524j0325r423q719q145p652p207o771o304
1362G48153n751n027m017k594r06k355q810j0853r251p820o832o157n683n326n037m780m533
$$ plain form
1374 24065266 25962340 23605748 18667604 13814018 10272242 7928458 6379400 5324585 4580811 4039774
1373 4039774 3637017 3334467 3111641 2960675 2870639 2775548 2602224 2416941 2272290 2165217 2086740 2033476
1371 2033476 2000828 1961423 1886032 1801579 1731476 1675100 1627783 1586429 1549278 1515296 1483836 1454463 1426869
1370 1426869 1400822 1376144 1352690 1330343 1309004 1288591 1269034 1250272 1232253 1214934 1198276 1182250 1166831
1368 1166831 1152001 1137750 1124073 1110980 1098490 1086642 1075499 1065159 1055779 1047603 1041022 1036670 1035597 1039536 1051147
1366 1051147 1073427 1103955 1119521 1097726 1062807 1040310 1036072 1051972 1089717 1139601 1160085 1115934 1041407 976805
1364 976805 930025 896709 872088 852968 837404 824223 812699 802374 792951 784232 776087 768435 761228 754457 748153
1362 748153 742402 737375 733358 730764 729858 727503 718693 707840 698589 690769 683937 677780 672097 666771 661734 656954 652421
1359F52421m279m001l681l292k800k152j261MJ862M661Q912J5212K3620K9257J3726k1672
1357G06537l7205l1566k3161j6862j2611r811p951o680n780n114m594m163l776l396k985k496
1355E28386j864r92K53K014M313N881J843p363j1288r467o713m218j910j56j595o327q051
1353D82746o893n602m677m052l632l345l139k988k871k779k701k637k580k529k483k440k400
1350D24998k362k324k288k251k213k175k135k093k045j992j931j859j770j656j505j298j003
1348C92098n68Q0J030K279L126J189l230m921l518j261J350M306O172K259o886j0935r367
1346C73203o935n147l998l269k799k486k268k112j996j908j839j782j736j697j662j632j606
1343C28331j581j559j538j517j499j481j463j445j428j410j392j373j353j331j308j281j249
$$ plain form
1359 652421 648142 644141 640460 637168 634368 632216 630955 630959 632821 637482 646394 661606 685226 714483 728209 706537
1357 706537 669332 637766 614605 597743 585132 575321 567370 560690 554910 549796 545202 541039 537263 533867 530882 528386
1355 528386 526522 525530 525783 527797 532110 537991 539834 532471 521183 511716 505003 500785 498875 498719 497124 490797 482746
1353 482746 475853 470251 465574 461522 457890 454545 451406 448418 445547 442768 440067 437430 434850 432321 429838 427398 424998
1350 424998 422636 420312 418024 415773 413560 411385 409250 407157 405112 403120 401189 399330 397560 395904 394399 393101 392098
1348 392098 391530 391610 392640 394919 398045 399234 396004 391083 387565 386304 387654 391960 398132 400391 393505 382570 373203
1346 373203 366268 361121 357123 353854 351055 348569 346301 344189 342193 340285 338446 336664 334928 333231 331569 329937 328331
1343 328331 326750 325191 323653 322136 320637 319156 317693 316248 314820 313410 312018 310645 309292 307961 306653 305372 304123
1341C04123j213j166j107j028r18p61n25j56M28J335K532L157J015l465n608m982l788k880
1338B84993k297j931j696j540j433j356j299j257j222j194j172j152j135j121j107j094j084
1336B61903j072j063j054j044j036j028j020j012j005r97r90r83r76r70r62r57r49r44r37
1334B42904r31r25r19r13r08r01q96q90q84q79q73q68q63q57q52q47q42q36q32q26q21q17
1330B23724q11q07q02p97p93p88p83p78p74p70p65p60p56p52p47p43p39p35p30p27p22p18
1327B06927p14p10p06p02o98o94o90o86o83o79o75o71o68o64o61o56o54o49o46o43o39o36
1324A92103o32o29o26o22o19o15o12o09o06o03n99n97n93n90n87n84n81n78n75n71n69n66
1321A78940n64n60n57n55n51n49n46n44n40n38n35n33n29n27n25n22n19n17n14n11n09n07
$$ plain form
1341 304123 302910 301744 300637 299609 298691 297930 297405 297249 297677 299012 301544 304701 305716 302251 296643 291661 287873 284993
1338 284993 282696 280765 279069 277529 276096 274740 273441 272184 270962 269768 268596 267444 266309 265188 264081 262987 261903
1336 261903 260831 259768 258714 257670 256634 255606 254586 253574 252569 251572 250582 249599 248623 247653 246691 245734 244785 243841 242904
1334 242904 241973 241048 240129 239216 238308 237407 236511 235621 234737 233858 232985 232117 231254 230397 229545 228698 227856 227020 226188 225362 224541 223724
1330 223724 222913 222106 221304 220507 219714 218926 218143 217365 216591 215821 215056 214296 213540 212788 212041 211298 210559 209824 209094 208367 207645 206927
1327 206927 206213 205503 204797 204095 203397 202703 202013 201327 200644 199965 199290 198619 197951 197287 196626 195970 195316 194667 194021 193378 192739 192103
1324 192103 191471 190842 190216 189594 188975 188360 187748 187139 186533 185930 185331 184734 184141 183551 182964 182380 181799 181221 180646 180075 179506 178940
1321 178940 178376 177816 177259 176704 176153 175604 175058 174514 173974 173436 172901 172368 171839 171312 170787 170265 169746 169229 168715 168204 167695 167188
1318A67188n04n02m99m96m95m91m90m87m85m82m80m78m75m73m71m69m66m64m62m60m57m55
1315A56647m54m51m49m46m45m43m40m39m36m35m32m31m28m27m24m23m20m19m17m14m13m11
1312A47150m10m07m05m04m02m00l98l97l94l93l91l89l88l86l84l83l80l80l77l76l74l72
1309A38560l71l69l68l66l64l63l62l59l58l57l55l53l52l51l49l47l46l45l43l42l40l38
1306A30762l38l35l35l33l32l30l29l27l26l25l23l22l21l19l18l17l15l15l12l12l10l09
1303A23659l08l06l06l04l02l02l00k99k98k97k95k94k93k92k91k90k88k87k86k85k84k83
1300A17169k82k80k79k79k77k76k75k74k73k72k70k70k69k67k67k65k65k63k63k61k61k59
1297A11222k58k58k56k56k54k54k52k52k51k49k49k48k47k46k45k44k43k42k41k41k39k39
$$ plain form
1318 167188 166684 166182 165683 165187 164692 164201 163711 163224 162739 162257 161777 161299 160824 160351 159880 159411 158945 158481 158019 157559 157102 156647
1315 156647 156193 155742 155293 154847 154402 153959 153519 153080 152644 152209 151777 151346 150918 150491 150067 149644 149224 148805 148388 147974 147561 147150
1312 147150 146740 146333 145928 145524 145122 144722 144324 143927 143533 143140 142749 142360 141972 141586 141202 140819 140439 140059 139682 139306 138932 138560
1309 138560 138189 137820 137452 137086 136722 136359 135997 135638 135280 134923 134568 134215 133863 133512 133163 132816 132470 132125 131782 131440 131100 130762
1306 130762 130424 130089 129754 129421 129089 128759 128430 128103 127777 127452 127129 126807 126486 126167 125849 125532 125217 124902 124590 124278 123968 123659
1303 123659 123351 123045 122739 122435 122133 121831 121531 121232 120934 120637 120342 120048 119755 119463 119172 118882 118594 118307 118021 117736 117452 117169
1300 117169 116887 116607 116328 116049 115772 115496 115221 114947 114674 114402 114132 113862 113593 113326 113059 112794 112529 112266 112003 111742 111481 111222
1297 111222 110964 110706 110450 110194 109940 109686 109434 109182 108931 108682 108433 108185 107938 107692 107447 107203 106960 106718 106477 106236 105997 105758
1294A05758k38k37k36k35k34k34k32k32k31k30k29k28k27k27k26k25k24k23k23k21k21k20
1291A00725k20k18k18k17k16k15k15k14k13k12k12k11k10k09k08k08k07k07k05k05k04k04
1288I6077k02k03k01k00k00k00j98j98j97j96j96j95j95j93j93j93j92j91j90j90j89j88j88
1285I1589j87j87j86j85j85j84j83j83j82j81j81j81j79j79j79j78j77j77j76j75j75j75j73
1282H7441j74j72j72j72j71j70j70j69j69j68j67j67j67j66j65j65j64j64j63j63j62j62j61
1279H3598j60j60j60j59j58j58j58j57j56j56j56j55j54j54j54j53j52j53j51j51j51j50j50
1276H0032j49j49j48j48j47j47j46j46j46j45j44j44j44j43j43j42j42j42j41j40j40j40j39
1272G6717j39j39j38j37j37j37j37j35j36j35j35j34j34j33j33j33j32j32j31j31j31j30j30
$$ plain form
1294 105758 105520 105283 105047 104812 104578 104344 104112 103880 103649 103419 103190 102962 102735 102508 102282 102057 101833 101610 101387 101166 100945 100725
1291 100725 100505 100287 100069 99852 99636 99421 99206 98992 98779 98567 98355 98144 97934 97725 97517 97309 97102 96895 96690 96485 96281 96077
1288 96077 95875 95672 95471 95271 95071 94871 94673 94475 94278 94082 93886 93691 93496 93303 93110 92917 92725 92534 92344 92154 91965 91777 91589
1285 91589 91402 91215 91029 90844 90659 90475 90292 90109 89927 89746 89565 89384 89205 89026 88847 88669 88492 88315 88139 87964 87789 87614 87441
1282 87441 87267 87095 86923 86751 86580 86410 86240 86071 85902 85734 85567 85400 85233 85067 84902 84737 84573 84409 84246 84083 83921 83759 83598
1279 83598 83438 83278 83118 82959 82801 82643 82485 82328 82172 82016 81860 81705 81551 81397 81243 81090 80938 80785 80634 80483 80332 80182 80032
1276 80032 79883 79734 79586 79438 79291 79144 78998 78852 78706 78561 78417 78273 78129 77986 77843 77701 77559 77417 77276 77136 76996 76856 76717
1272 76717 76578 76439 76301 76164 76027 75890 75753 75618 75482 75347 75212 75078 74944 74811 74678 74545 74413 74281 74150 74019 73888 73758 73628
1269G3628j30j29j28j29j28j27j27j27j27j26j25j26j24j25j24j24j23j23j23j23j22j21j21
1266G0746j21j21j20j20j19j20j18j19j18j18j17j17j17j17j16j15j16j15j15j14j14j14j13
1263F8052j13j13j13j12j12j11j11j11j11j10j10j09j10j09j08j09j08j08j07j07j07j07j06
1260F5530j06j05j06j05j05j04j04j04j04j03j03j03j02j03j02j01j02j01j00j01j00j00j00
1257F3166r9r9r9r9r8r8r8r7r8r7r6r7r6r6r6r5r5r5r5r4r4r4r4r3r3r3r3r2r2r2r2r1r1r1
1252E9934r1r0r1q9r0r0q9q9q9q8q8q9q7q8q7q7q7q7q7q6q6q6q5q5q6q4q5q5q4q4q4q3q4q3
1247E6981q3q2q3q2q2q2q2q1q1q1q1q1q0q0q0q0q0p9p9p9p9p9p8p8p8p8p8p7p7p7p7p7p6p6
1243E4278p6p6p6p5p6p5p5p4p5p4p4p4p4p4p3p4p3p3p2p3p2p2p2p2p2p1p1p2p0p1p1p0p0p1
$$ plain form
1269 73628 73498 73369 73241 73112 72984 72857 72730 72603 72476 72350 72225 72099 71975 71850 71726 71602 71479 71356 71233 71110 70988 70867 70746
1266 70746 70625 70504 70384 70264 70145 70025 69907 69788 69670 69552 69435 69318 69201 69084 68968 68853 68737 68622 68507 68393 68279 68165 68052
1263 68052 67939 67826 67713 67601 67489 67378 67267 67156 67045 66935 66825 66716 66606 66497 66389 66280 66172 66064 65957 65850 65743 65636 65530
1260 65530 65424 65319 65213 65108 65003 64899 64795 64691 64587 64484 64381 64278 64176 64073 63971 63870 63768 63667 63567 63466 63366 63266 63166
1257 63166 63067 62968 62869 62770 62672 62574 62476 62379 62281 62184 62088 61991 61895 61799 61703 61608 61513 61418 61323 61229 61135 61041 60947 60854 60761 60668 60575 60483 60391 60299 60207 60116 60025 59934
1252 59934 59843 59753 59662 59573 59483 59393 59304 59215 59126 59038 58950 58861 58774 58686 58599 58512 58425 58338 58251 58165 58079 57993 57908 57823 57737 57653 57568 57483 57399 57315 57231 57148 57064 56981
1247 56981 56898 56816 56733 56651 56569 56487 56405 56324 56243 56162 56081 56000 55920 55840 55760 55680 55600 55521 55442 55363 55284 55205 55127 55049 54971 54893 54815 54738 54661 54584 54507 54430 54354 54278
1243 54278 54202 54126 54050 53975 53899 53824 53749 53675 53600 53526 53452 53378 53304 53230 53157 53083 53010 52937 52865 52792 52720 52648 52576 52504 52432 52361 52290 52218 52148 52077 52006 51936 51866 51795
1238E1795o9p0p0o9o9o9o9o9o8o9o8o8o8o8o7o8o7o7o7o7o6o7o6o6o6o6o5o6o5o5o5o5o5o4
1233D9512o5o4o4o4o4o3o4o3o3o4o2o3o3o2o2o3o2o1o2o2o1o1o1o1o1o1o1o0o0o0o0o0o0o0
1229D7405n9n9n9n9n9n9n9n8n9n8n8n8n8n7n8n7n8n7n7n7n6n7n6n7n6n6n6n6n6n5n6n5n5n6
1224D5459n4n5n5n5n4n5n4n4n4n4n3n4n4n3n3n3n3n3n3n3n2n3n2n2n2n2n2n2n2n1n1n2n1n1
1219D3658n1n1n0n1n1n0n0n0n0n0n0n0m9n0m9n0m9m9m9m9m8m9m9m8m8m9m8m8m8m7m8m8m7m8
1215D1987m7m7m7m7m7m7m6m7m6m7m6m6m6m6m6m6m6m5m6m5m5m5m6m5m4m5m5m5m4m4m5m4m4m4
1210D0436m4m4m4m3m4m4m3m3m3m4m3m3m2m3m3m2m3m2m3m2m2m2m2m2m2m1m2m1m2m1m2m1m1m1
1205C8992m1m1m0m1m1m0m0m1m0m0m0m0m0m0m0l9m0m0l9l9m0l9l9l9l9l9l8l9l9l8l9l8l8l9
$$ plain form
1238 51795 51726 51656 51586 51517 51448 51379 51310 51241 51173 51104 51036 50968 50900 50832 50765 50697 50630 50563 50496 50429 50363 50296 50230 50164 50098 50032 49967 49901 49836 49771 49706 49641 49576 49512
1233 49512 49447 49383 49319 49255 49191 49128 49064 49001 48938 48874 48812 48749 48686 48624 48562 48499 48437 48376 48314 48252 48191 48130 48069 48008 47947 47886 47825 47765 47705 47645 47585 47525 47465 47405
1229 47405 47346 47287 47228 47169 47110 47051 46992 46934 46875 46817 46759 46701 46643 46586 46528 46471 46413 46356 46299 46242 46186 46129 46073 46016 45960 45904 45848 45792 45736 45681 45625 45570 45515 45459
1224 45459 45405 45350 45295 45240 45186 45131 45077 45023 44969 44915 44862 44808 44754 44701 44648 44595 44542 44489 44436 44383 44331 44278 44226 44174 44122 44070 44018 43966 43914 43863 43812 43760 43709 43658
1219 43658 43607 43556 43506 43455 43404 43354 43304 43254 43204 43154 43104 43054 43005 42955 42906 42856 42807 42758 42709 42660 42612 42563 42514 42466 42418 42369 42321 42273 42225 42178 42130 42082 42035 41987
1215 41987 41940 41893 41846 41799 41752 41705 41659 41612 41566 41519 41473 41427 41381 41335 41289 41243 41197 41152 41106 41061 41016 40971 40925 40880 40836 40791 40746 40701 40657 40613 40568 40524 40480 40436
1210 40436 40392 40348 40304 40261 40217 40173 40130 40087 40044 40000 39957 39914 39872 39829 39786 39744 39701 39659 39616 39574 39532 39490 39448 39406 39364 39323 39281 39240 39198 39157 39115 39074 39033 38992
1205 38992 38951 38910 38870 38829 38788 38748 38708 38667 38627 38587 38547 38507 38467 38427 38387 38348 38308 38268 38229 38190 38150 38111 38072 38033 37994 37955 37917 37878 37839 37801 37762 37724 37686 37647
1201C7647l8l8l8l8l8l7l8l8l7l8l7l7l8l7l7l7l7l7l6l7l7l6l7l6l6l7l6l6l6l6l6l6l6l5
1196C6393l6l5l6l5l6l5l5l5l5l5l5l5l5l4l5l5l4l4l5l4l4l4l5l4l3l4l4l4l4l3l4l3l4l3
1191C5221l3l3l4l3l3l3l3l2l3l3l2l3l3l2l2l3l2l2l2l2l2l2l2l2l2l1l2l2l1l2l1l1l1l2
1187C4125l1l1l1l1l1l1l0l1l1l0l1l0l1l0l0l1l0l0l0l0l0l0l0l0k9l0l0k9l0k9k9l0k9k9
1182C3100k9l0k9k9k9k8k9k9k9k8k9k9k8k9k8k8k9k8k8k8k8k8k8k8k8k8k8k7k8k7k8k8k7k7
1177C2139k8k7k7k7k8k7k7k7k7k6k7k7k7k6k7k7k6k7k6k6k7k6k6k6k7k6k6k6k6k6k5k6k6k6
1172C1237k5k6k5k6k5k6k5k5k6k5k5k5k5k5k5k5k5k5k5k5k4k5k5k4k5k4k5k4k4k5k4k4k4k4
1168C0392k5k4k4k4k3k4k4k4k4k3k4k4k3k4k3k4k3k3k4k3k3k3k3k3k3k3k3k3k3k3k3k3k2k3
$$ plain form
1201 37647 37609 37571 37533 37495 37457 37420 37382 37344 37307 37269 37232 37195 37157 37120 37083 37046 37009 36972 36936 36899 36862 36826 36789 36753 36717 36680 36644 36608 36572 36536 36500 36464 36428 36393
1196 36393 36357 36322 36286 36251 36215 36180 36145 36110 36075 36040 36005 35970 35935 35901 35866 35831 35797 35763 35728 35694 35660 35626 35591 35557 35524 35490 35456 35422 35388 35355 35321 35288 35254 35221
1191 35221 35188 35155 35121 35088 35055 35022 34989 34957 34924 34891 34859 34826 34793 34761 34729 34696 34664 34632 34600 34568 34536 34504 34472 34440 34408 34377 34345 34313 34282 34250 34219 34188 34157 34125
1187 34125 34094 34063 34032 34001 33970 33939 33909 33878 33847 33817 33786 33756 33725 33695 33665 33634 33604 33574 33544 33514 33484 33454 33424 33394 33365 33335 33305 33276 33246 33217 33188 33158 33129 33100
1182 33100 33071 33041 33012 32983 32954 32926 32897 32868 32839 32811 32782 32753 32725 32696 32668 32640 32611 32583 32555 32527 32499 32471 32443 32415 32387 32359 32331 32304 32276 32249 32221 32193 32166 32139
1177 32139 32111 32084 32057 32030 32002 31975 31948 31921 31894 31868 31841 31814 31787 31761 31734 31707 31681 31654 31628 31602 31575 31549 31523 31497 31470 31444 31418 31392 31366 31340 31315 31289 31263 31237
1172 31237 31212 31186 31161 31135 31110 31084 31059 31034 31008 30983 30958 30933 30908 30883 30858 30833 30808 30783 30758 30733 30709 30684 30659 30635 30610 30586 30561 30537 30513 30488 30464 30440 30416 30392
1168 30392 30367 30343 30319 30295 30272 30248 30224 30200 30176 30153 30129 30105 30082 30058 30035 30011 29988 29965 29941 29918 29895 29872 29849 29826 29803 29780 29757 29734 29711 29688 29665 29642 29620 29597
1163B9597k3k2k3k2k3k2k2k3k2k2k3k2k2k2k2k2k2k2k2k2k2k1k2k2k1k2k2k1k2k1k2k1k1k2
1158B8850k1k1k1k2k1k1k1k1k1k1k1k0k1k1k1k0k1k1k0k1k0k1k0k1k0k0k1k0k0k0k1k0k0k0
1154B8148k0k0k0k0k0j9k0k0k0j9k0k0j9k0j9k0j9k0j9j9k0j9j9j9j9k0j9j9j9j9j9j9j9j8
1149B7488j9j9j9j9j8j9j9j8j9j8j9j8j9j8j8j9j8j8j9j8j8j8j8j8j8j8j8j8j8j8j8j8j7j8
1144B6866j8j8j7j8j8j7j8j7j8j7j7j8j7j8j7j7j7j8j7j7j7j7j7j7j7j7j7j7j7j7j6j7j7j7
1140B6280j6j7j7j6j7j6j7j6j7j6j7j6j6j7j6j6j6j7j6j6j6j6j6j6j6j6j6j6j6j6j6j5j6j6
1135B5729j6j5j6j6j5j6j5j6j5j6j5j6j5j5j6j5j5j6j5j5j5j5j5j6j5j5j5j5j5j5j4j5j5j5
1130B5210j5j5j4j5j5j4j5j5j4j5j4j5j4j5j4j5j4j5j4j4j5j4j4j4j4j5j4j4j4j4j4j4j4j4
$$ plain form
1163 29597 29574 29552 29529 29507 29484 29462 29440 29417 29395 29373 29350 29328 29306 29284 29262 29240 29218 29196 29174 29152 29130 29109 29087 29065 29044 29022 29000 28979 28957 28936 28914 28893 28872 28850
1158 28850 28829 28808 28787 28765 28744 28723 28702 28681 28660 28639 28618 28598 28577 28556 28535 28515 28494 28473 28453 28432 28412 28391 28371 28350 28330 28310 28289 28269 28249 28229 28208 28188 28168 28148
1154 28148 28128 28108 28088 28068 28048 28029 28009 27989 27969 27950 27930 27910 27891 27871 27852 27832 27813 27793 27774 27755 27735 27716 27697 27678 27659 27639 27620 27601 27582 27563 27544 27525 27506 27488
1149 27488 27469 27450 27431 27412 27394 27375 27356 27338 27319 27301 27282 27264 27245 27227 27209 27190 27172 27154 27135 27117 27099 27081 27063 27045 27027 27009 26991 26973 26955 26937 26919 26901 26884 26866
1144 26866 26848 26830 26813 26795 26777 26760 26742 26725 26707 26690 26673 26655 26638 26620 26603 26586 26569 26551 26534 26517 26500 26483 26466 26449 26432 26415 26398 26381 26364 26347 26331 26314 26297 26280
1140 26280 26264 26247 26230 26214 26197 26181 26164 26148 26131 26115 26098 26082 26066 26049 26033 26017 26001 25984 25968 25952 25936 25920 25904 25888 25872 25856 25840 25824 25808 25792 25776 25761 25745 25729
1135 25729 25713 25698 25682 25666 25651 25635 25620 25604 25589 25573 25558 25542 25527 25512 25496 25481 25466 25450 25435 25420 25405 25390 25375 25359 25344 25329 25314 25299 25284 25269 25255 25240 25225 25210
1130 25210 25195 25180 25166 25151 25136 25122 25107 25092 25078 25063 25049 25034 25020 25005 24991 24976 24962 24947 24933 24919 24904 24890 24876 24862 24848 24833 24819 24805 24791 24777 24763 24749 24735 24721
1126B4721j4j4j4j4j4j3j4j4j4j3j4j4j3j4j4j3j4j3j4j3j4j3j4j3j3j4j3j3j4j3j3j3j3j4
1121B4260j3j3j3j3j3j3j3j3j3j3j3j3j2j3j3j3j3j2j3j3j2j3j3j2j3j2j3j3j2j2j3j2j3j2
1116B3827j2j3j2j2j3j2j2j2j3j2j2j2j2j2j2j2j2j2j2j2j2j2j2j2j2j1j2j2j2j2j1j2j2j1
1112B3419j2j2j1j2j1j2j1j2j1j2j1j1j2j1j2j1j1j1j2j1j1j1j2j1j1j1j1j1j1j1j1j1j1j1
1107B3035j1j1j1j1j1j1j0j1j1j1j1j0j1j1j0j1j1j0j1j0j1j0j1j0j1j0j1j0j1j0j0j1j0j0
1102B2674j1j0j0j0j1j0j0j0j0j0j0j1j0j0j0j0j0j0j0j0rj0j0j0j0j0j0rj0j0j0rj0j0rj0
1097B2315j0rj0rj0rj0rj0rj0rj0rrj0rj0rrrj0rrrrj0rrrrrrrrrrrrrrrrrrrqrrrrqrrqr
1090B1803rqrrqrqrqrqrqrqrqqrqrqqqrqqqrqqqqqqrqqqqqqqqqqqpqqqqqqpqqqpqqpqqpqq
$$ plain form
1126 24721 24707 24693 24679 24665 24651 24638 24624 24610 24596 24583 24569 24555 24542 24528 24514 24501 24487 24474 24460 24447 24433 24420 24406 24393 24380 24366 24353 24340 24326 24313 24300 24287 24274 24260
1121 24260 24247 24234 24221 24208 24195 24182 24169 24156 24143 24130 24117 24104 24092 24079 24066 24053 24040 24028 24015 24002 23990 23977 23964 23952 23939 23927 23914 23901 23889 23877 23864 23852 23839 23827
1116 23827 23815 23802 23790 23778 23765 23753 23741 23729 23716 23704 23692 23680 23668 23656 23644 23632 23620 23608 23596 23584 23572 23560 23548 23536 23524 23513 23501 23489 23477 23465 23454 23442 23430 23419
1112 23419 23407 23395 23384 23372 23361 23349 23338 23326 23315 23303 23292 23281 23269 23258 23246 23235 23224 23213 23201 23190 23179 23168 23156 23145 23134 23123 23112 23101 23090 23079 23068 23057 23046 23035
1107 23035 23024 23013 23002 22991 22980 22969 22959 22948 22937 22926 22915 22905 22894 22883 22873 22862 22851 22841 22830 22820 22809 22799 22788 22778 22767 22757 22746 22736 22725 22715 22705 22694 22684 22674
1102 22674 22663 22653 22643 22633 22622 22612 22602 22592 22582 22572 22562 22551 22541 22531 22521 22511 22501 22491 22481 22471 22462 22452 22442 22432 22422 22412 22402 22393 22383 22373 22363 22354 22344 22334 22325 22315
1097 22315 22305 22296 22286 22277 22267 22258 22248 22239 22229 22220 22210 22201 22191 22182 22173 22163 22154 22144 22135 22126 22117 22107 22098 22089 22080 22071 22061 22052 22043 22034 22025 22016 22007 21998 21989 21980 21971 21962 21953 21944 21935 21926 21917 21908 21899 21890 21882 21873 21864 21855 21846 21838 21829 21820 21812 21803
1090 21803 21794 21786 21777 21768 21760 21751 21743 21734 21726 21717 21709 21700 21692 21683 21675 21666 21658 21650 21641 21633 21624 21616 21608 21600 21591 21583 21575 21567 21558 21550 21542 21534 21526 21518 21510 21501 21493 21485 21477 21469 21461 21453 21445 21437 21429 21421 21413 21406 21398 21390 21382 21374 21366 21358 21351 21343 21335 21327 21320 21312 21304 21297 21289 21281 21274 21266 21258
1081B1258pqpqpqqppqpqpqppqppqppqppppqppppppqpppppppppppoppppppopppopppoppopp
1071B0782opoppopopopoopopoopopooopooopoooopooooooooooooooooooooonooooonooono
1062B0370onoonoononoononononnonononnonnonnnonnnonnnnnonnnnnnnnnnnnnnnnnnnmnn
1053B0017nnnmnnnnmnnmnnmnnmnnmnmnmnmnmnmnmnmnmmnmnmmmnmmnmmmnmmmmnmmmmmmmmmm
1044A9720nmmmmlmmmmmmmmmmlmmmmlmmmlmmmlmmlmmlmlmmlmlmlmlmlmlmllmlmllmllmllml
1035A9475llmllllmlllllmlllllllllllllllllllkllllllkllllklllkllkllkllklkllklkl
1025A9281klklklklkklklkklkklkklkklkkkklkkkklkkkkkkkkkklkkkkkkjkkkkkkkkkkjkkk
1016A9136kjkkkjkkkjkkjkkjkkjkjkkjkjkjkjkjkjkjkjjkjjkjkjjkjjjkjjjkjjjjkjjjjjj
$$ plain form
1081 21258 21251 21243 21236 21228 21221 21213 21205 21198 21191 21183 21176 21168 21161 21153 21146 21139 21131 21124 21117 21109 21102 21095 21087 21080 21073 21066 21059 21051 21044 21037 21030 21023 21016 21009 21001 20994 20987 20980 20973 20966 20959 20952 20945 20938 20931 20924 20918 20911 20904 20897 20890 20883 20876 20870 20863 20856 20849 20843 20836 20829 20822 20816 20809 20802 20796 20789 20782
1071 20782 20776 20769 20763 20756 20749 20743 20736 20730 20723 20717 20710 20704 20698 20691 20685 20678 20672 20666 20659 20653 20646 20640 20634 20628 20621 20615 20609 20603 20596 20590 20584 20578 20572 20565 20559 20553 20547 20541 20535 20529 20523 20517 20511 20505 20499 20493 20487 20481 20475 20469 20463 20457 20451 20445 20439 20434 20428 20422 20416 20410 20404 20399 20393 20387 20381 20376 20370
1062 20370 20364 20359 20353 20347 20342 20336 20330 20325 20319 20314 20308 20302 20297 20291 20286 20280 20275 20269 20264 20259 20253 20248 20242 20237 20231 20226 20221 20215 20210 20205 20199 20194 20189 20184 20178 20173 20168 20163 20157 20152 20147 20142 20137 20132 20126 20121 20116 20111 20106 20101 20096 20091 20086 20081 20076 20071 20066 20061 20056 20051 20046 20041 20036 20031 20027 20022 20017
1053 20017 20012 20007 20002 19998 19993 19988 19983 19978 19974 19969 19964 19960 19955 19950 19946 19941 19936 19932 19927 19922 19918 19913 19909 19904 19900 19895 19891 19886 19882 19877 19873 19868 19864 19859 19855 19850 19846 19842 19837 19833 19828 19824 19820 19816 19811 19807 19803 19798 19794 19790 19786 19781 19777 19773 19769 19765 19760 19756 19752 19748 19744 19740 19736 19732 19728 19724 19720
1044 19720 19715 19711 19707 19703 19699 19696 19692 19688 19684 19680 19676 19672 19668 19664 19660 19656 19653 19649 19645 19641 19637 19634 19630 19626 19622 19619 19615 19611 19607 19604 19600 19596 19593 19589 19585 19582 19578 19575 19571 19567 19564 19560 19557 19553 19550 19546 19543 19539 19536 19532 19529 19525 19522 19519 19515 19512 19508 19505 19502 19498 19495 19492 19488 19485 19482 19478 19475
1035 19475 19472 19469 19465 19462 19459 19456 19453 19449 19446 19443 19440 19437 19434 19430 19427 19424 19421 19418 19415 19412 19409 19406 19403 19400 19397 19394 19391 19388 19385 19382 19379 19376 19373 19371 19368 19365 19362 19359 19356 19353 19351 19348 19345 19342 19339 19337 19334 19331 19328 19326 19323 19320 19318 19315 19312 19310 19307 19304 19302 19299 19297 19294 19291 19289 19286 19284 19281
1025 19281 19279 19276 19274 19271 19269 19266 19264 19261 19259 19257 19254 19252 19249 19247 19245 19242 19240 19238 19235 19233 19231 19228 19226 19224 19221 19219 19217 19215 19213 19210 19208 19206 19204 19202 19199 19197 19195 19193 19191 19189 19187 19185 19183 19181 19179 19176 19174 19172 19170 19168 19166 19164 19163 19161 19159 19157 19155 19153 19151 19149 19147 19145 19143 19142 19140 19138 19136
1016 19136 19134 19133 19131 19129 19127 19126 19124 19122 19120 19119 19117 19115 19114 19112 19110 19109 19107 19105 19104 19102 19101 19099 19097 19096 19094 19093 19091 19090 19088 19087 19085 19084 19082 19081 19079 19078 19076 19075 19074 19072 19071 19070 19068 19067 19065 19064 19063 19061 19060 19059 19058 19056 19055 19054 19053 19051 19050 19049 19048 19047 19045 19044 19043 19042 19041 19040 19039
1007A9039kjjjjjjjjjjjjjjjjjj%jjjjjjj%jjjj%jjj%jj%jj%jj%jj%j%jj%j%j%j%j%j%j%%
998A8988j%j%%j%%j%%j%%%j%%%j%%%%j%%%%%%%%j%%%%%%%%%%%%%J%%%%%%%J%%%%%J%%%J%%
988A8983%J%%J%%J%J%%J%J%%J%J%J%J%JJ%J%JJ%J%JJ%JJ%JJJ%JJJ%JJJJJ%JJJJJJJJ%JJJJ
979A9026JJJJJJKJJJJJJJJJKJJJJKJJJKJJJKJJKJJKJJKJKJJKJKJKJKJKJKJKKJKJKKJKKJKK
970A9118JKKKJKKKJKKKKJKKKKKKKKKKJKKKKKKKLKKKKKKKKKLKKKKLKKKKLKKLKKLKKLKKLKLK
960A9258KLKLKLKLKLKLKLLKLLKLKLLKLLLKLLLKLLLLKLLLLLLLKLLLLLLLLLLLLLMLLLLLLLML
951A9449LLLMLLLMLLMLLMLLMLLMLMLMLLMLMMLMLMLMMLMLMMLMMLMMMLMMMMLMMMMMMLMMMMMM
942A9692MMMMMMMMMMMNMMMMMNMMMMNMMMNMMNMMNMMNMNMNMNMNMNMNMNMNNMNNMNNMNNMNNNMN
$$ plain form
1007 19039 19037 19036 19035 19034 19033 19032 19031 19030 19029 19028 19027 19026 19025 19024 19023 19022 19021 19020 19019 19019 19018 19017 19016 19015 19014 19013 19012 19012 19011 19010 19009 19008 19008 19007 19006 19005 19005 19004 19003 19003 19002 19001 19001 19000 18999 18999 18998 18997 18997 18996 18996 18995 18994 18994 18993 18993 18992 18992 18991 18991 18990 18990 18989 18989 18988 18988 18988
998 18988 18987 18987 18986 18986 18986 18985 18985 18985 18984 18984 18984 18983 18983 18983 18983 18982 18982 18982 18982 18981 18981 18981 18981 18981 18980 18980 18980 18980 18980 18980 18980 18980 18980 18979 18979 18979 18979 18979 18979 18979 18979 18979 18979 18979 18979 18979 18979 18980 18980 18980 18980 18980 18980 18980 18980 18981 18981 18981 18981 18981 18981 18982 18982 18982 18982 18983 18983 18983
988 18983 18983 18984 18984 18984 18985 18985 18985 18986 18986 18987 18987 18987 18988 18988 18989 18989 18989 18990 18990 18991 18991 18992 18992 18993 18993 18994 18995 18995 18996 18996 18997 18998 18998 18999 18999 19000 19001 19001 19002 19003 19003 19004 19005 19006 19006 19007 19008 19009 19009 19010 19011 19012 19013 19014 19014 19015 19016 19017 19018 19019 19020 19021 19022 19022 19023 19024 19025 19026
979 19026 19027 19028 19029 19030 19031 19032 19034 19035 19036 19037 19038 19039 19040 19041 19042 19043 19045 19046 19047 19048 19049 19051 19052 19053 19054 19056 19057 19058 19059 19061 19062 19063 19065 19066 19067 19069 19070 19071 19073 19074 19076 19077 19078 19080 19081 19083 19084 19086 19087 19089 19090 19092 19093 19095 19096 19098 19100 19101 19103 19104 19106 19108 19109 19111 19113 19114 19116 19118
970 19118 19119 19121 19123 19125 19126 19128 19130 19132 19133 19135 19137 19139 19141 19142 19144 19146 19148 19150 19152 19154 19156 19158 19160 19162 19163 19165 19167 19169 19171 19173 19175 19177 19180 19182 19184 19186 19188 19190 19192 19194 19196 19198 19201 19203 19205 19207 19209 19212 19214 19216 19218 19220 19223 19225 19227 19230 19232 19234 19237 19239 19241 19244 19246 19248 19251 19253 19256 19258
960 19258 19260 19263 19265 19268 19270 19273 19275 19278 19280 19283 19285 19288 19290 19293 19296 19298 19301 19304 19306 19309 19311 19314 19317 19319 19322 19325 19328 19330 19333 19336 19339 19341 19344 19347 19350 19353 19355 19358 19361 19364 19367 19370 19373 19376 19378 19381 19384 19387 19390 19393 19396 19399 19402 19405 19408 19411 19414 19417 19421 19424 19427 19430 19433 19436 19439 19442 19446 19449
951 19449 19452 19455 19458 19462 19465 19468 19471 19475 19478 19481 19485 19488 19491 19495 19498 19501 19505 19508 19511 19515 19518 19522 19525 19529 19532 19535 19539 19542 19546 19550 19553 19557 19560 19564 19567 19571 19575 19578 19582 19585 19589 19593 19596 19600 19604 19607 19611 19615 19619 19622 19626 19630 19634 19638 19641 19645 19649 19653 19657 19661 19665 19668 19672 19676 19680 19684 19688 19692
942 19692 19696 19700 19704 19708 19712 19716 19720 19724 19728 19732 19736 19741 19745 19749 19753 19757 19761 19766 19770 19774 19778 19782 19787 19791 19795 19799 19804 19808 19812 19817 19821 19825 19830 19834 19838 19843 19847 19852 19856 19861 19865 19870 19874 19879 19883 19888 19892 19897 19901 19906 19910 19915 19920 19924 19929 19934 19938 19943 19948 19952 19957 19962 19966 19971 19976 19981 19985 19990
932A9990NNNNMNNNNNNNNNNNNNNNNNNNNNONNNNNONNNONNONNONNONONNONONONONONOONOONOO
923B0347NOONOOONOOOOONOOOOOOOOOOOOOOOOOOOPOOOOPOOOOPOOPOOPOOPOPOPOPOPOPOPOPP
914B0765OPPOPPOPPPOPPPPPOPPPPPPPPPPPPPPPPPPQPPPPQPPPQPPQPPQPPQPQPQPQPQPQPQQP
904B1249QQPQQPQQQPQQQQQQPQQQQQQQQQQQRQQQQQQRQQQRQQQRQRQQRQRQRQRQRQRQRRQRRQRR
895B1806RQRRRRRQRRRRRRRRRRRRRRJ0RRRRRJ0RRJ0RRRJ0RJ0RRJ0RJ0RJ0RJ0J0RJ0RJ0J0RJ0
887B2313J0J0RJ0J0J0J0RJ0J0J0J0J0J0J0J0J0J0J0J0J0J0J0J1J0J0J0J0J1J0J0J0J1J0J0
883B2664J1J0J1J0J1J0J1J0J1J0J1J0J1J1J0J1J1J0J1J1J0J1J1J1J1J1J1J0J1J1J1J1J1J1
878B3028J1J1J2J1J1J1J1J1J1J2J1J1J2J1J1J2J1J1J2J1J2J1J2J1J2J1J2J1J2J2J1J2J2J2
$$ plain form
932 19990 19995 20000 20005 20010 20014 20019 20024 20029 20034 20039 20044 20049 20054 20059 20064 20069 20074 20079 20084 20089 20094 20099 20104 20109 20114 20119 20125 20130 20135 20140 20145 20150 20156 20161 20166 20171 20177 20182 20187 20193 20198 20203 20209 20214 20219 20225 20230 20236 20241 20246 20252 20257 20263 20268 20274 20279 20285 20290 20296 20301 20307 20313 20318 20324 20330 20335 20341 20347
923 20347 20352 20358 20364 20369 20375 20381 20387 20392 20398 20404 20410 20416 20422 20427 20433 20439 20445 20451 20457 20463 20469 20475 20481 20487 20493 20499 20505 20511 20517 20523 20529 20535 20541 20548 20554 20560 20566 20572 20579 20585 20591 20597 20603 20610 20616 20622 20629 20635 20641 20648 20654 20660 20667 20673 20680 20686 20693 20699 20706 20712 20719 20725 20732 20738 20745 20751 20758 20765
914 20765 20771 20778 20785 20791 20798 20805 20811 20818 20825 20832 20838 20845 20852 20859 20866 20873 20879 20886 20893 20900 20907 20914 20921 20928 20935 20942 20949 20956 20963 20970 20977 20984 20991 20998 21005 21013 21020 21027 21034 21041 21049 21056 21063 21070 21078 21085 21092 21100 21107 21114 21122 21129 21136 21144 21151 21159 21166 21174 21181 21189 21196 21204 21211 21219 21226 21234 21242 21249
904 21249 21257 21265 21272 21280 21288 21295 21303 21311 21319 21326 21334 21342 21350 21358 21366 21374 21381 21389 21397 21405 21413 21421 21429 21437 21445 21453 21461 21469 21478 21486 21494 21502 21510 21518 21526 21535 21543 21551 21559 21568 21576 21584 21592 21601 21609 21618 21626 21634 21643 21651 21660 21668 21677 21685 21694 21702 21711 21719 21728 21736 21745 21754 21762 21771 21780 21788 21797 21806
895 21806 21815 21823 21832 21841 21850 21859 21868 21876 21885 21894 21903 21912 21921 21930 21939 21948 21957 21966 21975 21984 21993 22002 22012 22021 22030 22039 22048 22057 22067 22076 22085 22095 22104 22113 22122 22132 22141 22151 22160 22169 22179 22188 22198 22207 22217 22226 22236 22246 22255 22265 22274 22284 22294 22303 22313
887 22313 22323 22333 22342 22352 22362 22372 22382 22391 22401 22411 22421 22431 22441 22451 22461 22471 22481 22491 22501 22511 22521 22531 22541 22552 22562 22572 22582 22592 22603 22613 22623 22633 22644 22654 22664
883 22664 22675 22685 22696 22706 22717 22727 22738 22748 22759 22769 22780 22790 22801 22812 22822 22833 22844 22854 22865 22876 22886 22897 22908 22919 22930 22941 22952 22962 22973 22984 22995 23006 23017 23028
878 23028 23039 23050 23062 23073 23084 23095 23106 23117 23128 23140 23151 23162 23174 23185 23196 23208 23219 23230 23242 23253 23265 23276 23288 23299 23311 23322 23334 23345 23357 23369 23380 23392 23404 23416
873B3416J1J2J2J2J2J1J2J2J2J2J2J2J2J2J2J2J2J2J3J2J2J2J2J3J2J2J3J2J2J3J2J2J3J2
869B3827J3J2J3J3J2J3J2J3J3J2J3J3J3J3J2J3J3J3J3J3J3J3J3J3J3J3J3J3J3J3J4J3J3J3
864B4265J4J3J3J4J3J3J4J3J4J3J4J3J4J4J3J4J4J3J4J4J3J4J4J4J4J4J4J4J4J4J4J4J4J4
859B4731J4J4J4J4J5J4J4J4J5J4J5J4J4J5J4J5J4J5J4J5J5J4J5J5J5J4J5J5J5J5J5J4J5J5
855B5225J5J5J5J6J5J5J5J5J5J6J5J5J6J5J5J6J5J6J5J6J5J6J5J6J6J5J6J6J6J5J6J6J6J6
850B5751J6J6J6J6J6J6J6J6J6J7J6J6J6J7J6J7J6J6J7J6J7J6J7J7J6J7J7J6J7J7J7J7J7J6
845B6309J7J7J7J7J7J8J7J7J7J7J7J8J7J7J8J7J8J7J8J7J8J7J8J8J7J8J8J8J7J8J8J8J8J8
841B6903J8J8J8J8J8J8J9J8J8J8J9J8J9J8J9J8J9J8J9J8J9J9J8J9J9J9J9J9J9J9J9J9J9J9
$$ plain form
873 23416 23427 23439 23451 23463 23475 23486 23498 23510 23522 23534 23546 23558 23570 23582 23594 23606 23618 23630 23643 23655 23667 23679 23691 23704 23716 23728 23741 23753 23765 23778 23790 23802 23815 23827
869 23827 23840 23852 23865 23878 23890 23903 23915 23928 23941 23953 23966 23979 23992 24005 24017 24030 24043 24056 24069 24082 24095 24108 24121 24134 24147 24160 24173 24186 24199 24212 24226 24239 24252 24265
864 24265 24279 24292 24305 24319 24332 24345 24359 24372 24386 24399 24413 24426 24440 24454 24467 24481 24495 24508 24522 24536 24549 24563 24577 24591 24605 24619 24633 24647 24661 24675 24689 24703 24717 24731
859 24731 24745 24759 24773 24787 24802 24816 24830 24844 24859 24873 24888 24902 24916 24931 24945 24960 24974 24989 25003 25018 25033 25047 25062 25077 25092 25106 25121 25136 25151 25166 25181 25195 25210 25225
855 25225 25240 25255 25270 25286 25301 25316 25331 25346 25361 25377 25392 25407 25423 25438 25453 25469 25484 25500 25515 25531 25546 25562 25577 25593 25609 25624 25640 25656 25672 25687 25703 25719 25735 25751
850 25751 25767 25783 25799 25815 25831 25847 25863 25879 25895 25912 25928 25944 25960 25977 25993 26010 26026 26042 26059 26075 26092 26108 26125 26142 26158 26175 26192 26208 26225 26242 26259 26276 26293 26309
845 26309 26326 26343 26360 26377 26394 26412 26429 26446 26463 26480 26497 26515 26532 26549 26567 26584 26602 26619 26637 26654 26672 26689 26707 26725 26742 26760 26778 26796 26813 26831 26849 26867 26885 26903
841 26903 26921 26939 26957 26975 26993 27011 27030 27048 27066 27084 27103 27121 27140 27158 27177 27195 27214 27232 27251 27269 27288 27307 27325 27344 27363 27382 27401 27420 27439 27458 27477 27496 27515 27534
836B7534J9J9J9K0J9J9K0J9J9K0J9K0J9K0K0J9K0K0K0J9K0K0K0K0K0K0K0K0K0K1K0K0K0K1
831B8205K0K0K1K0K1K0K1K1K0K1K1K0K1K1K1K1K1K1K1K1K1K1K2K1K1K1K2K1K2K1K2K1K2K1
827B8918K2K2K1K2K2K2K2K2K2K2K2K2K2K2K3K2K2K2K3K2K3K2K3K2K3K3K3K2K3K3K3K3K3K3
822B9678K3K3K3K3K4K3K3K4K3K3K4K3K4K4K3K4K4K4K3K4K4K4K4K4K5K4K4K4K4K5K4K5K4K5
817C0487K4K5K5K4K5K5K5K5K4K5K6K5K5K5K5K5K6K5K6K5K6K5K6K5K6K6K6K5K6K6K6K6K6K7
813C1349K6K6K6K7K6K7K6K7K6K7K7K6K7K7K7K7K7K7K7K7K7K8K7K7K8K7K8K7K8K8K7K8K8K8
808C2268K8K8K8K8K8K8K9K8K8K9K8K9K8K9K9K9K8K9K9K9K9K9K9L0K9K9L0K9L0K9L0K9L0L0
803C3249L0L0L0L0L0L0L0L0L1L0L1L0L1L0L1L1L0L1L1L1L1L1L1L2L1L1L2L1L2L1L2L2L1L2
$$ plain form
836 27534 27553 27572 27591 27611 27630 27649 27669 27688 27707 27727 27746 27766 27785 27805 27825 27844 27864 27884 27904 27923 27943 27963 27983 28003 28023 28043 28063 28083 28103 28124 28144 28164 28184 28205
831 28205 28225 28245 28266 28286 28307 28327 28348 28369 28389 28410 28431 28451 28472 28493 28514 28535 28556 28577 28598 28619 28640 28661 28683 28704 28725 28746 28768 28789 28811 28832 28854 28875 28897 28918
827 28918 28940 28962 28983 29005 29027 29049 29071 29093 29115 29137 29159 29181 29203 29225 29248 29270 29292 29314 29337 29359 29382 29404 29427 29449 29472 29495 29518 29540 29563 29586 29609 29632 29655 29678
822 29678 29701 29724 29747 29770 29794 29817 29840 29864 29887 29910 29934 29957 29981 30005 30028 30052 30076 30100 30123 30147 30171 30195 30219 30243 30268 30292 30316 30340 30364 30389 30413 30438 30462 30487
817 30487 30511 30536 30561 30585 30610 30635 30660 30685 30709 30734 30760 30785 30810 30835 30860 30885 30911 30936 30962 30987 31013 31038 31064 31089 31115 31141 31167 31192 31218 31244 31270 31296 31322 31349
813 31349 31375 31401 31427 31454 31480 31507 31533 31560 31586 31613 31640 31666 31693 31720 31747 31774 31801 31828 31855 31882 31909 31937 31964 31991 32019 32046 32074 32101 32129 32157 32184 32212 32240 32268
808 32268 32296 32324 32352 32380 32408 32436 32465 32493 32521 32550 32578 32607 32635 32664 32693 32722 32750 32779 32808 32837 32866 32895 32924 32954 32983 33012 33042 33071 33101 33130 33160 33189 33219 33249
803 33249 33279 33309 33339 33369 33399 33429 33459 33489 33520 33550 33581 33611 33642 33672 33703 33734 33764 33795 33826 33857 33888 33919 33950 33982 34013 34044 34076 34107 34139 34170 34202 34234 34265 34297
799C4297L2L2L2L2L2L3L2L2L3L2L3L2L3L3L3L2L3L3L3L4L3L3L3L4L3L4L3L4L4L3L4L4L4L4
794C5418L5L4L4L4L5L4L5L4L5L5L5L5L5L5L5L5L5L6L5L5L6L6L5L6L6L6L6L6L6L6L6L7L6L7
789C6619L6L7L7L6L7L7L7L7L8L7L7L8L7L8L7L8L8L8L8L8L8L8L8L9L8L9L8L9L9L8L9L9L9M0
785C7906L9L9L9M0M0L9M0M0M0M0M0M0M0M0M1M0M1M0M1M1M1M1M1M1M2M1M1M2M1M2M2M2M2M2
780C9287M2M2M3M2M2M3M3M3M2M3M3M4M3M3M4M3M4M3M4M4M4M4M4M5M4M4M5M5M4M5M5M5M5M6
775D0772M5M5M6M6M5M6M6M6M6M7M6M6M7M7M6M7M7M7M7M8M7M7M8M8M8M7M8M9M8M8M8M9M9M8
771D2370M9M9M9M9N0M9N0M9N0N0N0N0N0N0N1N0N1N1N1N1N1N1N1N2N1N2N2N2N2N2N2N2N3N2
766D4094N3N3N3N3N3N4N3N4N3N4N4N4N5N4N4N5N5N4N5N5N6N5N5N6N6N6N6N6N6N6N7N6N7N7
$$ plain form
799 34297 34329 34361 34393 34425 34457 34490 34522 34554 34587 34619 34652 34684 34717 34750 34783 34815 34848 34881 34914 34948 34981 35014 35047 35081 35114 35148 35181 35215 35249 35282 35316 35350 35384 35418
794 35418 35453 35487 35521 35555 35590 35624 35659 35693 35728 35763 35798 35833 35868 35903 35938 35973 36008 36044 36079 36114 36150 36186 36221 36257 36293 36329 36365 36401 36437 36473 36509 36546 36582 36619
789 36619 36655 36692 36729 36765 36802 36839 36876 36913 36951 36988 37025 37063 37100 37138 37175 37213 37251 37289 37327 37365 37403 37441 37479 37518 37556 37595 37633 37672 37711 37749 37788 37827 37866 37906
785 37906 37945 37984 38023 38063 38103 38142 38182 38222 38262 38302 38342 38382 38422 38462 38503 38543 38584 38624 38665 38706 38747 38788 38829 38870 38912 38953 38994 39036 39077 39119 39161 39203 39245 39287
780 39287 39329 39371 39414 39456 39498 39541 39584 39627 39669 39712 39755 39799 39842 39885 39929 39972 40016 40059 40103 40147 40191 40235 40279 40324 40368 40412 40457 40502 40546 40591 40636 40681 40726 40772
775 40772 40817 40862 40908 40954 40999 41045 41091 41137 41183 41230 41276 41322 41369 41416 41462 41509 41556 41603 41650 41698 41745 41792 41840 41888 41936 41983 42031 42080 42128 42176 42224 42273 42322 42370
771 42370 42419 42468 42517 42566 42616 42665 42715 42764 42814 42864 42914 42964 43014 43064 43115 43165 43216 43267 43318 43369 43420 43471 43522 43574 43625 43677 43729 43781 43833 43885 43937 43989 44042 44094
766 44094 44147 44200 44253 44306 44359 44413 44466 44520 44573 44627 44681 44735 44790 44844 44898 44953 45008 45062 45117 45172 45228 45283 45338 45394 45450 45506 45562 45618 45674 45730 45787 45843 45900 45957
761D5957N7N7N8N7N8N7N8N8N8N8N9N8N9N9N9N9N9N9O0O0N9O0O0O0O1O0O1O1O1O1O1O1O2O1
757D7973O2O2O2O2O3O2O3O3O3O3O3O4O3O4O4O4O4O5O4O5O5O5O5O5O6O6O5O6O6O7O6O7O7O6
752E0160O8O7O7O8O8O8O8O8O8O9O9O9O9O9P0O9P0P0P0P1P0P1P1P1P1P1P2P2P2P2P2P3P2P3
747E2538P3P3P4P3P4P4P4P5P4P5P5P5P5P6P6P5P6P7P6P7P7P7P7P8P7P8P8P8P9P9P8P9Q0P9
743E5129Q0Q0Q0Q0Q1Q1Q1Q1Q1Q2Q2Q2Q2Q2Q3Q3Q3Q3Q4Q4Q4Q4Q4Q5Q5Q5Q5Q6Q6Q6Q6Q7Q6Q7
738E7960Q7Q8Q8Q8Q8Q8Q9Q9Q9Q9R0Q9R0R1R0R1R1R2R1R2R2R2R3R3R3R3R4R4R4R4R5R5R5R5
733F1062R6R6R6R6R7R7R8R7R8R8R9R8R9R9J00J00J00J00J01J01J01J01J02J02J03J02J03J03
729F3845J04J04J04J04J05J05J05J06J06J06J07J07J07J07J08J08J08J09J09J10J09J10J11
$$ plain form
761 45957 46014 46071 46129 46186 46244 46301 46359 46417 46475 46533 46592 46650 46709 46768 46827 46886 46945 47004 47064 47124 47183 47243 47303 47363 47424 47484 47545 47606 47667 47728 47789 47850 47912 47973
757 47973 48035 48097 48159 48221 48284 48346 48409 48472 48535 48598 48661 48725 48788 48852 48916 48980 49044 49109 49173 49238 49303 49368 49433 49498 49564 49630 49695 49761 49827 49894 49960 50027 50094 50160
752 50160 50228 50295 50362 50430 50498 50566 50634 50702 50770 50839 50908 50977 51046 51115 51185 51254 51324 51394 51464 51535 51605 51676 51747 51818 51889 51960 52032 52104 52176 52248 52320 52393 52465 52538
747 52538 52611 52684 52758 52831 52905 52979 53053 53128 53202 53277 53352 53427 53502 53578 53654 53729 53805 53882 53958 54035 54112 54189 54266 54344 54421 54499 54577 54655 54734 54813 54891 54970 55050 55129
743 55129 55209 55289 55369 55449 55530 55611 55692 55773 55854 55936 56018 56100 56182 56264 56347 56430 56513 56596 56680 56764 56848 56932 57016 57101 57186 57271 57356 57442 57528 57614 57700 57787 57873 57960
738 57960 58047 58135 58223 58311 58399 58487 58576 58665 58754 58843 58933 59022 59112 59203 59293 59384 59475 59567 59658 59750 59842 59934 60027 60120 60213 60306 60400 60494 60588 60682 60777 60872 60967 61062
733 61062 61158 61254 61350 61446 61543 61640 61738 61835 61933 62031 62130 62228 62327 62426 62526 62626 62726 62826 62927 63028 63129 63230 63332 63434 63537 63639 63742 63845
729 63845 63949 64053 64157 64261 64366 64471 64576 64682 64788 64894 65001 65108 65215 65322 65430 65538 65646 65755 65864 65974 66083 66193 66304
726F6304J10J11J12J11J12J12J13J13J13J14J14J14J15J15J15J16J16J16J17J17J17J18J18
723F8933J18J19J19J20J20J20J20J21J22J21J22J23J23J23J23J24J25J24J25J26J26J26J27
720G1750J27J27J28J28J28J29J30J30J30J30J31J32J32J32J32J33J34J34J34J35J35J35J36
717G4772J37J37J37J38J38J39J39J39J40J40J41J41J42J42J43J43J44J44J44J45J46J45J47
714G8023J47J47J48J48J49J49J50J50J51J51J52J52J53J53J53J55J54J56J55J57J56J58J58
710H1525J58J59J59J60J61J61J61J63J62J63J64J65J64J66J66J66J68J67J69J68J70J70J70
707H5305J72J71J73J73J73J74J75J75J76J77J77J78J78J79J80J80J81J82J82J83J84J84J84
704H9396J86J86J87J87J88J89J90J90J90J92J92J93J94J94J95J95J97J97J98J98J99K00K01
$$ plain form
726 66304 66414 66525 66637 66748 66860 66972 67085 67198 67311 67425 67539 67653 67768 67883 67998 68114 68230 68346 68463 68580 68697 68815 68933
723 68933 69051 69170 69289 69409 69529 69649 69769 69890 70012 70133 70255 70378 70501 70624 70747 70871 70996 71120 71245 71371 71497 71623 71750
720 71750 71877 72004 72132 72260 72388 72517 72647 72777 72907 73037 73168 73300 73432 73564 73696 73829 73963 74097 74231 74366 74501 74636 74772
717 74772 74909 75046 75183 75321 75459 75598 75737 75876 76016 76156 76297 76438 76580 76722 76865 77008 77152 77296 77440 77585 77731 77876 78023
714 78023 78170 78317 78465 78613 78762 78911 79061 79211 79362 79513 79665 79817 79970 80123 80276 80431 80585 80741 80896 81053 81209 81367 81525
710 81525 81683 81842 82001 82161 82322 82483 82644 82807 82969 83132 83296 83461 83625 83791 83957 84123 84291 84458 84627 84795 84965 85135 85305
707 85305 85477 85648 85821 85994 86167 86341 86516 86691 86867 87044 87221 87399 87577 87756 87936 88116 88297 88479 88661 88844 89028 89212 89396
704 89396 89582 89768 89955 90142 90330 90519 90709 90899 91089 91281 91473 91666 91860 92054 92249 92444 92641 92838 93036 93234 93433 93633 93834
701I3834K01K03K02K04K05K05K06K06K08K08K09K09K11K11K12K13K14K14K16K16K17K17K19
698I8660K19K20K21K22K23K23K25K25K26K27K28K28K30K30K32K32K33K34K35K36K37K37K39
695A03922K40K40K41K43K43K44K46K46K47K48K49K50K51K53K53K54K55K56K57K58K60K60K61
691A09677K63K63K65K65K67K68K69K70K71K72K73K74K76K77K77K79K80K82K82K84K85K86K87
688A15992K88K90K91K92K93K94K96K97K98L00L01L02L03L05L06L07L09L10L11L13L13L16L16
685A22943L19L19L21L22L24L25L26L28L30L31L32L34L35L37L38L40L41L43L44L46L48L49L50
682A30625L52L54L55L58L58L60L62L64L65L67L69L70L72L74L75L77L79L81L83L84L86L88L90
679A39148L91L94L95L97L99M01M03M05M06M09M11M12M15M16M19M21M22M25M27M29M31M33M35
$$ plain form
701 93834 94035 94238 94440 94644 94849 95054 95260 95466 95674 95882 96091 96300 96511 96722 96934 97147 97361 97575 97791 98007 98224 98441 98660
698 98660 98879 99099 99320 99542 99765 99988 100213 100438 100664 100891 101119 101347 101577 101807 102039 102271 102504 102738 102973 103209 103446 103683 103922
695 103922 104162 104402 104643 104886 105129 105373 105619 105865 106112 106360 106609 106859 107110 107363 107616 107870 108125 108381 108638 108896 109156 109416 109677
691 109677 109940 110203 110468 110733 111000 111268 111537 111807 112078 112350 112623 112897 113173 113450 113727 114006 114286 114568 114850 115134 115419 115705 115992
688 115992 116280 116570 116861 117153 117446 117740 118036 118333 118631 118931 119232 119534 119837 120142 120448 120755 121064 121374 121685 121998 122311 122627 122943
685 122943 123262 123581 123902 124224 124548 124873 125199 125527 125857 126188 126520 126854 127189 127526 127864 128204 128545 128888 129232 129578 129926 130275 130625
682 130625 130977 131331 131686 132044 132402 132762 133124 133488 133853 134220 134589 134959 135331 135705 136080 136457 136836 137217 137600 137984 138370 138758 139148
679 139148 139539 139933 140328 140725 141124 141525 141928 142333 142739 143148 143559 143971 144386 144802 145221 145642 146064 146489 146916 147345 147776 148209 148644
676A48644M38M39M42M44M46M48M51M52M55M58M59M62M65M66M69M72M73M76M79M81M83M86M89
672A59277M91M93M96M99N01N04N07N09N12N14N17N20N23N25N28N31N34N37N39N43N45N48N51
669A71244N55N57N60N63N67N69N73N75N79N82N86N88N92N95N98O02O05O08O12O16O18O23O26
666A84793O29O33O36O41O44O47O51O56O58O63O67O70O74O79O82O86O91O94O99P02P07P11P16
663B00229P19P24P28P33P37P42P46P51P55P60P64P70P74P78P84P89P93P98Q04Q08Q14Q18Q24
660B17942Q29Q35Q39Q45Q51Q56Q61Q67Q73Q78Q84Q90Q95R02R07R14R19R26R31R38R44R51R57
657B38434R63R70R77R83R89R97J003J011J017J024J032J038J046J053J061J068J075J083J091
654B57915J099J106J114J123J130J139J147J155J163J172J181J189J198J207J216J225J234
$$ plain form
676 148644 149082 149521 149963 150407 150853 151301 151752 152204 152659 153117 153576 154038 154503 154969 155438 155910 156383 156859 157338 157819 158302 158788 159277
672 159277 159768 160261 160757 161256 161757 162261 162768 163277 163789 164303 164820 165340 165863 166388 166916 167447 167981 168518 169057 169600 170145 170693 171244
669 171244 171799 172356 172916 173479 174046 174615 175188 175763 176342 176924 177510 178098 178690 179285 179883 180485 181090 181698 182310 182926 183544 184167 184793
666 184793 185422 186055 186691 187332 187976 188623 189274 189930 190588 191251 191918 192588 193262 193941 194623 195309 196000 196694 197393 198095 198802 199513 200229
663 200229 200948 201672 202400 203133 203870 204612 205358 206109 206864 207624 208388 209158 209932 210710 211494 212283 213076 213874 214678 215486 216300 217118 217942
660 217942 218771 219606 220445 221290 222141 222997 223858 224725 225598 226476 227360 228250 229145 230047 230954 231868 232787 233713 234644 235582 236526 237477 238434
657 238434 239397 240367 241344 242327 243316 244313 245316 246327 247344 248368 249400 250438 251484 252537 253598 254666 255741 256824 257915
654 257915 259014 260120 261234 262357 263487 264626 265773 266928 268091 269263 270444 271633 272831 274038 275254 276479 277713
652B77713J244J252J263J271J281J292J300J311J321J331J342J352J362J373J384J394J406
649C00192J416J428J439J451J463J474J486J498J510J523J535J547J560J574J586J599J613
647C25894J627J640J653J668J682J697J711J725J741J755J771J787J801J818J834J850J867
645C55521J883J900J917J934J952J970J988K006K024K043K062K082K100K121K140K161K182
642C89986K202K223K245K267K288K311K334K356K380K403K428K452K476K502K527K553K578
640D30511K606K633K659K688K716K745K773K803K834K864K894K926K959K990L024L057L091
638D78773L126L162L197L233L271L308L347L385L425L466L507L548L591L634L679L723L769
635E37144L816L863L911L961M011M062M114M167M222M277M333M391M449M510M571M633M697
$$ plain form
652 277713 278957 280209 281472 282743 284024 285316 286616 287927 289248 290579 291921 293273 294635 296008 297392 298786 300192
649 300192 301608 303036 304475 305926 307389 308863 310349 311847 313357 314880 316415 317962 319522 321096 322682 324281 325894
647 325894 327521 329161 330814 332482 334164 335861 337572 339297 341038 342793 344564 346351 348152 349970 351804 353654 355521
645 355521 357404 359304 361221 363155 365107 367077 369065 371071 373095 375138 377200 379282 381382 383503 385643 387804 389986
642 389986 392188 394411 396656 398923 401211 403522 405856 408212 410592 412995 415423 417875 420351 422853 425380 427933 430511
640 430511 433117 435750 438409 441097 443813 446558 449331 452134 454968 457832 460726 463652 466611 469601 472625 475682 478773
638 478773 481899 485061 488258 491491 494762 498070 501417 504802 508227 511693 515200 518748 522339 525973 529652 533375 537144
635 537144 540960 544823 548734 552695 556706 560768 564882 569049 573271 577548 581881 586272 590721 595231 599802 604435 609132
633F09132M762M828M897M966N037N110N184N260N338N417N499N582N668N755N845N936O031
631G00247O128O227O328O434O540O651O764O881P001P124P251P383P517P656P800P949Q101
628H19982Q259Q423Q592Q767Q948R137R332R534R746R964J0192J0430J0678J0937J1208J1491
626I75620J1787J2100J2426J2770J3133J3516J3921J4349J4803J5287J5801J6351J6939J7570
624A176373J8248J8979J9771K0629K1564K2584K3704K4935K6298K7810K9497L1388L3521L5940
622A531241L8698M1867M5532M9804N4823O0775O7898P6515Q7056J00115J16515J37425J64540
621B572804K00366K48710L15506M10277N48737P57450J081543J593647K381904L415533M144038
619A7670515L513330J334096j436010l533719m050252l268092k241325j472368r74383o58389
$$ plain form
633 609132 613894 618722 623619 628585 633622 638732 643916 649176 654514 659931 665430 671012 676680 682435 688280 694216 700247
631 700247 706375 712602 718930 725364 731904 738555 745319 752200 759201 766325 773576 780959 788476 796132 803932 811881 819982
628 819982 828241 836664 845256 854023 862971 872108 881440 890974 900720 910684 920876 931306 941984 952921 964129 975620
626 975620 987407 999507 1011933 1024703 1037836 1051352 1065273 1079622 1094425 1109712 1125513 1141864 1158803 1176373
624 1176373 1194621 1213600 1233371 1254000 1275564 1298148 1321852 1346787 1373085 1400895 1430392 1461780 1495301 1531241
622 1531241 1569939 1611806 1657338 1707142 1761965 1822740 1890638 1967153 2054209 2154324 2270839 2408264 2572804
621 2572804 2773170 3021880 3337386 3747663 4296400 5053850 6135393 7729040 10110944 13526477 17670515
619 17670515 21183845 22517941 21081931 17548212 13497960 10229868 7988543 6516175 5541792 4883403
618D883403m53707l16736k21814j53726j03222o4500l3812q656J2688L1451M8540O4661Q0386
616C764956R6217J12615J30042J48984J69994J93711K20922K52609K90037L34864L89313M56419
614F560683N40414O47320P85920R69341J217775J563237K058159K791145L915278N692104
613B6741376Q514333J2643686J6871968J7049963J0696213J124182o334339o849197l89229
612H0068956O110708M487591o548184j5964646j6667028j2709309q660223n801559l950091
610B0366215k751543j955365j408731j020406p35102n18441l48373k10317r4310O703R7913
609A1428243J83324K66196L49363M35468N27157O27283P39086Q66454J014230J188665J398070
607A9023539J653825J972008K376110K901871L606252M585234O010998Q211772J1831399J7985271
$$ plain form
618 4883403 4429696 4112960 3891146 3737420 3634198 3569698 3535886 3527230 3539918 3571369 3619909 3684570 3764956
616 3764956 3861173 3973788 4103830 4252814 4422808 4616519 4837441 5090050 5380087 5714951 6104264 6560683
614 6560683 7101097 7748417 8534337 9503678 10721453 12284690 14342849 17133994 21049272 26741376
613 26741376 35255709 47899395 64771363 81821326 92517539 93641721 87307382 80458185 80068956
612 80068956 86179664 90667255 84119071 68154425 51487397 38778088 30117865 24316306 20366215
610 20366215 17614672 15659307 14250576 13230170 12495068 11976627 11628254 11417937 11323627 11330330 11428243
609 11428243 11611567 11877763 12227126 12662594 13189751 13817034 14556120 15422574 16436804 17625469 19023539
607 19023539 20677364 22649372 25025482 27927353 31533605 36118839 42129837 50341609 62173008 80158279
606H0158279K7171703L3524182K8553420K2174158J7075961J7578169K7016962L0165705J9582608
605C03001147j590483k3758502l7339486l8603479k9953429k2430660k1842589k2045092k2976827
603H2460600j6884938j0956519p493841n436344m090745l139943k430338j878781j435587
602B8713564j068654p55990m81699k33757k608K19790M40592O66632R04856J162797J449049
601C1014572J773919K150164K594084L126991L777331M583808N599943O901006Q594265J0834312
599H0950395J3844569J7943642K3562126L1192222M1095547N2424977O1755547O3018644N1357521
598D37145190K7420447j232543k3246395l0684585k0539413k996467j6185718n6874805o6593956
597B46211755n0339370l6952137k8254013k1664952j6585462j2758536r902504p761733o137271
$$ plain form
606 80158279 107329982 140854164 169407584 191581742 208657703 226235872 253252834 283418539 303001147
605 303001147 301410664 277652162 240312676 201709197 171755768 149325108 127482519 105437427 82460600
603 82460600 65575662 54619143 47125302 41688958 37598213 34458270 32027932 30149151 28713564
602 28713564 27644910 26888920 26407221 26173464 26170856 26390646 26831238 27497870 28402726 29565523 31014572
601 31014572 32788491 34938655 37532739 40659730 44437061 49020869 54620812 61521818 70116083 80950395
599 80950395 94794964 112738606 136300732 167492954 208588501 261013478 322769025 385787669 437145190
598 437145190 464565637 463333094 440086699 409402114 388862701 385866234 369680516 312805711 246211755
597 246211755 195872385 158920248 130666235 109001283 92415821 79657285 69754781 61993048 55855777
596E5855777m884472l900523l112594k468563j930598j470649j067400p04132l67215m4979
594C5904652K73164N97465R38539J308148J720050K191175K743140L404528M214088N225664
593E8520613O515674Q194522J0423892J3441632J7592102K3344148L1223299M1413407N2256055
592B62925344N6710826M4151915K0764725J0903758K0376703L3683518L2667968O822964l3108134
590D55899587o1879135o8343013o0696944m9288549l8721751l0100436k3394138j8279817
589A05195804j4400815j1449974r187353p433713o057691m963538m081286l359403k759532
588D1502499k252726j816806j434419j091661p77072m80834j94153R1246L83626O91674J025033
587C5646407J394885J814652K300936K874663L562652M399550N430283O712922Q321452J0347662
$$ plain form
596 55855777 50971305 47070782 43958188 41489625 39559027 38088378 37020978 36316846 35949631 35904652
594 35904652 36177816 36775281 37713820 39021968 40742018 42933193 45676333 49080861 53294949 58520613
593 58520613 65036287 73230809 83654701 97096333 114688435 138032583 169255882 210669289 262925344
592 262925344 319636170 363788085 384552810 395456568 415833271 449516789 482184757 489007721 455899587
590 455899587 394020452 325677439 264980495 215691946 176970195 146869759 123475621 105195804
589 105195804 90794989 79345015 70157662 62723949 56666258 51702720 47621434 44262031 41502499
588 41502499 39249773 37432967 35998548 34906887 34129815 33648981 33454828 33546074 33929700 34621374 35646407
587 35646407 37041292 38855944 41156880 44031543 47594195 51993745 57424028 64136950 72458402 82806064
585H2806064J2899985J6097716K0061844K4907761L0676430L6771561M0194186L4609468J6056204
584C15081219q389291k4289784k4439668j6398057j5719307k1190410k5350965l2599140l2709368
583A13995229k4472669j6740440j1742938q648856o644121n267708m274437l529147k952811
581B9722102k496384k127798j825124j572816j359501j176607j017518q76963p50613o34783
580A5883995n26172m21654l18064k11961r9331K4837J67133L36680N46644Q16754J177667
579A7376528J678672K401440L483712N152424P723210J1317997J4735185J4743850R803662
577H8416680L281992J163801N920806J1432531Q489098j573886j3298241k2014537k2188682
576E9629562j6473746j0873331p117898m806309l374644k458318j849255j429685j131261
$$ plain form
585 82806064 95706049 111803765 131865609 156773370 187449800 224221361 264415547 299025015 315081219
584 315081219 306691928 282402144 257962476 241564419 225845112 204654702 179303737 146704597 113995229
583 113995229 89522560 72782120 61039182 52390326 45746205 40478497 36204060 32674913 29722102
581 29722102 27225718 25097920 23272796 21699980 20340479 19163872 18146354 17269391 16518778 15883995
580 15883995 15357823 14936169 14618105 14406144 14306813 14331650 14498783 14835463 15382107 16198861 17376528
579 17376528 19055200 21456640 24940352 30092776 37815986 49133983 63869168 78613018 88416680
577 88416680 91698672 92862473 98783279 110215810 118704908 117131022 103832781 81818244 59629562
576 59629562 43155816 32282485 25164587 20358278 16983634 14525316 12676061 11246376 10115115
575A0115115r12958p49278o23852n25857m47934l84966l33307k90308k54002k22901j95856
573E173896j71956j50454j30725j12210r4389p6745n8718l9677j8844M781L2541O6325J08865
572D532690J64258K38829L42674M92388P16024J061603J608574K463410L635970M583558M005820
570B3845798J318787k199128m429216m528438l427293k314039j542980j054867p46120n45726
569D376778m11461l18661k52662k04507j68561j41174j19926j03165q9747p8860o9914o2481
567B355659n6241n0950m6424m2521l9128l6158l3539l1216k9142k7283k5603k4082k2695k1427
565A869250k0262j9186j8191j7266j6404j5597j4841j4129j3458j2823j2221j1649j1104j0584
563A661535j0086r610r152q712q287p878p482p099o727o366o016n673n340n014m697m385m079
$$ plain form
575 10115115 9202157 8452879 7829027 7303170 6855236 6470270 6136963 5846655 5592653 5369752 5173896
573 5173896 5001940 4851486 4720761 4608551 4514162 4437417 4378699 4339022 4320178 4324959 4357500 4423825 4532690
572 4532690 4696948 4935777 5278451 5770839 6486863 7548466 9157040 11620450 15256420 19839978 23845798
570 23845798 25164585 22965457 18536241 14007803 10580510 8266471 6723491 5668624 4922504 4376778
569 4376778 3965317 3646656 3393994 3189487 3020926 2879752 2759826 2656661 2566914 2488054 2418140 2355659
567 2355659 2299418 2248468 2202044 2159523 2120395 2084237 2050698 2019482 1990340 1963057 1937454 1913372 1890677 1869250
565 1869250 1848988 1829802 1811611 1794345 1777941 1762344 1747503 1733374 1719916 1707093 1694872 1683223 1672119 1661535
563 1661535 1651449 1641839 1632687 1623975 1615688 1607810 1600328 1593229 1586502 1580136 1574120 1568447 1563107 1558093 1553396 1549011 1544932
561A544932l781l486l197k912k632k355k082j811j545j280j017p57m99k42J4K69N23P75J029
558A519946J280J534J786K039K292K547K802L059L317L576L837M100M365M633M903N175N452
556A576643N729O012O298O586O881P177P480P786Q098Q415Q737R065R399R739J0086J0439
554A704570J0801J1168J1545J1930J2322J2724J3136J3556J3988J4430J4883J5347J5824J6314
552A892538J6815J7332J7863J8408J8970J9547K0142K0754K1386K2036K2708K3400K4115K4853
550B180867K5615K6404K7219K8062K8935K9838L0774L1743L2750L3792L4874L5998L7165L8378
548B622414L9639M0951M2316M3737M5218M6762M8371N0051N1805N3636N5550N7552N9646O1840
546C319488O4138O6545O9072P1723P4508P7435Q0513Q3753Q7164R0761R4555R8558J02789
$$ plain form
561 1544932 1541151 1537665 1534468 1531556 1528924 1526569 1524487 1522676 1521131 1519851 1518834 1518077 1517578 1517336 1517350 1517619 1518142 1518917 1519946
558 1519946 1521226 1522760 1524546 1526585 1528877 1531424 1534226 1537285 1540602 1544178 1548015 1552115 1556480 1561113 1566016 1571191 1576643
556 1576643 1582372 1588384 1594682 1601268 1608149 1615326 1622806 1630592 1638690 1647105 1655842 1664907 1674306 1684045 1694131 1704570
554 1704570 1715371 1726539 1738084 1750014 1762336 1775060 1788196 1801752 1815740 1830170 1845053 1860400 1876224 1892538
552 1892538 1909353 1926685 1944548 1962956 1981926 2001473 2021615 2042369 2063755 2085791 2108499 2131899 2156014 2180867
550 2180867 2206482 2232886 2260105 2288167 2317102 2346940 2377714 2409457 2442207 2475999 2510873 2546871 2584036 2622414
548 2622414 2662053 2703004 2745320 2789057 2834275 2881037 2929408 2979459 3031264 3084900 3140450 3198002 3257648 3319488
546 3319488 3383626 3450171 3519243 3590966 3665474 3742909 3823422 3907175 3994339 4085100 4179655 4278213 4381002
544D381002J07261J11994J17007J22321J27958J33945J40309J47082J54295J61987J70196
543E875357J78970J88356J98410K09192K20771K33221K46626K61079K76687K93569L11852
541H494090L31692L53254L76733M02344M30336M60994M94642N31655N72463O17565O67544
540A3733312P23073P84946Q54094R31614J018815J117251J228781J355656J500598J666924
538B4915064J858710K080996K340060K643773L002120L427854L937435M552345N300924O221054
537F0280335P364044Q800396J0628530J2988212J6081498K0206263K5810280L3580286M4587649
536B40327493O0522505Q4036422J19098980J70708010K41157796L13964295L15297641J31134453
535A676247595j66055045l23630604l06173795k31190174j62929412j13720375q0419724n8076594
$$ plain form
544 4381002 4488263 4600257 4717264 4839585 4967543 5101488 5241797 5388879 5543174 5705161 5875357
543 5875357 6054327 6242683 6441093 6650285 6871056 7104277 7350903 7611982 7888669 8182238 8494090
541 8494090 8825782 9179036 9555769 9958113 10388449 10849443 11344085 11875740 12448203 13065768 13733312
540 13733312 14456385 15241331 16095425 17027039 18045854 19163105 20391886 21747542 23248140 24915064
538 24915064 26773774 28854770 31194830 33838603 36840723 40268577 44206012 48758357 54059281 60280335
537 60280335 67644379 76444775 87073305 100061517 116143015 136349278 162159558 195739844 240327493
536 240327493 300849998 384886420 503985400 674693410 915851206 1229815501 1545113142 1676247595
535 1676247595 1510192550 1186561946 880388151 649197977 486268565 372548190 292128466 234051872
534B34051872m2902202l2391409k4950928j9569933j5599311j2614660j0333006q561874p167805
532E9960744o056627n160720m430787l830371l332129k915331k564049k265937k011314j792537
531B5600942j603503j439313j295993j170310j059609r61693q74739p97225p27876o65607
530A5005074o09509n58799n12812m70976m32794l97841l65744l36179l08860k83541k59996
528A0468023k38032k17477j98173j79981j62778j46447j30888j16005j01709q7923p4571o1583
526H752456m8888l6430k4142j1967J56J2280K4467L6775M9261O1990P5023Q8429J02278J16646
524I198334J31615J47270J63710J81039J99369K18830K39565K61725K85494L11067L38666
523A1676684L68549M01005M36363M75001N17357N63932O15315O72181P35325Q05688Q84368
$$ plain form
534 234051872 191149670 158758261 133807333 114237400 98638089 86023429 75690423 67128549 59960744
532 59960744 53904117 48743397 44312610 40482239 37150110 34234779 31670730 29404793 27393479 25600942
531 25600942 23997439 22558126 21262133 20091823 19032214 18070521 17195782 16398557 15670681 15005074
530 15005074 14395565 13836766 13323954 12852978 12420184 12022343 11656599 11320420 11011560 10728019 10468023
528 10468023 10229991 10012514 9814341 9634360 9471582 9325135 9194247 9078242 8976533 8888610 8814039 8752456
526 8752456 8703568 8667138 8642996 8631029 8631185 8643465 8667932 8704707 8753968 8815958 8890981 8979410 9081688 9198334
524 9198334 9329949 9477219 9640929 9821968 10021337 10240167 10479732 10741457 11026951 11338018 11676684
523 11676684 12045233 12446238 12882601 13357602 13874959 14438891 15054206 15726387 16461712 17267400 18151768
521A8151768R72674J072161J184701J312541J458403J625613J818250K041353K301201K605676
520C4544341K964767L391224L901516M517128N266413O187256P330974Q768080J0597004J2957515
519A00426218J6051678K0177314K5782191L3552807M4560181O0493421Q4001982J19051069
518E04096861J70632407K41045340L13863293L15316168J31207665j66084928l23673137l06156961
517H80246708k31179117j62948338j13757329q0463277n8121343m2946216l2434116k4992377
515A33404595j9610337j5638917j2653693j0371661q600309p206173o095038n199280m469584
514D3559603l869474l371617k955264k604487k306937k052939j834830j646526j483112j340630
513B0093787j215834j106075j009160r23266q46872p78704p17684o62902o13579n69054n28758
$$ plain form
521 18151768 19124442 20196603 21381304 22693845 24152248 25777861 27596111 29637464 31938665 34544341
520 34544341 37509108 40900332 44801848 49318976 54585389 60772645 68103619 76871699 87468703 100426218
519 100426218 116477896 136655210 162437401 195990208 240550389 301043810 385045792 504096861
518 504096861 674729268 915774608 1229637901 1544954069 1676161734 1510076806 1186403669 880246708
517 880246708 649067591 486119253 372361924 291898647 233777304 190831088 158396972 133404595
515 133404595 113794258 98155341 85501648 75129987 66529678 59323505 53228467 48029187 43559603
514 43559603 39690129 36318512 33363248 30758761 28451824 26398885 24564055 22917529 21434417 20093787
513 20093787 18877953 17771878 16762718 15839452 14992580 14213876 13496192 12833290 12219711 11650657 11121899
511A1121899m92198m58955m28657m00988l75666l52450l31124l11500k93409k76707k61260
510G138985k46956k33687k21363k09901j99226j89272j79979j71292j63163j55549j48406
508E020191j41703j35402j29475j23895j18636j13676j08994j04569j00384r6426r2675q9121
507C665235q5750q2549p9510p6620p3873p1257o8767o6393o4130o1971n9911n7942n6060n4262
505B706240n2542n0894m9318m7806m6358m4969m3637m2357m1129l9949l8816l7724l6676l5667
503B098398l4695l3760l2858l1990l1153l0345k9566k8814k8088k7387k6710k6056k5424k4812
501A686740k4220k3649k3094k2558k2040k1536k1049k0577k0120j9675j9246j8827j8423j8030
499A393696j7647j7277j6917j6567j6227j5897j5576j5264j4959j4665j4377j4097j3825j3560
$$ plain form
511 11121899 10629701 10170746 9742089 9341101 8965435 8612985 8281861 7970361 7676952 7400245 7138985
510 7138985 6892029 6658342 6436979 6227078 6027852 5838580 5658601 5487309 5324146 5168597 5020191
508 5020191 4878488 4743086 4613611 4489716 4371080 4257404 4148410 4043841 3943457 3847031 3754356 3665235
507 3665235 3579485 3496936 3417426 3340806 3266933 3195676 3126909 3060516 2996386 2934415 2874504 2816562 2760502 2706240
505 2706240 2653698 2602804 2553486 2505680 2459322 2414353 2370716 2328359 2287230 2247281 2208465 2170741 2134065 2098398
503 2098398 2063703 2029943 1997085 1965095 1933942 1903597 1874031 1845217 1817129 1789742 1763032 1736976 1711552 1686740
501 1686740 1662520 1638871 1615777 1593219 1571179 1549643 1528594 1508017 1487897 1468222 1448976 1430149 1411726 1393696
499 1393696 1376049 1358772 1341855 1325288 1309061 1293164 1277588 1262324 1247365 1232700 1218323 1204226 1190401 1176841
497A176841j3301j3051j2805j2567j2334j2108j1887j1672j1461j1257j1057j0862j0671j0486
495A011322j0305j0128r955r786r621r461r303r149q999q852q709q568q431q297q165q037
493H65556p911p788p668p550p434p322p211p102o997o892o791o691o594o498o403o312o222
491G46170o133o046n962n878n796n716n637n560n484n410n337n265n195n126n058m992m926
488F52649m862m799m736m677m616m557m500m443m388m332m279m226m174m122m073m022l974
486E77869l927l879l833l787l742l699l655l612l570l529l488l448l409l370l331l294l257
484E17039l221l184l149l114l080l046l012k980k947k916k884k853k823k792k763k734k704
481D66837k677k648k621k594k567k540k514k489k463k438k413k389k365k342k317k295k272
$$ plain form
497 1176841 1163540 1150489 1137684 1125117 1112783 1100675 1088788 1077116 1065655 1054398 1043341 1032479 1021808 1011322
495 1011322 1001017 990889 980934 971148 961527 952066 942763 933614 924615 915763 907054 898486 890055 881758 873593 865556
493 865556 857645 849857 842189 834639 827205 819883 812672 805570 798573 791681 784890 778199 771605 765107 758704 752392 746170
491 746170 740037 733991 728029 722151 716355 710639 705002 699442 693958 688548 683211 677946 672751 667625 662567 657575 652649
488 652649 647787 642988 638252 633575 628959 624402 619902 615459 611071 606739 602460 598234 594060 589938 585865 581843 577869
486 577869 573942 570063 566230 562443 558701 555002 551347 547735 544165 540636 537148 533700 530291 526921 523590 520296 517039
484 517039 513818 510634 507485 504371 501291 498245 495233 492253 489306 486390 483506 480653 477830 475038 472275 469541 466837
481 466837 464160 461512 458891 456297 453730 451190 448676 446187 443724 441286 438873 436484 434119 431777 429460 427165 424893
479D24893k250k227k206k184k162k142k121k100k080k060k040k021k002j982j964j946j927
477C89479j909j891j874j856j839j822j805j789j773j756j740j724j709j694j678j663j648
474C59309j634j619j604j591j576j563j549j535j522j508j496j482j470j457j444j432j420
472C33407j408j395j384j372j361j349j337j327j315j304j293j283j272j261j251j241j230
470C11024j221j210j200j191j181j171j162j152j143j134j125j115j107j098j089j080j072
467B91573j063j055j046j038j030j022j014j005r98r90r83r74r67r60r52r45r37r30r23r16
464B71825r09r01q95q88q81q75q67q61q55q48q42q35q29q22q16q11q04p97p92p86p80p75p68
461B52588p63p56p52p45p40p35p29p23p18p13p07p03o97o91o87o82o76o71o67o61o57o52o47
$$ plain form
479 424893 422643 420416 418210 416026 413864 411722 409601 407501 405421 403361 401321 399300 397298 395316 393352 391406 389479
477 389479 387570 385679 383805 381949 380110 378288 376483 374694 372921 371165 369425 367701 365992 364298 362620 360957 359309
474 359309 357675 356056 354452 352861 351285 349722 348173 346638 345116 343608 342112 340630 339160 337703 336259 334827 333407
472 333407 331999 330604 329220 327848 326487 325138 323801 322474 321159 319855 318562 317279 316007 314746 313495 312254 311024
470 311024 309803 308593 307393 306202 305021 303850 302688 301536 300393 299259 298134 297019 295912 294814 293725 292645 291573
467 291573 290510 289455 288409 287371 286341 285319 284305 283300 282302 281312 280329 279355 278388 277428 276476 275531 274594 273664 272741 271825
464 271825 270916 270015 269120 268232 267351 266476 265609 264748 263893 263045 262203 261368 260539 259717 258901 258090 257286 256489 255697 254911 254131 253356 252588
461 252588 251825 251069 250317 249572 248832 248097 247368 246645 245927 245214 244507 243804 243107 242416 241729 241047 240371 239700 239033 238372 237715 237063 236416
458B36416o42o37o33o28o23o19o14o10o05o00n97n91n88n83n79n74n70n66n62n58n53n49n46
455B22789n41n37n34n29n25n22n17n14n10n06n03m98m95m91m88m84m80m77m73m69m66m63m59
452B11308m55m52m49m45m42m39m35m32m28m26m22m19m15m13m09m06m03m00l96l94l91l87l85
449B01665l81l79l75l73l69l67l64l60l58l55l53l49l47l43l41l39l35l33l30l27l24l22l19
445A93622l17l14l11l08l06l04l00k99k95k93k91k88k85k83k81k78k75k73k71k68k66k63k61
442A86992k58k56k54k51k49k47k44k42k40k37k35k33k30k28k26k24k21k19k17k15k12k11k08
439A81635k05k04k01k00j97j95j93j90j89j86j84j82j80j78j76j74j71j70j67j65j64j61j59
436A77444j57j55j53j51j49j47j45j43j40j39j37j35j33j31j28j27j25j23j21j19j17j15j13
$$ plain form
458 236416 235774 235137 234504 233876 233253 232634 232020 231410 230805 230205 229608 229017 228429 227846 227267 226693 226123 225557 224995 224437 223884 223335 222789
455 222789 222248 221711 221177 220648 220123 219601 219084 218570 218060 217554 217051 216553 216058 215567 215079 214595 214115 213638 213165 212696 212230 211767 211308
452 211308 210853 210401 209952 209507 209065 208626 208191 207759 207331 206905 206483 206064 205649 205236 204827 204421 204018 203618 203222 202828 202437 202050 201665
449 201665 201284 200905 200530 200157 199788 199421 199057 198697 198339 197984 197631 197282 196935 196592 196251 195912 195577 195244 194914 194587 194263 193941 193622
445 193622 193305 192991 192680 192372 192066 191762 191462 191163 190868 190575 190284 189996 189711 189428 189147 188869 188594 188321 188050 187782 187516 187253 186992
442 186992 186734 186478 186224 185973 185724 185477 185233 184991 184751 184514 184279 184046 183816 183588 183362 183138 182917 182698 182481 182266 182054 181843 181635
439 181635 181430 181226 181025 180825 180628 180433 180240 180050 179861 179675 179491 179309 179129 178951 178775 178601 178430 178260 178093 177928 177764 177603 177444
436 177444 177287 177132 176979 176828 176679 176532 176387 176244 176104 175965 175828 175693 175560 175429 175301 175174 175049 174926 174805 174686 174569 174454 174341
433A74341j11j09j08j05j03j02r9r8r5r4r2q9q8q6q4q2q1p8p6p5p2p1o9o7o5o3o1n9n8n5n4
429A71792n1n0m8m6m4m2m1l8l7l5l2l1k9k7k6k3k1k0j8j5j4j2j0romljKLNPRJ1J2J5J7J8K0
423A71178K3K4K6K8L0L2L4L6L8L9M2M3M6M7N0N1N4N5N7O0O1O3O6O7O9P1P4P5P7P9Q2Q3Q6Q7
419A73033Q9R2R4R5R8J00J02J04J06J08J10J12J15J16J19J21J23J25J27J29J32J34J36J38
415A75758J40J43J44J47J50J51J54J56J58J60J63J65J67J70J72J74J76J79J81J84J86J88J91
412A79557J93J96J98K00K03K05K08K10K13K15K18K20K23K25K28K30K33K36K38K41K43K46K49
409A84628K51K54K57K60K62K65K67K71K73K76K79K82K84K87K91K93K96K99L02L05L07L11L14
406A91114L17L20L23L26L29L32L35L39L41L45L48L52L54L58L61L64L68L71L75L77L82L84L88
$$ plain form
433 174341 174230 174121 174013 173908 173805 173703 173604 173506 173411 173317 173225 173136 173048 172962 172878 172796 172715 172637 172561 172486 172414 172343 172274 172207 172142 172079 172018 171959 171901 171846 171792
429 171792 171741 171691 171643 171597 171553 171511 171470 171432 171395 171360 171328 171297 171268 171241 171215 171192 171171 171151 171133 171118 171104 171092 171082 171073 171067 171063 171060 171059 171061 171064 171069 171076 171085 171096 171108 171123 171140 171158 171178
423 171178 171201 171225 171251 171279 171309 171341 171375 171411 171449 171488 171530 171573 171619 171666 171716 171767 171821 171876 171933 171993 172054 172117 172183 172250 172319 172390 172464 172539 172616 172695 172777 172860 172946 173033
419 173033 173122 173214 173308 173403 173501 173601 173703 173807 173913 174021 174131 174243 174358 174474 174593 174714 174837 174962 175089 175218 175350 175484 175620 175758
415 175758 175898 176041 176185 176332 176482 176633 176787 176943 177101 177261 177424 177589 177756 177926 178098 178272 178448 178627 178808 178992 179178 179366 179557
412 179557 179750 179946 180144 180344 180547 180752 180960 181170 181383 181598 181816 182036 182259 182484 182712 182942 183175 183411 183649 183890 184133 184379 184628
409 184628 184879 185133 185390 185650 185912 186177 186444 186715 186988 187264 187543 187825 188109 188396 188687 188980 189276 189575 189877 190182 190489 190800 191114
406 191114 191431 191751 192074 192400 192729 193061 193396 193735 194076 194421 194769 195121 195475 195833 196194 196558 196926 197297 197672 198049 198431 198815 199203
403A99203L92L95L99M02M06M09M13M17M20M24M28M31M35M40M42M47M51M54M59M62M66M71M74
399B09140M79M82M87M91M95M99N04N08N12N16N21N26N29N35N38N44N48N52N57N62N67N71N77
396B21240N81N85N91N96O01O06O11O16O21O26O32O37O42O48O53O58O64O70O75O81O87O92O98
393B35911P04P10P16P22P27P34P40P47P52P59P66P71P78P85P92P98Q04Q12Q18Q26Q32Q39Q47
390B53690Q53Q61Q68Q76Q83Q90Q99R05R14R21R29R37R45R54R61R70R78R86R95J004J012J021
387B74252J030J039J048J056J067J075J085J094J104J114J124J133J143J154J163J174J185
385B93040J195J205J217J227J238J249J261J272J283J295J307J318J331J342J355J367J380
382C14882J392J406J418J431J444J458J471J485J499J513J527J542J556J570J586J600J616
$$ plain form
403 199203 199595 199990 200389 200791 201197 201606 202019 202436 202856 203280 203708 204139 204574 205014 205456 205903 206354 206808 207267 207729 208195 208666 209140
399 209140 209619 210101 210588 211079 211574 212073 212577 213085 213597 214113 214634 215160 215689 216224 216762 217306 217854 218406 218963 219525 220092 220663 221240
396 221240 221821 222406 222997 223593 224194 224800 225411 226027 226648 227274 227906 228543 229185 229833 230486 231144 231808 232478 233153 233834 234521 235213 235911
393 235911 236615 237325 238041 238763 239490 240224 240964 241711 242463 243222 243988 244759 245537 246322 247114 247912 248716 249528 250346 251172 252004 252843 253690
390 253690 254543 255404 256272 257148 258031 258921 259820 260725 261639 262560 263489 264426 265371 266325 267286 268256 269234 270220 271215 272219 273231 274252
387 274252 275282 276321 277369 278425 279492 280567 281652 282746 283850 284964 286088 287221 288364 289518 290681 291855 293040
385 293040 294235 295440 296657 297884 299122 300371 301632 302904 304187 305482 306789 308107 309438 310780 312135 313502 314882
382 314882 316274 317680 319098 320529 321973 323431 324902 326387 327886 329399 330926 332468 334024 335594 337180 338780 340396
380C40396J631J646J662J679J694J711J727J744J761J777J796J812J831J849J866J885J904
378C70371J923J942J961J981K000K021K042K061K083K104K126K147K169K191K214K238K260
375D05834K284K307K332K356K381K407K431K458K484K510K537K565K593K620K649K678K707
373D48133K737K767K797K829K860K892K925K957K991L024L059L094L129L165L202L239L276
371D99076L314L353L393L432L473L515L556L599L642L685L731L776L821L869L916L965M013
368E61129M064M114M166M219M272M326M381M437M495M553M611M672M733M795M859M923M988
366F37737N056N123N193N263N335N408N482N559N635N714N794N877N959O044O130O219O309
364G33837O400O494O588O687O785O886O990P094P202P312P424P538P655P773P896Q019Q146
$$ plain form
380 340396 342027 343673 345335 347014 348708 350419 352146 353890 355651 357428 359224 361036 362867 364716 366582 368467 370371
378 370371 372294 374236 376197 378178 380178 382199 384241 386302 388385 390489 392615 394762 396931 399122 401336 403574 405834
375 405834 408118 410425 412757 415113 417494 419901 422332 424790 427274 429784 432321 434886 437479 440099 442748 445426 448133
373 448133 450870 453637 456434 459263 462123 465015 467940 470897 473888 476912 479971 483065 486194 489359 492561 495800 499076
371 499076 502390 505743 509136 512568 516041 519556 523112 526711 530353 534038 537769 541545 545366 549235 553151 557116 561129
368 561129 565193 569307 573473 577692 581964 586290 590671 595108 599603 604156 608767 613439 618172 622967 627826 632749 637737
366 637737 642793 647916 653109 658372 663707 669115 674597 680156 685791 691505 697299 703176 709135 715179 721309 727528 733837
364 733837 740237 746731 753319 760006 766791 773677 780667 787761 794963 802275 809699 817237 824892 832665 840561 848580 856726
361H56726Q277Q408Q544Q682Q823Q968R116R267R421R580R741R907J0076J0249J0427J0608
359A006820J0794J0984J1180J1380J1584J1794J2009J2229J2456J2687J2925J3169J3420J3676
357A177107J3940J4211J4488J4774J5068J5369J5679J5997J6325J6661J7008J7364J7731J8109
355A399831J8498J8898J9311J9736K0173K0626K1092K1572K2069K2580K3109K3654K4219K4801
353A700169K5404K6027K6671K7338K8029K8743K9484L0251L1047L1872L2728L3616L4539L5497
351B121415L6493L7528L8605L9726M0892M2108M3374M4694M6073M7510M9012N0581N2221N3938
349B744170N5735N7617N9590O1658O3830O6111O8508P1028P3683P6479P9427Q2536Q5821Q9293
348C735486R2967R6856J00981J05355J10004J14946J20207J25814J31798J38190J45029J52353
$$ plain form
361 856726 865003 873411 881955 890637 899460 908428 917544 926811 936232 945812 955553 965460 975536 985785 996212 1006820
359 1006820 1017614 1028598 1039778 1051158 1062742 1074536 1086545 1098774 1111230 1123917 1136842 1150011 1163431 1177107
357 1177107 1191047 1205258 1219746 1234520 1249588 1264957 1280636 1296633 1312958 1329619 1346627 1363991 1381722 1399831
355 1399831 1418329 1437227 1456538 1476274 1496447 1517073 1538165 1559737 1581806 1604386 1627495 1651149 1675368 1700169
353 1700169 1725573 1751600 1778271 1805609 1833638 1862381 1891865 1922116 1953163 1985035 2017763 2051379 2085918 2121415
351 2121415 2157908 2195436 2234041 2273767 2314659 2356767 2400141 2444835 2490908 2538418 2587430 2638011 2690232 2744170
349 2744170 2799905 2857522 2917112 2978770 3042600 3108711 3177219 3248247 3321930 3398409 3477836 3560372 3646193 3735486
348 3735486 3828453 3925309 4026290 4131645 4241649 4356595 4476802 4602616 4734414 4872604 5017633 5169986
346E169986J60211J68652J77732J87517J98076K09492K21856K35269K49850K65733K83068
344G527442L02031L22823L45674L70852L98668M29484M63724N01887N44561N92447O46378
343A2445971P07355P76580Q55524R45968J050112J170681J311068J475557J669580J900109
341B4308505K176183K509654K916249L417147M041262M828729N836270P145636Q877218J1212647
340G7269500J4433200J8987017K5609459L5541309N0914255P5329532J14062701J70053563
339E82200536K24451230K14734669R1825254r2034928k14517226k23832517j69324736j13382830
338C00119452p4707508n0325774l4966200k5034313j8402875j3833463j0591974q230804o468821
337E7557720n124282m076502l243251k567231k007539j534360j125412p63637m35590j30306
$$ plain form
346 5169986 5330197 5498849 5676581 5864098 6062174 6271666 6493522 6728791 6978641 7244374 7527442
344 7527442 7829473 8152296 8497970 8868822 9267490 9696974 10160698 10662585 11207146 11799593 12445971
343 12445971 13153326 13929906 14785430 15731398 16781510 17952191 19263259 20738816 22408396 24308505
341 24308505 26484688 28994342 31910591 35327738 39369000 44197729 50033999 57179635 66056853 77269500
340 77269500 91702700 110689717 136299176 171840485 222754740 298084272 412146973 582200536
339 582200536 806651766 1021386435 1113211689 1021176761 806659535 582827018 413502282 300119452
338 300119452 225411944 175086170 140119970 115085657 96682782 82849319 72257345 64026541 57557720
337 57557720 52433438 48356936 45113685 42546454 40538915 39004555 37879143 37115506 36679916 36549610
335C6549610J61526M48191P37447J037013J354948J700157K082877K515363L012681L593891
334E3193704M283589N114141O128986P387433Q972051J1000084J3641607J7149247K1907932
333A48778774K8520960L7962780N1857276P2987462J06189426J59570597K43983013L59293671
332A209143959M45791917L75254177J17293594k03364225m16274831m31780331l25474289
331G70589971k16641854j41945002r5272994o6117782m7399057l4974405k6457181k0444810
330A21336886j6088340j2857546j0411429q524502p043949n863762m908913m125185l472746
328D8040514k921737k449410k038063j673642j344698j041611p55999m80245k07028P1036
327C5199117L61858O74352J019059J408933J860459K395233L042246L841366M848656O144749
$$ plain form
335 36549610 36711136 37159327 37896774 38933787 40288735 41988892 44071769 46587132 49599813 53193704
334 53193704 57477293 62591434 68720420 76107853 85079904 96079988 109721595 126870842 148778774
333 148778774 177299734 215262514 267119790 340107252 446296678 605867275 849850288 1209143959
332 1209143959 1654935876 2030190053 2147483647 1944119422 1527844591 1096064260 770589971
331 770589971 553948117 412003115 316730121 250612339 203213282 168238877 141781696 121336886
330 121336886 105248546 92391000 81979571 73455069 66411120 60547358 55638445 51513260 48040514
328 48040514 45118777 42669367 40631304 38957662 37612964 36571353 35815354 35335109 35128081 35199117
327 35199117 35560975 36235327 37254386 38663319 40523778 42919011 45961257 49802623 54651279 60796028
326F0796028P848453J0139140J3295072J7760003K4261757L4023004M9115095P2900504J09673696
324C99812752J58955173J96105677J64884110L9114366j13888014j93253417j82218701j33329752
323C36182194q9523176n9897469m1079061k9055953k1173221j5847751j2144207r499560p565805
322E0395991o121748n022988m172872l505228k973797k545638k196866j909916j671663j472183
321A8803092j303879j160866j038545r33285q42189p62937o93647o32785n79097n31542m89258
319I835062m51525m17736l87385l60033l35318l12919k92568k74031k57107k41620k27416
318F277404k14364k02345j91257j81010j71521j62723j54549j46946j39862j33252j27077
316D452498j21299j15887j10812j06046j01565r7349r3376q9630q6093q2750p9590p6597p3762
$$ plain form
326 60796028 68644481 78783621 92078693 109838696 134100453 168123457 217238552 290139056 399812752
324 399812752 558767925 754873602 919757712 958872078 844984064 651730647 469511946 336182194
323 336182194 246659018 186761549 145682488 116626535 95453314 79605563 67461356 57961796 50395991
322 50395991 44274243 39251255 35078383 31573155 28599358 26053720 23856854 21946938 20275275 18803092
321 18803092 17499213 16338347 15299802 14366517 13524328 12761391 12067744 11434959 10855862 10324320 9835062
319 9835062 9383537 8965801 8578416 8218383 7883065 7570146 7277578 7003547 6746440 6504820 6277404
318 6277404 6063040 5860695 5669438 5488428 5316907 5154184 4999635 4852689 4712827 4579575 4452498
316 4452498 4331199 4215312 4104500 3998454 3896889 3799540 3706164 3616534 3530441 3447691 3368101 3291504 3217742
314C217742p1072o8520o6096o3791o1599n9511n7523n5627n3819n2092n0442m8866m7358m5915
312B415511m4534m3210m1941m0724l9557l8435l7358l6324l5329l4371l3451l2564l1710l0887
310A895116l0094k9329k8591k7879k7192k6528k5886k5266k4667k4088k3526k2984k2459k1950
309A534677k1457k0980k0517k0068j9633j9211j8802j8405j8018j7644j7280j6927j6583j6249
307A272903j5924j5609j5302j5002j4713j4429j4154j3885j3624j3370j3122j2881j2644j2416
305A075828j2191j1973j1761j1552j1350j1152j0959j0771j0587j0407j0231j0060r892r729
303I23213r568r413r259r110q964q821q681q544q410q280q151q025p903p783p665p549p437
300G79650p326p217p111p008o905o805o707o612o517o424o335o245o158o073n989n906n826
$$ plain form
314 3217742 3146670 3078150 3012054 2948263 2886664 2827153 2769630 2714003 2660184 2608092 2557650 2508784 2461426 2415511
312 2415511 2370977 2327767 2285826 2245102 2205545 2167110 2129752 2093428 2058099 2023728 1990277 1957713 1926003 1895116
310 1895116 1865022 1835693 1807102 1779223 1752031 1725503 1699617 1674351 1649684 1625596 1602070 1579086 1556627 1534677
309 1534677 1513220 1492240 1471723 1451655 1432022 1412811 1394009 1375604 1357586 1339942 1322662 1305735 1289152 1272903
307 1272903 1256979 1241370 1226068 1211066 1196353 1181924 1167770 1153885 1140261 1126891 1113769 1100888 1088244 1075828
305 1075828 1063637 1051664 1039903 1028351 1017001 1005849 994890 984119 973532 963125 952894 942834 932942 923213
303 923213 913645 904232 894973 885863 876899 868078 859397 850853 842443 834163 826012 817987 810084 802301 794636 787087 779650
300 779650 772324 765107 757996 750988 744083 737278 730571 723959 717442 711018 704683 698438 692280 686207 680218 674312 668486
298F68486n747n669n592n518n444n372n301n231n163n096n030m965m901m839m777m717m657
296E80467m600m541m486m430m375m322m269m217m166m116m067m019l970l924l877l832l788
293E09468l743l700l657l615l574l534l493l453l415l377l339l302l266l229l194l159l125
291D51293l091l057l024k993k960k928k898k867k837k807k778k749k721k692k665k637k611
289D02978k584k558k532k507k481k457k432k408k385k361k337k315k293k270k248k226k206
286C62378k184k163k143k122k102k083k063k044k024k006j988j969j951j933j915j898j881
284C27909j864j847j830j814j798j782j766j751j735j719j705j690j675j661j646j632j618
282B98376j604j591j577j563j551j537j524j512j499j486j474j462j450j438j426j414j403
$$ plain form
298 668486 662739 657070 651478 645960 640516 635144 629843 624612 619449 614353 609323 604358 599457 594618 589841 585124 580467
296 580467 575867 571326 566840 562410 558035 553713 549444 545227 541061 536945 532878 528859 524889 520965 517088 513256 509468
293 509468 505725 502025 498368 494753 491179 487645 484152 480699 477284 473907 470568 467266 464000 460771 457577 454418 451293
291 451293 448202 445145 442121 439128 436168 433240 430342 427475 424638 421831 419053 416304 413583 410891 408226 405589 402978
289 402978 400394 397836 395304 392797 390316 387859 385427 383019 380634 378273 375936 373621 371328 369058 366810 364584 362378
286 362378 360194 358031 355888 353766 351664 349581 347518 345474 343450 341444 339456 337487 335536 333603 331688 329790 327909
284 327909 326045 324198 322368 320554 318756 316974 315208 313457 311722 310003 308298 306608 304933 303272 301626 299994 298376
282 298376 296772 295181 293604 292041 290490 288953 287429 285917 284418 282932 281458 279996 278546 277108 275682 274268 272865
279B72865j391j380j369j358j347j336j326j314j305j294j284j273j264j254j244j234j225
277B50667j215j206j196j188j178j169j160j152j142j134j126j117j109j100j092j084j076
275B31223j068j060j052j045j037j029j022j015j007r99r93r85r79r71r65r57r51r44r37r31
272B11276r24r18r11r05q99q92q87q80q74q68q62q56q50q45q39q33q28q21q17q11q05q01p94
269A91556p90p84p79p74p69p64p59p54p49p44p39p35p29p25p21p16p11p07p02o97o94o89o84
266A74641o80o76o72o68o63o59o55o51o47o43o40o35o31o27o24o20o16o12o09o05o01n98n94
263A60015n90n87n84n80n77n73n70n66n63n60n57n53n50n47n43n41n37n35n31n28n25n23n19
259A47276n16n13n11n07n05n02m98m97m93m91m87m86m82m80m77m74m72m70m66m64m62m59m57
$$ plain form
279 272865 271474 270094 268725 267367 266020 264684 263358 262044 260739 259445 258161 256888 255624 254370 253126 251892 250667
277 250667 249452 248246 247050 245862 244684 243515 242355 241203 240061 238927 237801 236684 235575 234475 233383 232299 231223
275 231223 230155 229095 228043 226998 225961 224932 223910 222895 221888 220889 219896 218911 217932 216961 215996 215039 214088 213144 212207 211276
272 211276 210352 209434 208523 207618 206719 205827 204940 204060 203186 202318 201456 200600 199750 198905 198066 197233 196405 195584 194767 193956 193151 192350 191556
269 191556 190766 189982 189203 188429 187660 186896 186137 185383 184634 183890 183151 182416 181687 180962 180241 179525 178814 178107 177405 176708 176014 175325 174641
266 174641 173961 173285 172613 171945 171282 170623 169968 169317 168670 168027 167387 166752 166121 165494 164870 164250 163634 163022 162413 161808 161207 160609 160015
263 160015 159425 158838 158254 157674 157097 156524 155954 155388 154825 154265 153708 153155 152605 152058 151515 150974 150437 149902 149371 148843 148318 147795 147276
259 147276 146760 146247 145736 145229 144724 144222 143724 143227 142734 142243 141756 141270 140788 140308 139831 139357 138885 138415 137949 137485 137023 136564 136107
256A36107m54m51m50m46m45m42m39m38m34m33m30m28m26m23m22m19m16m15m12m11m08m06m03
253A26256m02m00l97l96l93l92l89l88l85l84l81l80l78l75l74l72l70l69l66l64l63l61l59
250A17518l58l55l54l52l50l49l46l46l43l42l40l38l37l35l34l32l30l28l28l25l24l22l21
247A09729l20l17l17l15l13l12l10l09l07l06l05l03l02l00k99k97k96k95k93k92k91k89k88
244A02753k87k85k84k83k82k80k79k77k77k75k74k72k72k70k69k68k66k66k64k63k62k60k60
240I6478k58k58k56k55k54k53k51k51k49k49k47k46k45k45k43k42k41k39k39k38k37k36k35
237I0811k34k32k32k31k30k29k28k27k26k25k24k24k22k21k21k19k19k17k17k16k15k14k14
234H5674k12k11k11k10k09k08k07k06k06k05k04k03k02k01k01k00j99j98j97j97j96j95j94
$$ plain form
256 136107 135653 135202 134752 134306 133861 133419 132980 132542 132108 131675 131245 130817 130391 129968 129546 129127 128711 128296 127884 127473 127065 126659 126256
253 126256 125854 125454 125057 124661 124268 123876 123487 123099 122714 122330 121949 121569 121191 120816 120442 120070 119700 119331 118965 118601 118238 117877 117518
250 117518 117160 116805 116451 116099 115749 115400 115054 114708 114365 114023 113683 113345 113008 112673 112339 112007 111677 111349 111021 110696 110372 110050 109729
247 109729 109409 109092 108775 108460 108147 107835 107525 107216 106909 106603 106298 105995 105693 105393 105094 104797 104501 104206 103913 103621 103330 103041 102753
244 102753 102466 102181 101897 101614 101332 101052 100773 100496 100219 99944 99670 99398 99126 98856 98587 98319 98053 97787 97523 97260 96998 96738 96478
240 96478 96220 95962 95706 95451 95197 94944 94693 94442 94193 93944 93697 93451 93206 92961 92718 92476 92235 91996 91757 91519 91282 91046 90811
237 90811 90577 90345 90113 89882 89652 89423 89195 88968 88742 88517 88293 88069 87847 87626 87405 87186 86967 86750 86533 86317 86102 85888 85674
234 85674 85462 85251 85040 84830 84621 84413 84206 84000 83794 83589 83385 83182 82980 82779 82578 82378 82179 81981 81784 81587 81391 81196 81002
231H1002j94j92j92j92j90j90j89j88j88j86j86j86j84j84j83j83j82j81j80j80j79j78j77
228G6738j77j77j75j75j74j74j73j72j71j71j71j69j69j69j67j67j67j66j65j65j64j63j63
225G2834j62j62j61j60j60j59j59j58j57j57j56j56j55j55j54j53j53j53j51j52j50j51j49
221F9251j49j49j48j48j46j47j46j45j45j45j43j44j43j42j42j41j41j40j40j40j39j38j38
218F5952j37j37j37j36j35j35j35j34j34j33j33j32j32j31j31j31j30j29j30j28j29j27j28
215F2908j27j26j27j25j26j24j25j24j24j23j23j22j22j22j21j20j21j20j19j20j18j19j18
212F0092j17j18j17j16j16j16j15j15j15j14j14j13j13j13j12j12j12j11j11j11j10j10j10
209E7481j09j09j08j08j08j07j08j06j07j06j06j05j05j05j04j05j03j04j03j03j02j02j02
$$ plain form
231 81002 80808 80616 80424 80232 80042 79852 79663 79475 79287 79101 78915 78729 78545 78361 78178 77995 77813 77632 77452 77272 77093 76915 76738
228 76738 76561 76384 76209 76034 75860 75686 75513 75341 75170 74999 74828 74659 74490 74321 74154 73987 73820 73654 73489 73324 73160 72997 72834
225 72834 72672 72510 72349 72189 72029 71870 71711 71553 71396 71239 71083 70927 70772 70617 70463 70310 70157 70004 69853 69701 69551 69400 69251
221 69251 69102 68953 68805 68657 68511 68364 68218 68073 67928 67783 67640 67496 67353 67211 67069 66928 66787 66647 66507 66367 66228 66090 65952
218 65952 65815 65678 65541 65405 65270 65135 65000 64866 64732 64599 64466 64334 64202 64071 63940 63809 63679 63550 63420 63292 63163 63036 62908
215 62908 62781 62655 62528 62403 62277 62153 62028 61904 61780 61657 61534 61412 61290 61168 61047 60927 60806 60686 60567 60447 60329 60210 60092
212 60092 59975 59857 59740 59624 59508 59392 59277 59162 59047 58933 58819 58706 58593 58480 58368 58256 58144 58033 57922 57811 57701 57591 57481
209 57481 57372 57263 57155 57047 56939 56832 56724 56618 56511 56405 56299 56194 56089 55984 55880 55775 55672 55568 55465 55362 55260 55158 55056
206E5056j02j01j01j01j00j00j00r9r9r9r8r9r7r8r7r7r7r6r6r6r6r5r5r5r4r4r4r3r4r2r3
201E2048r3r2r2r1r1r1r1r1r0r0r0q9q9q9q9q8q8q8q8q7q7q7q7q6q6q6q5q6q5q5q4q5q4q4
197D9054q3q4q3q3q2q3q2q2q2q1q1q1q1q1q0q0q0q0p9q0p9p8p9p8p8p8p8p7p8p7p7p6p7p6
192D6340p6p5p6p5p5p5p5p5p4p4p4p4p3p3p4p2p3p3p2p2p2p2p1p2p1p1p0p1p0p1p0o9p0p0
187D3870o9o9o9o8o9o8o9o7o8o8o7o8o7o7o6o7o6o7o6o5o6o6o5o5o5o5o5o4o5o4o4o4o3o4
183D1615o3o3o3o3o3o2o3o2o2o2o2o1o2o1o1o1o1o0o1o0o1o0n9o0o0n9n9o0n9n8n9n9n8n8
178C9550n9n7n8n8n8n7n7n7n7n7n7n6n7n6n6n6n6n6n5n6n5n5n5n5n5n5n4n5n4n4n4n4n3n4
173C7652n4n3n3n3n3n3n3n2n3n2n2n2n2n2n2n1n2n1n1n2n0n1n1n1n0n1n0n0n0n0n0m9n0m9
$$ plain form
206 55056 54954 54853 54752 54651 54551 54451 54351 54252 54153 54054 53956 53857 53760 53662 53565 53468 53371 53275 53179 53083 52987 52892 52797 52702 52608 52514 52420 52327 52233 52141 52048
201 52048 51955 51863 51771 51680 51589 51498 51407 51316 51226 51136 51046 50957 50868 50779 50690 50602 50514 50426 50338 50251 50164 50077 49990 49904 49818 49732 49647 49561 49476 49391 49307 49222 49138 49054
197 49054 48971 48887 48804 48721 48639 48556 48474 48392 48310 48229 48148 48067 47986 47905 47825 47745 47665 47585 47506 47426 47347 47269 47190 47112 47034 46956 46878 46801 46723 46646 46569 46493 46416 46340
192 46340 46264 46189 46113 46038 45963 45888 45813 45738 45664 45590 45516 45442 45369 45296 45222 45150 45077 45004 44932 44860 44788 44716 44645 44573 44502 44431 44361 44290 44220 44149 44079 44010 43940 43870
187 43870 43801 43732 43663 43595 43526 43458 43389 43322 43254 43186 43119 43051 42984 42917 42851 42784 42718 42651 42585 42520 42454 42388 42323 42258 42193 42128 42063 41999 41934 41870 41806 41742 41679 41615
183 41615 41552 41489 41426 41363 41300 41238 41175 41113 41051 40989 40927 40866 40804 40743 40682 40621 40560 40500 40439 40379 40318 40258 40199 40139 40079 40020 39961 39901 39842 39784 39725 39666 39608 39550
178 39550 39491 39434 39376 39318 39260 39203 39146 39089 39032 38975 38918 38862 38805 38749 38693 38637 38581 38525 38470 38414 38359 38304 38249 38194 38139 38084 38030 37975 37921 37867 37813 37759 37706 37652
173 37652 37598 37545 37492 37439 37386 37333 37280 37228 37175 37123 37071 37019 36967 36915 36863 36812 36760 36709 36658 36606 36556 36505 36454 36403 36353 36302 36252 36202 36152 36102 36052 36003 35953 35904
169C5904n0m9m9m9m9m9m8m9m8m8m9m8m8m8m7m8m8m7m7m7m8m7m6m7m7m6m7m6m6m7m6m6m5m6
164C4289m6m5m6m5m5m5m5m5m5m5m4m5m4m5m4m4m4m4m4m3m4m3m4m3m3m4m3m3m2m3m3m2m3m2
159C2794m3m2m2m2m2m2m1m2m2m1m1m2m1m1m1m1m1m1m0m1m0m1m0m0m0m1m0l9m0m0m0l9m0l9
155C1406l9l9m0l9l9l8l9l9l9l8l9l8l8l9l8l8l8l8l8l7l8l8l7l7l8l7l7l7l8l6l7l7l7l7
150C0115l6l7l6l7l6l6l6l6l6l6l6l6l5l6l6l5l6l5l5l5l5l5l5l5l5l5l5l4l5l4l5l4l4l5
145B8912l4l4l4l4l4l3l4l4l3l4l3l4l3l3l4l3l3l3l3l3l2l3l3l2l3l2l3l2l2l3l2l2l2l2
141B7789l2l2l1l2l2l1l2l1l2l1l2l1l1l1l1l1l1l1l1l1l0l1l0l1l0l1l0l0l1l0l0l0l0l0
136B6738l0l0k9l0l0k9l0k9l0k9l0k9k9k9k9k9k9k9k9k9k9k9k8k9k8k9k8k9k8k8k9k8k8k8
$$ plain form
169 35904 35854 35805 35756 35707 35658 35609 35561 35512 35464 35416 35367 35319 35271 35223 35176 35128 35080 35033 34986 34939 34891 34844 34798 34751 34704 34658 34611 34565 34519 34472 34426 34380 34335 34289
164 34289 34243 34198 34152 34107 34062 34017 33972 33927 33882 33837 33793 33748 33704 33659 33615 33571 33527 33483 33439 33396 33352 33309 33265 33222 33179 33135 33092 33049 33007 32964 32921 32879 32836 32794
159 32794 32751 32709 32667 32625 32583 32541 32500 32458 32416 32375 32334 32292 32251 32210 32169 32128 32087 32046 32006 31965 31925 31884 31844 31804 31764 31723 31683 31644 31604 31564 31524 31485 31445 31406
155 31406 31367 31328 31288 31249 31210 31172 31133 31094 31055 31017 30978 30940 30902 30863 30825 30787 30749 30711 30673 30636 30598 30560 30523 30486 30448 30411 30374 30337 30299 30263 30226 30189 30152 30115
150 30115 30079 30042 30006 29969 29933 29897 29861 29825 29789 29753 29717 29681 29646 29610 29574 29539 29503 29468 29433 29398 29363 29328 29293 29258 29223 29188 29153 29119 29084 29050 29015 28981 28947 28912
145 28912 28878 28844 28810 28776 28742 28709 28675 28641 28608 28574 28541 28507 28474 28441 28407 28374 28341 28308 28275 28242 28210 28177 28144 28112 28079 28047 28014 27982 27950 27917 27885 27853 27821 27789
141 27789 27757 27725 27694 27662 27630 27599 27567 27536 27504 27473 27441 27410 27379 27348 27317 27286 27255 27224 27193 27162 27132 27101 27071 27040 27010 26979 26949 26919 26888 26858 26828 26798 26768 26738
136 26738 26708 26678 26649 26619 26589 26560 26530 26501 26471 26442 26412 26383 26354 26325 26296 26267 26238 26209 26180 26151 26122 26093 26065 26036 26008 25979 25951 25922 25894 25866 25837 25809 25781 25753
131B5753k8k8k8k8k8k7k8k8k7k8k8k7k7k8k7k7k8k7k7k7k7k7k7k7k7k6k7k7k6k7k7k6k6k7
127B4828k6k6k7k6k6k6k6k6k6k6k6k6k6k5k6k6k5k6k5k6k5k6k5k5k5k6k5k5k5k5k5k5k5k4
122B3959k5k5k5k4k5k5k4k5k4k4k5k4k4k5k4k4k4k4k4k4k4k4k4k4k3k4k4k3k4k4k3k4k3k3
117B3140k4k3k3k4k3k3k3k3k3k3k3k3k3k3k3k3k2k3k3k2k3k2k3k2k3k2k2k3k2k2k2k3k2k2
113B2367k2k2k2k2k2k2k1k2k2k2k1k2k2k1k2k1k2k1k2k1k1k2k1k1k1k1k1k2k1k1k1k1k0k1
108B1638k1k1k1k0k1k1k0k1k1k0k1k0k1k0k0k1k0k0k1k0k0k0k0k0k0k0k0k0k0k0k0k0j9k0
103B0948k0k0j9k0j9k0k0j9j9k0j9k0j9j9k0j9j9j9j9k0j9j9j9j9j9j9j9j9j8j9j9j9j9j8
99B0295j9j9j8j9j8j9j8j9j8j9j8j9j8j8j9j8j8j8j8j9j8j8j8j8j8j8j8j8j7j8j8j8j8j8j7
$$ plain form
131 25753 25725 25697 25669 25641 25613 25586 25558 25530 25503 25475 25447 25420 25393 25365 25338 25311 25283 25256 25229 25202 25175 25148 25121 25094 25067 25041 25014 24987 24961 24934 24907 24881 24855 24828
127 24828 24802 24776 24749 24723 24697 24671 24645 24619 24593 24567 24541 24515 24489 24464 24438 24412 24387 24361 24336 24310 24285 24259 24234 24209 24184 24158 24133 24108 24083 24058 24033 24008 23983 23959
122 23959 23934 23909 23884 23860 23835 23810 23786 23761 23737 23713 23688 23664 23640 23615 23591 23567 23543 23519 23495 23471 23447 23423 23399 23375 23352 23328 23304 23281 23257 23233 23210 23186 23163 23140
117 23140 23116 23093 23070 23046 23023 23000 22977 22954 22931 22908 22885 22862 22839 22816 22793 22770 22748 22725 22702 22680 22657 22635 22612 22590 22567 22545 22523 22500 22478 22456 22434 22411 22389 22367
113 22367 22345 22323 22301 22279 22257 22235 22214 22192 22170 22148 22127 22105 22083 22062 22040 22019 21997 21976 21954 21933 21912 21890 21869 21848 21827 21806 21785 21763 21742 21721 21700 21679 21659 21638
108 21638 21617 21596 21575 21555 21534 21513 21493 21472 21451 21431 21410 21390 21369 21349 21329 21308 21288 21268 21247 21227 21207 21187 21167 21147 21127 21107 21087 21067 21047 21027 21007 20987 20968 20948
103 20948 20928 20908 20889 20869 20850 20830 20810 20791 20772 20752 20733 20713 20694 20675 20655 20636 20617 20598 20579 20559 20540 20521 20502 20483 20464 20445 20426 20407 20389 20370 20351 20332 20313 20295
99 20295 20276 20257 20239 20220 20202 20183 20165 20146 20128 20109 20091 20072 20054 20036 20017 19999 19981 19963 19945 19926 19908 19890 19872 19854 19836 19818 19800 19782 19765 19747 19729 19711 19693 19675 19658
94A9658j8j8j7j8j7j8j8j7j8j7j7j8j7j8j7j7j7j8j7j7j7j7j8j7j7j7j7j7j7j7j6j7j7j7j7
89A9054j7j6j7j7j7j6j7j6j7j7j6j7j6j7j6j6j7j6j6j7j6j6j7j6j6j6j6j6j6j7j6j6j6j6j6
84A8481j5j6j6j6j6j6j6j5j6j6j6j5j6j5j6j6j5j6j5j6j5j6j5j6j5j5j6j5j5j5j6j5j5j5j6
79A7937j5j5j5j5j5j5j5j5j5j5j5j5j5j5j4j5j5j5j5j4j5j5j4j5j5j4j5j4j5j4j5j4j5j4j5
75A7420j4j5j4j4j5j4j4j4j5j4j4j4j4j5j4j4j4j4j4j4j4j4j4j4j4j4j4j4j3j4j4j4j4j3j4
70A6928j4j4j3j4j4j3j4j3j4j3j4j3j4j3j4j3j4j3j4j3j3j4j3j3j3j4j3j3j3j4j3j3j3j3j3
65A6459j3j3j3j3j3j3j3j3j3j3j3j3j3j3j3j2j3j3j3j2j3j3j3j2j3j3j2j3j2j3j3j2j3j2j3
60A6011j2j3j2j2j3j2j3j2j2j3j2j2j3j2j2j2j3j2j2j2j2j2j3j2j2j2j2j2j2j2j2j2j2j2j2
$$ plain form
94 19658 19640 19622 19605 19587 19570 19552 19534 19517 19499 19482 19465 19447 19430 19412 19395 19378 19361 19343 19326 19309 19292 19275 19257 19240 19223 19206 19189 19172 19155 19138 19122 19105 19088 19071 19054
89 19054 19037 19021 19004 18987 18970 18954 18937 18921 18904 18887 18871 18854 18838 18821 18805 18789 18772 18756 18740 18723 18707 18691 18674 18658 18642 18626 18610 18594 18578 18561 18545 18529 18513 18497 18481
84 18481 18466 18450 18434 18418 18402 18386 18370 18355 18339 18323 18307 18292 18276 18261 18245 18229 18214 18198 18183 18167 18152 18136 18121 18105 18090 18075 18059 18044 18029 18014 17998 17983 17968 17953 17937
79 17937 17922 17907 17892 17877 17862 17847 17832 17817 17802 17787 17772 17757 17742 17727 17713 17698 17683 17668 17653 17639 17624 17609 17595 17580 17565 17551 17536 17522 17507 17493 17478 17464 17449 17435 17420
75 17420 17406 17391 17377 17363 17348 17334 17320 17306 17291 17277 17263 17249 17235 17220 17206 17192 17178 17164 17150 17136 17122 17108 17094 17080 17066 17052 17038 17024 17011 16997 16983 16969 16955 16942 16928
70 16928 16914 16900 16887 16873 16859 16846 16832 16819 16805 16792 16778 16765 16751 16738 16724 16711 16697 16684 16670 16657 16644 16630 16617 16604 16591 16577 16564 16551 16538 16524 16511 16498 16485 16472 16459
65 16459 16446 16433 16420 16407 16394 16381 16368 16355 16342 16329 16316 16303 16290 16277 16264 16252 16239 16226 16213 16201 16188 16175 16162 16150 16137 16124 16112 16099 16087 16074 16061 16049 16036 16024 16011
60 16011 15999 15986 15974 15962 15949 15937 15924 15912 15900 15887 15875 15863 15850 15838 15826 15814 15801 15789 15777 15765 15753 15741 15728 15716 15704 15692 15680 15668 15656 15644 15632 15620 15608 15596 15584
55A5584j2j2j1j2j2j2j2j2j1j2j2j2j1j2j2j2j1j2j2j1j2j1j2j2j1j2j1j2j1j2j1j2j1j1j2
51A5176j1j2j1j1j2j1j1j1j2j1j1j2j1j1j1j1j1j2j1j1j1j1j1j1j1j1j1j1j1j1j1j1j1j1j1
46A4786j1j1j1j0j1j1j1j1j1j0j1j1j1j0j1j1j0j1j1j0j1j1j0j1j0j1j0j1j1j0j1j0j1j0j0
41A4413j1j0j1j0j0j1j0j1j0j0j0j1j0j0j1j0j0j0j0j1j0j0j0j0j0j1j0j0j0j0j0j0j0j0j0
36A4055j0j0j0j0j0j0j0j0j0rj0j0j0j0j0j0rj0j0j0rj0j0j0rj0j0rj0j0rj0j0rj0rj0j0r
31A3674j0rj0rj0rj0rj0rj0rrj0rrj0rj0rrrj0rrj0rrrj0rrrrrj0rrrrrrrrj0rrrrrrrrrr
23A3165rqrrrrrrrrqrrrrqrrrrqrrqrrrqrrqrqrrqrqrrqrqrqrqrqrqqrqrqqrqrqqrqqrqqq
14A2572rqqqrqqqrqqqqqrqqqqqqqqqqrqqqqqqqqqpqqqqqqqqqqpqqqqqpqqqqpqqqpqqpqqqp
$$ plain form
55 15584 15572 15560 15549 15537 15525 15513 15501 15489 15478 15466 15454 15442 15431 15419 15407 15395 15384 15372 15360 15349 15337 15326 15314 15302 15291 15279 15268 15256 15245 15233 15222 15210 15199 15188 15176
51 15176 15165 15153 15142 15131 15119 15108 15097 15086 15074 15063 15052 15040 15029 15018 15007 14996 14985 14973 14962 14951 14940 14929 14918 14907 14896 14885 14874 14863 14852 14841 14830 14819 14808 14797 14786
46 14786 14775 14764 14753 14743 14732 14721 14710 14699 14688 14678 14667 14656 14645 14635 14624 14613 14603 14592 14581 14571 14560 14549 14539 14528 14518 14507 14497 14486 14475 14465 14454 14444 14433 14423 14413
41 14413 14402 14392 14381 14371 14361 14350 14340 14329 14319 14309 14299 14288 14278 14268 14257 14247 14237 14227 14217 14206 14196 14186 14176 14166 14156 14145 14135 14125 14115 14105 14095 14085 14075 14065 14055
36 14055 14045 14035 14025 14015 14005 13995 13985 13975 13965 13956 13946 13936 13926 13916 13906 13896 13887 13877 13867 13857 13848 13838 13828 13818 13809 13799 13789 13780 13770 13760 13751 13741 13731 13722 13712 13703 13693 13683 13674
31 13674 13664 13655 13645 13636 13626 13617 13607 13598 13588 13579 13569 13560 13551 13541 13532 13523 13513 13504 13494 13485 13476 13467 13457 13448 13439 13429 13420 13411 13402 13392 13383 13374 13365 13356 13347 13337 13328 13319 13310 13301 13292 13283 13274 13265 13255 13246 13237 13228 13219 13210 13201 13192 13183 13174 13165
23 13165 13156 13148 13139 13130 13121 13112 13103 13094 13085 13076 13068 13059 13050 13041 13032 13024 13015 13006 12997 12988 12980 12971 12962 12954 12945 12936 12927 12919 12910 12901 12893 12884 12876 12867 12858 12850 12841 12833 12824 12815 12807 12798 12790 12781 12773 12764 12756 12747 12739 12730 12722 12714 12705 12697 12688 12680 12672 12663 12655 12646 12638 12630 12621 12613 12605 12596 12588 12580 12572
14 12572 12563 12555 12547 12539 12530 12522 12514 12506 12497 12489 12481 12473 12465 12457 12448 12440 12432 12424 12416 12408 12400 12392 12384 12376 12368 12359 12351 12343 12335 12327 12319 12311 12303 12295 12287 12280 12272 12264 12256 12248 12240 12232 12224 12216 12208 12200 12193 12185 12177 12169 12161 12153 12146 12138 12130 12122 12114 12107 12099 12091 12083 12076 12068 12060 12053 12045 12037 12029 12022
4A2022qqpqpqqpqpqqpqpqpqpqpqpqpqpqpqppqpqppqppqppqppqppqpppqppppqppppqpppppp
-5A1505qppppppppppppppppppppppppppppppoppppppopppppopppopppopppoppoppoppoppo
-15A1031ppopoppopopoppopopopopopoopopopoopopoopopoopoopoopooopooopooopooopoo
-24A0595ooopooooopooooooooopooooooooooooooooooooooonooooooooonoooooonooooono
-34A0188oonoooonoonooonoonooonoononoonoononoononoonononononononononononononn
-43I807onononnonnononnonnonnonnonnnonnonnnonnnonnnonnnnnonnnnonnnnnnonnnnnnn
-52I444nnonnnnnnnnnnnnnnnnnnnnnnnnnnnnnnnnnnnmnnnnnnnnnmnnnnnnmnnnnnmnnnnmnn
-62I103nnmnnnmnnnmnnnmnnmnnnmnnmnnmnnmnnmnnmnmnnmnnmnmnnmnmnmnmnnmnmnmnmnmnm
$$ plain form
4 12022 12014 12006 11999 11991 11984 11976 11968 11961 11953 11946 11938 11930 11923 11915 11908 11900 11893 11885 11878 11870 11863 11855 11848 11840 11833 11825 11818 11810 11803 11795 11788 11781 11773 11766 11758 11751 11744 11736 11729 11722 11714 11707 11700 11692 11685 11678 11670 11663 11656 11648 11641 11634 11627 11619 11612 11605 11598 11591 11583 11576 11569 11562 11555 11547 11540 11533 11526 11519 11512 11505
-5 11505 11497 11490 11483 11476 11469 11462 11455 11448 11441 11434 11427 11420 11413 11406 11399 11392 11385 11378 11371 11364 11357 11350 11343 11336 11329 11322 11315 11308 11301 11294 11287 11281 11274 11267 11260 11253 11246 11239 11233 11226 11219 11212 11205 11198 11192 11185 11178 11171 11165 11158 11151 11144 11138 11131 11124 11117 11111 11104 11097 11091 11084 11077 11071 11064 11057 11051 11044 11037 11031
-15 11031 11024 11017 11011 11004 10998 10991 10984 10978 10971 10965 10958 10952 10945 10938 10932 10925 10919 10912 10906 10899 10893 10886 10880 10873 10867 10861 10854 10848 10841 10835 10828 10822 10816 10809 10803 10796 10790 10784 10777 10771 10764 10758 10752 10745 10739 10733 10726 10720 10714 10707 10701 10695 10689 10682 10676 10670 10664 10657 10651 10645 10639 10632 10626 10620 10614 10607 10601 10595
-24 10595 10589 10583 10577 10570 10564 10558 10552 10546 10540 10533 10527 10521 10515 10509 10503 10497 10491 10485 10479 10472 10466 10460 10454 10448 10442 10436 10430 10424 10418 10412 10406 10400 10394 10388 10382 10376 10370 10364 10358 10352 10346 10340 10334 10329 10323 10317 10311 10305 10299 10293 10287 10281 10275 10270 10264 10258 10252 10246 10240 10234 10229 10223 10217 10211 10205 10199 10194 10188
-34 10188 10182 10176 10171 10165 10159 10153 10147 10142 10136 10130 10125 10119 10113 10107 10102 10096 10090 10085 10079 10073 10067 10062 10056 10050 10045 10039 10034 10028 10022 10017 10011 10005 10000 9994 9989 9983 9977 9972 9966 9961 9955 9949 9944 9938 9933 9927 9922 9916 9911 9905 9900 9894 9889 9883 9878 9872 9867 9861 9856 9850 9845 9839 9834 9828 9823 9817 9812 9807
-43 9807 9801 9796 9790 9785 9779 9774 9769 9763 9758 9753 9747 9742 9736 9731 9726 9720 9715 9710 9704 9699 9694 9688 9683 9678 9672 9667 9662 9657 9651 9646 9641 9635 9630 9625 9620 9614 9609 9604 9599 9593 9588 9583 9578 9572 9567 9562 9557 9552 9547 9541 9536 9531 9526 9521 9515 9510 9505 9500 9495 9490 9485 9479 9474 9469 9464 9459 9454 9449 9444
-52 9444 9439 9434 9428 9423 9418 9413 9408 9403 9398 9393 9388 9383 9378 9373 9368 9363 9358 9353 9348 9343 9338 9333 9328 9323 9318 9313 9308 9303 9298 9293 9288 9283 9278 9273 9268 9263 9258 9253 9249 9244 9239 9234 9229 9224 9219 9214 9209 9204 9200 9195 9190 9185 9180 9175 9170 9166 9161 9156 9151 9146 9141 9137 9132 9127 9122 9117 9113 9108 9103
-62 9103 9098 9093 9089 9084 9079 9074 9070 9065 9060 9055 9051 9046 9041 9036 9032 9027 9022 9018 9013 9008 9003 8999 8994 8989 8985 8980 8975 8971 8966 8961 8957 8952 8947 8943 8938 8933 8929 8924 8920 8915 8910 8906 8901 8896 8892 8887 8883 8878 8873 8869 8864 8860 8855 8851 8846 8842 8837 8832 8828 8823 8819 8814 8810 8805 8801 8796 8792 8787 8783
-71H783nmnmnmnmnmnmnmnmmnmnmnmmnmnmmnmnmmnmmnmmnmnmmnmmmnmmnmmnmmmnmmnmmmnmm
-81H481mnmmmnmmmmnmmmmnmmmmnmmmmmmnmmmmmmnmmmmmmmmnmmmmmmmmmmmmmmnmmmmmmmmmm
-90H196mmmmmmmmmmmmmmmlmmmmmmmmmmmmmmlmmmmmmmmlmmmmmmmlmmmmmlmmmmmlmmmmlmmmm
-100G927lmmmlmmmmlmmmlmmmlmmlmmmlmmlmmmlmmlmmlmmlmmlmmlmmlmmlmlmmlmlmmlmlmml
-109G677mlmmlmlmlmmlmlmlmlmlmmlmlmlmlmlmlmlmlmlmllmlmlmlmlmlmllmlmlmllmlmllm
-118G439lmllmlmllmllmlmllmllmllmllmllmllmllmllmlllmllmlllmllmlllmlllmlllmlll
-128G214lmlllmllllmllllmllllmlllllmlllllmllllllmlllllllmlllllllllmllllllllll
-137G000lmllllllllllllllllllllllllllllllllllllllllllllllllllllllllllklllllll
$$ plain form
-71 8783 8778 8774 8769 8765 8760 8756 8751 8747 8742 8738 8733 8729 8724 8720 8715 8711 8707 8702 8698 8693 8689 8684 8680 8676 8671 8667 8662 8658 8654 8649 8645 8640 8636 8632 8627 8623 8619 8614 8610 8606 8601 8597 8592 8588 8584 8579 8575 8571 8567 8562 8558 8554 8549 8545 8541 8536 8532 8528 8524 8519 8515 8511 8506 8502 8498 8494 8489 8485 8481
-81 8481 8477 8472 8468 8464 8460 8455 8451 8447 8443 8439 8434 8430 8426 8422 8418 8413 8409 8405 8401 8397 8392 8388 8384 8380 8376 8372 8368 8363 8359 8355 8351 8347 8343 8339 8334 8330 8326 8322 8318 8314 8310 8306 8302 8297 8293 8289 8285 8281 8277 8273 8269 8265 8261 8257 8253 8249 8245 8241 8236 8232 8228 8224 8220 8216 8212 8208 8204 8200 8196
-90 8196 8192 8188 8184 8180 8176 8172 8168 8164 8160 8156 8152 8148 8144 8140 8136 8133 8129 8125 8121 8117 8113 8109 8105 8101 8097 8093 8089 8085 8081 8077 8074 8070 8066 8062 8058 8054 8050 8046 8042 8039 8035 8031 8027 8023 8019 8015 8011 8008 8004 8000 7996 7992 7988 7985 7981 7977 7973 7969 7965 7962 7958 7954 7950 7946 7943 7939 7935 7931 7927
-100 7927 7924 7920 7916 7912 7909 7905 7901 7897 7893 7890 7886 7882 7878 7875 7871 7867 7863 7860 7856 7852 7849 7845 7841 7837 7834 7830 7826 7823 7819 7815 7811 7808 7804 7800 7797 7793 7789 7786 7782 7778 7775 7771 7767 7764 7760 7756 7753 7749 7745 7742 7738 7734 7731 7727 7724 7720 7716 7713 7709 7706 7702 7698 7695 7691 7688 7684 7680 7677
-109 7677 7673 7670 7666 7662 7659 7655 7652 7648 7645 7641 7637 7634 7630 7627 7623 7620 7616 7613 7609 7606 7602 7598 7595 7591 7588 7584 7581 7577 7574 7570 7567 7563 7560 7556 7553 7549 7546 7542 7539 7535 7532 7529 7525 7522 7518 7515 7511 7508 7504 7501 7497 7494 7490 7487 7484 7480 7477 7473 7470 7466 7463 7460 7456 7453 7449 7446 7443 7439
-118 7439 7436 7432 7429 7426 7422 7419 7415 7412 7409 7405 7402 7399 7395 7392 7388 7385 7382 7378 7375 7372 7368 7365 7362 7358 7355 7352 7348 7345 7342 7338 7335 7332 7328 7325 7322 7318 7315 7312 7308 7305 7302 7299 7295 7292 7289 7285 7282 7279 7276 7272 7269 7266 7262 7259 7256 7253 7249 7246 7243 7240 7236 7233 7230 7227 7223 7220 7217 7214
-128 7214 7211 7207 7204 7201 7198 7194 7191 7188 7185 7182 7178 7175 7172 7169 7166 7162 7159 7156 7153 7150 7146 7143 7140 7137 7134 7131 7127 7124 7121 7118 7115 7112 7108 7105 7102 7099 7096 7093 7090 7086 7083 7080 7077 7074 7071 7068 7065 7061 7058 7055 7052 7049 7046 7043 7040 7037 7034 7030 7027 7024 7021 7018 7015 7012 7009 7006 7003 7000
-137 7000 6997 6993 6990 6987 6984 6981 6978 6975 6972 6969 6966 6963 6960 6957 6954 6951 6948 6945 6942 6939 6936 6933 6930 6927 6924 6921 6918 6915 6912 6909 6906 6903 6900 6897 6894 6891 6888 6885 6882 6879 6876 6873 6870 6867 6864 6861 6858 6855 6852 6849 6846 6843 6840 6837 6834 6831 6828 6825 6822 6819 6817 6814 6811 6808 6805 6802 6799 6796
-146F796lllllklllllllllklllllllkllllllkllllllklllllklllllkllllkllllkllllklll
-156F602lklllklllkllllklllkllklllklllkllklllkllklllkllkllkllkllkllkllkllkllk
-165F418llkllkllklkllkllklkllkllklkllklkllklklkllklklkllklklkllklklklklklkll
-174F241klklklklklklklklklklklklklklklklklklkklklklklklkklklklklkklklklkklkl
-184F073klkklklkklklkklklkklkklklkklkklklkklkklkklkklkklkklkklkklkklkklkklkk
-193E913lkklkkklkklkkklkklkkklkklkkklkkklkkklkkklkkklkkklkkklkkklkkkklkkkklk
-203E759kklkkkklkkkklkkkkklkkkklkkkkklkkkkklkkkkkklkkkkkklkkkkkklkkkkkkklkkk
-212E612kkkkklkkkkkkkkklkkkkkkkkkklkkkkkkkkkkkkklkkkkkkkkkkkkkkkkkkkklkkkkkk
$$ plain form
-146 6796 6793 6790 6787 6784 6781 6779 6776 6773 6770 6767 6764 6761 6758 6755 6752 6750 6747 6744 6741 6738 6735 6732 6729 6727 6724 6721 6718 6715 6712 6709 6707 6704 6701 6698 6695 6692 6689 6687 6684 6681 6678 6675 6672 6670 6667 6664 6661 6658 6655 6653 6650 6647 6644 6641 6639 6636 6633 6630 6627 6625 6622 6619 6616 6613 6611 6608 6605 6602
-156 6602 6599 6597 6594 6591 6588 6586 6583 6580 6577 6575 6572 6569 6566 6563 6561 6558 6555 6552 6550 6547 6544 6542 6539 6536 6533 6531 6528 6525 6522 6520 6517 6514 6512 6509 6506 6503 6501 6498 6495 6493 6490 6487 6484 6482 6479 6476 6474 6471 6468 6466 6463 6460 6458 6455 6452 6450 6447 6444 6442 6439 6436 6434 6431 6428 6426 6423 6420 6418
-165 6418 6415 6412 6410 6407 6404 6402 6399 6396 6394 6391 6389 6386 6383 6381 6378 6375 6373 6370 6368 6365 6362 6360 6357 6354 6352 6349 6347 6344 6341 6339 6336 6334 6331 6328 6326 6323 6321 6318 6316 6313 6310 6308 6305 6303 6300 6298 6295 6292 6290 6287 6285 6282 6280 6277 6274 6272 6269 6267 6264 6262 6259 6257 6254 6252 6249 6247 6244 6241
-174 6241 6239 6236 6234 6231 6229 6226 6224 6221 6219 6216 6214 6211 6209 6206 6204 6201 6199 6196 6194 6191 6189 6186 6184 6181 6179 6176 6174 6171 6169 6166 6164 6161 6159 6156 6154 6151 6149 6147 6144 6142 6139 6137 6134 6132 6129 6127 6124 6122 6120 6117 6115 6112 6110 6107 6105 6102 6100 6098 6095 6093 6090 6088 6085 6083 6081 6078 6076 6073
-184 6073 6071 6068 6066 6064 6061 6059 6056 6054 6052 6049 6047 6044 6042 6040 6037 6035 6032 6030 6028 6025 6023 6021 6018 6016 6013 6011 6009 6006 6004 6002 5999 5997 5994 5992 5990 5987 5985 5983 5980 5978 5976 5973 5971 5969 5966 5964 5962 5959 5957 5955 5952 5950 5948 5945 5943 5941 5938 5936 5934 5931 5929 5927 5924 5922 5920 5917 5915 5913
-193 5913 5910 5908 5906 5903 5901 5899 5897 5894 5892 5890 5887 5885 5883 5881 5878 5876 5874 5871 5869 5867 5865 5862 5860 5858 5855 5853 5851 5849 5846 5844 5842 5840 5837 5835 5833 5831 5828 5826 5824 5822 5819 5817 5815 5813 5810 5808 5806 5804 5801 5799 5797 5795 5792 5790 5788 5786 5783 5781 5779 5777 5775 5772 5770 5768 5766 5764 5761 5759
-203 5759 5757 5755 5752 5750 5748 5746 5744 5741 5739 5737 5735 5733 5730 5728 5726 5724 5722 5720 5717 5715 5713 5711 5709 5706 5704 5702 5700 5698 5696 5693 5691 5689 5687 5685 5683 5680 5678 5676 5674 5672 5670 5668 5665 5663 5661 5659 5657 5655 5653 5650 5648 5646 5644 5642 5640 5638 5635 5633 5631 5629 5627 5625 5623 5621 5618 5616 5614 5612
-212 5612 5610 5608 5606 5604 5602 5599 5597 5595 5593 5591 5589 5587 5585 5583 5581 5578 5576 5574 5572 5570 5568 5566 5564 5562 5560 5558 5555 5553 5551 5549 5547 5545 5543 5541 5539 5537 5535 5533 5531 5529 5526 5524 5522 5520 5518 5516 5514 5512 5510 5508 5506 5504 5502 5500 5498 5496 5494 5492 5490 5488 5486 5483 5481 5479 5477 5475 5473 5471
-221E471kkkkkkkkkkkkkkkkkkkkkkkkkkkkkkkkkkkkkkkkkkkkkkkkkjkkkkkkkkkkkkkkkkkk
-231E336kkjkkkkkkkkkkkkkkjkkkkkkkkkkkjkkkkkkkkkjkkkkkkkkjkkkkkkkkjkkkkkkjkkk
-240E207kkkkjkkkkkkjkkkkkjkkkkkkjkkkkkjkkkkjkkkkkjkkkkkjkkkkjkkkkjkkkkjkkkkj
-249E083kkkjkkkkjkkkkjkkkjkkkjkkkkjkkkjkkkjkkkjkkkjkkkjkkkjkkjkkkjkkkjkkkjkk
-259D963jkkkjkkjkkkjkkjkkjkkkjkkjkkjkkkjkkjkkjkkjkkjkkjkkjkkjkkjkkjkkjkkjkkj
-268D849kkjkkjkkjkkjkjkkjkkjkkjkjkkjkkjkjkkjkkjkjkkjkjkkjkkjkjkkjkjkkjkjkkjk
-277D738jkjkkjkjkkjkjkjkkjkjkkjkjkjkjkkjkjkjkkjkjkjkjkkjkjkjkjkjkkjkjkjkjkjk
-287D632jkjkkjkjkjkjkjkjkjkjkjkjkjkjkjkjkjkjkjkjkjkjkjkjkjkjkjkjkjkjkjkjkjkj
$$ plain form
-221 5471 5469 5467 5465 5463 5461 5459 5457 5455 5453 5451 5449 5447 5445 5443 5441 5439 5437 5435 5433 5431 5429 5427 5425 5423 5421 5419 5417 5415 5413 5411 5409 5407 5405 5403 5401 5399 5397 5395 5393 5391 5389 5387 5385 5383 5381 5379 5377 5375 5373 5372 5370 5368 5366 5364 5362 5360 5358 5356 5354 5352 5350 5348 5346 5344 5342 5340 5338 5336
-231 5336 5334 5332 5331 5329 5327 5325 5323 5321 5319 5317 5315 5313 5311 5309 5307 5305 5303 5302 5300 5298 5296 5294 5292 5290 5288 5286 5284 5282 5280 5279 5277 5275 5273 5271 5269 5267 5265 5263 5261 5260 5258 5256 5254 5252 5250 5248 5246 5244 5243 5241 5239 5237 5235 5233 5231 5229 5227 5226 5224 5222 5220 5218 5216 5214 5213 5211 5209 5207
-240 5207 5205 5203 5201 5199 5198 5196 5194 5192 5190 5188 5186 5185 5183 5181 5179 5177 5175 5174 5172 5170 5168 5166 5164 5162 5161 5159 5157 5155 5153 5151 5150 5148 5146 5144 5142 5141 5139 5137 5135 5133 5131 5130 5128 5126 5124 5122 5120 5119 5117 5115 5113 5111 5110 5108 5106 5104 5102 5101 5099 5097 5095 5093 5092 5090 5088 5086 5084 5083
-249 5083 5081 5079 5077 5076 5074 5072 5070 5068 5067 5065 5063 5061 5059 5058 5056 5054 5052 5051 5049 5047 5045 5044 5042 5040 5038 5036 5035 5033 5031 5029 5028 5026 5024 5022 5021 5019 5017 5015 5014 5012 5010 5008 5007 5005 5003 5001 5000 4998 4996 4994 4993 4991 4989 4988 4986 4984 4982 4981 4979 4977 4975 4974 4972 4970 4968 4967 4965 4963
-259 4963 4962 4960 4958 4956 4955 4953 4951 4950 4948 4946 4944 4943 4941 4939 4938 4936 4934 4933 4931 4929 4927 4926 4924 4922 4921 4919 4917 4916 4914 4912 4910 4909 4907 4905 4904 4902 4900 4899 4897 4895 4894 4892 4890 4889 4887 4885 4884 4882 4880 4879 4877 4875 4874 4872 4870 4869 4867 4865 4864 4862 4860 4859 4857 4855 4854 4852 4850 4849
-268 4849 4847 4845 4844 4842 4840 4839 4837 4835 4834 4832 4830 4829 4827 4826 4824 4822 4821 4819 4817 4816 4814 4812 4811 4809 4808 4806 4804 4803 4801 4799 4798 4796 4795 4793 4791 4790 4788 4786 4785 4783 4782 4780 4778 4777 4775 4774 4772 4770 4769 4767 4765 4764 4762 4761 4759 4757 4756 4754 4753 4751 4749 4748 4746 4745 4743 4741 4740 4738
-277 4738 4737 4735 4734 4732 4730 4729 4727 4726 4724 4722 4721 4719 4718 4716 4715 4713 4711 4710 4708 4707 4705 4703 4702 4700 4699 4697 4696 4694 4693 4691 4689 4688 4686 4685 4683 4682 4680 4678 4677 4675 4674 4672 4671 4669 4668 4666 4664 4663 4661 4660 4658 4657 4655 4654 4652 4651 4649 4647 4646 4644 4643 4641 4640 4638 4637 4635 4634 4632
-287 4632 4631 4629 4628 4626 4624 4623 4621 4620 4618 4617 4615 4614 4612 4611 4609 4608 4606 4605 4603 4602 4600 4599 4597 4596 4594 4593 4591 4590 4588 4587 4585 4584 4582 4581 4579 4578 4576 4575 4573 4572 4570 4569 4567 4566 4564 4563 4561 4560 4558 4557 4555 4554 4552 4551 4549 4548 4546 4545 4543 4542 4540 4539 4537 4536 4534 4533 4531 4530
-296D530kjkjjkjkjkjkjkjkjkjjkjkjkjkjkjjkjkjkjkjkjjkjkjkjjkjkjkjkjjkjkjkjjkjk
-305D431jjkjkjkjjkjkjjkjkjkjjkjkjjkjkjjkjkjjkjkjjkjjkjkjjkjkjjkjjkjkjjkjjkjk
-315D336jjkjjkjkjjkjjkjjkjkjjkjjkjjkjjkjjkjkjjkjjkjjkjjkjjkjjkjjkjjkjjkjjkjj
-324D245kjjjkjjkjjkjjkjjkjjkjjjkjjkjjkjjkjjjkjjkjjjkjjkjjkjjjkjjkjjjkjjjkjjk
-333D156jjjkjjkjjjkjjjkjjjkjjkjjjkjjjkjjjkjjjkjjjkjjjkjjjkjjjkjjjkjjjkjjjkjj
-343D071jjkjjjkjjjkjjjjkjjjkjjjjkjjjjkjjjkjjjjkjjjjkjjjjkjjjjkjjjjkjjjjkjjjj
-352C989kjjjjkjjjjkjjjjjkjjjjkjjjjjkjjjjjkjjjjjkjjjjjkjjjjjkjjjjjkjjjjjkjjjj
-361C909jjkjjjjjjkjjjjjkjjjjjjkjjjjjjjkjjjjjjkjjjjjjjkjjjjjjjkjjjjjjjkjjjjjj
$$ plain form
-296 4530 4528 4527 4525 4524 4523 4521 4520 4518 4517 4515 4514 4512 4511 4509 4508 4506 4505 4503 4502 4501 4499 4498 4496 4495 4493 4492 4490 4489 4487 4486 4485 4483 4482 4480 4479 4477 4476 4474 4473 4471 4470 4469 4467 4466 4464 4463 4461 4460 4459 4457 4456 4454 4453 4451 4450 4448 4447 4446 4444 4443 4441 4440 4438 4437 4436 4434 4433 4431
-305 4431 4430 4429 4427 4426 4424 4423 4421 4420 4419 4417 4416 4414 4413 4412 4410 4409 4407 4406 4404 4403 4402 4400 4399 4397 4396 4395 4393 4392 4390 4389 4388 4386 4385 4383 4382 4381 4379 4378 4376 4375 4374 4372 4371 4370 4368 4367 4365 4364 4363 4361 4360 4358 4357 4356 4354 4353 4352 4350 4349 4347 4346 4345 4343 4342 4341 4339 4338 4336
-315 4336 4335 4334 4332 4331 4330 4328 4327 4325 4324 4323 4321 4320 4319 4317 4316 4315 4313 4312 4310 4309 4308 4306 4305 4304 4302 4301 4300 4298 4297 4296 4294 4293 4292 4290 4289 4287 4286 4285 4283 4282 4281 4279 4278 4277 4275 4274 4273 4271 4270 4269 4267 4266 4265 4263 4262 4261 4259 4258 4257 4255 4254 4253 4251 4250 4249 4247 4246 4245
-324 4245 4243 4242 4241 4240 4238 4237 4236 4234 4233 4232 4230 4229 4228 4226 4225 4224 4222 4221 4220 4218 4217 4216 4215 4213 4212 4211 4209 4208 4207 4205 4204 4203 4201 4200 4199 4198 4196 4195 4194 4192 4191 4190 4189 4187 4186 4185 4183 4182 4181 4179 4178 4177 4176 4174 4173 4172 4170 4169 4168 4167 4165 4164 4163 4162 4160 4159 4158 4156
-333 4156 4155 4154 4153 4151 4150 4149 4147 4146 4145 4144 4142 4141 4140 4139 4137 4136 4135 4134 4132 4131 4130 4128 4127 4126 4125 4123 4122 4121 4120 4118 4117 4116 4115 4113 4112 4111 4110 4108 4107 4106 4105 4103 4102 4101 4100 4098 4097 4096 4095 4093 4092 4091 4090 4088 4087 4086 4085 4083 4082 4081 4080 4078 4077 4076 4075 4073 4072 4071
-343 4071 4070 4069 4067 4066 4065 4064 4062 4061 4060 4059 4057 4056 4055 4054 4053 4051 4050 4049 4048 4046 4045 4044 4043 4042 4040 4039 4038 4037 4036 4034 4033 4032 4031 4029 4028 4027 4026 4025 4023 4022 4021 4020 4019 4017 4016 4015 4014 4013 4011 4010 4009 4008 4007 4005 4004 4003 4002 4001 3999 3998 3997 3996 3995 3993 3992 3991 3990 3989
-352 3989 3987 3986 3985 3984 3983 3981 3980 3979 3978 3977 3975 3974 3973 3972 3971 3970 3968 3967 3966 3965 3964 3962 3961 3960 3959 3958 3957 3955 3954 3953 3952 3951 3950 3948 3947 3946 3945 3944 3943 3941 3940 3939 3938 3937 3936 3934 3933 3932 3931 3930 3929 3927 3926 3925 3924 3923 3922 3920 3919 3918 3917 3916 3915 3913 3912 3911 3910 3909
-361 3909 3908 3907 3905 3904 3903 3902 3901 3900 3899 3897 3896 3895 3894 3893 3892 3890 3889 3888 3887 3886 3885 3884 3882 3881 3880 3879 3878 3877 3876 3875 3873 3872 3871 3870 3869 3868 3867 3865 3864 3863 3862 3861 3860 3859 3858 3856 3855 3854 3853 3852 3851 3850 3849 3847 3846 3845 3844 3843 3842 3841 3840 3838 3837 3836 3835 3834 3833 3832
-371C832jjkjjjjjjjjkjjjjjjjjkjjjjjjjjjkjjjjjjjjjjkjjjjjjjjjjkjjjjjjjjjjjkjjj
-380C757jjjjjjjjjkjjjjjjjjjjjjjkjjjjjjjjjjjjjjjkjjjjjjjjjjjjjjjjjjkjjjjjjjjj
-389C685jjjjjjjjjjjjjkjjjjjjjjjjjjjjjjjjjjjjjjjjjjjjjjjkjjjjjjjjjjjjjjjjjjjj
-399C615jjjjjjjjjjjjjjjjjjjjjjjjjjjjjjjjjjjjjjjjjjjjjjjjjjjjjjjjjjjjjjjjjjjj
-408C547j%jjjjjjjjjjjjjjjjjjjjjjjjjjjjjjjjjj%jjjjjjjjjjjjjjjjjjjjjjj%jjjjjjj
-417C482jjjjjjjjjjj%jjjjjjjjjjjjjjjj%jjjjjjjjjjjjjj%jjjjjjjjjjjjj%jjjjjjjjjj
-427C418jj%jjjjjjjjjjj%jjjjjjjjjjj%jjjjjjjjjj%jjjjjjjjj%jjjjjjjjj%jjjjjjjjj%
-436C357jjjjjjjj%jjjjjjjj%jjjjjjj%jjjjjjjj%jjjjjjj%jjjjjjj%jjjjjjj%jjjjjjj%j
$$ plain form
-371 3832 3831 3830 3828 3827 3826 3825 3824 3823 3822 3821 3820 3818 3817 3816 3815 3814 3813 3812 3811 3810 3808 3807 3806 3805 3804 3803 3802 3801 3800 3799 3797 3796 3795 3794 3793 3792 3791 3790 3789 3788 3787 3785 3784 3783 3782 3781 3780 3779 3778 3777 3776 3775 3773 3772 3771 3770 3769 3768 3767 3766 3765 3764 3763 3762 3760 3759 3758 3757
-380 3757 3756 3755 3754 3753 3752 3751 3750 3749 3748 3746 3745 3744 3743 3742 3741 3740 3739 3738 3737 3736 3735 3734 3733 3731 3730 3729 3728 3727 3726 3725 3724 3723 3722 3721 3720 3719 3718 3717 3716 3714 3713 3712 3711 3710 3709 3708 3707 3706 3705 3704 3703 3702 3701 3700 3699 3698 3697 3696 3694 3693 3692 3691 3690 3689 3688 3687 3686 3685
-389 3685 3684 3683 3682 3681 3680 3679 3678 3677 3676 3675 3674 3673 3672 3670 3669 3668 3667 3666 3665 3664 3663 3662 3661 3660 3659 3658 3657 3656 3655 3654 3653 3652 3651 3650 3649 3648 3647 3646 3645 3644 3643 3642 3641 3640 3639 3638 3637 3635 3634 3633 3632 3631 3630 3629 3628 3627 3626 3625 3624 3623 3622 3621 3620 3619 3618 3617 3616 3615
-399 3615 3614 3613 3612 3611 3610 3609 3608 3607 3606 3605 3604 3603 3602 3601 3600 3599 3598 3597 3596 3595 3594 3593 3592 3591 3590 3589 3588 3587 3586 3585 3584 3583 3582 3581 3580 3579 3578 3577 3576 3575 3574 3573 3572 3571 3570 3569 3568 3567 3566 3565 3564 3563 3562 3561 3560 3559 3558 3557 3556 3555 3554 3553 3552 3551 3550 3549 3548 3547
-408 3547 3546 3546 3545 3544 3543 3542 3541 3540 3539 3538 3537 3536 3535 3534 3533 3532 3531 3530 3529 3528 3527 3526 3525 3524 3523 3522 3521 3520 3519 3518 3517 3516 3515 3514 3513 3512 3512 3511 3510 3509 3508 3507 3506 3505 3504 3503 3502 3501 3500 3499 3498 3497 3496 3495 3494 3493 3492 3491 3490 3489 3489 3488 3487 3486 3485 3484 3483 3482
-417 3482 3481 3480 3479 3478 3477 3476 3475 3474 3473 3472 3471 3471 3470 3469 3468 3467 3466 3465 3464 3463 3462 3461 3460 3459 3458 3457 3456 3455 3455 3454 3453 3452 3451 3450 3449 3448 3447 3446 3445 3444 3443 3442 3441 3441 3440 3439 3438 3437 3436 3435 3434 3433 3432 3431 3430 3429 3428 3428 3427 3426 3425 3424 3423 3422 3421 3420 3419 3418
-427 3418 3417 3416 3416 3415 3414 3413 3412 3411 3410 3409 3408 3407 3406 3405 3405 3404 3403 3402 3401 3400 3399 3398 3397 3396 3395 3394 3394 3393 3392 3391 3390 3389 3388 3387 3386 3385 3384 3384 3383 3382 3381 3380 3379 3378 3377 3376 3375 3375 3374 3373 3372 3371 3370 3369 3368 3367 3366 3366 3365 3364 3363 3362 3361 3360 3359 3358 3357 3357
-436 3357 3356 3355 3354 3353 3352 3351 3350 3349 3349 3348 3347 3346 3345 3344 3343 3342 3341 3341 3340 3339 3338 3337 3336 3335 3334 3334 3333 3332 3331 3330 3329 3328 3327 3326 3326 3325 3324 3323 3322 3321 3320 3319 3319 3318 3317 3316 3315 3314 3313 3312 3312 3311 3310 3309 3308 3307 3306 3305 3305 3304 3303 3302 3301 3300 3299 3298 3298 3297
-445C297jjjjj%jjjjjj%jjjjjjj%jjjjjj%jjjjjj%jjjjj%jjjjjj%jjjjjj%jjjjj%jjjjj%j
-455C239jjjjj%jjjjj%jjjjj%jjjjj%jjjjj%jjjjj%jjjjj%jjjj%jjjjj%jjjjj%jjjj%jjjj
-464C182j%jjjj%jjjjj%jjjj%jjjj%jjjj%jjjjj%jjjj%jjjj%jjjj%jjjj%jjjj%jjjj%jjjj
-473C127%jjj%jjjj%jjjj%jjjj%jjj%jjjj%jjjj%jjj%jjjj%jjj%jjjj%jjj%jjjj%jjj%jjj
-483C074j%jjj%jjj%jjjj%jjj%jjj%jjj%jjj%jjjj%jjj%jjj%jjj%jjj%jjj%jjj%jjj%jjj%
-492C023jjj%jjj%jjj%jjj%jjj%jjj%jjj%jjj%jjj%jj%jjj%jjj%jjj%jjj%jj%jjj%jjj%jj
-501B972%jjj%jjj%jj%jjj%jjj%jj%jjj%jjj%jj%jjj%jj%jjj%jj%jjj%jj%jjj%jj%jjj%jj
-511B923%jjj%jj%jj%jjj%jj%jjj%jj%jj%jjj%jj%jj%jjj%jj%jj%jj%jjj%jj%jj%jjj%jj%
$$ plain form
-445 3297 3296 3295 3294 3293 3292 3292 3291 3290 3289 3288 3287 3286 3286 3285 3284 3283 3282 3281 3280 3279 3279 3278 3277 3276 3275 3274 3273 3273 3272 3271 3270 3269 3268 3267 3267 3266 3265 3264 3263 3262 3262 3261 3260 3259 3258 3257 3256 3256 3255 3254 3253 3252 3251 3250 3250 3249 3248 3247 3246 3245 3245 3244 3243 3242 3241 3240 3240 3239
-455 3239 3238 3237 3236 3235 3234 3234 3233 3232 3231 3230 3229 3229 3228 3227 3226 3225 3224 3224 3223 3222 3221 3220 3219 3219 3218 3217 3216 3215 3214 3214 3213 3212 3211 3210 3209 3209 3208 3207 3206 3205 3204 3204 3203 3202 3201 3200 3200 3199 3198 3197 3196 3195 3195 3194 3193 3192 3191 3190 3190 3189 3188 3187 3186 3186 3185 3184 3183 3182
-464 3182 3181 3181 3180 3179 3178 3177 3177 3176 3175 3174 3173 3172 3172 3171 3170 3169 3168 3168 3167 3166 3165 3164 3164 3163 3162 3161 3160 3160 3159 3158 3157 3156 3155 3155 3154 3153 3152 3151 3151 3150 3149 3148 3147 3147 3146 3145 3144 3143 3143 3142 3141 3140 3139 3139 3138 3137 3136 3135 3135 3134 3133 3132 3131 3131 3130 3129 3128 3127
-473 3127 3127 3126 3125 3124 3124 3123 3122 3121 3120 3120 3119 3118 3117 3116 3116 3115 3114 3113 3112 3112 3111 3110 3109 3109 3108 3107 3106 3105 3105 3104 3103 3102 3101 3101 3100 3099 3098 3098 3097 3096 3095 3094 3094 3093 3092 3091 3091 3090 3089 3088 3087 3087 3086 3085 3084 3084 3083 3082 3081 3080 3080 3079 3078 3077 3077 3076 3075 3074
-483 3074 3073 3073 3072 3071 3070 3070 3069 3068 3067 3067 3066 3065 3064 3063 3063 3062 3061 3060 3060 3059 3058 3057 3057 3056 3055 3054 3054 3053 3052 3051 3051 3050 3049 3048 3047 3047 3046 3045 3044 3044 3043 3042 3041 3041 3040 3039 3038 3038 3037 3036 3035 3035 3034 3033 3032 3032 3031 3030 3029 3029 3028 3027 3026 3026 3025 3024 3023 3023
-492 3023 3022 3021 3020 3020 3019 3018 3017 3017 3016 3015 3014 3014 3013 3012 3011 3011 3010 3009 3008 3008 3007 3006 3005 3005 3004 3003 3002 3002 3001 3000 2999 2999 2998 2997 2996 2996 2995 2994 2994 2993 2992 2991 2991 2990 2989 2988 2988 2987 2986 2985 2985 2984 2983 2982 2982 2981 2980 2980 2979 2978 2977 2977 2976 2975 2974 2974 2973 2972
-501 2972 2972 2971 2970 2969 2969 2968 2967 2966 2966 2965 2964 2964 2963 2962 2961 2961 2960 2959 2958 2958 2957 2956 2956 2955 2954 2953 2953 2952 2951 2950 2950 2949 2948 2948 2947 2946 2945 2945 2944 2943 2943 2942 2941 2940 2940 2939 2938 2938 2937 2936 2935 2935 2934 2933 2933 2932 2931 2930 2930 2929 2928 2928 2927 2926 2925 2925 2924 2923
-511 2923 2923 2922 2921 2920 2920 2919 2918 2918 2917 2916 2916 2915 2914 2913 2913 2912 2911 2911 2910 2909 2908 2908 2907 2906 2906 2905 2904 2904 2903 2902 2901 2901 2900 2899 2899 2898 2897 2897 2896 2895 2894 2894 2893 2892 2892 2891 2890 2890 2889 2888 2888 2887 2886 2885 2885 2884 2883 2883 2882 2881 2881 2880 2879 2878 2878 2877 2876 2876
-520B876jj%jj%jj%jjj%jj%jj%jj%jj%jj%jjj%jj%jj%jj%jj%jj%jj%jj%jjj%jj%jj%jj%jj
-529B829%jj%jj%jj%jj%jj%jj%jj%jj%jj%jj%jj%jj%jj%jj%jj%jj%jj%j%jj%jj%jj%jj%jj
-539B784%jj%jj%jj%jj%j%jj%jj%jj%jj%jj%j%jj%jj%jj%jj%jj%j%jj%jj%jj%j%jj%jj%jj
-548B740%jj%j%jj%jj%j%jj%jj%jj%j%jj%jj%j%jj%jj%jj%j%jj%jj%j%jj%jj%j%jj%j%jj%
-558B698jj%j%jj%jj%j%jj%j%jj%jj%j%jj%j%jj%jj%j%jj%j%jj%j%jj%jj%j%jj%j%jj%j%j
-567B656j%j%jj%j%jj%j%jj%j%jj%j%jj%j%jj%j%jj%j%jj%j%jj%j%jj%j%jj%j%jj%j%j%jj
-576B615%j%jj%j%jj%j%j%jj%j%jj%j%j%jj%j%jj%j%j%jj%j%jj%j%j%jj%j%j%jj%j%jj%j%
-586B576j%jj%j%j%jj%j%j%jj%j%j%jj%j%j%jj%j%j%j%jj%j%j%jj%j%j%jj%j%j%j%jj%j%j
$$ plain form
-520 2876 2875 2874 2874 2873 2872 2872 2871 2870 2870 2869 2868 2867 2867 2866 2865 2865 2864 2863 2863 2862 2861 2861 2860 2859 2859 2858 2857 2857 2856 2855 2854 2854 2853 2852 2852 2851 2850 2850 2849 2848 2848 2847 2846 2846 2845 2844 2844 2843 2842 2842 2841 2840 2840 2839 2838 2837 2837 2836 2835 2835 2834 2833 2833 2832 2831 2831 2830 2829
-529 2829 2829 2828 2827 2827 2826 2825 2825 2824 2823 2823 2822 2821 2821 2820 2819 2819 2818 2817 2817 2816 2815 2815 2814 2813 2813 2812 2811 2811 2810 2809 2809 2808 2807 2807 2806 2805 2805 2804 2803 2803 2802 2801 2801 2800 2799 2799 2798 2797 2797 2796 2795 2795 2794 2794 2793 2792 2792 2791 2790 2790 2789 2788 2788 2787 2786 2786 2785 2784
-539 2784 2784 2783 2782 2782 2781 2780 2780 2779 2778 2778 2777 2776 2776 2775 2775 2774 2773 2773 2772 2771 2771 2770 2769 2769 2768 2767 2767 2766 2765 2765 2764 2764 2763 2762 2762 2761 2760 2760 2759 2758 2758 2757 2756 2756 2755 2754 2754 2753 2753 2752 2751 2751 2750 2749 2749 2748 2747 2747 2746 2746 2745 2744 2744 2743 2742 2742 2741 2740
-548 2740 2740 2739 2738 2738 2737 2737 2736 2735 2735 2734 2733 2733 2732 2732 2731 2730 2730 2729 2728 2728 2727 2726 2726 2725 2725 2724 2723 2723 2722 2721 2721 2720 2720 2719 2718 2718 2717 2716 2716 2715 2714 2714 2713 2713 2712 2711 2711 2710 2709 2709 2708 2708 2707 2706 2706 2705 2704 2704 2703 2703 2702 2701 2701 2700 2700 2699 2698 2698
-558 2698 2697 2696 2696 2695 2695 2694 2693 2693 2692 2691 2691 2690 2690 2689 2688 2688 2687 2687 2686 2685 2685 2684 2683 2683 2682 2682 2681 2680 2680 2679 2679 2678 2677 2677 2676 2675 2675 2674 2674 2673 2672 2672 2671 2671 2670 2669 2669 2668 2668 2667 2666 2666 2665 2664 2664 2663 2663 2662 2661 2661 2660 2660 2659 2658 2658 2657 2657 2656
-567 2656 2655 2655 2654 2654 2653 2652 2652 2651 2651 2650 2649 2649 2648 2648 2647 2646 2646 2645 2645 2644 2643 2643 2642 2642 2641 2640 2640 2639 2639 2638 2637 2637 2636 2636 2635 2634 2634 2633 2633 2632 2631 2631 2630 2630 2629 2628 2628 2627 2627 2626 2625 2625 2624 2624 2623 2622 2622 2621 2621 2620 2619 2619 2618 2618 2617 2617 2616 2615
-576 2615 2615 2614 2614 2613 2612 2612 2611 2611 2610 2609 2609 2608 2608 2607 2607 2606 2605 2605 2604 2604 2603 2602 2602 2601 2601 2600 2600 2599 2598 2598 2597 2597 2596 2595 2595 2594 2594 2593 2593 2592 2591 2591 2590 2590 2589 2588 2588 2587 2587 2586 2586 2585 2584 2584 2583 2583 2582 2582 2581 2580 2580 2579 2579 2578 2577 2577 2576 2576
-586 2576 2575 2575 2574 2573 2573 2572 2572 2571 2571 2570 2569 2569 2568 2568 2567 2567 2566 2565 2565 2564 2564 2563 2563 2562 2561 2561 2560 2560 2559 2559 2558 2557 2557 2556 2556 2555 2555 2554 2554 2553 2552 2552 2551 2551 2550 2550 2549 2548 2548 2547 2547 2546 2546 2545 2544 2544 2543 2543 2542 2542 2541 2541 2540 2539 2539 2538 2538 2537
-595B537%jj%j%j%j%jj%j%j%j%jj%j%j%j%jj%j%j%j%jj%j%j%j%jj%j%j%j%j%jj%j%j%j%jj
-604B499%j%j%j%j%jj%j%j%j%j%j%jj%j%j%j%j%jj%j%j%j%j%j%jj%j%j%j%j%j%j%jj%j%j%
-614B463j%j%j%jj%j%j%j%j%j%j%j%jj%j%j%j%j%j%j%j%j%jj%j%j%j%j%j%j%j%j%j%jj%j%
-623B427j%j%j%j%j%j%j%j%j%j%jj%j%j%j%j%j%j%j%j%j%j%j%j%j%j%j%j%j%jj%j%j%j%j%
-632B392j%j%j%j%j%j%j%j%j%j%j%j%j%j%j%j%j%j%j%j%j%j%j%j%j%j%j%j%j%j%j%j%j%j%
-642B358j%j%j%j%j%j%j%j%j%j%j%j%j%j%j%j%j%j%j%%j%j%j%j%j%j%j%j%j%j%j%j%j%j%j
-651B324%j%j%j%%j%j%j%j%j%j%j%j%j%j%j%j%j%%j%j%j%j%j%j%j%j%j%j%j%%j%j%j%j%j%
-660B292j%j%j%j%%j%j%j%j%j%j%j%j%%j%j%j%j%j%j%j%j%%j%j%j%j%j%j%%j%j%j%j%j%j%
$$ plain form
-595 2537 2537 2536 2535 2535 2534 2534 2533 2533 2532 2532 2531 2530 2530 2529 2529 2528 2528 2527 2527 2526 2525 2525 2524 2524 2523 2523 2522 2522 2521 2520 2520 2519 2519 2518 2518 2517 2517 2516 2515 2515 2514 2514 2513 2513 2512 2512 2511 2510 2510 2509 2509 2508 2508 2507 2507 2506 2506 2505 2504 2504 2503 2503 2502 2502 2501 2501 2500 2499
-604 2499 2499 2498 2498 2497 2497 2496 2496 2495 2495 2494 2493 2493 2492 2492 2491 2491 2490 2490 2489 2489 2488 2488 2487 2486 2486 2485 2485 2484 2484 2483 2483 2482 2482 2481 2480 2480 2479 2479 2478 2478 2477 2477 2476 2476 2475 2475 2474 2473 2473 2472 2472 2471 2471 2470 2470 2469 2469 2468 2468 2467 2467 2466 2465 2465 2464 2464 2463 2463
-614 2463 2462 2462 2461 2461 2460 2460 2459 2458 2458 2457 2457 2456 2456 2455 2455 2454 2454 2453 2453 2452 2452 2451 2451 2450 2449 2449 2448 2448 2447 2447 2446 2446 2445 2445 2444 2444 2443 2443 2442 2442 2441 2441 2440 2439 2439 2438 2438 2437 2437 2436 2436 2435 2435 2434 2434 2433 2433 2432 2432 2431 2431 2430 2430 2429 2428 2428 2427 2427
-623 2427 2426 2426 2425 2425 2424 2424 2423 2423 2422 2422 2421 2421 2420 2420 2419 2419 2418 2418 2417 2417 2416 2415 2415 2414 2414 2413 2413 2412 2412 2411 2411 2410 2410 2409 2409 2408 2408 2407 2407 2406 2406 2405 2405 2404 2404 2403 2403 2402 2402 2401 2401 2400 2400 2399 2399 2398 2398 2397 2396 2396 2395 2395 2394 2394 2393 2393 2392 2392
-632 2392 2391 2391 2390 2390 2389 2389 2388 2388 2387 2387 2386 2386 2385 2385 2384 2384 2383 2383 2382 2382 2381 2381 2380 2380 2379 2379 2378 2378 2377 2377 2376 2376 2375 2375 2374 2374 2373 2373 2372 2372 2371 2371 2370 2370 2369 2369 2368 2368 2367 2367 2366 2366 2365 2365 2364 2364 2363 2363 2362 2362 2361 2361 2360 2360 2359 2359 2358 2358
-642 2358 2357 2357 2356 2356 2355 2355 2354 2354 2353 2353 2352 2352 2351 2351 2350 2350 2349 2349 2348 2348 2347 2347 2346 2346 2345 2345 2344 2344 2343 2343 2342 2342 2341 2341 2340 2340 2339 2339 2339 2338 2338 2337 2337 2336 2336 2335 2335 2334 2334 2333 2333 2332 2332 2331 2331 2330 2330 2329 2329 2328 2328 2327 2327 2326 2326 2325 2325 2324
-651 2324 2324 2323 2323 2322 2322 2321 2321 2321 2320 2320 2319 2319 2318 2318 2317 2317 2316 2316 2315 2315 2314 2314 2313 2313 2312 2312 2311 2311 2310 2310 2309 2309 2308 2308 2308 2307 2307 2306 2306 2305 2305 2304 2304 2303 2303 2302 2302 2301 2301 2300 2300 2299 2299 2298 2298 2297 2297 2297 2296 2296 2295 2295 2294 2294 2293 2293 2292 2292
-660 2292 2291 2291 2290 2290 2289 2289 2288 2288 2288 2287 2287 2286 2286 2285 2285 2284 2284 2283 2283 2282 2282 2281 2281 2280 2280 2280 2279 2279 2278 2278 2277 2277 2276 2276 2275 2275 2274 2274 2273 2273 2272 2272 2272 2271 2271 2270 2270 2269 2269 2268 2268 2267 2267 2266 2266 2266 2265 2265 2264 2264 2263 2263 2262 2262 2261 2261 2260 2260
-670B260j%%j%j%j%j%j%j%%j%j%j%j%j%%j%j%j%j%j%j%%j%j%j%j%j%%j%j%j%j%j%%j%j%j%
-679B229j%j%%j%j%j%j%%j%j%j%j%j%%j%j%j%j%%j%j%j%j%%j%j%j%j%%j%j%j%j%%j%j%j%j
-688B198%%j%j%j%j%%j%j%j%j%%j%j%j%%j%j%j%j%%j%j%j%%j%j%j%j%%j%j%j%%j%j%j%%j%
-698B169j%j%%j%j%j%j%%j%j%j%%j%j%j%%j%j%j%%j%j%j%%j%j%%j%j%j%%j%j%j%%j%j%j%%
-707B140j%j%j%%j%j%%j%j%j%%j%j%j%%j%j%%j%j%j%%j%j%%j%j%j%%j%j%%j%j%j%%j%j%%j
-716B111%j%%j%j%j%%j%j%%j%j%j%%j%j%%j%j%%j%j%%j%j%j%%j%j%%j%j%%j%j%%j%j%%j%j
-726B083%%j%j%%j%j%j%%j%j%%j%j%%j%j%%j%j%%j%j%%j%j%%j%j%%j%j%%j%j%%j%j%%j%%j
-735B056%j%%j%j%%j%j%%j%j%%j%j%%j%j%%j%%j%j%%j%j%%j%j%%j%j%%j%%j%j%%j%j%%j%j
$$ plain form
-670 2260 2259 2259 2259 2258 2258 2257 2257 2256 2256 2255 2255 2254 2254 2253 2253 2253 2252 2252 2251 2251 2250 2250 2249 2249 2248 2248 2248 2247 2247 2246 2246 2245 2245 2244 2244 2243 2243 2242 2242 2242 2241 2241 2240 2240 2239 2239 2238 2238 2237 2237 2237 2236 2236 2235 2235 2234 2234 2233 2233 2232 2232 2232 2231 2231 2230 2230 2229 2229
-679 2229 2228 2228 2227 2227 2227 2226 2226 2225 2225 2224 2224 2223 2223 2223 2222 2222 2221 2221 2220 2220 2219 2219 2218 2218 2218 2217 2217 2216 2216 2215 2215 2214 2214 2214 2213 2213 2212 2212 2211 2211 2210 2210 2210 2209 2209 2208 2208 2207 2207 2206 2206 2206 2205 2205 2204 2204 2203 2203 2202 2202 2202 2201 2201 2200 2200 2199 2199 2198
-688 2198 2198 2198 2197 2197 2196 2196 2195 2195 2194 2194 2194 2193 2193 2192 2192 2191 2191 2190 2190 2190 2189 2189 2188 2188 2187 2187 2187 2186 2186 2185 2185 2184 2184 2183 2183 2183 2182 2182 2181 2181 2180 2180 2180 2179 2179 2178 2178 2177 2177 2176 2176 2176 2175 2175 2174 2174 2173 2173 2173 2172 2172 2171 2171 2170 2170 2170 2169 2169
-698 2169 2168 2168 2167 2167 2167 2166 2166 2165 2165 2164 2164 2163 2163 2163 2162 2162 2161 2161 2160 2160 2160 2159 2159 2158 2158 2157 2157 2157 2156 2156 2155 2155 2154 2154 2154 2153 2153 2152 2152 2151 2151 2151 2150 2150 2149 2149 2149 2148 2148 2147 2147 2146 2146 2146 2145 2145 2144 2144 2143 2143 2143 2142 2142 2141 2141 2140 2140 2140
-707 2140 2139 2139 2138 2138 2137 2137 2137 2136 2136 2135 2135 2135 2134 2134 2133 2133 2132 2132 2132 2131 2131 2130 2130 2129 2129 2129 2128 2128 2127 2127 2127 2126 2126 2125 2125 2124 2124 2124 2123 2123 2122 2122 2122 2121 2121 2120 2120 2119 2119 2119 2118 2118 2117 2117 2117 2116 2116 2115 2115 2114 2114 2114 2113 2113 2112 2112 2112 2111
-716 2111 2111 2110 2110 2110 2109 2109 2108 2108 2107 2107 2107 2106 2106 2105 2105 2105 2104 2104 2103 2103 2102 2102 2102 2101 2101 2100 2100 2100 2099 2099 2098 2098 2098 2097 2097 2096 2096 2096 2095 2095 2094 2094 2093 2093 2093 2092 2092 2091 2091 2091 2090 2090 2089 2089 2089 2088 2088 2087 2087 2087 2086 2086 2085 2085 2085 2084 2084 2083
-726 2083 2083 2083 2082 2082 2081 2081 2081 2080 2080 2079 2079 2078 2078 2078 2077 2077 2076 2076 2076 2075 2075 2074 2074 2074 2073 2073 2072 2072 2072 2071 2071 2070 2070 2070 2069 2069 2068 2068 2068 2067 2067 2066 2066 2066 2065 2065 2064 2064 2064 2063 2063 2062 2062 2062 2061 2061 2060 2060 2060 2059 2059 2058 2058 2058 2057 2057 2057 2056
-735 2056 2056 2055 2055 2055 2054 2054 2053 2053 2053 2052 2052 2051 2051 2051 2050 2050 2049 2049 2049 2048 2048 2047 2047 2047 2046 2046 2045 2045 2045 2044 2044 2044 2043 2043 2042 2042 2042 2041 2041 2040 2040 2040 2039 2039 2038 2038 2038 2037 2037 2036 2036 2036 2035 2035 2035 2034 2034 2033 2033 2033 2032 2032 2031 2031 2031 2030 2030 2029
-744B029%%j%%j%j%%j%j%%j%%j%j%%j%j%%j%%j%j%%j%j%%j%%j%j%%j%j%%j%%j%j%%j%%j%j
-754B003%%j%%j%j%%j%j%%j%%j%j%%j%%j%j%%j%%j%j%%j%%j%j%%j%%j%j%%j%%j%j%%j%%j%
-763A978%j%j%%j%%j%j%%j%%j%j%%j%%j%%j%j%%j%%j%j%%j%%j%%j%j%%j%%j%%j%j%%j%%j%
-772A953%j%j%%j%%j%%j%j%%j%%j%%j%j%%j%%j%%j%j%%j%%j%%j%%j%j%%j%%j%%j%%j%j%%j
-782A928%%j%%j%%j%j%%j%%j%%j%%j%%j%j%%j%%j%%j%%j%%j%j%%j%%j%%j%%j%%j%%j%j%%j
-791A904%%j%%j%%j%%j%%j%j%%j%%j%%j%%j%%j%%j%%j%%j%%j%j%%j%%j%%j%%j%%j%%j%%j%
-800A881%j%%j%%j%%j%j%%j%%j%%j%%j%%j%%j%%j%%j%%j%%j%%j%%j%%j%%j%%j%%j%%j%%j%
-810A858%j%%j%%j%%j%%j%%j%%j%%j%%j%%j%%j%%j%%j%%j%%j%%j%%j%%j%%j%%j%%j%%j%%j
$$ plain form
-744 2029 2029 2029 2028 2028 2028 2027 2027 2026 2026 2026 2025 2025 2024 2024 2024 2023 2023 2023 2022 2022 2021 2021 2021 2020 2020 2019 2019 2019 2018 2018 2018 2017 2017 2016 2016 2016 2015 2015 2014 2014 2014 2013 2013 2013 2012 2012 2011 2011 2011 2010 2010 2009 2009 2009 2008 2008 2008 2007 2007 2006 2006 2006 2005 2005 2005 2004 2004 2003
-754 2003 2003 2003 2002 2002 2002 2001 2001 2000 2000 2000 1999 1999 1998 1998 1998 1997 1997 1997 1996 1996 1995 1995 1995 1994 1994 1994 1993 1993 1992 1992 1992 1991 1991 1991 1990 1990 1989 1989 1989 1988 1988 1988 1987 1987 1986 1986 1986 1985 1985 1985 1984 1984 1983 1983 1983 1982 1982 1982 1981 1981 1980 1980 1980 1979 1979 1979 1978 1978
-763 1978 1978 1977 1977 1976 1976 1976 1975 1975 1975 1974 1974 1973 1973 1973 1972 1972 1972 1971 1971 1970 1970 1970 1969 1969 1969 1968 1968 1968 1967 1967 1966 1966 1966 1965 1965 1965 1964 1964 1963 1963 1963 1962 1962 1962 1961 1961 1961 1960 1960 1959 1959 1959 1958 1958 1958 1957 1957 1957 1956 1956 1955 1955 1955 1954 1954 1954 1953 1953
-772 1953 1953 1952 1952 1951 1951 1951 1950 1950 1950 1949 1949 1949 1948 1948 1947 1947 1947 1946 1946 1946 1945 1945 1945 1944 1944 1943 1943 1943 1942 1942 1942 1941 1941 1941 1940 1940 1939 1939 1939 1938 1938 1938 1937 1937 1937 1936 1936 1936 1935 1935 1934 1934 1934 1933 1933 1933 1932 1932 1932 1931 1931 1931 1930 1930 1929 1929 1929 1928
-782 1928 1928 1928 1927 1927 1927 1926 1926 1926 1925 1925 1924 1924 1924 1923 1923 1923 1922 1922 1922 1921 1921 1921 1920 1920 1920 1919 1919 1918 1918 1918 1917 1917 1917 1916 1916 1916 1915 1915 1915 1914 1914 1914 1913 1913 1912 1912 1912 1911 1911 1911 1910 1910 1910 1909 1909 1909 1908 1908 1908 1907 1907 1907 1906 1906 1905 1905 1905 1904
-791 1904 1904 1904 1903 1903 1903 1902 1902 1902 1901 1901 1901 1900 1900 1900 1899 1899 1898 1898 1898 1897 1897 1897 1896 1896 1896 1895 1895 1895 1894 1894 1894 1893 1893 1893 1892 1892 1892 1891 1891 1891 1890 1890 1890 1889 1889 1888 1888 1888 1887 1887 1887 1886 1886 1886 1885 1885 1885 1884 1884 1884 1883 1883 1883 1882 1882 1882 1881 1881
-800 1881 1881 1880 1880 1880 1879 1879 1879 1878 1878 1878 1877 1877 1876 1876 1876 1875 1875 1875 1874 1874 1874 1873 1873 1873 1872 1872 1872 1871 1871 1871 1870 1870 1870 1869 1869 1869 1868 1868 1868 1867 1867 1867 1866 1866 1866 1865 1865 1865 1864 1864 1864 1863 1863 1863 1862 1862 1862 1861 1861 1861 1860 1860 1860 1859 1859 1859 1858 1858
-810 1858 1858 1857 1857 1857 1856 1856 1856 1855 1855 1855 1854 1854 1854 1853 1853 1853 1852 1852 1852 1851 1851 1851 1850 1850 1850 1849 1849 1849 1848 1848 1848 1847 1847 1847 1846 1846 1846 1845 1845 1845 1844 1844 1844 1843 1843 1843 1842 1842 1842 1841 1841 1841 1840 1840 1840 1839 1839 1839 1838 1838 1838 1837 1837 1837 1836 1836 1836 1835
$$ [...]
-1801@
##END=		$$ NMR SPECTRUM
##TITLE=	
##JCAMP-DX=	6.0	$$ MestReNova 15.0.0-34764
##DATA TYPE=	NMR PEAK TABLE
##DATA CLASS=	PEAK TABLE
##BLOCK_ID=	3
##ORIGIN=	Mestrelab Research S.L.
##OWNER=	PC
##CROSS REFERENCE=	NMR SPECTRUM: BLOCK_ID=2                                     
##.OBSERVE FREQUENCY=	360.12729902500001344
##.OBSERVE NUCLEUS=	^Unknown
##NPOINTS=	180
##FIRSTX=	0.89915209074370194831
##LASTX=	7.3639329976666694222
##XFACTOR=	1
##YFACTOR=	1
##FIRSTY=	0.035813110096776110125
##XUNITS=	PPM
##YUNITS=	ARBITRARY UNITS
##PEAK TABLE=	(XYW..XYW)
0.89915209074370194831,0.035813110096776110125,0.002411089527397185326
0.91970768094098964696,0.080212202585474109973,0.0024309137500367443419
0.94025439051966586135,0.041381033320584847957,0.0023756155775918729595
1.4354295870823032821,0.062668180846777193915,0.0024571547722270340765
1.4846396331078859365,0.062668043518807350911,0.0024571547722270340765
1.5826990603391390966,0.00084736473377947205306,0.002430755343722419172
1.6010706978486730634,0.0037449659173705964268,0.0024571547722270340765
1.6032529911943087519,0.0023199997662174507047,0.0024571547722270340765
1.6193049710955618181,0.0028935097535685450759,0.0022428281259825647541
1.6215636753994402408,0.011151861485624740833,0.0037386465457254370454
1.6398743596045717297,0.016014245910302999515,0.0033604908773550213642
1.642155376893932317,0.0076020489032021633727,0.0026737528569399358382
1.6582140733048846837,0.0082032902439550994117,0.0023957756056141961062
1.6604738793353446269,0.015008667751151370112,0.0034750741886292704948
1.6765767812031726613,0.0010910731783286204463,0.0016942095970132195829
1.6789655738071314062,0.010795577541678933256,0.0033880814776428070691
1.6812988007822438075,0.0028696923497392723412,0.0020667994119056708364
1.6973575983251554256,0.0026546581625653347357,0.0022754247682441170429
1.6996780243608478056,0.0028668174294566176399,0.0024571547722270340765
1.7180890049687569388,0.00077043569526366335182,0.0025544681527036859105
3.7185184894746079465,7.1573801050186703085e-07,0.0020934955512533653423
3.7375921188549536822,1.4110568535881309775e-06,0.0020541087641592725536
3.7406438995558088934,7.567692141534208812e-07,0.0021593326894962109122
3.7566651199167826469,7.1607564480377081053e-07,0.0020268410943933869162
3.759717528936154185,1.5143580672659000452e-06,0.0021917349440665821574
3.7688728710387198184,5.5457241218612773393e-06,0.0021418431737484072003
3.7787734570992399519,7.5774309343155662047e-07,0.0018256482974187504629
3.7879465004190651101,1.0440096078306677346e-05,0.0020896173863782980563
3.7909982811199203212,5.6869754556613899443e-06,0.0020029706201104692347
3.8070229813172136168,4.7231958369383410652e-06,0.0016942095970132195829
3.8100779820923325047,1.0723584521101558599e-05,0.0016544850593127023459
3.8158092380259409637,0.00088202828216528297942,0.0022888355256414417462
3.8249493414169353223,0.0011137336132109126006,0.0022838481554784831676
$$ [...]
Compound,None,,1,-0.2000000000000000111,0,0
Compound,None,,1,-0.69006299403797122238,0,0
Compound,None,,1,-0.2045875553900847188,0,0
Compound,None,,1,-0.2000000000000000111,0,0
Compound,None,,1,0.32381641535900568263,0,0
Compound,None,,1,-1,0,0
Compound,None,,1,-0.45695166883958632242,0,0
Compound,None,,1,1,0,0
Compound,None,,1,0.0035297621516403986791,0,0
Compound,None,,1,0.46462169564955507761,0,0
Compound,None,,1,0.071654984357810425077,0,0
Compound,None,,1,-0.1129095442120529591,0,0
Compound,None,,1,-0.20517240437802303221,0,0
Compound,None,,1,1.0434694980750616189,0,0
Compound,None,,1,-0.11204629722366460376,0,0
Compound,None,,1,0.10102114169915671349,0,0
Compound,None,,1,0.6503508180745699585,0,0
Compound,None,,1,0.0064381534085405488915,0,0
Compound,None,,1,0.52081851172155824159,0,0
Compound,None,,1,0.34804315227536164468,0,0
Compound,None,,1,0.82347834530280117349,0,0
Compound,None,,1,0.32138851010772689909,0,0
Compound,None,,1,0.46965016840415296784,0,0
Impurity,None,,1,0.045635732662009015348,0,0
Impurity,None,,1,0.025727544602308111132,0,0
Impurity,None,,1,-0.017095892125890261443,0,0
Impurity,None,,1,1.9421263291952255425,0,0
Impurity,None,,1,1.999999999999999778,0,0
Impurity,None,,1,1.999999999999999778,0,0
Impurity,None,,1,0.46185568487723949183,0,0
Impurity,None,,1,0.2077430565508476823,0,0
Impurity,None,,1,0.80000000000000004441,0,0
Compound,None,,1,0.61867762512583912571,0,0
Compound,None,,1,0.45615346749458801634,0,0
Compound,None,,1,-0.17390867139740714964,0,0
Compound,None,,1,-0.20000000000000006661,0,0
Compound,None,,1,-0.2000000000000000111,0,0
Compound,None,,1,-0.28444209303205453265,0,0
Compound,None,,1,-1,0,0
Compound,None,,1,0.082461576762288879561,0,0
Compound,None,,1,-0.73720130151271168195,0,0
Compound,None,,1,-0.80777408487606094933,0,0
Compound,None,,1,0.52169509338694486367,0,0
Compound,None,,1,0.10620880137623639472,0,0
Compound,None,,1,0.1580172638623927317,0,0
Compound,None,,1,-0.68779492071987180513,0,0
Compound,None,,1,-0.032201225723399264089,0,0
Compound,None,,1,-0.14779056717547239819,0,0
Compound,None,,1,-0.15689390201903627431,0,0
Compound,None,,1,-0.055563738122682920784,0,0
Compound,None,,1,-0.86642175188085457371,0,0
Compound,None,,1,-0.0027494800935608382231,0,0
Compound,None,,1,0.02369048735057883992,0,0
Compound,None,,1,-0.73269396789367169376,0,0
Compound,None,,1,-0.49775158162108346094,0,0
Compound,None,,1,0.17588840438984576497,0,0
Compound,None,,1,0.021323900219451432519,0,0
Compound,None,,1,-0.80000000000000004441,0,0
Compound,None,,1,0.77697903881674235116,0,0
Compound,None,,1,0.088845177857342069738,0,0
Compound,None,,1,1.0018173618225467703,0,0
Impurity,None,,1,-1,0,0
Impurity,None,,1,-0.60000000000000008882,0,0
Impurity,None,,1,-0.39526705524876676323,0,0
Impurity,None,,1,1.999999999999999778,0,0
Impurity,None,,1,1.999999999999999778,0,0
Impurity,None,,1,1.999999999999999778,0,0
Impurity,None,,1,1.999999999999999778,0,0
##END=		$$ NMR PEAK TABLE
##END=		$$ LINK
