##TITLE=	Document 1
##JCAMP-DX=	6.0	$$ MestReNova 15.0.0-34764
##DATA TYPE=	LINK
##BLOCKS=	3    
##ORIGIN=	Mestrelab Research S.L.
##OWNER=	PC
##$MNOVA/METADATA=	(DOCUMENT,BASE64)
ewogICAgIm5hbWUiOiAiRG9jdW1lbnQgMSIsCiAgICAicGFnZXMiOiBbCiAgICAgICAgewogICAgICA
gICAgICAiaXRlbXMiOiBbCiAgICAgICAgICAgICAgICAiMiIsICAgICAgICAgICAgICAgICAgICAgIC
AgICAgICAgICAgICAgIAogICAgICAgICAgICAgICAgIjEiICAgICAgICAgICAgICAgICAgICAgICAgI
CAgICAgICAgICAgIAogICAgICAgICAgICBdCiAgICAgICAgfQogICAgXQp9Cg==
##TITLE=	H NMR calculated spectrum
##JCAMP-CS=	3.7	$$ MestReNova 15.0.0-34764
##BLOCK_ID=	1
##ORIGIN=	Mestrelab Research S.L.
##OWNER=	PC
##$MNOVA/METADATA=	(ITEM,BASE64)
ewogICAgImFuZ2xlIjogMCwKICAgICJwb2ludHMiOiBbCiAgICAgICAgewogICAgICAgICAgICAieCI
6IDU1NTcsCiAgICAgICAgICAgICJ5IjogNjA3MQogICAgICAgIH0sCiAgICAgICAgewogICAgICAgIC
AgICAieCI6IDYwNDQuOTkxNzE5NjA4MjQsCiAgICAgICAgICAgICJ5IjogNjA3MQogICAgICAgIH0sC
iAgICAgICAgewogICAgICAgICAgICAieCI6IDYwNDQuOTkxNzE5NjA4MjQsCiAgICAgICAgICAgICJ5
IjogNjU3Ny4wODQwMzc2NzA3NDkKICAgICAgICB9LAogICAgICAgIHsKICAgICAgICAgICAgIngiOiA
1NTU3LAogICAgICAgICAgICAieSI6IDY1NzcuMDg0MDM3NjcwNzQ5CiAgICAgICAgfSwKICAgICAgIC
B7CiAgICAgICAgICAgICJ4IjogNTU1NywKICAgICAgICAgICAgInkiOiA2MDcxCiAgICAgICAgfQogI
CAgXSwKICAgICJ6IjogMQp9Cg==
##NAMES=	H NMR calculated spectrum
##ATOMLIST=	
$$ AN	AS	NH
	1	C	3
	2	C	1
	3	C	3
	4	C	1
	5	C	3
	6	O	 
	7	P	 
	8	C	3
	9	F	 
	10	O	 
##BONDLIST=	
$$ AN1	AN2	BT
	1	2	S
	2	3	S
	2	4	S
	4	5	S
	4	6	S
	6	7	S
	7	8	S
	7	9	S
	7	10	D
##MAXRASTER=	32768
##XY_RASTER=	
$$ AN	X	Y	Z
	1	10631	9704	0
	2	19082	9704	0
	3	23226	2453	0
	4	23226	17065	0
	5	31677	17065	0
	6	19082	24317	0
	7	10631	24317	0
	8	10631	32768	0
	9	10631	15866	0
	10	2180	24317	0
##END=		$$ JCAMP-CS
##TITLE=	
##JCAMP-DX=	6.0	$$ MestReNova 15.0.0-34764
##DATA TYPE=	NMR SPECTRUM
##DATA CLASS=	XYDATA
##BLOCK_ID=	2
##ORIGIN=	Mnova: Peaks
##OWNER=	PC
##NUMDIM=	1
##$MNOVA/METADATA=	(ITEM,BASE64)
ewogICAgImFuZ2xlIjogMCwKICAgICJheGVzIjogewogICAgICAgICJ4IjogewogICAgICAgICAgICA
ibWF4IjogMjAuMDAwMTUwMDAxMTI1MDA3LAogICAgICAgICAgICAibWluIjogLTQuOTk5NjU2MDI3Nj
kzNjQ1NQogICAgICAgIH0sCiAgICAgICAgInkiOiB7CiAgICAgICAgICAgICJtYXgiOiAwLjEzMjQ0M
zYxODk2MDY3ODU4LAogICAgICAgICAgICAibWluIjogLTAuMDEyMDQwMzI5MTY1NzU2NzAyCiAgICAg
ICAgfQogICAgfSwKICAgICJwb2ludHMiOiBbCiAgICAgICAgewogICAgICAgICAgICAieCI6IDUzMjE
sCiAgICAgICAgICAgICJ5IjogNTgzNQogICAgICAgIH0sCiAgICAgICAgewogICAgICAgICAgICAieC
I6IDg3MjIsCiAgICAgICAgICAgICJ5IjogNTgzNQogICAgICAgIH0sCiAgICAgICAgewogICAgICAgI
CAgICAieCI6IDg3MjIsCiAgICAgICAgICAgICJ5IjogODIwOAogICAgICAgIH0sCiAgICAgICAgewog
ICAgICAgICAgICAieCI6IDUzMjEsCiAgICAgICAgICAgICJ5IjogODIwOAogICAgICAgIH0sCiAgICA
gICAgewogICAgICAgICAgICAieCI6IDUzMjEsCiAgICAgICAgICAgICJ5IjogNTgzNQogICAgICAgIH
0KICAgIF0sCiAgICAieiI6IDAKfQo=
##.OBSERVE FREQUENCY=	200.12849902499999644
##.OBSERVE NUCLEUS=	^Unknown
##.SOLVENT NAME=	
##.PULSE SEQUENCE=	
##.ACQUISITIONMODE=	SIMULTANEOUS
##$ORIGINAL FORMAT=	MNova
##$MNOVA/SCALES_VERSION=	9
##$PARAMETER FILE=	(originalData.xml, ASCII, , 0)
$$ <?xml version="1.0" encoding="UTF-8"?>
$$ <MnovaSpectrumParams>
$$     <itemId>{926ebd28-6787-4c20-95a6-61242a7f3b6c}</itemId>
$$     <spectrumIndex>0</spectrumIndex>
$$     <DataFileName/>
$$     <Title>
$$         <dim0>Simulated Unknown NMR Spectrum</dim0>
$$     </Title>
$$     <Comment/>
$$     <Origin>
$$         <dim0>Mnova: Spin Simulation</dim0>
$$     </Origin>
$$     <Owner/>
$$     <Site/>
$$     <Instrument/>
$$     <Author/>
$$     <Solvent/>
$$     <Temperature/>
$$     <PulseSequence/>
$$     <Experiment>
$$         <dim0>1D</dim0>
$$     </Experiment>
$$     <Probe/>
$$     <NumberofScans/>
$$     <ReceiverGain/>
$$     <RelaxationDelay/>
$$     <PulseWidth/>
$$     <PresaturationFrequency/>
$$     <AcquisitionTime/>
$$     <AcquisitionDate/>
$$     <ModificationDate/>
$$     <Class/>
$$     <Purity>
$$         <dim0>100</dim0>
$$     </Purity>
$$     <SpectrumQuality>
$$         <dim0>0</dim0>
$$     </SpectrumQuality>
$$     <Version/>
$$     <Algorithm/>
$$     <UseDB/>
$$     <GMMXCycles/>
$$     <LineWidth>
$$         <dim0>0</dim0>
$$     </LineWidth>
$$     <SpectrometerFrequency>
$$         <dim0>200.13</dim0>
$$     </SpectrometerFrequency>
$$     <SpectralWidth>
$$         <dim0>5003.25</dim0>
$$     </SpectralWidth>
$$     <LowestFrequency>
$$         <dim0>-1000.65</dim0>
$$     </LowestFrequency>
$$     <Nucleus>
$$         <dim0>Unknown</dim0>
$$     </Nucleus>
$$     <AcquiredSize/>
$$     <SpectralSize>
$$         <dim0>65536</dim0>
$$     </SpectralSize>
$$     <DigitalResolution>
$$         <dim0>0.0763435363769531</dim0>
$$     </DigitalResolution>
$$     <AbsoluteReference/>
$$ </MnovaSpectrumParams>
$$ 
##$PARAMETER FILE=	(parameters, ASCII, , 0)
$$ <MnovaSpectrumParams>
$$ <SpecCount>1</SpecCount>
$$ <Dimensions>1</Dimensions>
$$ <Origin>Mnova: Peaks</Origin>
$$ <Window Dim="f1">
$$ <Nucleus>Unknown</Nucleus>
$$ <Points>65536</Points>
$$ <Width>5003.25</Width>
$$ <MHz>200.128499024999996</MHz>
$$ <Hz>-1000.64999999999998</Hz>
$$ </Window>
$$ <Window Dim="f0">
$$ <Points>1</Points>
$$ </Window>
$$ </MnovaSpectrumParams>
##$PARAMETER FILE=	(title, ASCII, , 0)
$$ 
##XUNITS=	HZ
##YUNITS=	ARBITRARY UNITS
##FIRSTX=	4002.5999999999999091
##LASTX=	-1000.5736564636230241
##DELTAX=	-0.076343536376953125
##XFACTOR=	1
##YFACTOR=	5.6067150948098407091E-11
##FIRSTY=	3.2952580664158404034E-09
##MINY=	0
##MAXY=	0.120403289794921875
##NPOINTS=	65536
##XYDATA=	(X++(Y..Y))
$$ [...]
962 28357 28447 28537 28628 28720 28811 28904 28996 29090 29183 29278 29372 29468 29563 29659 29756 29853 29951 30049 30148 30247 30347 30448 30549 30650 30752 30855 30958 31061 31165 31270
959 31270 31375 31481 31588 31695 31803 31911 32020 32129 32239 32350 32461 32573 32685 32798 32912 33027 33142 33257 33374 33491 33608 33727 33845
957 33845 33965 34085 34207 34328 34451 34574 34698 34822 34947 35073 35200 35328 35456 35585 35715 35845 35976 36108 36241 36375 36509 36644 36780
956 36780 36917 37055 37193 37333 37473 37614 37756 37898 38042 38187 38332 38478 38625 38773 38922 39072 39223 39375 39528 39681 39836 39992 40148
954 40148 40306 40465 40624 40785 40946 41109 41273 41438 41604 41771 41939 42108 42278 42449 42622 42795 42970 43146 43323 43501 43681 43861 44043
952 44043 44226 44410 44596 44783 44971 45160 45351 45543 45736 45930 46126 46324 46522 46722 46924 47126 47331 47536 47743 47952 48162 48374 48587
950 48587 48801 49017 49235 49454 49675 49898 50122 50348 50575 50804 51035 51267 51501 51737 51975 52214 52455 52698 52943 53190 53439 53689 53942
949 53942 54196 54452 54710 54971 55233 55497 55764 56032 56303 56576 56851 57128 57407 57688 57972 58258 58547 58837 59131 59426 59724 60024 60327
947 60327 60633 60940 61251 61564 61880 62198 62519 62843 63169 63499 63831 64166 64504 64844 65188 65535 65885 66238 66594 66953 67315 67681 68050
945 68050 68422 68798 69177 69559 69945 70335 70728 71125 71526 71930 72338 72750 73166 73585 74009 74437 74869 75305 75746 76190 76639 77093 77551
943 77551 78013 78480 78952 79429 79910 80397 80888 81384 81886 82392 82904 83422 83944 84473 85007 85546 86092 86643 87200 87764 88333 88909 89491
942 89491 90080 90675 91277 91886 92502 93125 93755 94392 95037 95689 96349 97017 97692 98376 99068 99769 100478 101196 101922 102658 103403 104157 104921
940 104921 105695 106479 107272 108077 108891 109717 110553 111401 112260 113131 114013 114908 115815 116735 117668 118615 119574 120548 121536 122538 123555 124588
938 124588 125636 126699 127779 128876 129990 131121 132270 133437 134624 135829 137054 138300 139567 140855 142165 143497 144853
937 144853 146232 147637 149066 150521 152003 153513 155051 156618 158215 159843 161503 163196 164924 166686 168485 170321 172197
936 172197 174112 176070 178070 180115 182206 184346 186535 188776 191071 193422 195831 198301 200834 203432 206100 208838 211652
934 211652 214544 217517 220576 223725 226968 230309 233755 237309 240978 244768 248685 252737 256931 261275 265779 270452 275304
933 275304 280347 285593 291055 296749 302689 308894 315382 322176 329297 336771 344627 352896 361613 370816 380548 390859 401802
932 401802 413438 425836 439075 453243 468441 484785 502409 521466 542134 564620 589167 616060 645634 678292
931 678292 714511 754869 800065 850954 908588 974275 1049658 1136815 1238411 1357904 1499837 1670264 1877386
930 1877386 2132495 2451425 2856824 3381741 4075387 5012328 6306635 8130836 10728896 14368553 19054560
929 19054560 23749947 25891288 23764614 19083918 14412643 10787788 8204622 6395427 5116267 4194635
928 4194635 3516487 3007285 2617843 2315144 2076569 1886315 1733127 1608839 1507435 1424414 1356363 1300665
927 1300665 1255291 1218658 1189517 1166882 1149971 1138165 1130974 1128017 1128998 1133702 1141975 1153724 1168906 1187533 1209661
926 1209661 1235397 1264901 1298384 1336118 1378442 1425773 1478615 1537581 1603411 1677002 1759446 1852073 1956524
925 1956524 2074831 2209535 2363852 2541893 2748988 2992145 3280731 3627488 4050087 4573551 5234105
924 5234105 6085358 7208259 8726576 10827986 13778771 17868833 23088742 28327482 30984940 29374050
923 29374050 25234522 21225732 18532668 17264923 17276814 18519210 21140662 25537683 32379003 42408127
923 42408127 55480486 68917045 78039861 79333929 72264163 59484915 45621087 34221837 26054107
922 26054107 20456611 16628939 13988417 12161081 10915900 10113968 9677622 9573866 9807480 10421084
921 10421084 11500288 13180766 15650203 19128315 23703922 28493108 30678688 28252216 23215425 18378389
920 18378389 14617082 11833373 9796172 8303421 7200719 6377394 5756420 5284605 4925076 4652046
920 4652046 4447308 4297907 4194593 4130797 4101945 4104995 4138138 4200611 4292593 4415173 4570377 4761265 4992096
919 4992096 5268586 5598281 5991093 6460076 7022538 7701667 8528946 9547797 10819161 12430232 14508251
918 14508251 17242436 20918151 25965875 33011031 42834718 55923248 71062709 83553572 86693902
917 86693902 78799051 65544289 53068969 43967507 38356448 35678078 35517551 37794727 42771252 50954210
916 50954210 62659849 76715063 88518487 91175681 82861656 69470299 57347195 49292872 45787038
916 45787038 45882596 46788896 45945925 42660350 37125991 31325483 27372944 25562821 25487551 26871747 29675315
915 29675315 34034367 40216331 48686772 60138103 73396616 81207482 76351361 63108521 50104922
914 50104922 40064939 32411859 26528187 22015254 18554200 15885934 13810922 12181168 10888723 9855127
913 9855127 9023154 8350779 7806922 7368441 7018055 6742872 6533372 6382696 6286158 6240935 6245886 6301494
913 6301494 6409918 6575167 6803415 7103507 7487717 7972880 8582065 9347086 10312319 11540592 13122409
912 13122409 15190605 17943633 21681654 26856743 34116007 44219581 57465456 72237752 83831256
911 83831256 86425155 78633607 65210560 51841416 41400821 34201858 29625150 27052294 26101039
910 26101039 26628811 28695404 32484870 38020456 44280605 48421696 48574076 47086865 47345297 50989711
910 50989711 58512791 69405716 80882591 87176314 83641909 72469415 59651339 49026111 41564753
909 41564753 36991431 34857590 34909657 37169371 41935818 49715951 60882855 74469302 85802348 87353377
908 87353377 77336707 62320984 48453240 37651421 29691741 23887499 19619877 16431915 14006805
907 14006805 12128522 10649288 9466790 8509095 7724787 7076527 6536792 6085029 5705718 5387045 5119975
907 5119975 4897603 4714694 4567365 4452865 4369439 4316251 4293373 4301836 4343749 4422500 4543083 4712579 4940869
906 4940869 5241693 5634220 6145367 6813205 7691812 8857710 10416970 12509943 15312659 19066184 24114098
905 24114098 29934662 32962048 30243306 24740107 20027526 16637686 14239233 12606125 11581447 11049941
904 11049941 10939355 11219951 11903981 13049773 14773948 17275825 20879041 26090508 33639307 44304612
903 44304612 58035104 72349394 82418753 83968561 76320307 62940627 48875089 37505532 29490016
903 29490016 24209791 20960804 19293325 19029397 20219433 23014205 27204387 31376294 32885804 30143514
902 30143514 24675974 19056576 14610817 11428853 9189075 7585794 6407265 5516947 4827201 4280807
901 4280807 3839502 3477048 3175018 2920169 2702791 2515629 2353170 2211161 2086278 1975890 1877894 1790590
900 1790590 1712596 1642782 1580216 1524128 1473881 1428952 1388907 1353396 1322136 1294910 1271555 1251965 1236084 1223911
899 1223911 1215495 1210946 1210436 1214206 1222584 1235990 1254962 1280184 1312514 1353034 1403113 1464489 1539385 1630672 1742089
898 1742089 1878569 2046706 2255447 2517127 2849063 3276037 3834233 4577543 5587645 6989503 8972139
897 8972139 11802849 15774986 20893731 26022798 28353287 26007093 20862297 15727773 11739786 8893126
896 8893126 6894418 5476340 4449841 3689931 3114902 2670833 2321508 2042115 1815299 1628690 1473301
895 1473301 1342499 1231304 1135929 1053454 981600 918569 862927 813522 769415 729842 694170 661875 632516
894 632516 605727 581194 558652 537873 518664 500854 484300 468873 454463 440973 428317 416419 405213 394639
893 394639 384644 375181 366207 357685 349580 341861 334500 327472 320754 314325 308166 302258 296587 291138 285897 280851 275990
892 275990 271302 266779 262411 258189 254106 250155 246329 242621 239027 235539 232155 228867 225673 222568 219548 216609 213748
891 213748 210961 208246 205600 203019 200502 198045 195646 193304 191016 188780 186594 184457 182366 180321 178319 176359 174440
889 174440 172560 170718 168914 167145 165410 163709 162041 160404 158798 157221 155673 154154 152661 151195 149755 148340 146949
888 146949 145582 144238 142916 141616 140338 139080 137843 136625 135427 134247 133086 131943 130817 129708 128616 127540 126481
887 126481 125436 124407 123393 122393 121408 120436 119479 118534 117603 116684 115778 114884 114002 113132 112273 111426 110589 109764 108949 108145 107351
885 107351 106567 105792 105028 104273 103527 102791 102063 101344 100634 99932 99239 98554 97877 97208 96547 95893 95247 94608 93976 93352 92735 92124 91521
884 91521 90924 90333 89749 89172 88601 88036 87477 86923 86376 85835 85299 84769 84245 83725 83212 82703 82200 81702 81209 80721 80237 79759 79285
882 79285 78816 78352 77892 77437 76986 76540 76098 75660 75226 74797 74371 73950 73532 73118 72709 72303 71901 71502 71107 70716 70329 69944 69564
880 69564 69187 68813 68442 68075 67711 67350 66993 66639 66287 65939 65594 65251 64912 64576 64242 63912 63584 63259 62936 62617 62300 61985 61673
878 61673 61364 61058 60754 60452 60153 59856 59562 59270 58980 58693 58408 58126 57845 57567 57291 57017 56746 56476 56209 55943 55680 55419 55159
876 55159 54902 54647 54393 54142 53892 53645 53399 53155 52913 52673 52434 52198 51963 51729 51498 51268 51040 50813 50589 50365 50144 49924 49705
875 49705 49489 49273 49059 48847 48637 48427 48220 48013 47808 47605 47403 47202 47003 46805 46609 46414 46220 46028 45836 45647 45458 45271 45085
873 45085 44900 44717 44534 44353 44173 43995 43817 43641 43466 43292 43119 42947 42777 42607 42439 42272 42105 41940 41776 41613 41451 41290 41130
871 41130 40972 40814 40657 40501 40346 40192 40039 39887 39736 39586 39437 39288 39141 38995 38849 38705 38561 38418 38276 38135 37994 37855 37716
869 37716 37579 37442 37306 37170 37036 36902 36769 36637 36506 36375 36246 36117 35988 35861 35734 35608 35483 35358 35234 35111 34989 34867 34746
868 34746 34626 34506 34387 34269 34151 34034 33918 33803 33688 33573 33460 33347 33234 33122 33011 32901 32791 32682 32573 32465 32357 32250 32144
866 32144 32038 31933 31829 31724 31621 31518 31416 31314 31213 31112 31012 30912 30813 30715 30617 30519 30422 30325 30230 30134 30039 29945 29851 29757 29664 29572 29480 29388
864 29388 29297 29206 29116 29026 28937 28849 28760 28672 28585 28498 28411 28325 28240 28155 28070 27985 27902 27818 27735 27652 27570 27488 27407 27326 27245 27165 27085 27006 26927 26848 26770 26692 26614 26537
861 26537 26460 26384 26308 26232 26157 26082 26008 25933 25860 25786 25713 25640 25568 25496 25424 25353 25282 25211 25140 25070 25001 24931 24862 24793 24725 24657 24589 24522 24455 24388 24321 24255 24189 24123
859 24123 24058 23993 23928 23864 23800 23736 23673 23609 23546 23484 23421 23359 23297 23236 23175 23114 23053 22992 22932 22872 22813 22753 22694 22635 22577 22519 22460 22403 22345 22288 22231 22174 22117 22061
856 22061 22005 21949 21894 21838 21783 21729 21674 21620 21565 21512 21458 21404 21351 21298 21246 21193 21141 21089 21037 20985 20934 20883 20832 20781 20730 20680 20630 20580 20530 20481 20431 20382 20333 20285
853 20285 20236 20188 20140 20092 20044 19997 19950 19903 19856 19809 19763 19716 19670 19624 19578 19533 19488 19442 19397 19353 19308 19263 19219 19175 19131 19087 19044 19000 18957 18914 18871 18829 18786 18744
851 18744 18702 18659 18618 18576 18534 18493 18452 18411 18370 18329 18289 18248 18208 18168 18128 18088 18049 18009 17970 17931 17892 17853 17814 17776 17737 17699 17661 17623 17585 17547 17510 17472 17435 17398
848 17398 17361 17324 17288 17251 17215 17178 17142 17106 17070 17035 16999 16964 16928 16893 16858 16823 16788 16754 16719 16685 16650 16616 16582 16548 16515 16481 16447 16414 16381 16348 16315 16282 16249 16216
846 16216 16184 16151 16119 16087 16055 16023 15991 15959 15927 15896 15865 15833 15802 15771 15740 15709 15679 15648 15618 15587 15557 15527 15497 15467 15437 15407 15377 15348 15318 15289 15260 15231 15202 15173
843 15173 15144 15115 15087 15058 15030 15001 14973 14945 14917 14889 14861 14834 14806 14779 14751 14724 14696 14669 14642 14615 14588 14562 14535 14508 14482 14455 14429 14403 14377 14351 14325 14299 14273 14247
840 14247 14222 14196 14171 14145 14120 14095 14070 14045 14020 13995 13970 13946 13921 13896 13872 13848 13823 13799 13775 13751 13727 13703 13679 13656 13632 13609 13585 13562 13538 13515 13492 13469 13446 13423
838 13423 13400 13377 13354 13332 13309 13287 13264 13242 13220 13197 13175 13153 13131 13109 13087 13066 13044 13022 13001 12979 12958 12936 12915 12894 12873 12852 12831 12810 12789 12768 12747 12727 12706 12685
835 12685 12665 12644 12624 12604 12584 12563 12543 12523 12503 12483 12463 12444 12424 12404 12385 12365 12346 12326 12307 12287 12268 12249 12230 12211 12192 12173 12154 12135 12116 12098 12079 12060 12042 12023
833 12023 12005 11987 11968 11950 11932 11914 11896 11878 11860 11842 11824 11806 11788 11770 11753 11735 11718 11700 11683 11665 11648 11631 11613 11596 11579 11562 11545 11528 11511 11494 11477 11461 11444 11427
830 11427 11411 11394 11378 11361 11345 11328 11312 11296 11279 11263 11247 11231 11215 11199 11183 11167 11151 11135 11120 11104 11088 11073 11057 11042 11026 11011 10995 10980 10965 10949 10934 10919 10904 10889
827 10889 10874 10859 10844 10829 10814 10799 10784 10770 10755 10740 10726 10711 10697 10682 10668 10653 10639 10625 10610 10596 10582 10568 10554 10540 10526 10512 10498 10484 10470 10456 10442 10428 10415 10401
825 10401 10387 10374 10360 10347 10333 10320 10306 10293 10280 10266 10253 10240 10227 10213 10200 10187 10174 10161 10148 10135 10122 10110 10097 10084 10071 10058 10046 10033 10021 10008 9995 9983 9970 9958
822 9958 9946 9933 9921 9909 9896 9884 9872 9860 9848 9836 9823 9811 9799 9787 9776 9764 9752 9740 9728 9716 9705 9693 9681 9670 9658 9646 9635 9623 9612 9600 9589 9578 9566 9555 9544
820 9544 9532 9521 9510 9499 9487 9476 9465 9454 9443 9432 9421 9410 9399 9388 9378 9367 9356 9345 9334 9324 9313 9302 9292 9281 9271 9260 9250 9239 9229 9218 9208 9197 9187 9177 9166
817 9166 9156 9146 9136 9126 9115 9105 9095 9085 9075 9065 9055 9045 9035 9025 9015 9005 8996 8986 8976 8966 8956 8947 8937 8927 8918 8908 8899 8889 8879 8870 8860 8851 8841 8832 8823 8813 8804 8795 8785 8776
814 8776 8767 8758 8748 8739 8730 8721 8712 8703 8694 8685 8676 8667 8658 8649 8640 8631 8622 8613 8604 8596 8587 8578 8569 8561 8552 8543 8535 8526 8517 8509 8500 8492 8483 8475 8466 8458 8449 8441 8432 8424 8416 8407 8399 8391 8383 8374 8366 8358 8350 8341 8333 8325 8317 8309 8301 8293 8285 8277 8269 8261 8253 8245 8237 8229 8221 8214 8206 8198
809 8198 8190 8182 8175 8167 8159 8152 8144 8136 8129 8121 8113 8106 8098 8091 8083 8076 8068 8061 8053 8046 8039 8031 8024 8016 8009 8002 7995 7987 7980 7973 7966 7958 7951 7944 7937 7930 7923 7915 7908 7901 7894 7887 7880 7873 7866 7859 7852 7845 7838 7832 7825 7818 7811 7804 7797 7791 7784 7777 7770 7764 7757 7750 7743 7737 7730 7724 7717 7710 7704
803 7704 7697 7691 7684 7678 7671 7665 7658 7652 7645 7639 7632 7626 7620 7613 7607 7601 7594 7588 7582 7575 7569 7563 7557 7550 7544 7538 7532 7526 7520 7513 7507 7501 7495 7489 7483 7477 7471 7465 7459 7453 7447 7441 7435 7429 7423 7417 7412 7406 7400 7394 7388 7382 7377 7371 7365 7359 7354 7348 7342 7336 7331 7325 7319 7314 7308 7302 7297 7291 7286
798 7286 7280 7275 7269 7263 7258 7252 7247 7242 7236 7231 7225 7220 7214 7209 7204 7198 7193 7187 7182 7177 7172 7166 7161 7156 7150 7145 7140 7135 7129 7124 7119 7114 7109 7104 7098 7093 7088 7083 7078 7073 7068 7063 7058 7053 7048 7043 7038 7033 7028 7023 7018 7013 7008 7003 6998 6993 6988 6984 6979 6974 6969 6964 6959 6955 6950 6945 6940 6936 6931
793 6931 6926 6921 6917 6912 6907 6903 6898 6893 6889 6884 6879 6875 6870 6866 6861 6856 6852 6847 6843 6838 6834 6829 6825 6820 6816 6811 6807 6802 6798 6794 6789 6785 6780 6776 6772 6767 6763 6759 6754 6750 6746 6741 6737 6733 6729 6724 6720 6716 6712 6707 6703 6699 6695 6691 6686 6682 6678 6674 6670 6666 6662 6657 6653 6649 6645 6641 6637 6633 6629
788 6629 6625 6621 6617 6613 6609 6605 6601 6597 6593 6589 6585 6581 6577 6573 6570 6566 6562 6558 6554 6550 6546 6542 6539 6535 6531 6527 6523 6520 6516 6512 6508 6505 6501 6497 6493 6490 6486 6482 6479 6475 6471 6468 6464 6460 6457 6453 6449 6446 6442 6439 6435 6431 6428 6424 6421 6417 6414 6410 6407 6403 6400 6396 6393 6389 6386 6382 6379 6375 6372
782 6372 6368 6365 6362 6358 6355 6351 6348 6345 6341 6338 6335 6331 6328 6325 6321 6318 6315 6311 6308 6305 6301 6298 6295 6292 6288 6285 6282 6279 6276 6272 6269 6266 6263 6260 6256 6253 6250 6247 6244 6241 6238 6234 6231 6228 6225 6222 6219 6216 6213 6210 6207 6204 6201 6198 6195 6191 6188 6185 6182 6179 6177 6174 6171 6168 6165 6162 6159 6156 6153
777 6153 6150 6147 6144 6141 6138 6135 6133 6130 6127 6124 6121 6118 6115 6113 6110 6107 6104 6101 6099 6096 6093 6090 6087 6085 6082 6079 6076 6074 6071 6068 6066 6063 6060 6057 6055 6052 6049 6047 6044 6041 6039 6036 6033 6031 6028 6025 6023 6020 6018 6015 6012 6010 6007 6005 6002 6000 5997 5994 5992 5989 5987 5984 5982 5979 5977 5974 5972 5969 5967
772 5967 5964 5962 5959 5957 5955 5952 5950 5947 5945 5942 5940 5937 5935 5933 5930 5928 5926 5923 5921 5918 5916 5914 5911 5909 5907 5904 5902 5900 5897 5895 5893 5890 5888 5886 5884 5881 5879 5877 5875 5872 5870 5868 5866 5863 5861 5859 5857 5854 5852 5850 5848 5846 5843 5841 5839 5837 5835 5833 5830 5828 5826 5824 5822 5820 5818 5816 5813 5811 5809
767 5809 5807 5805 5803 5801 5799 5797 5795 5793 5791 5789 5787 5785 5782 5780 5778 5776 5774 5772 5770 5768 5766 5764 5762 5760 5758 5757 5755 5753 5751 5749 5747 5745 5743 5741 5739 5737 5735 5733 5731 5730 5728 5726 5724 5722 5720 5718 5716 5715 5713 5711 5709 5707 5705 5704 5702 5700 5698 5696 5694 5693 5691 5689 5687 5685 5684 5682 5680 5678 5677
761 5677 5675 5673 5671 5670 5668 5666 5664 5663 5661 5659 5658 5656 5654 5652 5651 5649 5647 5646 5644 5642 5641 5639 5637 5636 5634 5632 5631 5629 5628 5626 5624 5623 5621 5620 5618 5616 5615 5613 5612 5610 5608 5607 5605 5604 5602 5601 5599 5597 5596 5594 5593 5591 5590 5588 5587 5585 5584 5582 5581 5579 5578 5576 5575 5573 5572 5570 5569 5567 5566
756 5566 5565 5563 5562 5560 5559 5557 5556 5554 5553 5552 5550 5549 5547 5546 5545 5543 5542 5540 5539 5538 5536 5535 5534 5532 5531 5529 5528 5527 5525 5524 5523 5521 5520 5519 5517 5516 5515 5514 5512 5511 5510 5508 5507 5506 5504 5503 5502 5501 5499 5498 5497 5496 5494 5493 5492 5491 5489 5488 5487 5486 5484 5483 5482 5481 5480 5478 5477 5476 5475
751 5475 5474 5472 5471 5470 5469 5468 5467 5465 5464 5463 5462 5461 5460 5459 5457 5456 5455 5454 5453 5452 5451 5450 5448 5447 5446 5445 5444 5443 5442 5441 5440 5439 5438 5436 5435 5434 5433 5432 5431 5430 5429 5428 5427 5426 5425 5424 5423 5422 5421 5420 5419 5418 5417 5416 5415 5414 5413 5412 5411 5410 5409 5408 5407 5406 5405 5404 5403 5402 5401
745 5401 5400 5399 5398 5397 5396 5396 5395 5394 5393 5392 5391 5390 5389 5388 5387 5386 5386 5385 5384 5383 5382 5381 5380 5379 5378 5378 5377 5376 5375 5374 5373 5372 5372 5371 5370 5369 5368 5367 5367 5366 5365 5364 5363 5363 5362 5361 5360 5359 5359 5358 5357 5356 5355 5355 5354 5353 5352 5352 5351 5350 5349 5348 5348 5347 5346 5345 5345 5344 5343
740 5343 5343 5342 5341 5340 5340 5339 5338 5338 5337 5336 5335 5335 5334 5333 5333 5332 5331 5331 5330 5329 5329 5328 5327 5327 5326 5325 5325 5324 5323 5323 5322 5321 5321 5320 5319 5319 5318 5318 5317 5316 5316 5315 5315 5314 5313 5313 5312 5312 5311 5310 5310 5309 5309 5308 5307 5307 5306 5306 5305 5305 5304 5303 5303 5302 5302 5301 5301 5300 5300
735 5300 5299 5299 5298 5298 5297 5297 5296 5296 5295 5294 5294 5293 5293 5292 5292 5292 5291 5291 5290 5290 5289 5289 5288 5288 5287 5287 5286 5286 5285 5285 5284 5284 5284 5283 5283 5282 5282 5281 5281 5281 5280 5280 5279 5279 5278 5278 5278 5277 5277 5276 5276 5276 5275 5275 5274 5274 5274 5273 5273 5273 5272 5272 5271 5271 5271 5270 5270 5270 5269
730 5269 5269 5269 5268 5268 5268 5267 5267 5267 5266 5266 5266 5265 5265 5265 5264 5264 5264 5263 5263 5263 5262 5262 5262 5262 5261 5261 5261 5260 5260 5260 5260 5259 5259 5259 5258 5258 5258 5258 5257 5257 5257 5257 5256 5256 5256 5256 5255 5255 5255 5255 5255 5254 5254 5254 5254 5253 5253 5253 5253 5253 5252 5252 5252 5252 5252 5251 5251 5251 5251
724 5251 5251 5251 5250 5250 5250 5250 5250 5250 5249 5249 5249 5249 5249 5249 5248 5248 5248 5248 5248 5248 5248 5247 5247 5247 5247 5247 5247 5247 5247 5246 5246 5246 5246 5246 5246 5246 5246 5246 5246 5245 5245 5245 5245 5245 5245 5245 5245 5245 5245 5245 5245 5245 5244 5244 5244 5244 5244 5244 5244 5244 5244 5244 5244 5244 5244 5244 5244 5244 5244
719 5244 5244 5244 5244 5244 5244 5244 5244 5244 5244 5244 5244 5244 5244 5244 5244 5244 5244 5244 5244 5244 5244 5244 5244 5244 5244 5244 5244 5244 5244 5244 5244 5244 5244 5244 5244 5244 5244 5244 5245 5245 5245 5245 5245 5245 5245 5245 5245 5245 5245 5245 5245 5245 5246 5246 5246 5246 5246 5246 5246 5246 5246 5246 5247 5247 5247 5247 5247 5247 5247
714 5247 5247 5248 5248 5248 5248 5248 5248 5248 5248 5249 5249 5249 5249 5249 5249 5250 5250 5250 5250 5250 5250 5251 5251 5251 5251 5251 5251 5252 5252 5252 5252 5252 5253 5253 5253 5253 5253 5253 5254 5254 5254 5254 5255 5255 5255 5255 5255 5256 5256 5256 5256 5257 5257 5257 5257 5257 5258 5258 5258 5258 5259 5259 5259 5259 5260 5260 5260 5260 5261
709 5261 5261 5261 5262 5262 5262 5262 5263 5263 5263 5263 5264 5264 5264 5265 5265 5265 5266 5266 5266 5266 5267 5267 5267 5268 5268 5268 5269 5269 5269 5270 5270 5270 5271 5271 5271 5272 5272 5272 5273 5273 5273 5274 5274 5274 5275 5275 5275 5276 5276 5276 5277 5277 5278 5278 5278 5279 5279 5279 5280 5280 5281 5281 5281 5282 5282 5283 5283 5283 5284
703 5284 5284 5285 5285 5285 5286 5286 5287 5287 5287 5288 5288 5289 5289 5289 5290 5290 5291 5291 5292 5292 5293 5293 5293 5294 5294 5295 5295 5296 5296 5297 5297 5297 5298 5298 5299 5299 5300 5300 5301 5301 5302 5302 5303 5303 5304 5304 5305 5305 5306 5306 5307 5307 5308 5308 5309 5309 5310 5310 5311 5311 5312 5312 5313 5313 5314 5314 5315 5315 5316
698 5316 5316 5317 5317 5318 5318 5319 5320 5320 5321 5321 5322 5322 5323 5323 5324 5324 5325 5326 5326 5327 5327 5328 5328 5329 5330 5330 5331 5331 5332 5332 5333 5334 5334 5335 5335 5336 5337 5337 5338 5338 5339 5340 5340 5341 5341 5342 5343 5343 5344 5345 5345 5346 5346 5347 5348 5348 5349 5350 5350 5351 5351 5352 5353 5353 5354 5355 5355 5356 5357
693 5357 5357 5358 5359 5359 5360 5361 5361 5362 5363 5363 5364 5365 5365 5366 5367 5367 5368 5369 5369 5370 5371 5372 5372 5373 5374 5374 5375 5376 5376 5377 5378 5379 5379 5380 5381 5381 5382 5383 5384 5384 5385 5386 5386 5387 5388 5389 5389 5390 5391 5392 5392 5393 5394 5395 5395 5396 5397 5398 5398 5399 5400 5401 5401 5402 5403 5404 5405 5405 5406
688 5406 5407 5408 5408 5409 5410 5411 5412 5412 5413 5414 5415 5416 5416 5417 5418 5419 5420 5420 5421 5422 5423 5424 5424 5425 5426 5427 5428 5429 5429 5430 5431 5432 5433 5434 5434 5435 5436 5437 5438 5439 5440 5440 5441 5442 5443 5444 5445 5446 5446 5447 5448 5449 5450 5451 5452 5452 5453 5454 5455 5456 5457 5458 5459 5460 5460 5461 5462 5463 5464
682 5464 5465 5466 5467 5468 5469 5469 5470 5471 5472 5473 5474 5475 5476 5477 5478 5479 5480 5480 5481 5482 5483 5484 5485 5486 5487 5488 5489 5490 5491 5492 5493 5494 5495 5496 5497 5498 5498 5499 5500 5501 5502 5503 5504 5505 5506 5507 5508 5509 5510 5511 5512 5513 5514 5515 5516 5517 5518 5519 5520 5521 5522 5523 5524 5525 5526 5527 5528 5529 5530
677 5530 5531 5532 5533 5534 5535 5536 5537 5538 5539 5541 5542 5543 5544 5545 5546 5547 5548 5549 5550 5551 5552 5553 5554 5555 5556 5557 5558 5559 5561 5562 5563 5564 5565 5566 5567 5568 5569 5570 5571 5572 5573 5575 5576 5577 5578 5579 5580 5581 5582 5583 5584 5586 5587 5588 5589 5590 5591 5592 5593 5595 5596 5597 5598 5599 5600 5601 5602 5604 5605
672 5605 5606 5607 5608 5609 5610 5612 5613 5614 5615 5616 5617 5619 5620 5621 5622 5623 5624 5626 5627 5628 5629 5630 5631 5633 5634 5635 5636 5637 5638 5640 5641 5642 5643 5644 5646 5647 5648 5649 5650 5652 5653 5654 5655 5657 5658 5659 5660 5661 5663 5664 5665 5666 5668 5669 5670 5671 5672 5674 5675 5676 5677 5679 5680 5681 5682 5684 5685 5686 5687
666 5687 5689 5690 5691 5693 5694 5695 5696 5698 5699 5700 5701 5703 5704 5705 5707 5708 5709 5710 5712 5713 5714 5716 5717 5718 5720 5721 5722 5723 5725 5726 5727 5729 5730 5731 5733 5734 5735 5737 5738 5739 5741 5742 5743 5745 5746 5747 5749 5750 5751 5753 5754 5755 5757 5758 5759 5761 5762 5764 5765 5766 5768 5769 5770 5772 5773 5774 5776 5777 5779
661 5779 5780 5781 5783 5784 5786 5787 5788 5790 5791 5793 5794 5795 5797 5798 5800 5801 5802 5804 5805 5807 5808 5809 5811 5812 5814 5815 5817 5818 5819 5821 5822 5824 5825 5827 5828 5830 5831 5832 5834 5835 5837 5838 5840 5841 5843 5844 5846 5847 5848 5850 5851 5853 5854 5856 5857 5859 5860 5862 5863 5865 5866 5868 5869 5871 5872 5874 5875 5877 5878
656 5878 5880 5881 5883 5884 5886 5887 5889 5890 5892 5893 5895 5896 5898 5899 5901 5903 5904 5906 5907 5909 5910 5912 5913 5915 5916 5918 5920 5921 5923 5924 5926 5927 5929 5930 5932 5934 5935 5937 5938 5940 5941 5943 5945 5946 5948 5949 5951 5953 5954 5956 5957 5959 5961 5962 5964 5965 5967 5969 5970 5972 5973 5975 5977 5978 5980 5982 5983 5985 5986
651 5986 5988 5990 5991 5993 5995 5996 5998 6000 6001 6003 6004 6006 6008 6009 6011 6013 6014 6016 6018 6019 6021 6023 6024 6026 6028 6029 6031 6033 6035 6036 6038 6040 6041 6043 6045 6046 6048 6050 6051 6053 6055 6057 6058 6060 6062 6063 6065 6067 6069 6070 6072 6074 6076 6077 6079 6081 6082 6084 6086 6088 6089 6091 6093 6095 6096 6098 6100 6102 6103
645 6103 6105 6107 6109 6111 6112 6114 6116 6118 6119 6121 6123 6125 6127 6128 6130 6132 6134 6136 6137 6139 6141 6143 6145 6146 6148 6150 6152 6154 6155 6157 6159 6161 6163 6164 6166 6168 6170 6172 6174 6175 6177 6179 6181 6183 6185 6187 6188 6190 6192 6194 6196 6198 6200 6201 6203 6205 6207 6209 6211 6213 6215 6216 6218 6220 6222 6224 6226 6228 6230
640 6230 6232 6233 6235 6237 6239 6241 6243 6245 6247 6249 6251 6253 6254 6256 6258 6260 6262 6264 6266 6268 6270 6272 6274 6276 6278 6280 6282 6284 6285 6287 6289 6291 6293 6295 6297 6299 6301 6303 6305 6307 6309 6311 6313 6315 6317 6319 6321 6323 6325 6327 6329 6331 6333 6335 6337 6339 6341 6343 6345 6347 6349 6351 6353 6355 6357 6359 6361 6363 6365
635 6365 6367 6369 6371 6373 6375 6377 6380 6382 6384 6386 6388 6390 6392 6394 6396 6398 6400 6402 6404 6406 6408 6410 6413 6415 6417 6419 6421 6423 6425 6427 6429 6431 6434 6436 6438 6440 6442 6444 6446 6448 6450 6453 6455 6457 6459 6461 6463 6465 6467 6470 6472 6474 6476 6478 6480 6482 6485 6487 6489 6491 6493 6495 6498 6500 6502 6504 6506 6508 6511
630 6511 6513 6515 6517 6519 6522 6524 6526 6528 6530 6533 6535 6537 6539 6541 6544 6546 6548 6550 6552 6555 6557 6559 6561 6564 6566 6568 6570 6572 6575 6577 6579 6581 6584 6586 6588 6590 6593 6595 6597 6600 6602 6604 6606 6609 6611 6613 6615 6618 6620 6622 6625 6627 6629 6631 6634 6636 6638 6641 6643 6645 6648 6650 6652 6655 6657 6659 6662 6664 6666
624 6666 6669 6671 6673 6676 6678 6680 6683 6685 6687 6690 6692 6694 6697 6699 6701 6704 6706 6709 6711 6713 6716 6718 6720 6723 6725 6728 6730 6732 6735 6737 6740 6742 6744 6747 6749 6752 6754 6756 6759 6761 6764 6766 6769 6771 6773 6776 6778 6781 6783 6786 6788 6790 6793 6795 6798 6800 6803 6805 6808 6810 6813 6815 6818 6820 6823 6825 6827 6830 6832
619 6832 6835 6837 6840 6842 6845 6847 6850 6852 6855 6857 6860 6863 6865 6868 6870 6873 6875 6878 6880 6883 6885 6888 6890 6893 6895 6898 6901 6903 6906 6908 6911 6913 6916 6918 6921 6924 6926 6929 6931 6934 6937 6939 6942 6944 6947 6950 6952 6955 6957 6960 6963 6965 6968 6970 6973 6976 6978 6981 6984 6986 6989 6991 6994 6997 6999 7002 7005 7007 7010
614 7010 7013 7015 7018 7021 7023 7026 7029 7031 7034 7037 7039 7042 7045 7047 7050 7053 7056 7058 7061 7064 7066 7069 7072 7074 7077 7080 7083 7085 7088 7091 7094 7096 7099 7102 7105 7107 7110 7113 7116 7118 7121 7124 7127 7129 7132 7135 7138 7140 7143 7146 7149 7152 7154 7157 7160 7163 7166 7168 7171 7174 7177 7180 7182 7185 7188 7191 7194 7197 7199
609 7199 7202 7205 7208 7211 7214 7216 7219 7222 7225 7228 7231 7234 7236 7239 7242 7245 7248 7251 7254 7257 7259 7262 7265 7268 7271 7274 7277 7280 7283 7286 7289 7291 7294 7297 7300 7303 7306 7309 7312 7315 7318 7321 7324 7327 7330 7333 7336 7338 7341 7344 7347 7350 7353 7356 7359 7362 7365 7368 7371 7374 7377 7380 7383 7386 7389 7392 7395 7398 7401
603 7401 7404 7407 7410 7413 7416 7420 7423 7426 7429 7432 7435 7438 7441 7444 7447 7450 7453 7456 7459 7462 7465 7468 7472 7475 7478 7481 7484 7487 7490 7493 7496 7499 7503 7506 7509 7512 7515 7518 7521 7524 7528 7531 7534 7537 7540 7543 7546 7550 7553 7556 7559 7562 7565 7569 7572 7575 7578 7581 7585 7588 7591 7594 7597 7601 7604 7607 7610 7613 7617
598 7617 7620 7623 7626 7630 7633 7636 7639 7642 7646 7649 7652 7656 7659 7662 7665 7669 7672 7675 7678 7682 7685 7688 7692 7695 7698 7701 7705 7708 7711 7715 7718 7721 7725 7728 7731 7735 7738 7741 7745 7748 7751 7755 7758 7761 7765 7768 7771 7775 7778 7781 7785 7788 7792 7795 7798 7802 7805 7809 7812 7815 7819 7822 7826 7829 7832 7836 7839 7843 7846
593 7846 7850 7853 7856 7860 7863 7867 7870 7874 7877 7881 7884 7888 7891 7895 7898 7902 7905 7908 7912 7915 7919 7922 7926 7929 7933 7937 7940 7944 7947 7951 7954 7958 7961 7965 7968 7972 7975 7979 7983 7986 7990 7993 7997 8000 8004 8008 8011 8015 8018 8022 8025 8029 8033 8036 8040 8044 8047 8051 8054 8058 8062 8065 8069 8073 8076 8080 8084 8087 8091
587 8091 8095 8098 8102 8106 8109 8113 8117 8120 8124 8128 8131 8135 8139 8142 8146 8150 8154 8157 8161 8165 8169 8172 8176 8180 8183 8187 8191 8195 8198 8202 8206 8210 8214 8217 8221 8225 8229 8232 8236 8240 8244 8248 8252 8255 8259 8263 8267 8271 8274 8278 8282 8286 8290 8294 8298 8301 8305 8309 8313 8317 8321 8325 8328 8332 8336 8340 8344 8348 8352
582 8352 8356 8360 8364 8367 8371 8375 8379 8383 8387 8391 8395 8399 8403 8407 8411 8415 8419 8423 8427 8431 8435 8439 8443 8447 8451 8455 8459 8463 8467 8471 8475 8479 8483 8487 8491 8495 8499 8503 8507 8511 8515 8519 8523 8527 8531 8535 8540 8544 8548 8552 8556 8560 8564 8568 8572 8576 8581 8585 8589 8593 8597 8601 8605 8610 8614 8618 8622 8626 8630
577 8630 8634 8639 8643 8647 8651 8655 8660 8664 8668 8672 8676 8681 8685 8689 8693 8698 8702 8706 8710 8714 8719 8723 8727 8732 8736 8740 8744 8749 8753 8757 8761 8766 8770 8774 8779 8783 8787 8792 8796 8800 8805 8809 8813 8818 8822 8826 8831 8835 8839 8844 8848 8853 8857 8861 8866 8870 8875 8879 8883 8888 8892 8897 8901 8905 8910 8914 8919 8923 8928
572 8928 8932 8937 8941 8945 8950 8954 8959 8963 8968 8972 8977 8981 8986 8990 8995 8999 9004 9008 9013 9018 9022 9027 9031 9036 9040 9045 9049 9054 9059 9063 9068 9072 9077 9082 9086 9091 9095 9100 9105 9109 9114 9118 9123 9128 9132 9137 9142 9146 9151 9156 9160 9165 9170 9174 9179 9184 9189 9193 9198 9203 9207 9212 9217 9222 9226 9231 9236 9241 9245
566 9245 9250 9255 9260 9264 9269 9274 9279 9284 9288 9293 9298 9303 9308 9312 9317 9322 9327 9332 9337 9341 9346 9351 9356 9361 9366 9371 9376 9380 9385 9390 9395 9400 9405 9410 9415 9420 9425 9430 9435 9439 9444 9449 9454 9459 9464 9469 9474 9479 9484 9489 9494 9499 9504 9509 9514 9519 9524 9529 9534 9539 9545 9550 9555 9560 9565 9570 9575 9580 9585
561 9585 9590 9595 9600 9606 9611 9616 9621 9626 9631 9636 9641 9647 9652 9657 9662 9667 9672 9678 9683 9688 9693 9698 9704 9709 9714 9719 9724 9730 9735 9740 9745 9751 9756 9761 9767 9772 9777 9782 9788 9793 9798 9804 9809 9814 9820 9825 9830 9836 9841 9846 9852 9857 9862 9868 9873 9878 9884 9889 9895 9900 9905 9911 9916 9922 9927 9933 9938 9943 9949
556 9949 9954 9960 9965 9971 9976 9982 9987 9993 9998 10004 10009 10015 10020 10026 10031 10037 10042 10048 10054 10059 10065 10070 10076 10081 10087 10093 10098 10104 10109 10115 10121 10126 10132 10138 10143 10149 10155 10160 10166 10172 10177 10183 10189 10194 10200 10206 10212 10217 10223 10229 10234 10240 10246 10252 10257 10263 10269 10275 10281 10286 10292 10298 10304 10310 10315 10321 10327 10333 10339
551 10339 10345 10351 10356 10362 10368 10374 10380 10386 10392 10398 10404 10410 10415 10421 10427 10433 10439 10445 10451 10457 10463 10469 10475 10481 10487 10493 10499 10505 10511 10517 10523 10529 10535 10541 10547 10553 10560 10566 10572 10578 10584 10590 10596 10602 10608 10615 10621 10627 10633 10639 10645 10651 10658 10664 10670 10676 10682 10689 10695 10701 10707 10714 10720 10726 10732 10739 10745 10751
545 10751 10757 10764 10770 10776 10783 10789 10795 10802 10808 10814 10821 10827 10833 10840 10846 10852 10859 10865 10872 10878 10884 10891 10897 10904 10910 10917 10923 10930 10936 10943 10949 10956 10962 10969 10975 10982 10988 10995 11001 11008 11014 11021 11027 11034 11041 11047 11054 11060 11067 11074 11080 11087 11093 11100 11107 11113 11120 11127 11133 11140 11147 11154 11160 11167 11174 11180 11187 11194
540 11194 11201 11207 11214 11221 11228 11235 11241 11248 11255 11262 11269 11275 11282 11289 11296 11303 11310 11317 11323 11330 11337 11344 11351 11358 11365 11372 11379 11386 11393 11400 11407 11414 11421 11428 11435 11442 11449 11456 11463 11470 11477 11484 11491 11498 11505 11512 11519 11526 11533 11541 11548 11555 11562 11569 11576 11583 11591 11598 11605 11612 11619 11627 11634 11641 11648 11656 11663 11670
535 11670 11677 11685 11692 11699 11706 11714 11721 11728 11736 11743 11750 11758 11765 11773 11780 11787 11795 11802 11810 11817 11824 11832 11839 11847 11854 11862 11869 11877 11884 11892 11899 11907 11914 11922 11929 11937 11944 11952 11960 11967 11975 11982 11990 11998 12005 12013 12021 12028 12036 12044 12051 12059 12067 12074 12082 12090 12097 12105 12113 12121 12129 12136 12144 12152 12160 12167 12175 12183
530 12183 12191 12199 12207 12215 12222 12230 12238 12246 12254 12262 12270 12278 12286 12294 12302 12310 12318 12326 12334 12342 12350 12358 12366 12374 12382 12390 12398 12406 12414 12422 12430 12438 12447 12455 12463 12471 12479 12487 12496 12504 12512 12520 12528 12537 12545 12553 12561 12570 12578 12586 12595 12603 12611 12619 12628 12636 12644 12653 12661 12670 12678 12686 12695 12703 12712 12720 12729 12737
525 12737 12746 12754 12762 12771 12779 12788 12797 12805 12814 12822 12831 12839 12848 12857 12865 12874 12882 12891 12900 12908 12917 12926 12934 12943 12952 12961 12969 12978 12987 12996 13004 13013 13022 13031 13039 13048 13057 13066 13075 13084 13093 13101 13110 13119 13128 13137 13146 13155 13164 13173 13182 13191 13200 13209 13218 13227 13236 13245 13254 13263 13272 13281 13291 13300 13309 13318 13327
520 13327 13336 13345 13355 13364 13373 13382 13391 13401 13410 13419 13428 13438 13447 13456 13466 13475 13484 13494 13503 13512 13522 13531 13541 13550 13559 13569 13578 13588 13597 13607 13616 13626 13635 13645 13654 13664 13674 13683 13693 13702 13712 13722 13731 13741 13750 13760 13770 13780
516 13780 13789 13799 13809 13818 13828 13838 13848 13858 13867 13877 13887 13897 13907 13917 13926 13936 13946 13956 13966 13976 13986 13996 14006 14016 14026 14036 14046 14056 14066 14076 14086 14096 14106 14116 14126 14137
513 14137 14147 14157 14167 14177 14187 14198 14208 14218 14228 14239 14249 14259 14270 14280 14290 14300 14311 14321 14332 14342 14352 14363 14373 14384 14394 14405 14415 14426 14436 14447 14457 14468 14478 14489
510 14489 14499 14510 14521 14531 14542 14552 14563 14574 14584 14595 14606 14617 14627 14638 14649 14660 14671 14681 14692 14703 14714 14725 14736 14746 14757 14768 14779 14790 14801 14812 14823 14834 14845 14856
508 14856 14867 14878 14889 14900 14912 14923 14934 14945 14956 14967 14979 14990 15001 15012 15023 15035 15046 15057 15069 15080 15091 15103 15114 15125 15137 15148 15160 15171 15182 15194 15205 15217 15228 15240
505 15240 15252 15263 15275 15286 15298 15309 15321 15333 15344 15356 15368 15379 15391 15403 15415 15426 15438 15450 15462 15474 15486 15497 15509 15521 15533 15545 15557 15569 15581 15593 15605 15617 15629 15641
503 15641 15653 15665 15677 15689 15702 15714 15726 15738 15750 15762 15775 15787 15799 15811 15824 15836 15848 15861 15873 15886 15898 15910 15923 15935 15948 15960 15973 15985 15998 16010 16023 16035 16048 16061
500 16061 16073 16086 16098 16111 16124 16137 16149 16162 16175 16188 16200 16213 16226 16239 16252 16265 16278 16290 16303 16316 16329 16342 16355 16368 16381 16394 16408 16421 16434 16447 16460 16473 16486 16500
498 16500 16513 16526 16539 16553 16566 16579 16593 16606 16619 16633 16646 16660 16673 16686 16700 16713 16727 16741 16754 16768 16781 16795 16808 16822 16836 16849 16863 16877 16891 16904 16918 16932 16946 16960
495 16960 16974 16987 17001 17015 17029 17043 17057 17071 17085 17099 17113 17127 17141 17156 17170 17184 17198 17212 17226 17241 17255 17269 17283 17298 17312 17326 17341 17355 17370 17384 17399 17413 17428 17442
492 17442 17457 17471 17486 17500 17515 17530 17544 17559 17574 17588 17603 17618 17633 17648 17662 17677 17692 17707 17722 17737 17752 17767 17782 17797 17812 17827 17842 17857 17872 17888 17903 17918 17933 17948
490 17948 17964 17979 17994 18010 18025 18040 18056 18071 18087 18102 18118 18133 18149 18164 18180 18195 18211 18227 18242 18258 18274 18290 18305 18321 18337 18353 18369 18385 18400 18416 18432 18448 18464 18480
487 18480 18496 18512 18529 18545 18561 18577 18593 18609 18626 18642 18658 18675 18691 18707 18724 18740 18757 18773 18789 18806 18823 18839 18856 18872 18889 18906 18922 18939 18956 18973 18989 19006 19023 19040
485 19040 19057 19074 19091 19108 19125 19142 19159 19176 19193 19210 19227 19244 19261 19279 19296 19313 19331 19348 19365 19383 19400 19417 19435 19452 19470 19487 19505 19523 19540 19558 19576 19593 19611 19629
482 19629 19647 19664 19682 19700 19718 19736 19754 19772 19790 19808 19826 19844 19862 19881 19899 19917 19935 19953 19972 19990 20008 20027 20045 20064 20082 20101 20119 20138 20156 20175 20194 20212 20231 20250
479 20250 20269 20287 20306 20325 20344 20363 20382 20401 20420 20439 20458 20477 20496 20515 20534 20554 20573 20592 20612 20631 20650 20670 20689 20709 20728 20748 20767 20787 20806 20826 20846 20865 20885 20905
477 20905 20925 20945 20965 20984 21004 21024 21044 21064 21085 21105 21125 21145 21165 21185 21206 21226 21246 21267 21287 21308 21328 21349 21369 21390 21410 21431 21452 21472 21493 21514 21535 21556 21577 21597
474 21597 21618 21639 21660 21681 21703 21724 21745 21766 21787 21809 21830 21851 21873 21894 21916 21937 21959 21980 22002 22023 22045 22067 22088 22110 22132 22154 22176 22198 22220 22242 22264 22286 22308 22330
472 22330 22352 22375 22397 22419 22441 22464 22486 22509 22531 22554 22576 22599 22622 22644 22667 22690 22713 22735 22758 22781 22804 22827 22850 22873 22897 22920 22943 22966 22989 23013 23036 23060 23083 23106
469 23106 23130 23154 23177 23201 23225 23248 23272 23296 23320 23344 23368 23392 23416 23440 23464 23488 23512 23536 23561 23585 23610 23634 23658 23683 23707 23732 23757 23781 23806 23831 23856 23881 23905 23930
466 23930 23955 23980 24006 24031 24056 24081 24106 24132 24157 24182 24208 24233 24259 24285 24310 24336 24362 24387 24413 24439 24465 24491 24517 24543 24569 24595 24621 24648 24674 24700 24727 24753 24780 24806
464 24806 24833 24860 24886 24913 24940 24967 24993 25020 25047 25074 25102 25129 25156 25183 25210 25238 25265 25293 25320 25348 25375 25403 25431 25458 25486 25514 25542 25570 25598 25626 25654 25682 25711 25739
461 25739 25767 25796 25824 25853 25881 25910 25938 25967 25996 26025 26054 26083 26112 26141 26170 26199 26228 26257 26287 26316 26346 26375 26405 26434 26464 26494 26524 26553 26583 26613 26643 26673 26704 26734
459 26734 26764 26794 26825 26855 26886 26916 26947 26978 27008 27039 27070 27101 27132 27163 27194 27225 27256 27288 27319 27351 27382 27414 27445 27477 27509 27540 27572 27604 27636 27668 27700 27733 27765 27797
456 27797 27830 27862 27895 27927 27960 27992 28025 28058 28091 28124 28157 28190 28223 28257 28290 28323 28357 28390 28424 28458 28491 28525 28559 28593 28627 28661 28695 28729 28764 28798 28832 28867 28902 28936
453 28936 28971 29006 29041 29076 29111 29146 29181 29216 29251 29287 29322 29358 29393 29429 29465 29501 29537 29573 29609 29645 29681 29717 29754 29790 29827 29863 29900 29937 29974 30011 30048 30085 30122 30159
451 30159 30196 30234 30271 30309 30347 30384 30422 30460 30498 30536 30574 30612 30651 30689 30728 30766 30805 30844 30882 30921 30960 30999 31039 31078 31117 31157 31196 31236 31275 31315 31355 31395 31435 31475
448 31475 31515 31556 31596 31637 31677 31718 31759 31799 31840 31881 31923 31964 32005 32047 32088 32130 32171 32213 32255 32297 32339 32381 32424 32466 32508 32551 32594 32636 32679 32722 32765 32809 32852 32895
446 32895 32939 32982 33026 33070 33113 33157 33202 33246 33290 33334 33379 33423 33468 33513 33558 33603 33648 33693 33739 33784 33830 33875 33921 33967 34013 34059 34105 34152 34198 34244 34291 34338 34385 34432
443 34432 34479 34526 34573 34621 34668 34716 34764 34812 34860 34908 34956 35005 35053 35102 35151 35199 35248 35297 35347 35396 35445 35495 35545 35595 35645 35695 35745 35795 35846 35896 35947 35998 36049 36100
440 36100 36151 36202 36254 36305 36357 36409 36461 36513 36565 36618 36670 36723 36776 36829 36882 36935 36988 37042 37096 37149 37203 37257 37311 37366 37420 37475 37530 37584 37639 37695 37750 37805 37861 37917
438 37917 37973 38029 38085 38141 38198 38254 38311 38368 38425 38482 38540 38597 38655 38713 38771 38829 38887 38946 39004 39063 39122 39181 39240 39300 39359 39419 39479 39539 39599 39660 39720 39781 39842 39903
435 39903 39964 40026 40087 40149 40211 40273 40335 40398 40460 40523 40586 40649 40712 40776 40840 40903 40967 41032 41096 41161 41225 41290 41355 41421 41486 41552 41618 41684 41750 41816 41883 41950 42017 42084
433 42084 42151 42219 42286 42354 42423 42491 42559 42628 42697 42766 42836 42905 42975 43045 43115 43186 43256 43327 43398 43469 43541 43612 43684 43756 43828 43901 43974 44047 44120 44193 44267 44340 44415 44489
430 44489 44563 44638 44713 44788 44864 44939 45015 45091 45167 45244 45321 45398 45475 45553 45630 45708 45787 45865 45944 46023 46102 46181 46261 46341 46421 46502 46583 46664 46745 46826 46908 46990 47072 47155
427 47155 47238 47321 47404 47488 47572 47656 47740 47825 47910 47995 48080 48166 48252 48339 48425 48512 48599 48687 48775 48863 48951 49040 49129 49218 49308 49397 49488 49578 49669 49760 49851 49943 50035 50127
425 50127 50220 50313 50406 50500 50593 50688 50782 50877 50972 51068 51163 51260 51356 51453 51550 51648 51745 51844 51942 52041 52140 52240 52340 52440 52541 52642 52743 52845 52947 53049
423 53049 53152 53255 53359 53463 53567 53672 53777 53882 53988 54094 54201 54308 54415 54523 54631 54740 54849 54958 55068 55178 55289 55400 55511
421 55511 55623 55735 55848 55961 56074 56188 56303 56418 56533 56649 56765 56881 56998 57116 57234 57352 57471 57590 57710 57830 57951 58072 58194
419 58194 58316 58439 58562 58686 58810 58934 59059 59185 59311 59437 59565 59692 59820 59949 60078 60208 60338 60469 60600 60732 60864 60997 61130
417 61130 61264 61399 61534 61670 61806 61943 62080 62218 62356 62496 62635 62776 62916 63058 63200 63343 63486 63630 63774 63920 64065 64212 64359
416 64359 64506 64655 64804 64953 65104 65255 65406 65559 65712 65865 66020 66175 66330 66487 66644 66802 66960 67119 67279 67440 67602 67764 67927
414 67927 68090 68255 68420 68586 68753 68920 69089 69258 69428 69598 69770 69942 70115 70289 70464 70640 70816 70993 71171 71351 71530 71711 71893
412 71893 72075 72259 72443 72628 72815 73002 73190 73379 73569 73759 73951 74144 74338 74533 74728 74925 75123 75322 75521 75722 75924 76127 76331
410 76331 76536 76742 76949 77157 77367 77577 77789 78002 78216 78431 78647 78864 79083 79302 79523 79745 79969 80193 80419 80646 80874 81104 81335
408 81335 81567 81800 82035 82271 82509 82747 82987 83229 83472 83716 83962 84209 84458 84708 84959 85212 85467 85723 85980 86239 86500 86762 87026
407 87026 87291 87558 87827 88097 88369 88643 88918 89195 89473 89754 90036 90320 90606 90893 91183 91474 91767 92062 92359 92658 92959 93261 93566
405 93566 93873 94181 94492 94805 95120 95437 95756 96078 96401 96727 97055 97385 97718 98053 98390 98729 99071 99415 99762 100111 100463 100817 101174
403 101174 101533 101895 102260 102627 102997 103370 103745 104123 104504 104888 105275 105665 106057 106453 106852 107254 107659 108067 108478 108893 109311 109732 110156
401 110156 110584 111015 111450 111889 112331 112776 113226 113679 114135 114596 115060 115529 116001 116478 116958 117443 117932 118425 118923 119425 119931 120442 120957
400 120957 121478 122002 122532 123067 123606 124151 124700 125255 125815 126380 126951 127527 128109 128696 129289 129888 130493 131104 131721 132344 132974 133610 134253
398 134253 134902 135558 136221 136891 137568 138252 138944 139643 140350 141065 141787 142518 143256 144004 144759 145524 146297 147079 147870 148671 149481 150301 151131
396 151131 151971 152821 153682 154553 155436 156329 157234 158151 159080 160021 160974 161940 162919 163911 164917 165936 166970 168018 169081 170160 171254
395 171254 172364 173490 174633 175793 176971 178166 179381 180614 181866 183139 184432 185746 187081 188439 189819 191223 192651
393 192651 194104 195583 197087 198619 200179 201767 203385 205033 206713 208425 210171 211951 213767 215620 217511 219442 221413
392 221413 223427 225485 227588 229739 231938 234188 236490 238848 241262 243735 246270 248870 251536 254271 257080 259964 262928
391 262928 265974 269108 272332 275651 279070 282594 286229 289978 293850 297850 301985 306262 310690 315278 320034 324969 330094
389 330094 335420 340960 346728 352739 359010 365559 372405 379569 387077 394952 403224 411926 421091 430758 440972 451779 463235
388 463235 475399 488340 502135 516871 532646 549575 567785 587427 608671 631718 656801 684194 714220 747262
387 747262 783783 824335 869595 920392 977755 1042977 1117698 1204034 1304756 1423557 1565459 1737441 1949450
386 1949450 2216030 2559021 3011898 3626005 4475174 5637981 7101499 8594424 9625854 9960227 10001580
385 10001580 10408139 11663462 14075120 17887804 23035787 28259901 30579524 28015862 22519025 17034640
384 17034640 12773457 9734277 7603193 6093643 5003297 4198586 3592272 3126799 2763505 2475889
384 2475889 2245413 2058853 1906606 1781581 1678469 1593235 1522782 1464708 1417131 1378572 1347862 1324074 1306477
383 1306477 1294497 1287692 1285729 1288370 1295462 1306931 1322775 1343067 1367952 1397657 1432498 1472888 1519363 1572596
382 1572596 1633439 1702962 1782520 1873837 1979132 2101299 2244171 2412925 2614698 2859575 3162174 3544238
381 3544238 4038774 4695903 5587048 6788157 8289214 9828937 10916675 11329702 11502120 12081001 13509586
380 13509586 16068779 19999032 25294282 30823001 33601100 31594826 26910506 22613390 19899143 18690004
379 18690004 18359897 18191559 17830746 17490797 17747727 19151572 22071708 26797270 33271122 40179513
378 40179513 44588142 44760895 43052183 43079346 46815959 54306224 62811872 66093248 59968071 48250770
378 48250770 36769448 27857910 21463631 16939587 13702231 11338752 9575277 8231894 7189175 6366406
377 6366406 5707912 5174505 4738061 4378038 4079183 3830010 3621759 3447676 3302508 3182144 3083356 3003607
376 3003607 2940914 2893746 2860953 2841707 2835472 2841983 2861233 2893483 2939279 2999490 3075364 3168612 3281542 3417240
375 3417240 3579852 3775008 4010467 4297142 4650722 5094279 5662303 6406122 7397043 8708697 10330254
374 10330254 12003261 13217207 13693210 13828888 14274794 15476869 17714128 21286603 26523740 33350939
373 33350939 40411097 45057785 45879170 44960740 45629144 49931132 58232420 68309172 73547625 68505645
372 68505645 57147600 46243097 38323733 33377811 30944842 30720668 32660509 36876202 43154070 49813680
372 49813680 53592036 53692657 53641711 56840419 64330090 74868777 85080790 91372669 91961300 86475353
371 86475353 75541856 61528248 47925210 36912629 28761708 22891995 18646866 15523384 13176579
370 13176579 11376475 9969338 8850858 7948879 7212475 6605001 6099609 5676309 5320000 5019131 4764776
369 4764776 4549976 4369279 4218405 4093998 3993454 3914786 3856542 3817733 3797804 3796614 3814449 3852046 3910660
368 3910660 3992154 4099145 4235217 4405226 4615753 4875769 5197594 5598287 6101557 6740125 7558031 8611788
368 8611788 9968177 11668831 13527027 14912090 15409328 15563865 16159578 17583666 20072730 23939994
367 23939994 29558264 37002814 45044492 50482915 51244443 49959980 50696734 55682631 65476089 78316639
366 78316639 87606194 85078414 71967527 56768042 44460596 35738463 29921190 26262162 24241937
365 24241937 23577699 24189169 26177462 29810080 35448703 43176976 51507849 56349465 55412032 52388411
365 52388411 51862673 55730753 63853334 73158275 76608579 69461021 56049436 42959952 32792306
364 32792306 25470394 20264243 16517505 13765015 11697364 10110760 8869585 7881949 7084311 6431830
363 6431830 5892237 5441898 5063211 4742881 4470732 4238893 4041220 3872881 3730068 3609772 3509630
362 3509630 3427806 3362908 3313932 3280219 3261434 3257568 3268943 3296250 3340605 3403639 3487632 3595715 3732174
361 3732174 3902911 4116151 4383556 4722004 5156416 5724150 6481036 7505948 8887133 10636694 12473299
360 12473299 13713061 13927275 13638670 13640028 14354855 15972068 18697236 22863844 28870376 36712365 44923212
360 44923212 50249370 50804181 49231130 49623951 54280215 63278823 73463582 77620055 70927373 57851791
359 57851791 45221053 35855495 29850711 26500841 24675354 23093514 21071702 18824714 17116426 16468868
358 16468868 16979159 18726490 21953086 26991239 33794783 40707090 43695015 40061272 32475595 24939574
357 24939574 19068985 14851448 11864268 9722733 8154485 6979082 6078237 5373619 4812403 4358226
357 4358226 3985529 3675986 3416213 3196264 3008636 2847588 2708673 2588408 2484040 2393377 2314663 2246489
356 2246489 2187719 2137446 2094949 2059668 2031181 2009191 1993515 1984085 1980943 1984248 1994292 2011509 2036508 2070109
355 2070109 2113392 2167776 2235120 2317875 2419304 2543808 2697416 2888551 3129224 3436949 3837803 4371178
354 4371178 5096283 6096876 7465367 9207583 11009301 12131058 12111107 11497253 11129449 11454540 12655528
353 12655528 14915772 18535216 23873422 30902735 38000303 41195498 37833779 30554331 23309623 17698115
352 17698115 13712016 10939030 9005046 7648038 6698731 6052496 5649448 5463416 5498005 5787831 6399709
351 6399709 7412244 8808739 10217401 10790863 9976929 8320331 6660424 5359816 4424059 3760381
350 3760381 3283236 2932409 2668284 2465013 2305520 2178294 2075400 1991247 1921810 1864137 1816022 1775790
349 1775790 1742153 1714103 1690847 1671751 1656306 1644102 1634801 1628131 1623867 1621827 1621861 1623851 1627702 1633342 1640718 1649796
348 1649796 1660558 1673005 1687152 1703033 1720700 1740226 1761705 1785258 1811035 1839224 1870058 1903823 1940873 1981653
347 1981653 2026717 2076770 2132710 2195702 2267271 2349448 2444974 2557627 2692700 2857774 3063944 3327802 3674658
346 3674658 4143592 4794393 5712366 6989349 8614687 10217894 10965811 10323311 8828188 7313188 6147750
345 6147750 5342253 4805087 4451315 4221529 4077025 3992868 3952852 3946283 3966003 4007167 4066483 4141725 4231430
344 4231430 4334682 4450988 4580182 4722367 4877881 5047269 5231273 5430834 5647090 5881396 6135336
344 6135336 6410754 6709784 7034896 7388943 7775228 8197588 8660484 9169128 9729636 10349212 11036393
343 11036393 11801353 12656289 13615934 14698210 15925112 17323881 18928604 20782437 22940727 25475533
342 25475533 28482289 32089966 36477064 41897800 48727049 57541256 69271052 85491850 108890197
341 108890197 143177467 188385384 232526271 262487030 285023308 317627600 362828990 404811597
341 404811597 421744091 401231130 350594573 288307039 229611400 181351822 144144467 116081853
340 116081853 94920280 78808594 66376799 56646571 48924182 42715108 37663028 33507890 30057331
339 30057331 27167148 24727871 22655390 20884359 19363489 18052144 16917848 15934458 15080780 14339540
339 14339540 13696590 13140304 12661116 12251146 11903926 11614176 11377628 11190897 11051373 10957147 10906957 10900155
338 10900155 10936682 11017077 11142490 11314718 11536258 11810387 12141273 12534102 12995270 13532613 14155709 14876273
337 14876273 15708679 16670628 17784076 19076447 20582326 22345816 24423880 26891223 29847577 33428954
336 33428954 37825640 43312268 50300453 59435843 71783778 89176268 114673096 151803477 198196196
335 198196196 241776433 275988505 304559818 338874960 382825553 421396791 434014088 410316496
335 410316496 357593950 293037109 231920723 181790697 143451595 114805202 93380372 77170923
334 77170923 64718597 54998634 47294011 41098997 36052279 31891878 28424992 25507656 23030889 20911113
333 20911113 19083469 17497049 16111492 14894478 13819904 12866510 12016844 11256480 10573410 9957581
333 9957581 9400519 8895049 8435060 8015323 7631345 7279245 6955658 6657657 6382686 6128504 5893139
332 5893139 5674853 5472108 5283540 5107933 4944207 4791392 4648620 4515115 4390173 4273164 4163517
331 4163517 4060716 3964291 3873820 3788915 3709225 3634431 3564241 3498388 3436629 3378742 3324523 3273787 3226364
330 3226364 3182097 3140845 3102478 3066877 3033935 3003552 2975640 2950118 2926913 2905961 2887202 2870586 2856068 2843608
329 2843608 2833175 2824740 2818281 2813784 2811236 2810632 2811972 2815261 2820508 2827729 2836946 2848184 2861475 2876859 2894378 2914084
328 2914084 2936035 2960294 2986935 3016037 3047688 3081988 3119043 3158973 3201906 3247986 3297368 3350223 3406737 3467115
327 3467115 3531581 3600380 3673781 3752078 3835595 3924688 4019748 4121206 4229538 4345271 4468986 4601329 4743018
326 4743018 4894852 5057722 5232624 5420676 5623133 5841412 6077109 6332039 6608261 6908126 7234324
325 7234324 7589947 7978562 8404298 8871964 9387176 9956536 10587838 11290341 12075112 12955457 13947498
324 13947498 15070907 16349885 17814472 19502297 21460994 23751527 26452869 29668670 33536912 38244100
323 38244100 44046450 51301962 60519339 72432564 88111803 109115399 137649520 176558897 228589634
322 228589634 293852967 365490379 428861870 470026625 483176432 467519285 424072665 359363270
322 359363270 287844161 223681679 172960905 135169255 107483550 87103475 71885444 60321927
321 60321927 51378642 44345856 38731143 34187525 30466371 27386509 24813801 22647442 20810623 19244090
320 19244090 17901598 16746688 15750359 14889344 14144861 13501652 12947279 12471566 12066188 11724343 11440501
320 11440501 11210212 11029952 10897010 10809405 10765817 10765554 10808527 10895245 11026827 11205035 11432329 11711929
319 11711929 12047921 12445388 12910570 13451085 14076203 14797203 15627827 16584879 17688998 18965684 20446661
318 20446661 22171703 24191133 26569232 29389037 32759061 36822985 41773684 47873949 55487309 65124300
317 65124300 77511404 93690496 115147435 143921350 182480761 232746630 293331686 355829314 404792461
316 404792461 424194788 408085295 366159098 316546965 275237064 248968479 232992770 214985936
316 214985936 186492745 151673480 119386804 94057613 75450737 61845353 51708205 43970904 37927153
315 37927153 33108551 29198083 25975829 23285452 21013269 19074904 17406582 15959301 14694865 13583108
314 13583108 12599928 11725861 10945041 10244420 9613181 9042292 8524163 8052370 7621449 7226727 6864187
313 6864187 6530358 6222231 5937183 5672922 5427435 5198951 4985902 4786901 4600715 4426242 4262500
313 4262500 4108607 3963771 3827281 3698491 3576820 3461741 3352775 3249487 3151478 3058387 2969881 2885658
312 2885658 2805438 2728966 2656004 2586337 2519764 2456099 2395172 2336822 2280904 2227281 2175824 2126417 2078948 2033315
311 2033315 1989423 1947181 1906505 1867318 1829545 1793117 1757970 1724043 1691279 1659623 1629026 1599438 1570817 1543118
310 1543118 1516301 1490330 1465167 1440779 1417133 1394200 1371951 1350357 1329393 1309034 1289257 1270039 1251360 1233198
308 1233198 1215536 1198353 1181634 1165360 1149517 1134090 1119063 1104422 1090155 1076249 1062692 1049472 1036578 1023999
307 1023999 1011726 999748 988057 976642 965496 954610 943976 933587 923435 913513 903815 894334 885063 875997 867130
306 867130 858456 849970 841666 833539 825586 817800 810178 802715 795407 788250 781241 774374 767647 761056 754597 748268 742066
305 742066 735986 730026 724184 718456 712840 707333 701932 696636 691441 686345 681347 676444 671633 666914 662283 657740 653281
304 653281 648905 644611 640397 636261 632202 628217 624306 620467 616698 612999 609367 605802 602301 598865 595492 592180 588928
302 588928 585736 582602 579525 576504 573539 570627 567769 564963 562208 559504 556849 554243 551685 549175 546710 544292 541918
301 541918 539589 537303 535060 532860 530700 528582 526505 524467 522468 520507 518585 516701 514853 513042 511266 509527 507822
300 507822 506152 504516 502914 501345 499809 498305 496833 495394 493985 492607 491260 489943 488656 487398 486170 484971 483800
298 483800 482657 481543 480456 479397 478365 477360 476381 475429 474504 473604 472730 471882 471058 470260 469487 468739 468015 467316 466640 465989 465361
297 465361 464758 464177 463620 463087 462576 462089 461624 461182 460762 460365 459990 459638 459308 458999 458713 458448 458206 457985 457786 457608 457452 457317 457203
295 457203 457111 457040 456991 456962 456955 456969 457004 457060 457137 457235 457354 457494 457655 457837 458040 458264 458509 458775 459062 459370 459699 460050 460421 460814 461228 461663
293 461663 462119 462597 463096 463617 464159 464723 465309 465916 466545 467196 467869 468564 469281 470021 470783 471568 472375 473205 474057 474933 475832 476754 477699
291 477699 478668 479661 480677 481718 482783 483871 484985 486123 487286 488474 489687 490926 492190 493480 494797 496139 497508 498904
290 498904 500327 501777 503254 504759 506292 507854 509444 511062 512710 514387 516094 517831 519598 521396 523225 525085 526977
289 526977 528901 530857 532846 534869 536924 539014 541138 543297 545490 547720 549985 552287 554626 557003 559417 561870 564362
287 564362 566893 569464 572076 574729 577423 580160 582940 585763 588630 591542 594499 597502 600552 603649 606795 609989 613233
286 613233 616527 619873 623270 626720 630224 633782 637395 641065 644792 648576 652420 656324 660289 664316 668406 672561 676781
285 676781 681067 685421 689843 694336 698900 703537 708248 713033 717896 722837 727857 732958 738142 743410 748764 754205 759735
284 759735 765356 771070 776878 782783 788786 794889 801095 807405 813822 820347 826984 833734 840600 847585 854690 861919 869274
282 869274 876758 884374 892125 900014 908043 916217 924538 933010 941636 950421 959367 968478 977759 987214 996846 1006660 1016661
281 1016661 1026854 1037242 1047831 1058626 1069633 1080856 1092302 1103975 1115883 1128031 1140426 1153074 1165983 1179159
280 1179159 1192610 1206343 1220366 1234688 1249317 1264262 1279531 1295135 1311084 1327386 1344054 1361098 1378529 1396359
279 1396359 1414601 1433268 1452372 1471928 1491951 1512455 1533455 1554969 1577014 1599607 1622766 1646511 1670863 1695842
278 1695842 1721470 1747771 1774769 1802488 1830955 1860198 1890246 1921129 1952879 1985529 2019113 2053670 2089238 2125856
277 2125856 2163569 2202420 2242456 2283729 2326290 2370195 2415501 2462272 2510571 2560468 2612035 2665351 2720496 2777557
276 2777557 2836626 2897801 2961185 3026889 3095029 3165732 3239129 3315363 3394586 3476959 3562656 3651863 3744778 3841615
275 3841615 3942602 4047987 4158033 4273027 4393277 4519116 4650902 4789026 4933908 5086009 5245825
274 5245825 5413900 5590823 5777240 5973857 6181449 6400862 6633029 6878979 7139845 7416879 7711471
273 7711471 8025162 8359667 8716901 9099003 9508373 9947706 10420040 10928814 11477921 12071795 12715495
272 12715495 13414813 14176414 15007991 15918461 16918206 18019373 19236239 20585688 22087775 23766491
271 23766491 25650703 27775393 30183262 32926852 36071361 39698454 43911429 48842378 54662194 61594795
270 61594795 69937674 80092014 92607677 108251527 128112936 153768971 187545091 232923735 295160241
270 295160241 382099493 504823980 676378329 902001931 1143751738 1277280714 1192944414 963412346
269 963412346 727450090 542404780 408959822 314474165 247110740 198262240 162117165 134823243
269 134823243 113815603 97362182 84272141 73711150 65083716 57957233 52012246 47009251 42766140
268 42766140 39142680 36029609 33340866 31008019 28976150 27200835 25645886 24281616 23083549 22031398
267 22031398 21108287 20300139 19595187 18983599 18457166 18009072 17633692 17326443 17083663 16902522 16780943
266 16780943 16717560 16711683 16763277 16872970 17042060 17272551 17567201 17929593 18364222 18876617 19473492 20162929
265 20162929 20954627 21860192 22893513 24071246 25413407 26944152 28692756 30694909 32994391 35645280
265 35645280 38714918 42287873 46471371 51402790 57260101 64276715 72762812 83136441 95969545
264 95969545 112056930 132520332 158965607 193714956 240125399 302926739 388197067 501654100
263 501654100 642439256 791359373 903646803 927222771 848917468 709332844 560939490 434373945
263 434373945 337032983 264965916 211854942 172316355 142419663 119427360 101449595 87173067
262 87173067 75673306 66289538 58542034 52077082 46630059 42000252 38033467 34609829 31635116 29034504
261 29034504 26748017 24727146 22932343 21331116 19896576 18606331 17441612 16386593 15427864 14553997
261 14553997 13755207 13023079 12350344 11730697 11158649 10629400 10138745 9682981 9258839 8863427 8494175
260 8494175 8148796 7825248 7521704 7236524 6968234 6715505 6477139 6252049 6039250 5837849 5647031
259 5647031 5466054 5294241 5130971 4975677 4827837 4686972 4552642 4424440 4301992 4184950 4072995
258 4072995 3965829 3863178 3764786 3670415 3579844 3492867 3409293 3328941 3251646 3177249 3105605 3036577 2970034
257 2970034 2905858 2843934 2784156 2726423 2670642 2616721 2564580 2514137 2465318 2418053 2372274 2327919 2284928 2243245
256 2243245 2202815 2163587 2125514 2088549 2052649 2017772 1983880 1950934 1918899 1887740 1857427 1827926 1799210 1771250
255 1771250 1744019 1717492 1691643 1666451 1641891 1617943 1594586 1571801 1549568 1527870 1506690 1486010 1465815 1446090
254 1446090 1426819 1407989 1389587 1371598 1354011 1336815 1319996 1303544 1287448 1271698 1256284 1241197 1226426 1211964
253 1211964 1197802 1183930 1170342 1157030 1143986 1131203 1118673 1106391 1094350 1082544 1070966 1059610 1048471 1037544
252 1037544 1026823 1016303 1005979 995846 985899 976135 966548 957134 947889 938810 929892 921132 912525 904069 895760 887594
250 887594 879569 871681 863927 856304 848810 841440 834194 827068 820059 813166 806385 799714 793151 786694 780340 774087 767934
249 767934 761878 755918 750050 744275 738589 732990 727478 722051 716707 711443 706260 701155 696126 691173 686293 681486 676751
248 676751 672085 667487 662957 658493 654094 649759 645486 641275 637124 633033 629000 625024 621105 617240 613431 609675 605971
247 605971 602319 598718 595167 591665 588212 584806 581447 578134 574866 571643 568464 565328 562234 559182 556172 553202 550272
245 550272 547381 544529 541715 538939 536200 533497 530830 528199 525602 523040 520511 518016 515554 513125 510727 508361 506025
244 506025 503721 501447 499202 496987 494801 492643 490514 488412 486338 484291 482271 480277 478310 476368 474451 472559 470692
243 470692 468850 467031 465237 463466 461718 459993 458291 456611 454953 453317 451703 450110 448538 446987 445457 443946 442456
241 442456 440986 439536 438105 436693 435300 433926 432571 431234 429915 428614 427331 426066 424818 423587 422373 421176 419996
240 419996 418833 417686 416555 415440 414341 413258 412190 411138 410101 409079 408072 407080 406103 405141 404193 403259 402339 401434 400542
239 400542 399664 398800 397950 397113 396289 395479 394681 393897 393126 392367 391622 390889 390168 389460 388764 388080 387409 386749 386102 385466 384843 384231 383630
237 383630 383041 382464 381898 381343 380800 380267 379746 379236 378737 378248 377771 377304 376848 376402 375968 375543 375129 374726 374333 373950 373577 373215 372862
235 372862 372520 372188 371865 371553 371251 370958 370675 370402 370139 369885 369641 369406 369181 368966 368760 368563 368376 368198 368030 367871 367721 367580 367449
233 367449 367327 367214 367110 367015 366929 366853 366785 366727 366677 366637 366605 366583 366569 366564 366568 366581 366603 366634 366673 366722 366779 366845 366920 367004 367096 367197 367307 367426 367553 367690 367835
231 367835 367988 368151 368322 368502 368691 368888 369095 369310 369534 369766 370007 370258 370516 370784 371061 371346 371640 371943 372255 372575 372905 373243 373591
229 373591 373947 374312 374686 375069 375461 375862 376272 376691 377119 377556 378002 378458 378922 379396 379879 380371 380872 381383 381903 382432 382971 383519 384077
227 384077 384644 385220 385806 386402 387007 387622 388247 388881 389525 390179 390843 391517 392200 392894 393597 394311 395035 395769 396513 397267 398032 398807 399593
226 399593 400389 401195 402012 402840 403679 404528 405388 406259 407141 408034 408938 409853 410779 411717 412666 413626 414598 415581 416576 417583 418602 419632
224 419632 420674 421729 422795 423874 424965 426068 427183 428312 429452 430606 431772 432951 434143 435349 436567 437799 439044
223 439044 440302 441574 442860 444160 445473 446800 448142 449498 450868 452252 453652 455065 456494 457938 459397 460870 462360
221 462360 463864 465385 466921 468472 470040 471624 473225 474841 476475 478125 479792 481476 483177 484895 486631 488385 490156
220 490156 491946 493754 495580 497424 499287 501170 503071 504991 506931 508891 510870 512870 514890 516930 518991 521072 523175
219 523175 525299 527445 529612 531801 534013 536247 538503 540783 543085 545412 547761 550135 552533 554955 557402 559874 562371
218 562371 564894 567442 570017 572618 575246 577901 580583 583293 586031 588797 591591 594415 597268 600151 603063 606006 608980
216 608980 611985 615021 618089 621190 624323 627489 630688 633922 637189 640492 643829 647202 650611 654057 657540 661060 664618
215 664618 668214 671850 675524 679239 682994 686791 690628 694508 698431 702397 706406 710460 714559 718704 722895 727133 731419
214 731419 735753 740136 744568 749051 753584 758170 762808 767499 772244 777044 781900 786812 791781 796808 801895 807041 812248
212 812248 817516 822847 828242 833701 839225 844816 850475 856201 861998 867865 873805 879817 885903 892064 898302 904618 911013
211 911013 917488 924044 930684 937408 944217 951113 958099 965174 972340 979600 986955 994405 1001954 1009603 1017352 1025205 1033163
210 1033163 1041228 1049402 1057686 1066083 1074594 1083223 1091970 1100838 1109829 1118946 1128191 1137566 1147073 1156716 1166497 1176418 1186482
208 1186482 1196691 1207050 1217560 1228224 1239046 1250028 1261174 1272488 1283971 1295629 1307464 1319480 1331681 1344070
207 1344070 1356652 1369430 1382409 1395593 1408987 1422593 1436419 1450467 1464743 1479253 1494000 1508991 1524230 1539724
206 1539724 1555477 1571497 1587789 1604360 1621215 1638361 1655806 1673557 1691620 1710003 1728713 1747760 1767151 1786894
205 1786894 1806998 1827472 1848325 1869568 1891210 1913260 1935731 1958631 1981974 2005770 2030032 2054772 2080002 2105737
204 2105737 2131989 2158774 2186105 2213999 2242471 2271537 2301215 2331522 2362476 2394097 2426404 2459417 2493158 2527649
203 2527649 2562912 2598971 2635852 2673580 2712181 2751683 2792115 2833508 2875893 2919302 2963769 3009331 3056023 3103886
202 3103886 3152959 3203284 3254906 3307870 3362224 3418020 3475309 3534147 3594591 3656703 3720545 3786184 3853690 3923137
201 3923137 3994600 4068162 4143908 4221926 4302311 4385163 4470585 4558689 4649591 4743412 4840285 4940344 5043735
200 5043735 5150613 5261139 5375485 5493836 5616384 5743335 5874908 6011337 6152869 6299769 6452317
199 6452317 6610817 6775587 6946972 7125339 7311083 7504626 7706420 7916954 8136751 8366375 8606435
198 8606435 8857588 9120542 9396067 9684994 9988226 10306743 10641611 10993995 11365161 11756497 12169518
197 12169518 12605891 13067441 13556181 14074327 14624332 15208904 15831054 16494127 17201847 17958382 18768391
197 18768391 19637111 20570435 21575019 22658401 23829145 25097014 26473178 27970463 29603651 31389859
196 31389859 33348979 35504254 37882956 40517277 43445408 46712935 50374624 54496725 59159957 64463463
195 64463463 70530066 77513322 85607171 95059238 106189482 119416712 135296943 154579796 178292969
194 178292969 207870798 245353130 293695762 357253627 442506281 559018214 720181252 941680183
194 941680183 1232014841 1569528144 1885456787 2095553239 2147483647 2029603812 1769183153 1434342203
193 1434342203 1110001962 846792543 651102276 509603883 407006586 331454465 274724902 231283149
193 231283149 197399839 170528330 148898390 131255982 116696213 104554676 94335587 85663457 78250063
192 78250063 71871367 66351248 61549834 57354961 53675934 50438817 47582923 45058113 42822725 40841970
191 40841970 39086673 37532276 36158061 34946516 33882826 32954473 32150918 31463314 30884316 30407898
190 30407898 30029219 29744517 29551028 29446930 29431303 29504113 29666212 29919355 30266241 30710569 31257121 31911875
189 31911875 32682134 33576705 34606116 35782889 37121859 38640614 40359985 42304708 44504237 46993737
189 46993737 49815429 53020212 56669855 60839770 65622713 71133696 77516570 84953044 93675015 103981935
188 103981935 116265386 131044567 149018254 171142417 198747659 233719860 278779758 337912561
187 337912561 417000765 524629751 672616771 874395908 1136453333 1438783676 1721564388 1912170608
187 1912170608 1964655420 1867565448 1642466881 1345577319 1050673218 806218236 621797561 487244328
186 487244328 389155978 316680882 262135595 220290094 187597349 161625766 140680890 123560519
185 123560519 109396189 97549751 87544718 79020067 71698473 65364277 59847808 55014194 50755158
185 50755158 46982989 43626071 40625439 37932236 35505674 33311513 31320836 29509082 27855290 26341479
184 26341479 24952163 23673934 22495152 21405659 20396565 19460066 18589280 17778125 17021213 16313745
183 16313745 15651451 15030510 14447499 13899343 13383274 12896797 12437653 12003797 11593374 11204696 10836224
182 10836224 10486556 10154409 9838609 9538079 9251830 8978952 8718608 8470027 8232493 8005347 7787979
182 7787979 7579822 7380353 7189081 7005555 6829351 6660074 6497360 6340862 6190262 6045259 5905573
181 5905573 5770939 5641110 5515855 5394956 5278209 5165418 5056405 4950996 4849031 4750357 4654829 4562314
180 4562314 4472680 4385806 4301579 4219887 4140627 4063701 3989016 3916483 3846017 3777540 3710974 3646247 3583289 3522037
179 3522037 3462425 3404396 3347891 3292856 3239239 3186991 3136063 3086411 3037991 2990762 2944683 2899716 2855825 2812975
178 2812975 2771133 2730266 2690342 2651333 2613210 2575946 2539514 2503888 2469045 2434961 2401614 2368982 2337044 2305780
177 2305780 2275170 2245197 2215841 2187086 2158915 2131312 2104261 2077746 2051755 2026272 2001284 1976778 1952741 1929161
176 1929161 1906026 1883326 1861047 1839181 1817717 1796643 1775952 1755633 1735678 1716077 1696821 1677904 1659315 1641049
175 1641049 1623096 1605451 1588105 1571051 1554284 1537796 1521581 1505634 1489947 1474515 1459333 1444395 1429695 1415229
173 1415229 1400992 1386978 1373183 1359602 1346231 1333064 1320099 1307331 1294755 1282368 1270166 1258144 1246301 1234631
172 1234631 1223132 1211800 1200632 1189624 1178773 1168077 1157532 1147136 1136885 1126778 1116810 1106980 1097284 1087722
171 1087722 1078289 1068983 1059803 1050746 1041809 1032991 1024289 1015702 1007227 998862 990605 982455 974409 966466 958623 950881 943235
170 943235 935685 928230 920867 913595 906413 899318 892311 885388 878549 871792 865117 858521 852003 845562 839198 832908 826691
169 826691 820547 814474 808471 802537 796671 790872 785138 779469 773864 768322 762842 757423 752063 746763 741521 736336 731208
167 731208 726136 721118 716154 711244 706386 701580 696825 692120 687464 682858 678299 673788 669324 664906 660533 656205 651921
166 651921 647681 643484 639329 635216 631145 627114 623123 619172 615260 611386 607551 603753 599992 596267 592579 588926 585308
165 585308 581725 578176 574661 571179 567730 564314 560930 557577 554255 550965 547705 544475 541274 538104 534962 531848 528763
164 528763 525706 522676 519674 516699 513750 510827 507931 505060 502214 499393 496598 493826 491079 488355 485655 482979 480325
162 480325 477694 475086 472500 469936 467393 464872 462373 459894 457436 454999 452581 450184 447807 445449 443111 440792 438492
161 438492 436210 433947 431703 429476 427268 425077 422904 420748 418610 416488 414383 412295 410223 408168 406128 404105 402097
160 402097 400105 398128 396167 394220 392289 390372 388470 386583 384709 382851 381006 379175 377357 375554 373764 371987 370223
158 370223 368473 366735 365010 363298 361599 359912 358237 356574 354924 353285 351658 350043 348440 346848 345268 343698 342140
157 342140 340593 339057 337532 336017 334514 333020 331537 330065 328602 327150 325708 324276 322854 321441 320038 318645 317261
156 317261 315887 314522 313166 311819 310482 309153 307834 306523 305221 303927 302642 301366 300098 298838 297587 296344 295109
154 295109 293882 292663 291452 290249 289054 287867 286687 285514 284349 283192 282042 280899 279764 278636 277515 276400 275293
153 275293 274193 273100 272014 270934 269862 268795 267736 266683 265636 264596 263563 262535 261514 260499 259491 258488 257492
152 257492 256501 255517 254538 253566 252599 251638 250683 249733 248789 247851 246918 245991 245069 244153 243242 242336 241436 240541 239651 238766 237887 237012 236143
150 236143 235278 234419 233564 232715 231870 231030 230195 229364 228538 227717 226901 226089 225282 224479 223681 222887 222098 221313 220532 219756 218984 218216 217453
148 217453 216693 215938 215187 214441 213698 212959 212224 211494 210767 210044 209325 208610 207899 207191 206487 205788 205091 204399 203710 203025 202344 201666 200991
147 200991 200321 199653 198990 198329 197673 197019 196369 195722 195079 194439 193803 193169 192539 191912 191289 190668 190051 189437 188826 188218 187613 187011 186412
145 186412 185817 185224 184634 184047 183463 182882 182304 181729 181157 180587 180021 179457 178896 178338 177782 177229 176679 176132 175587 175045 174505 173968 173434
143 173434 172902 172373 171847 171323 170801 170282 169766 169252 168740 168231 167724 167220 166718 166219 165721 165227 164734 164244 163756 163270 162787 162306 161827
141 161827 161351 160876 160404 159934 159466 159000 158537 158075 157616 157159 156704 156251 155800 155351 154904 154459 154016 153576 153137 152700 152265 151832 151401
140 151401 150972 150545 150120 149697 149275 148856 148438 148022 147608 147196 146785 146377 145970 145565 145162 144760 144361 143963 143566 143172 142779 142388 141999
138 141999 141611 141225 140841 140458 140077 139697 139319 138943 138569 138196 137824 137454 137086 136719 136354 135990 135628 135268 134909 134551 134195 133841 133487
136 133487 133136 132786 132437 132090 131744 131399 131056 130715 130375 130036 129699 129363 129028 128695 128363 128032 127703 127375 127049 126724 126400 126077 125756
134 125756 125436 125117 124800 124484 124169 123855 123543 123232 122922 122613 122306 122000 121695 121391 121089 120787 120487 120188 119890 119593 119298 119004 118710
133 118710 118418 118127 117838 117549 117261 116975 116690 116405 116122 115840 115559 115279 115000 114723 114446 114170 113896 113622 113350 113078 112808 112538 112270
131 112270 112003 111736 111471 111206 110943 110681 110419 110159 109899 109641 109383 109127 108871 108616 108363 108110 107858 107607 107357 107108 106860 106612 106366
129 106366 106121 105876 105632 105390 105148 104907 104667 104427 104189 103951 103715 103479 103244 103010 102776 102544 102312 102081 101851 101622 101394 101166 100940
127 100940 100714 100489 100264 100041 99818 99596 99375 99154 98935 98716 98498 98280 98064 97848 97633 97419 97205 96992 96780 96569 96358 96148 95939
125 95939 95731 95523 95316 95110 94904 94699 94495 94291 94089 93887 93685 93484 93284 93085 92886 92688 92491 92294 92098 91903 91708 91514 91320
124 91320 91128 90936 90744 90553 90363 90173 89984 89796 89608 89421 89235 89049 88864 88679 88495 88312 88129 87947 87765 87584 87404 87224 87045
122 87045 86866 86688 86510 86334 86157 85981 85806 85632 85457 85284 85111 84939 84767 84595 84425 84254 84085 83916 83747 83579 83411 83244 83078
120 83078 82912 82747 82582 82417 82254 82090 81927 81765 81603 81442 81281 81121 80961 80802 80643 80485 80327 80170 80013 79857 79701 79546 79391
118 79391 79236 79082 78929 78776 78623 78471 78320 78169 78018 77868 77718 77569 77420 77272 77124 76976 76829 76683 76537 76391 76246 76101 75956
117 75956 75812 75669 75526 75383 75241 75099 74958 74817 74676 74536 74396 74257 74118 73980 73842 73704 73567 73430 73294 73158 73022 72887 72752
115 72752 72618 72484 72350 72217 72084 71951 71819 71687 71556 71425 71295 71164 71035 70905 70776 70647 70519 70391 70264 70136 70010 69883 69757
113 69757 69631 69506 69381 69256 69132 69008 68884 68761 68638 68515 68393 68271 68150 68029 67908 67787 67667 67547 67428 67308 67190 67071 66953
111 66953 66835 66718 66600 66484 66367 66251 66135 66019 65904 65789 65675 65560 65446 65333 65219 65106 64994 64881 64769 64657 64546 64435 64324
110 64324 64213 64103 63993 63883 63774 63665 63556 63447 63339 63231 63124 63016 62909 62803 62696 62590 62484 62378 62273 62168 62063 61959 61855
108 61855 61751 61647 61544 61441 61338 61235 61133 61031 60929 60828 60727 60626 60525 60425 60324 60224 60125 60026 59926 59828 59729 59631 59533 59435 59337 59240
106 59240 59143 59046 58950 58853 58757 58661 58566 58471 58376 58281 58186 58092 57998 57904 57810 57717 57624 57531 57438 57346 57254 57162 57070 56979 56887 56796 56706 56615 56525 56435 56345 56255 56166 56077
103 56077 55988 55899 55810 55722 55634 55546 55459 55371 55284 55197 55110 55024 54937 54851 54765 54680 54594 54509 54424 54339 54255 54170 54086 54002 53918 53835 53751 53668 53585 53502 53420 53337 53255 53173
101 53173 53091 53010 52928 52847 52766 52686 52605 52525 52444 52364 52285 52205 52126 52046 51967 51888 51810 51731 51653 51575 51497 51419 51342 51264 51187 51110 51034 50957 50881 50804 50728 50652 50577 50501
98 50501 50426 50351 50276 50201 50126 50052 49977 49903 49829 49756 49682 49609 49535 49462 49389 49317 49244 49172 49099 49027 48955 48884 48812 48741 48670 48599 48528 48457 48386 48316 48246 48176 48106 48036 47966
95 47966 47897 47828 47758 47689 47621 47552 47484 47415 47347 47279 47211 47143 47076 47008 46941 46874 46807 46740 46674 46607 46541 46475 46409 46343 46277 46211 46146 46081 46015 45950 45885 45821 45756 45692 45627
93 45627 45563 45499 45435 45372 45308 45245 45181 45118 45055 44992 44930 44867 44804 44742 44680 44618 44556 44494 44433 44371 44310 44248 44187 44126 44065 44005 43944 43884 43823 43763 43703 43643 43583 43524 43464
90 43464 43405 43346 43286 43227 43169 43110 43051 42993 42934 42876 42818 42760 42702 42644 42587 42529 42472 42414 42357 42300 42243 42187 42130 42073 42017 41961 41904 41848 41792 41737 41681 41625 41570 41515 41459
87 41459 41404 41349 41294 41239 41185 41130 41076 41022 40967 40913 40859 40805 40752 40698 40644 40591 40538 40485 40431 40379 40326 40273 40220 40168 40115 40063 40011 39959 39907 39855 39803 39751 39700 39648 39597
85 39597 39546 39495 39443 39393 39342 39291 39240 39190 39139 39089 39039 38989 38939 38889 38839 38789 38740 38690 38641 38591 38542 38493 38444 38395 38346 38298 38249 38201 38152 38104 38056 38007 37959 37911 37864
82 37864 37816 37768 37721 37673 37626 37579 37531 37484 37437 37390 37344 37297 37250 37204 37157 37111 37065 37019 36972 36926 36881 36835 36789 36743 36698 36652 36607 36562 36517 36472 36427 36382 36337 36292 36247
79 36247 36203 36158 36114 36070 36025 35981 35937 35893 35849 35806 35762 35718 35675 35631 35588 35545 35501 35458 35415 35372 35329 35287 35244 35201 35159 35116 35074 35032 34989 34947 34905 34863 34821 34779 34738
77 34738 34696 34654 34613 34572 34530 34489 34448 34407 34366 34325 34284 34243 34202 34162 34121 34080 34040 34000 33959 33919 33879 33839 33799 33759 33719 33680 33640 33600 33561 33521 33482 33443 33403 33364 33325
74 33325 33286 33247 33208 33169 33131 33092 33053 33015 32977 32938 32900 32862 32823 32785 32747 32709 32671 32634 32596 32558 32521 32483 32446 32408 32371 32334 32296 32259 32222 32185 32148 32111 32075 32038 32001
71 32001 31965 31928 31892 31855 31819 31783 31746 31710 31674 31638 31602 31566 31531 31495 31459 31423 31388 31352 31317 31282 31246 31211 31176 31141 31106 31071 31036 31001 30966 30931 30897 30862 30827 30793 30758
69 30758 30724 30690 30656 30621 30587 30553 30519 30485 30451 30417 30384 30350 30316 30283 30249 30216 30182 30149 30116 30082 30049 30016 29983 29950 29917 29884 29851 29818 29786 29753 29720 29688 29655 29623 29590
66 29590 29558 29526 29493 29461 29429 29397 29365 29333 29301 29269 29238 29206 29174 29143 29111 29079 29048 29017 28985 28954 28923 28892 28860 28829 28798 28767 28736 28705 28675 28644 28613 28582 28552 28521 28491
63 28491 28460 28430 28399 28369 28339 28309 28279 28248 28218 28188 28158 28128 28099 28069 28039 28009 27980 27950 27921 27891 27862 27832 27803 27773 27744 27715 27686 27657 27628 27599 27570 27541 27512 27483 27454
61 27454 27425 27397 27368 27340 27311 27282 27254 27226 27197 27169 27141 27112 27084 27056 27028 27000 26972 26944 26916 26888 26861 26833 26805 26777 26750 26722 26695 26667 26640 26612 26585 26558 26530 26503 26476
58 26476 26449 26422 26395 26368 26341 26314 26287 26260 26233 26206 26180 26153 26127 26100 26073 26047 26020 25994 25968 25941 25915 25889 25863 25836 25810 25784 25758 25732 25706 25680 25655 25629 25603 25577 25552
55 25552 25526 25500 25475 25449 25424 25398 25373 25347 25322 25297 25271 25246 25221 25196 25171 25146 25121 25096 25071 25046 25021 24996 24971 24947 24922 24897 24873 24848 24823 24799 24774 24750 24726 24701 24677
53 24677 24653 24628 24604 24580 24556 24532 24508 24484 24460 24436 24412 24388 24364 24340 24316 24293 24269 24245 24222 24198 24175 24151 24128 24104 24081 24057 24034 24011 23987 23964 23941 23918 23895 23872 23849
50 23849 23826 23803 23780 23757 23734 23711 23688 23665 23643 23620 23597 23575 23552 23529 23507 23484 23462 23439 23417 23395 23372 23350 23328 23306 23283 23261 23239 23217 23195 23173 23151 23129 23107 23085 23063
47 23063 23041 23020 22998 22976 22954 22933 22911 22889 22868 22846 22825 22803 22782 22760 22739 22718 22696 22675 22654 22632 22611 22590 22569 22548 22527 22506 22485 22464 22443 22422 22401 22380 22359 22338 22318
45 22318 22297 22276 22256 22235 22214 22194 22173 22153 22132 22112 22091 22071 22050 22030 22010 21989 21969 21949 21929 21909 21888 21868 21848 21828 21808 21788 21768 21748 21728 21708 21689 21669 21649 21629 21609
42 21609 21590 21570 21550 21531 21511 21492 21472 21452 21433 21414 21394 21375 21355 21336 21317 21297 21278 21259 21240 21220 21201 21182 21163 21144 21125 21106 21087 21068 21049 21030 21011 20992 20973 20955 20936
39 20936 20917 20898 20880 20861 20842 20824 20805 20787 20768 20749 20731 20712 20694 20676 20657 20639 20621 20602 20584 20566 20547 20529 20511 20493 20475 20457 20438 20420 20402 20384 20366 20348 20330 20313 20295
37 20295 20277 20259 20241 20223 20206 20188 20170 20152 20135 20117 20100 20082 20064 20047 20029 20012 19994 19977 19959 19942 19925 19907 19890 19873 19855 19838 19821 19804 19786 19769 19752 19735 19718 19701 19684
34 19684 19667 19650 19633 19616 19599 19582 19565 19548 19531 19515 19498 19481 19464 19448 19431 19414 19397 19381 19364 19348 19331 19314 19298 19281 19265 19248 19232 19216 19199 19183 19166 19150 19134 19118 19101
31 19101 19085 19069 19053 19036 19020 19004 18988 18972 18956 18940 18924 18908 18892 18876 18860 18844 18828 18812 18796 18780 18765 18749 18733 18717 18702 18686 18670 18655 18639 18623 18608 18592 18576 18561 18545
29 18545 18530 18514 18499 18483 18468 18453 18437 18422 18407 18391 18376 18361 18345 18330 18315 18300 18284 18269 18254 18239 18224 18209 18194 18179 18164 18149 18134 18119 18104 18089 18074 18059 18044 18029 18014
26 18014 18000 17985 17970 17955 17941 17926 17911 17896 17882 17867 17852 17838 17823 17809 17794 17780 17765 17751 17736 17722 17707 17693 17678 17664 17650 17635 17621 17607 17592 17578 17564 17550 17535 17521 17507
23 17507 17493 17479 17464 17450 17436 17422 17408 17394 17380 17366 17352 17338 17324 17310 17296 17282 17268 17255 17241 17227 17213 17199 17185 17172 17158 17144 17131 17117 17103 17090 17076 17062 17049 17035 17021
21 17021 17008 16994 16981 16967 16954 16940 16927 16913 16900 16887 16873 16860 16846 16833 16820 16807 16793 16780 16767 16753 16740 16727 16714 16701 16687 16674 16661 16648 16635 16622 16609 16596 16583 16570 16557
18 16557 16544 16531 16518 16505 16492 16479 16466 16453 16440 16428 16415 16402 16389 16376 16364 16351 16338 16325 16313 16300 16287 16275 16262 16249 16237 16224 16212 16199 16187 16174 16161 16149 16137 16124 16112
15 16112 16099 16087 16074 16062 16050 16037 16025 16012 16000 15988 15976 15963 15951 15939 15926 15914 15902 15890 15878 15866 15853 15841 15829 15817 15805 15793 15781 15769 15757 15745 15733 15721 15709 15697 15685
13 15685 15673 15661 15649 15637 15625 15613 15602 15590 15578 15566 15554 15543 15531 15519 15507 15496 15484 15472 15461 15449 15437 15426 15414 15402 15391 15379 15368 15356 15345 15333 15321 15310 15298 15287 15276
10 15276 15264 15253 15241 15230 15218 15207 15196 15184 15173 15162 15150 15139 15128 15116 15105 15094 15083 15071 15060 15049 15038 15027 15016 15004 14993 14982 14971 14960 14949 14938 14927 14916 14905 14894 14883
7 14883 14872 14861 14850 14839 14828 14817 14806 14795 14784 14773 14762 14752 14741 14730 14719 14708 14698 14687 14676 14665 14654 14644 14633 14622 14612 14601 14590 14580 14569 14558 14548 14537 14527 14516 14505
5 14505 14495 14484 14474 14463 14453 14442 14432 14421 14411 14400 14390 14379 14369 14359 14348 14338 14327 14317 14307 14296 14286 14276 14265 14255 14245 14235 14224 14214 14204 14194 14184 14173 14163 14153 14143
2 14143 14133 14123 14112 14102 14092 14082 14072 14062 14052 14042 14032 14022 14012 14002 13992 13982 13972 13962 13952 13942 13932 13922 13912 13902 13892 13883 13873 13863 13853 13843 13833 13824 13814 13804 13794 13784
-1 13784 13775 13765 13755 13745 13736 13726 13716 13707 13697 13687 13678 13668 13658 13649 13639 13630 13620 13610 13601 13591 13582 13572 13563 13553 13544 13534 13525 13515 13506 13496 13487 13478 13468 13459 13449 13440 13431 13421 13412 13403 13393 13384 13375 13365 13356 13347
-4 13347 13337 13328 13319 13310 13300 13291 13282 13273 13264 13254 13245 13236 13227 13218 13209 13200 13190 13181 13172 13163 13154 13145 13136 13127 13118 13109 13100 13091 13082 13073 13064 13055 13046 13037 13028 13019 13010 13001 12992 12983 12975 12966 12957 12948 12939 12930 12921 12913 12904 12895 12886 12877 12869 12860 12851 12842 12834 12825 12816 12808 12799 12790 12781 12773 12764
-9 12764 12756 12747 12738 12730 12721 12712 12704 12695 12687 12678 12670 12661 12652 12644 12635 12627 12618 12610 12601 12593 12584 12576 12567 12559 12551 12542 12534 12525 12517 12509 12500 12492 12483 12475 12467 12458 12450 12442 12433 12425 12417 12409 12400 12392 12384 12375 12367 12359 12351 12343 12334 12326 12318 12310 12302 12293 12285 12277 12269 12261 12253 12245 12236 12228 12220 12212 12204 12196 12188
-15 12188 12180 12172 12164 12156 12148 12140 12132 12124 12116 12108 12100 12092 12084 12076 12068 12060 12052 12044 12036 12029 12021 12013 12005 11997 11989 11981 11974 11966 11958 11950 11942 11934 11927 11919 11911 11903 11896 11888 11880 11872 11865 11857 11849 11841 11834 11826 11818 11811 11803 11795 11788 11780 11772 11765 11757 11750 11742 11734 11727 11719 11712 11704 11697 11689 11681 11674 11666 11659
-20 11659 11651 11644 11636 11629 11621 11614 11606 11599 11592 11584 11577 11569 11562 11554 11547 11540 11532 11525 11517 11510 11503 11495 11488 11481 11473 11466 11459 11451 11444 11437 11429 11422 11415 11408 11400 11393 11386 11379 11371 11364 11357 11350 11342 11335 11328 11321 11314 11307 11299 11292 11285 11278 11271 11264 11257 11249 11242 11235 11228 11221 11214 11207 11200 11193 11186 11179 11172 11165
-25 11165 11158 11151 11144 11137 11130 11123 11116 11109 11102 11095 11088 11081 11074 11067 11060 11053 11046 11039 11032 11025 11019 11012 11005 10998 10991 10984 10977 10971 10964 10957 10950 10943 10936 10930 10923 10916 10909 10902 10896 10889 10882 10875 10869 10862 10855 10848 10842 10835 10828 10822 10815 10808 10802 10795 10788 10782 10775 10768 10762 10755 10748 10742 10735 10729 10722 10715 10709 10702
-30 10702 10696 10689 10682 10676 10669 10663 10656 10650 10643 10637 10630 10624 10617 10611 10604 10598 10591 10585 10578 10572 10565 10559 10552 10546 10540 10533 10527 10520 10514 10508 10501 10495 10488 10482 10476 10469 10463 10457 10450 10444 10438 10431 10425 10419 10412 10406 10400 10393 10387 10381 10375 10368 10362 10356 10350 10343 10337 10331 10325 10318 10312 10306 10300 10294 10287 10281 10275 10269
-35 10269 10263 10257 10250 10244 10238 10232 10226 10220 10214 10207 10201 10195 10189 10183 10177 10171 10165 10159 10153 10147 10141 10134 10128 10122 10116 10110 10104 10098 10092 10086 10080 10074 10068 10062 10056 10050 10044 10038 10032 10027 10021 10015 10009 10003 9997 9991 9985 9979 9973 9967 9961 9956 9950 9944 9938 9932 9926 9920 9915 9909 9903 9897 9891 9885 9880 9874 9868 9862
-40 9862 9856 9851 9845 9839 9833 9827 9822 9816 9810 9804 9799 9793 9787 9782 9776 9770 9764 9759 9753 9747 9742 9736 9730 9725 9719 9713 9708 9702 9696 9691 9685 9679 9674 9668 9662 9657 9651 9646 9640 9634 9629 9623 9618 9612 9607 9601 9595 9590 9584 9579 9573 9568 9562 9557 9551 9546 9540 9535 9529 9524 9518 9513 9507 9502 9496 9491 9485 9480 9474
-46 9474 9469 9464 9458 9453 9447 9442 9436 9431 9426 9420 9415 9409 9404 9399 9393 9388 9383 9377 9372 9366 9361 9356 9350 9345 9340 9334 9329 9324 9319 9313 9308 9303 9297 9292 9287 9281 9276 9271 9266 9260 9255 9250 9245 9239 9234 9229 9224 9219 9213 9208 9203 9198 9192 9187 9182 9177 9172 9167 9161 9156 9151 9146 9141 9136 9130 9125 9120 9115 9110
-51 9110 9105 9100 9095 9089 9084 9079 9074 9069 9064 9059 9054 9049 9044 9039 9034 9028 9023 9018 9013 9008 9003 8998 8993 8988 8983 8978 8973 8968 8963 8958 8953 8948 8943 8938 8933 8928 8923 8918 8913 8908 8903 8899 8894 8889 8884 8879 8874 8869 8864 8859 8854 8849 8844 8840 8835 8830 8825 8820 8815 8810 8805 8801 8796 8791 8786 8781 8776 8771 8767
-56 8767 8762 8757 8752 8747 8743 8738 8733 8728 8723 8719 8714 8709 8704 8699 8695 8690 8685 8680 8676 8671 8666 8661 8657 8652 8647 8642 8638 8633 8628 8624 8619 8614 8609 8605 8600 8595 8591 8586 8581 8577 8572 8567 8563 8558 8553 8549 8544 8539 8535 8530 8526 8521 8516 8512 8507 8502 8498 8493 8489 8484 8480 8475 8470 8466 8461 8457 8452 8447 8443
-62 8443 8438 8434 8429 8425 8420 8416 8411 8407 8402 8398 8393 8389 8384 8380 8375 8371 8366 8362 8357 8353 8348 8344 8339 8335 8330 8326 8321 8317 8312 8308 8304 8299 8295 8290 8286 8281 8277 8273 8268 8264 8259 8255 8250 8246 8242 8237 8233 8229 8224 8220 8215 8211 8207 8202 8198 8194 8189 8185 8181 8176 8172 8168 8163 8159 8155 8150 8146 8142 8137
-67 8137 8133 8129 8125 8120 8116 8112 8107 8103 8099 8095 8090 8086 8082 8077 8073 8069 8065 8061 8056 8052 8048 8044 8039 8035 8031 8027 8022 8018 8014 8010 8006 8001 7997 7993 7989 7985 7981 7976 7972 7968 7964 7960 7956 7951 7947 7943 7939 7935 7931 7927 7922 7918 7914 7910 7906 7902 7898 7894 7889 7885 7881 7877 7873 7869 7865 7861 7857 7853 7849
-72 7849 7845 7840 7836 7832 7828 7824 7820 7816 7812 7808 7804 7800 7796 7792 7788 7784 7780 7776 7772 7768 7764 7760 7756 7752 7748 7744 7740 7736 7732 7728 7724 7720 7716 7712 7708 7704 7700 7696 7692 7688 7684 7681 7677 7673 7669 7665 7661 7657 7653 7649 7645 7641 7637 7634 7630 7626 7622 7618 7614 7610 7606 7602 7599 7595 7591 7587 7583 7579 7575
-77 7575 7572 7568 7564 7560 7556 7552 7548 7545 7541 7537 7533 7529 7526 7522 7518 7514 7510 7507 7503 7499 7495 7491 7488 7484 7480 7476 7472 7469 7465 7461 7457 7454 7450 7446 7442 7439 7435 7431 7427 7424 7420 7416 7412 7409 7405 7401 7398 7394 7390 7386 7383 7379 7375 7372 7368 7364 7361 7357 7353 7350 7346 7342 7339 7335 7331 7328 7324 7320 7317
-83 7317 7313 7309 7306 7302 7298 7295 7291 7287 7284 7280 7277 7273 7269 7266 7262 7259 7255 7251 7248 7244 7241 7237 7233 7230 7226 7223 7219 7215 7212 7208 7205 7201 7198 7194 7190 7187 7183 7180 7176 7173 7169 7166 7162 7159 7155 7152 7148 7144 7141 7137 7134 7130 7127 7123 7120 7116 7113 7109 7106 7102 7099 7095 7092 7089 7085 7082 7078 7075 7071
-88 7071 7068 7064 7061 7057 7054 7050 7047 7044 7040 7037 7033 7030 7026 7023 7020 7016 7013 7009 7006 7002 6999 6996 6992 6989 6985 6982 6979 6975 6972 6968 6965 6962 6958 6955 6952 6948 6945 6941 6938 6935 6931 6928 6925 6921 6918 6915 6911 6908 6905 6901 6898 6895 6891 6888 6885 6881 6878 6875 6871 6868 6865 6861 6858 6855 6851 6848 6845 6842 6838
-93 6838 6835 6832 6828 6825 6822 6819 6815 6812 6809 6805 6802 6799 6796 6792 6789 6786 6783 6779 6776 6773 6770 6766 6763 6760 6757 6754 6750 6747 6744 6741 6737 6734 6731 6728 6725 6721 6718 6715 6712 6709 6705 6702 6699 6696 6693 6689 6686 6683 6680 6677 6674 6670 6667 6664 6661 6658 6655 6651 6648 6645 6642 6639 6636 6633 6629 6626 6623 6620 6617
-98 6617 6614 6611 6608 6604 6601 6598 6595 6592 6589 6586 6583 6580 6576 6573 6570 6567 6564 6561 6558 6555 6552 6549 6546 6543 6539 6536 6533 6530 6527 6524 6521 6518 6515 6512 6509 6506 6503 6500 6497 6494 6491 6488 6485 6482 6478 6475 6472 6469 6466 6463 6460 6457 6454 6451 6448 6445 6442 6439 6436 6433 6430 6427 6424 6421 6418 6415 6412 6409 6406
-104 6406 6403 6401 6398 6395 6392 6389 6386 6383 6380 6377 6374 6371 6368 6365 6362 6359 6356 6353 6350 6347 6344 6342 6339 6336 6333 6330 6327 6324 6321 6318 6315 6312 6309 6307 6304 6301 6298 6295 6292 6289 6286 6283 6280 6278 6275 6272 6269 6266 6263 6260 6257 6255 6252 6249 6246 6243 6240 6237 6235 6232 6229 6226 6223 6220 6217 6215 6212 6209
-109 6209 6206 6203 6200 6198 6195 6192 6189 6186 6184 6181 6178 6175 6172 6169 6167 6164 6161 6158 6155 6153 6150 6147 6144 6142 6139 6136 6133 6130 6128 6125 6122 6119 6117 6114 6111 6108 6105 6103 6100 6097 6094 6092 6089 6086 6083 6081 6078 6075 6072 6070 6067 6064 6061 6059 6056 6053 6051 6048 6045 6042 6040 6037 6034 6032 6029 6026 6023 6021
-114 6021 6018 6015 6013 6010 6007 6005 6002 5999 5996 5994 5991 5988 5986 5983 5980 5978 5975 5972 5970 5967 5964 5962 5959 5956 5954 5951 5948 5946 5943 5940 5938 5935 5933 5930 5927 5925 5922 5919 5917 5914 5911 5909 5906 5904 5901 5898 5896 5893 5890 5888 5885 5883 5880 5877 5875 5872 5870 5867 5864 5862 5859 5857 5854 5851 5849 5846 5844 5841
-119 5841 5839 5836 5833 5831 5828 5826 5823 5821 5818 5815 5813 5810 5808 5805 5803 5800 5797 5795 5792 5790 5787 5785 5782 5780 5777 5775 5772 5770 5767 5764 5762 5759 5757 5754 5752 5749 5747 5744 5742 5739 5737 5734 5732 5729 5727 5724 5722 5719 5717 5714 5712 5709 5707 5704 5702 5699 5697 5694 5692 5689 5687 5684 5682 5679 5677 5675 5672 5670
-124 5670 5667 5665 5662 5660 5657 5655 5652 5650 5647 5645 5643 5640 5638 5635 5633 5630 5628 5625 5623 5621 5618 5616 5613 5611 5608 5606 5604 5601 5599 5596 5594 5592 5589 5587 5584 5582 5580 5577 5575 5572 5570 5568 5565 5563 5560 5558 5556 5553 5551 5548 5546 5544 5541 5539 5536 5534 5532 5529 5527 5525 5522 5520 5518 5515 5513 5510 5508 5506
-130 5506 5503 5501 5499 5496 5494 5492 5489 5487 5485 5482 5480 5478 5475 5473 5471 5468 5466 5464 5461 5459 5457 5454 5452 5450 5447 5445 5443 5440 5438 5436 5433 5431 5429 5427 5424 5422 5420 5417 5415 5413 5410 5408 5406 5404 5401 5399 5397 5394 5392 5390 5388 5385 5383 5381 5378 5376 5374 5372 5369 5367 5365 5363 5360 5358 5356 5354 5351 5349
-135 5349 5347 5345 5342 5340 5338 5336 5333 5331 5329 5327 5324 5322 5320 5318 5315 5313 5311 5309 5306 5304 5302 5300 5298 5295 5293 5291 5289 5286 5284 5282 5280 5278 5275 5273 5271 5269 5267 5264 5262 5260 5258 5256 5253 5251 5249 5247 5245 5242 5240 5238 5236 5234 5232 5229 5227 5225 5223 5221 5219 5216 5214 5212 5210 5208 5206 5203 5201 5199
-140 5199 5197 5195 5193 5190 5188 5186 5184 5182 5180 5178 5175 5173 5171 5169 5167 5165 5163 5160 5158 5156 5154 5152 5150 5148 5146 5143 5141 5139 5137 5135 5133 5131 5129 5127 5124 5122 5120 5118 5116 5114 5112 5110 5108 5105 5103 5101 5099 5097 5095 5093 5091 5089 5087 5085 5082 5080 5078 5076 5074 5072 5070 5068 5066 5064 5062 5060 5058 5055
-145 5055 5053 5051 5049 5047 5045 5043 5041 5039 5037 5035 5033 5031 5029 5027 5025 5023 5021 5018 5016 5014 5012 5010 5008 5006 5004 5002 5000 4998 4996 4994 4992 4990 4988 4986 4984 4982 4980 4978 4976 4974 4972 4970 4968 4966 4964 4962 4960 4958 4956 4954 4952 4950 4948 4946 4944 4942 4940 4938 4936 4934 4932 4930 4928 4926 4924 4922 4920 4918
-150 4918 4916 4914 4912 4910 4908 4906 4904 4902 4900 4898 4896 4894 4892 4890 4888 4886 4884 4882 4880 4879 4877 4875 4873 4871 4869 4867 4865 4863 4861 4859 4857 4855 4853 4851 4849 4847 4845 4843 4842 4840 4838 4836 4834 4832 4830 4828 4826 4824 4822 4820 4818 4817 4815 4813 4811 4809 4807 4805 4803 4801 4799 4797 4795 4794 4792 4790 4788 4786
-156 4786 4784 4782 4780 4778 4776 4775 4773 4771 4769 4767 4765 4763 4761 4759 4758 4756 4754 4752 4750 4748 4746 4744 4743 4741 4739 4737 4735 4733 4731 4729 4728 4726 4724 4722 4720 4718 4716 4715 4713 4711 4709 4707 4705 4703 4702 4700 4698 4696 4694 4692 4691 4689 4687 4685 4683 4681 4680 4678 4676 4674 4672 4670 4669 4667 4665 4663 4661 4659
-161 4659 4658 4656 4654 4652 4650 4648 4647 4645 4643 4641 4639 4638 4636 4634 4632 4630 4629 4627 4625 4623 4621 4620 4618 4616 4614 4612 4611 4609 4607 4605 4603 4602 4600 4598 4596 4594 4593 4591 4589 4587 4586 4584 4582 4580 4578 4577 4575 4573 4571 4570 4568 4566 4564 4563 4561 4559 4557 4555 4554 4552 4550 4548 4547 4545 4543 4541 4540 4538
-166 4538 4536 4534 4533 4531 4529 4527 4526 4524 4522 4520 4519 4517 4515 4513 4512 4510 4508 4507 4505 4503 4501 4500 4498 4496 4494 4493 4491 4489 4488 4486 4484 4482 4481 4479 4477 4476 4474 4472 4470 4469 4467 4465 4464 4462 4460 4458 4457 4455 4453 4452 4450 4448 4447 4445 4443 4441 4440 4438 4436 4435 4433 4431 4430 4428 4426 4425 4423 4421
-171 4421 4420 4418 4416 4414 4413 4411 4409 4408 4406 4404 4403 4401 4399 4398 4396 4394 4393 4391 4389 4388 4386 4384 4383 4381 4379 4378 4376 4374 4373 4371 4370 4368 4366 4365 4363 4361 4360 4358 4356 4355 4353 4351 4350 4348 4346 4345 4343 4342 4340 4338 4337 4335 4333 4332 4330 4328 4327 4325 4324 4322 4320 4319 4317 4315 4314 4312 4311 4309
-176 4309 4307 4306 4304 4303 4301 4299 4298 4296 4295 4293 4291 4290 4288 4286 4285 4283 4282 4280 4278 4277 4275 4274 4272 4270 4269 4267 4266 4264 4263 4261 4259 4258 4256 4255 4253 4251 4250 4248 4247 4245 4243 4242 4240 4239 4237 4236 4234 4232 4231 4229 4228 4226 4225 4223 4221 4220 4218 4217 4215 4214 4212 4211 4209 4207 4206 4204 4203 4201
-182 4201 4200 4198 4196 4195 4193 4192 4190 4189 4187 4186 4184 4183 4181 4179 4178 4176 4175 4173 4172 4170 4169 4167 4166 4164 4163 4161 4159 4158 4156 4155 4153 4152 4150 4149 4147 4146 4144 4143 4141 4140 4138 4137 4135 4134 4132 4131 4129 4127 4126 4124 4123 4121 4120 4118 4117 4115 4114 4112 4111 4109 4108 4106 4105 4103 4102 4100 4099 4097
-187 4097 4096 4094 4093 4091 4090 4088 4087 4085 4084 4082 4081 4079 4078 4076 4075 4074 4072 4071 4069 4068 4066 4065 4063 4062 4060 4059 4057 4056 4054 4053 4051 4050 4048 4047 4045 4044 4043 4041 4040 4038 4037 4035 4034 4032 4031 4029 4028 4026 4025 4024 4022 4021 4019 4018 4016 4015 4013 4012 4010 4009 4008 4006 4005 4003 4002 4000 3999 3997
-192 3997 3996 3995 3993 3992 3990 3989 3987 3986 3985 3983 3982 3980 3979 3977 3976 3974 3973 3972 3970 3969 3967 3966 3965 3963 3962 3960 3959 3957 3956 3955 3953 3952 3950 3949 3947 3946 3945 3943 3942 3940 3939 3938 3936 3935 3933 3932 3931 3929 3928 3926 3925 3924 3922 3921 3919 3918 3917 3915 3914 3912 3911 3910 3908 3907 3905 3904 3903 3901
-197 3901 3900 3898 3897 3896 3894 3893 3892 3890 3889 3887 3886 3885 3883 3882 3880 3879 3878 3876 3875 3874 3872 3871 3869 3868 3867 3865 3864 3863 3861 3860 3859 3857 3856 3854 3853 3852 3850 3849 3848 3846 3845 3844 3842 3841 3839 3838 3837 3835 3834 3833 3831 3830 3829 3827 3826 3825 3823 3822 3821 3819 3818 3817 3815 3814 3813 3811 3810 3809
-202 3809 3807 3806 3805 3803 3802 3800 3799 3798 3796 3795 3794 3793 3791 3790 3789 3787 3786 3785 3783 3782 3781 3779 3778 3777 3775 3774 3773 3771 3770 3769 3767 3766 3765 3763 3762 3761 3759 3758 3757 3756 3754 3753 3752 3750 3749 3748 3746 3745 3744 3742 3741 3740 3739 3737 3736 3735 3733 3732 3731 3729 3728 3727 3726 3724 3723 3722 3720 3719
-208 3719 3718 3717 3715 3714 3713 3711 3710 3709 3708 3706 3705 3704 3702 3701 3700 3699 3697 3696 3695 3693 3692 3691 3690 3688 3687 3686 3685 3683 3682 3681 3679 3678 3677 3676 3674 3673 3672 3671 3669 3668 3667 3666 3664 3663 3662 3660 3659 3658 3657 3655 3654 3653 3652 3650 3649 3648 3647 3645 3644 3643 3642 3640 3639 3638 3637 3635 3634 3633
-213 3633 3632 3630 3629 3628 3627 3625 3624 3623 3622 3620 3619 3618 3617 3616 3614 3613 3612 3611 3609 3608 3607 3606 3604 3603 3602 3601 3600 3598 3597 3596 3595 3593 3592 3591 3590 3588 3587 3586 3585 3584 3582 3581 3580 3579 3578 3576 3575 3574 3573 3571 3570 3569 3568 3567 3565 3564 3563 3562 3561 3559 3558 3557 3556 3555 3553 3552 3551 3550
-218 3550 3549 3547 3546 3545 3544 3543 3541 3540 3539 3538 3537 3535 3534 3533 3532 3531 3529 3528 3527 3526 3525 3523 3522 3521 3520 3519 3517 3516 3515 3514 3513 3512 3510 3509 3508 3507 3506 3504 3503 3502 3501 3500 3499 3497 3496 3495 3494 3493 3492 3490 3489 3488 3487 3486 3485 3483 3482 3481 3480 3479 3478 3476 3475 3474 3473 3472 3471 3469
-223 3469 3468 3467 3466 3465 3464 3462 3461 3460 3459 3458 3457 3455 3454 3453 3452 3451 3450 3449 3447 3446 3445 3444 3443 3442 3441 3439 3438 3437 3436 3435 3434 3433 3431 3430 3429 3428 3427 3426 3425 3423 3422 3421 3420 3419 3418 3417 3415 3414 3413 3412 3411 3410 3409 3408 3406 3405 3404 3403 3402 3401 3400 3399 3397 3396 3395 3394 3393 3392
-228 3392 3391 3390 3388 3387 3386 3385 3384 3383 3382 3381 3380 3378 3377 3376 3375 3374 3373 3372 3371 3369 3368 3367 3366 3365 3364 3363 3362 3361 3360 3358 3357 3356 3355 3354 3353 3352 3351 3350 3349 3347 3346 3345 3344 3343 3342 3341 3340 3339 3338 3336 3335 3334 3333 3332 3331 3330 3329 3328 3327 3326 3324 3323 3322 3321 3320 3319 3318 3317
-233 3317 3316 3315 3314 3313 3311 3310 3309 3308 3307 3306 3305 3304 3303 3302 3301 3300 3299 3297 3296 3295 3294 3293 3292 3291 3290 3289 3288 3287 3286 3285 3284 3282 3281 3280 3279 3278 3277 3276 3275 3274 3273 3272 3271 3270 3269 3268 3267 3265 3264 3263 3262 3261 3260 3259 3258 3257 3256 3255 3254 3253 3252 3251 3250 3249 3248 3246 3245 3244
-239 3244 3243 3242 3241 3240 3239 3238 3237 3236 3235 3234 3233 3232 3231 3230 3229 3228 3227 3226 3225 3224 3223 3221 3220 3219 3218 3217 3216 3215 3214 3213 3212 3211 3210 3209 3208 3207 3206 3205 3204 3203 3202 3201 3200 3199 3198 3197 3196 3195 3194 3193 3192 3191 3190 3189 3188 3187 3186 3184 3183 3182 3181 3180 3179 3178 3177 3176 3175 3174
-244 3174 3173 3172 3171 3170 3169 3168 3167 3166 3165 3164 3163 3162 3161 3160 3159 3158 3157 3156 3155 3154 3153 3152 3151 3150 3149 3148 3147 3146 3145 3144 3143 3142 3141 3140 3139 3138 3137 3136 3135 3134 3133 3132 3131 3130 3129 3128 3127 3126 3125 3124 3123 3122 3121 3120 3119 3118 3117 3116 3115 3114 3113 3112 3111 3110 3110 3109 3108 3107
-249 3107 3106 3105 3104 3103 3102 3101 3100 3099 3098 3097 3096 3095 3094 3093 3092 3091 3090 3089 3088 3087 3086 3085 3084 3083 3082 3081 3080 3079 3078 3077 3076 3075 3074 3074 3073 3072 3071 3070 3069 3068 3067 3066 3065 3064 3063 3062 3061 3060 3059 3058 3057 3056 3055 3054 3053 3052 3051 3050 3050 3049 3048 3047 3046 3045 3044 3043 3042 3041
-254 3041 3040 3039 3038 3037 3036 3035 3034 3033 3032 3032 3031 3030 3029 3028 3027 3026 3025 3024 3023 3022 3021 3020 3019 3018 3017 3016 3016 3015 3014 3013 3012 3011 3010 3009 3008 3007 3006 3005 3004 3003 3002 3002 3001 3000 2999 2998 2997 2996 2995 2994 2993 2992 2991 2990 2989 2989 2988 2987 2986 2985 2984 2983 2982 2981 2980 2979 2978 2977
-259 2977 2977 2976 2975 2974 2973 2972 2971 2970 2969 2968 2967 2966 2966 2965 2964 2963 2962 2961 2960 2959 2958 2957 2956 2956 2955 2954 2953 2952 2951 2950 2949 2948 2947 2946 2946 2945 2944 2943 2942 2941 2940 2939 2938 2937 2937 2936 2935 2934 2933 2932 2931 2930 2929 2928 2928 2927 2926 2925 2924 2923 2922 2921 2920 2920 2919 2918 2917 2916
-265 2916 2915 2914 2913 2912 2912 2911 2910 2909 2908 2907 2906 2905 2904 2904 2903 2902 2901 2900 2899 2898 2897 2896 2896 2895 2894 2893 2892 2891 2890 2889 2889 2888 2887 2886 2885 2884 2883 2882 2882 2881 2880 2879 2878 2877 2876 2875 2875 2874 2873 2872 2871 2870 2869 2869 2868 2867 2866 2865 2864 2863 2862 2862 2861 2860 2859 2858 2857 2856
-270 2856 2856 2855 2854 2853 2852 2851 2850 2850 2849 2848 2847 2846 2845 2844 2844 2843 2842 2841 2840 2839 2838 2838 2837 2836 2835 2834 2833 2832 2832 2831 2830 2829 2828 2827 2826 2826 2825 2824 2823 2822 2821 2821 2820 2819 2818 2817 2816 2815 2815 2814 2813 2812 2811 2810 2810 2809 2808 2807 2806 2805 2805 2804 2803 2802 2801 2800 2799 2799
-275 2799 2798 2797 2796 2795 2794 2794 2793 2792 2791 2790 2789 2789 2788 2787 2786 2785 2784 2784 2783 2782 2781 2780 2780 2779 2778 2777 2776 2775 2775 2774 2773 2772 2771 2770 2770 2769 2768 2767 2766 2766 2765 2764 2763 2762 2761 2761 2760 2759 2758 2757 2757 2756 2755 2754 2753 2752 2752 2751 2750 2749 2748 2748 2747 2746 2745 2744 2743 2743
-280 2743 2742 2741 2740 2739 2739 2738 2737 2736 2735 2735 2734 2733 2732 2731 2731 2730 2729 2728 2727 2727 2726 2725 2724 2723 2723 2722 2721 2720 2719 2719 2718 2717 2716 2715 2715 2714 2713 2712 2711 2711 2710 2709 2708 2707 2707 2706 2705 2704 2703 2703 2702 2701 2700 2699 2699 2698 2697 2696 2695 2695 2694 2693 2692 2692 2691 2690 2689 2688
-285 2688 2688 2687 2686 2685 2684 2684 2683 2682 2681 2681 2680 2679 2678 2677 2677 2676 2675 2674 2674 2673 2672 2671 2670 2670 2669 2668 2667 2667 2666 2665 2664 2663 2663 2662 2661 2660 2660 2659 2658 2657 2656 2656 2655 2654 2653 2653 2652 2651 2650 2650 2649 2648 2647 2646 2646 2645 2644 2643 2643 2642 2641 2640 2640 2639 2638 2637 2636 2636
-291 2636 2635 2634 2633 2633 2632 2631 2630 2630 2629 2628 2627 2627 2626 2625 2624 2624 2623 2622 2621 2621 2620 2619 2618 2618 2617 2616 2615 2614 2614 2613 2612 2611 2611 2610 2609 2608 2608 2607 2606 2605 2605 2604 2603 2602 2602 2601 2600 2599 2599 2598 2597 2597 2596 2595 2594 2594 2593 2592 2591 2591 2590 2589 2588 2588 2587 2586 2585 2585
-296 2585 2584 2583 2582 2582 2581 2580 2579 2579 2578 2577 2576 2576 2575 2574 2574 2573 2572 2571 2571 2570 2569 2568 2568 2567 2566 2565 2565 2564 2563 2563 2562 2561 2560 2560 2559 2558 2557 2557 2556 2555 2555 2554 2553 2552 2552 2551 2550 2549 2549 2548 2547 2547 2546 2545 2544 2544 2543 2542 2541 2541 2540 2539 2539 2538 2537 2536 2536 2535
-301 2535 2534 2534 2533 2532 2531 2531 2530 2529 2529 2528 2527 2526 2526 2525 2524 2524 2523 2522 2521 2521 2520 2519 2519 2518 2517 2516 2516 2515 2514 2514 2513 2512 2511 2511 2510 2509 2509 2508 2507 2506 2506 2505 2504 2504 2503 2502 2502 2501 2500 2499 2499 2498 2497 2497 2496 2495 2495 2494 2493 2492 2492 2491 2490 2490 2489 2488 2488 2487
-306 2487 2486 2485 2485 2484 2483 2483 2482 2481 2481 2480 2479 2478 2478 2477 2476 2476 2475 2474 2474 2473 2472 2472 2471 2470 2469 2469 2468 2467 2467 2466 2465 2465 2464 2463 2463 2462 2461 2461 2460 2459 2458 2458 2457 2456 2456 2455 2454 2454 2453 2452 2452 2451 2450 2450 2449 2448 2448 2447 2446 2445 2445 2444 2443 2443 2442 2441 2441 2440
-311 2440 2439 2439 2438 2437 2437 2436 2435 2435 2434 2433 2433 2432 2431 2431 2430 2429 2429 2428 2427 2427 2426 2425 2425 2424 2423 2422 2422 2421 2420 2420 2419 2418 2418 2417 2416 2416 2415 2414 2414 2413 2412 2412 2411 2410 2410 2409 2408 2408 2407 2406 2406 2405 2404 2404 2403 2402 2402 2401 2401 2400 2399 2399 2398 2397 2397 2396 2395 2395
-317 2395 2394 2393 2393 2392 2391 2391 2390 2389 2389 2388 2387 2387 2386 2385 2385 2384 2383 2383 2382 2381 2381 2380 2379 2379 2378 2378 2377 2376 2376 2375 2374 2374 2373 2372 2372 2371 2370 2370 2369 2368 2368 2367 2366 2366 2365 2365 2364 2363 2363 2362 2361 2361 2360 2359 2359 2358 2357 2357 2356 2356 2355 2354 2354 2353 2352 2352 2351 2350
-322 2350 2350 2349 2348 2348 2347 2347 2346 2345 2345 2344 2343 2343 2342 2341 2341 2340 2340 2339 2338 2338 2337 2336 2336 2335 2334 2334 2333 2333 2332 2331 2331 2330 2329 2329 2328 2327 2327 2326 2326 2325 2324 2324 2323 2322 2322 2321 2321 2320 2319 2319 2318 2317 2317 2316 2316 2315 2314 2314 2313 2312 2312 2311 2311 2310 2309 2309 2308 2307
-327 2307 2307 2306 2306 2305 2304 2304 2303 2302 2302 2301 2301 2300 2299 2299 2298 2297 2297 2296 2296 2295 2294 2294 2293 2293 2292 2291 2291 2290 2289 2289 2288 2288 2287 2286 2286 2285 2285 2284 2283 2283 2282 2281 2281 2280 2280 2279 2278 2278 2277 2277 2276 2275 2275 2274 2274 2273 2272 2272 2271 2270 2270 2269 2269 2268 2267 2267 2266 2266
-332 2266 2265 2264 2264 2263 2263 2262 2261 2261 2260 2260 2259 2258 2258 2257 2257 2256 2255 2255 2254 2254 2253 2252 2252 2251 2251 2250 2249 2249 2248 2248 2247 2246 2246 2245 2245 2244 2243 2243 2242 2242 2241 2240 2240 2239 2239 2238 2237 2237 2236 2236 2235 2234 2234 2233 2233 2232 2232 2231 2230 2230 2229 2229 2228 2227 2227 2226 2226 2225
-337 2225 2224 2224 2223 2223 2222 2221 2221 2220 2220 2219 2219 2218 2217 2217 2216 2216 2215 2214 2214 2213 2213 2212 2212 2211 2210 2210 2209 2209 2208 2207 2207 2206 2206 2205 2205 2204 2203 2203 2202 2202 2201 2200 2200 2199 2199 2198 2198 2197 2196 2196 2195 2195 2194 2194 2193 2192 2192 2191 2191 2190 2189 2189 2188 2188 2187 2187 2186 2185
-342 2185 2185 2184 2184 2183 2183 2182 2181 2181 2180 2180 2179 2179 2178 2177 2177 2176 2176 2175 2175 2174 2173 2173 2172 2172 2171 2171 2170 2170 2169 2168 2168 2167 2167 2166 2166 2165 2164 2164 2163 2163 2162 2162 2161 2160 2160 2159 2159 2158 2158 2157 2157 2156 2155 2155 2154 2154 2153 2153 2152 2151 2151 2150 2150 2149 2149 2148 2148 2147
-348 2147 2146 2146 2145 2145 2144 2144 2143 2143 2142 2141 2141 2140 2140 2139 2139 2138 2138 2137 2136 2136 2135 2135 2134 2134 2133 2133 2132 2131 2131 2130 2130 2129 2129 2128 2128 2127 2126 2126 2125 2125 2124 2124 2123 2123 2122 2122 2121 2120 2120 2119 2119 2118 2118 2117 2117 2116 2116 2115 2114 2114 2113 2113 2112 2112 2111 2111 2110 2110
-353 2110 2109 2108 2108 2107 2107 2106 2106 2105 2105 2104 2104 2103 2103 2102 2101 2101 2100 2100 2099 2099 2098 2098 2097 2097 2096 2095 2095 2094 2094 2093 2093 2092 2092 2091 2091 2090 2090 2089 2089 2088 2087 2087 2086 2086 2085 2085 2084 2084 2083 2083 2082 2082 2081 2081 2080 2079 2079 2078 2078 2077 2077 2076 2076 2075 2075 2074 2074 2073
-358 2073 2073 2072 2071 2071 2070 2070 2069 2069 2068 2068 2067 2067 2066 2066 2065 2065 2064 2064 2063 2063 2062 2061 2061 2060 2060 2059 2059 2058 2058 2057 2057 2056 2056 2055 2055 2054 2054 2053 2053 2052 2052 2051 2051 2050 2049 2049 2048 2048 2047 2047 2046 2046 2045 2045 2044 2044 2043 2043 2042 2042 2041 2041 2040 2040 2039 2039 2038 2038
-363 2038 2037 2037 2036 2036 2035 2034 2034 2033 2033 2032 2032 2031 2031 2030 2030 2029 2029 2028 2028 2027 2027 2026 2026 2025 2025 2024 2024 2023 2023 2022 2022 2021 2021 2020 2020 2019 2019 2018 2018 2017 2017 2016 2016 2015 2015 2014 2014 2013 2013 2012 2012 2011 2011 2010 2010 2009 2009 2008 2007 2007 2006 2006 2005 2005 2004 2004 2003 2003
-368 2003 2002 2002 2001 2001 2000 2000 1999 1999 1998 1998 1997 1997 1996 1996 1995 1995 1994 1994 1993 1993 1992 1992 1991 1991 1990 1990 1989 1989 1988 1988 1987 1987 1986 1986 1986 1985 1985 1984 1984 1983 1983 1982 1982 1981 1981 1980 1980 1979 1979 1978 1978 1977 1977 1976 1976 1975 1975 1974 1974 1973 1973 1972 1972 1971 1971 1970 1970 1969
-374 1969 1969 1968 1968 1967 1967 1966 1966 1965 1965 1964 1964 1963 1963 1962 1962 1961 1961 1960 1960 1960 1959 1959 1958 1958 1957 1957 1956 1956 1955 1955 1954 1954 1953 1953 1952 1952 1951 1951 1950 1950 1949 1949 1948 1948 1947 1947 1946 1946 1945 1945 1945 1944 1944 1943 1943 1942 1942 1941 1941 1940 1940 1939 1939 1938 1938 1937 1937 1936
-379 1936 1936 1935 1935 1934 1934 1934 1933 1933 1932 1932 1931 1931 1930 1930 1929 1929 1928 1928 1927 1927 1926 1926 1925 1925 1925 1924 1924 1923 1923 1922 1922 1921 1921 1920 1920 1919 1919 1918 1918 1917 1917 1917 1916 1916 1915 1915 1914 1914 1913 1913 1912 1912 1911 1911 1910 1910 1909 1909 1909 1908 1908 1907 1907 1906 1906 1905 1905 1904
-384 1904 1904 1903 1903 1903 1902 1902 1901 1901 1900 1900 1899 1899 1898 1898 1897 1897 1896 1896 1896 1895 1895 1894 1894 1893 1893 1892 1892 1891 1891 1890 1890 1890 1889 1889 1888 1888 1887 1887 1886 1886 1885 1885 1885 1884 1884 1883 1883 1882 1882 1881 1881 1880 1880 1880 1879 1879 1878 1878 1877 1877 1876 1876 1875 1875 1874 1874 1874 1873
-389 1873 1873 1872 1872 1871 1871 1870 1870 1870 1869 1869 1868 1868 1867 1867 1866 1866 1865 1865 1865 1864 1864 1863 1863 1862 1862 1861 1861 1861 1860 1860 1859 1859 1858 1858 1857 1857 1856 1856 1856 1855 1855 1854 1854 1853 1853 1852 1852 1852 1851 1851 1850 1850 1849 1849 1848 1848 1848 1847 1847 1846 1846 1845 1845 1844 1844 1844 1843 1843
-394 1843 1842 1842 1841 1841 1840 1840 1840 1839 1839 1838 1838 1837 1837 1836 1836 1836 1835 1835 1834 1834 1833 1833 1833 1832 1832 1831 1831 1830 1830 1829 1829 1829 1828 1828 1827 1827 1826 1826 1826 1825 1825 1824 1824 1823 1823 1822 1822 1822 1821 1821 1820 1820 1819 1819 1819 1818 1818 1817 1817 1816 1816 1816 1815 1815 1814 1814 1813 1813
-400 1813 1813 1812 1812 1811 1811 1810 1810 1810 1809 1809 1808 1808 1807 1807 1807 1806 1806 1805 1805 1804 1804 1804 1803 1803 1802 1802 1801 1801 1801 1800 1800 1799 1799 1798 1798 1798 1797 1797 1796 1796 1795 1795 1795 1794 1794 1793 1793 1792 1792 1792 1791 1791 1790 1790 1789 1789 1789 1788 1788 1787 1787 1787 1786 1786 1785 1785 1784 1784
-405 1784 1784 1783 1783 1782 1782 1781 1781 1781 1780 1780 1779 1779 1779 1778 1778 1777 1777 1776 1776 1776 1775 1775 1774 1774 1773 1773 1773 1772 1772 1771 1771 1771 1770 1770 1769 1769 1768 1768 1768 1767 1767 1766 1766 1766 1765 1765 1764 1764 1764 1763 1763 1762 1762 1761 1761 1761 1760 1760 1759 1759 1759 1758 1758 1757 1757 1757 1756 1756
-410 1756 1755 1755 1754 1754 1754 1753 1753 1752 1752 1752 1751 1751 1750 1750 1750 1749 1749 1748 1748 1747 1747 1747 1746 1746 1745 1745 1745 1744 1744 1743 1743 1743 1742 1742 1741 1741 1741 1740 1740 1739 1739 1739 1738 1738 1737 1737 1737 1736 1736 1735 1735 1735 1734 1734 1733 1733 1732 1732 1732 1731 1731 1730 1730 1730 1729 1729 1728 1728
-415 1728 1728 1727 1727 1726 1726 1726 1725 1725 1724 1724 1724 1723 1723 1722 1722 1722 1721 1721 1720 1720 1720 1719 1719 1718 1718 1718 1717 1717 1716 1716 1716 1715 1715 1715 1714 1714 1713 1713 1713 1712 1712 1711 1711 1711 1710 1710 1709 1709 1709 1708 1708 1707 1707 1707 1706 1706 1705 1705 1705 1704 1704 1703 1703 1703 1702 1702 1702 1701
-420 1701 1701 1700 1700 1700 1699 1699 1698 1698 1698 1697 1697 1696 1696 1696 1695 1695 1694 1694 1694 1693 1693 1693 1692 1692 1691 1691 1691 1690 1690 1689 1689 1689 1688 1688 1687 1687 1687 1686 1686 1686 1685 1685 1684 1684 1684 1683 1683 1682 1682 1682 1681 1681 1681 1680 1680 1679 1679 1679 1678 1678 1677 1677 1677 1676 1676 1676 1675 1675
-426 1675 1674 1674 1674 1673 1673 1672 1672 1672 1671 1671 1671 1670 1670 1669 1669 1669 1668 1668 1668 1667 1667 1666 1666 1666 1665 1665 1665 1664 1664 1663 1663 1663 1662 1662 1661 1661 1661 1660 1660 1660 1659 1659 1658 1658 1658 1657 1657 1657 1656 1656 1655 1655 1655 1654 1654 1654 1653 1653 1652 1652 1652 1651 1651 1651 1650 1650 1649 1649
-431 1649 1649 1648 1648 1648 1647 1647 1646 1646 1646 1645 1645 1645 1644 1644 1643 1643 1643 1642 1642 1642 1641 1641 1641 1640 1640 1639 1639 1639 1638 1638 1638 1637 1637 1636 1636 1636 1635 1635 1635 1634 1634 1633 1633 1633 1632 1632 1632 1631 1631 1631 1630 1630 1629 1629 1629 1628 1628 1628 1627 1627 1627 1626 1626 1625 1625 1625 1624 1624
-436 1624 1624 1623 1623 1622 1622 1622 1621 1621 1621 1620 1620 1620 1619 1619 1618 1618 1618 1617 1617 1617 1616 1616 1616 1615 1615 1615 1614 1614 1613 1613 1613 1612 1612 1612 1611 1611 1611 1610 1610 1609 1609 1609 1608 1608 1608 1607 1607 1607 1606 1606 1605 1605 1605 1604 1604 1604 1603 1603 1603 1602 1602 1602 1601 1601 1600 1600 1600 1599
-441 1599 1599 1599 1598 1598 1598 1597 1597 1597 1596 1596 1595 1595 1595 1594 1594 1594 1593 1593 1593 1592 1592 1592 1591 1591 1591 1590 1590 1589 1589 1589 1588 1588 1588 1587 1587 1587 1586 1586 1586 1585 1585 1585 1584 1584 1583 1583 1583 1582 1582 1582 1581 1581 1581 1580 1580 1580 1579 1579 1579 1578 1578 1578 1577 1577 1576 1576 1576 1575
-446 1575 1575 1575 1574 1574 1574 1573 1573 1573 1572 1572 1572 1571 1571 1571 1570 1570 1570 1569 1569 1568 1568 1568 1567 1567 1567 1566 1566 1566 1565 1565 1565 1564 1564 1564 1563 1563 1563 1562 1562 1562 1561 1561 1561 1560 1560 1560 1559 1559 1558 1558 1558 1557 1557 1557 1556 1556 1556 1555 1555 1555 1554 1554 1554 1553 1553 1553 1552 1552
-452 1552 1552 1551 1551 1551 1550 1550 1550 1549 1549 1549 1548 1548 1548 1547 1547 1547 1546 1546 1546 1545 1545 1545 1544 1544 1544 1543 1543 1542 1542 1542 1541 1541 1541 1540 1540 1540 1539 1539 1539 1538 1538 1538 1537 1537 1537 1536 1536 1536 1535 1535 1535 1534 1534 1534 1533 1533 1533 1532 1532 1532 1531 1531 1531 1530 1530 1530 1529 1529
-457 1529 1529 1528 1528 1528 1527 1527 1527 1526 1526 1526 1525 1525 1525 1524 1524 1524 1523 1523 1523 1522 1522 1522 1521 1521 1521 1520 1520 1520 1519 1519 1519 1518 1518 1518 1517 1517 1517 1516 1516 1516 1516 1515 1515 1515 1514 1514 1514 1513 1513 1513 1512 1512 1512 1511 1511 1511 1510 1510 1510 1509 1509 1509 1508 1508 1508 1507 1507 1507
-462 1507 1506 1506 1506 1505 1505 1505 1504 1504 1504 1503 1503 1503 1502 1502 1502 1501 1501 1501 1501 1500 1500 1500 1499 1499 1499 1498 1498 1498 1497 1497 1497 1496 1496 1496 1495 1495 1495 1494 1494 1494 1493 1493 1493 1492 1492 1492 1491 1491 1491 1491 1490 1490 1490 1489 1489 1489 1488 1488 1488 1487 1487 1487 1486 1486 1486 1485 1485 1485
-467 1485 1484 1484 1484 1483 1483 1483 1483 1482 1482 1482 1481 1481 1481 1480 1480 1480 1479 1479 1479 1478 1478 1478 1477 1477 1477 1477 1476 1476 1476 1475 1475 1475 1474 1474 1474 1473 1473 1473 1472 1472 1472 1471 1471 1471 1471 1470 1470 1470 1469 1469 1469 1468 1468 1468 1467 1467 1467 1466 1466 1466 1466 1465 1465 1465 1464 1464 1464 1463
-472 1463 1463 1463 1462 1462 1462 1461 1461 1461 1461 1460 1460 1460 1459 1459 1459 1458 1458 1458 1457 1457 1457 1456 1456 1456 1456 1455 1455 1455 1454 1454 1454 1453 1453 1453 1452 1452 1452 1452 1451 1451 1451 1450 1450 1450 1449 1449 1449 1448 1448 1448 1448 1447 1447 1447 1446 1446 1446 1445 1445 1445 1445 1444 1444 1444 1443 1443 1443 1442
-477 1442 1442 1442 1441 1441 1441 1441 1440 1440 1440 1439 1439 1439 1438 1438 1438 1438 1437 1437 1437 1436 1436 1436 1435 1435 1435 1434 1434 1434 1434 1433 1433 1433 1432 1432 1432 1431 1431 1431 1431 1430 1430 1430 1429 1429 1429 1428 1428 1428 1428 1427 1427 1427 1426 1426 1426 1425 1425 1425 1425 1424 1424 1424 1423 1423 1423 1422 1422 1422
-483 1422 1422 1421 1421 1421 1420 1420 1420 1419 1419 1419 1419 1418 1418 1418 1417 1417 1417 1417 1416 1416 1416 1415 1415 1415 1414 1414 1414 1414 1413 1413 1413 1412 1412 1412 1411 1411 1411 1411 1410 1410 1410 1409 1409 1409 1409 1408 1408 1408 1407 1407 1407 1406 1406 1406 1406 1405 1405 1405 1404 1404 1404 1404 1403 1403 1403 1402 1402 1402
-488 1402 1401 1401 1401 1401 1400 1400 1400 1399 1399 1399 1399 1398 1398 1398 1397 1397 1397 1397 1396 1396 1396 1395 1395 1395 1395 1394 1394 1394 1393 1393 1393 1392 1392 1392 1392 1391 1391 1391 1390 1390 1390 1390 1389 1389 1389 1388 1388 1388 1388 1387 1387 1387 1386 1386 1386 1386 1385 1385 1385 1384 1384 1384 1384 1383 1383 1383 1382 1382
-493 1382 1382 1382 1381 1381 1381 1380 1380 1380 1380 1379 1379 1379 1378 1378 1378 1378 1377 1377 1377 1376 1376 1376 1376 1375 1375 1375 1374 1374 1374 1374 1373 1373 1373 1372 1372 1372 1372 1371 1371 1371 1370 1370 1370 1370 1369 1369 1369 1369 1368 1368 1368 1367 1367 1367 1367 1366 1366 1366 1365 1365 1365 1365 1364 1364 1364 1363 1363 1363
-498 1363 1363 1362 1362 1362 1362 1361 1361 1361 1360 1360 1360 1360 1359 1359 1359 1358 1358 1358 1358 1357 1357 1357 1356 1356 1356 1356 1355 1355 1355 1355 1354 1354 1354 1353 1353 1353 1353 1352 1352 1352 1352 1351 1351 1351 1350 1350 1350 1350 1349 1349 1349 1348 1348 1348 1348 1347 1347 1347 1347 1346 1346 1346 1345 1345 1345 1345 1344 1344
-503 1344 1344 1344 1343 1343 1343 1342 1342 1342 1342 1341 1341 1341 1341 1340 1340 1340 1339 1339 1339 1339 1338 1338 1338 1338 1337 1337 1337 1336 1336 1336 1336 1335 1335 1335 1335 1334 1334 1334 1333 1333 1333 1333 1332 1332 1332 1332 1331 1331 1331 1330 1330 1330 1330 1329 1329 1329 1329 1328 1328 1328 1328 1327 1327 1327 1326 1326 1326 1326
-509 1326 1325 1325 1325 1325 1324 1324 1324 1324 1323 1323 1323 1322 1322 1322 1322 1321 1321 1321 1321 1320 1320 1320 1319 1319 1319 1319 1318 1318 1318 1318 1317 1317 1317 1317 1316 1316 1316 1316 1315 1315 1315 1314 1314 1314 1314 1313 1313 1313 1313 1312 1312 1312 1312 1311 1311 1311 1310 1310 1310 1310 1309 1309 1309 1309 1308 1308 1308 1308
-514 1308 1307 1307 1307 1307 1306 1306 1306 1305 1305 1305 1305 1304 1304 1304 1304 1303 1303 1303 1303 1302 1302 1302 1302 1301 1301 1301 1301 1300 1300 1300 1299 1299 1299 1299 1298 1298 1298 1298 1297 1297 1297 1297 1296 1296 1296 1296 1295 1295 1295 1295 1294 1294 1294 1294 1293 1293 1293 1292 1292 1292 1292 1291 1291 1291 1291 1290 1290 1290
-519 1290 1290 1289 1289 1289 1289 1288 1288 1288 1288 1287 1287 1287 1287 1286 1286 1286 1286 1285 1285 1285 1285 1284 1284 1284 1283 1283 1283 1283 1282 1282 1282 1282 1281 1281 1281 1281 1280 1280 1280 1280 1279 1279 1279 1279 1278 1278 1278 1278 1277 1277 1277 1277 1276 1276 1276 1276 1275 1275 1275 1275 1274 1274 1274 1274 1273 1273 1273 1273
-524 1273 1272 1272 1272 1272 1271 1271 1271 1271 1270 1270 1270 1270 1269 1269 1269 1269 1268 1268 1268 1268 1267 1267 1267 1267 1266 1266 1266 1266 1265 1265 1265 1265 1264 1264 1264 1264 1263 1263 1263 1263 1262 1262 1262 1262 1261 1261 1261 1261 1260 1260 1260 1260 1259 1259 1259 1259 1258 1258 1258 1258 1257 1257 1257 1257 1256 1256 1256 1256
-529 1256 1255 1255 1255 1255 1254 1254 1254 1254 1253 1253 1253 1253 1252 1252 1252 1252 1251 1251 1251 1251 1250 1250 1250 1250 1249 1249 1249 1249 1248 1248 1248 1248 1247 1247 1247 1247 1247 1246 1246 1246 1246 1245 1245 1245 1245 1244 1244 1244 1244 1243 1243 1243 1243 1242 1242 1242 1242 1241 1241 1241 1241 1240 1240 1240 1240 1239 1239 1239
-535 1239 1239 1238 1238 1238 1238 1238 1237 1237 1237 1237 1236 1236 1236 1236 1235 1235 1235 1235 1234 1234 1234 1234 1233 1233 1233 1233 1232 1232 1232 1232 1232 1231 1231 1231 1231 1230 1230 1230 1230 1229 1229 1229 1229 1228 1228 1228 1228 1227 1227 1227 1227 1226 1226 1226 1226 1226 1225 1225 1225 1225 1224 1224 1224 1224 1223 1223 1223 1223
-540 1223 1222 1222 1222 1222 1221 1221 1221 1221 1221 1220 1220 1220 1220 1219 1219 1219 1219 1218 1218 1218 1218 1217 1217 1217 1217 1217 1216 1216 1216 1216 1215 1215 1215 1215 1214 1214 1214 1214 1213 1213 1213 1213 1213 1212 1212 1212 1212 1211 1211 1211 1211 1210 1210 1210 1210 1209 1209 1209 1209 1209 1208 1208 1208 1208 1207 1207 1207 1207
-545 1207 1206 1206 1206 1206 1206 1205 1205 1205 1205 1204 1204 1204 1204 1203 1203 1203 1203 1203 1202 1202 1202 1202 1201 1201 1201 1201 1200 1200 1200 1200 1200 1199 1199 1199 1199 1198 1198 1198 1198 1197 1197 1197 1197 1197 1196 1196 1196 1196 1195 1195 1195 1195 1194 1194 1194 1194 1194 1193 1193 1193 1193 1192 1192 1192 1192 1191 1191 1191
-550 1191 1191 1191 1190 1190 1190 1190 1189 1189 1189 1189 1189 1188 1188 1188 1188 1187 1187 1187 1187 1186 1186 1186 1186 1186 1185 1185 1185 1185 1184 1184 1184 1184 1184 1183 1183 1183 1183 1182 1182 1182 1182 1182 1181 1181 1181 1181 1180 1180 1180 1180 1179 1179 1179 1179 1179 1178 1178 1178 1178 1177 1177 1177 1177 1177 1176 1176 1176 1176
-555 1176 1175 1175 1175 1175 1175 1174 1174 1174 1174 1173 1173 1173 1173 1173 1172 1172 1172 1172 1171 1171 1171 1171 1171 1170 1170 1170 1170 1169 1169 1169 1169 1169 1168 1168 1168 1168 1167 1167 1167 1167 1167 1166 1166 1166 1166 1165 1165 1165 1165 1165 1164 1164 1164 1164 1163 1163 1163 1163 1163 1162 1162 1162 1162 1161 1161 1161 1161 1161
-561 1161 1160 1160 1160 1160 1160 1159 1159 1159 1159 1158 1158 1158 1158 1158 1157 1157 1157 1157 1156 1156 1156 1156 1156 1155 1155 1155 1155 1155 1154 1154 1154 1154 1153 1153 1153 1153 1153 1152 1152 1152 1152 1151 1151 1151 1151 1151 1150 1150 1150 1150 1150 1149 1149 1149 1149 1148 1148 1148 1148 1148 1147 1147 1147 1147 1146 1146 1146 1146
-566 1146 1146 1145 1145 1145 1145 1145 1144 1144 1144 1144 1143 1143 1143 1143 1143 1142 1142 1142 1142 1142 1141 1141 1141 1141 1140 1140 1140 1140 1140 1139 1139 1139 1139 1139 1138 1138 1138 1138 1138 1137 1137 1137 1137 1136 1136 1136 1136 1136 1135 1135 1135 1135 1135 1134 1134 1134 1134 1133 1133 1133 1133 1133 1132 1132 1132 1132 1132 1131
-571 1131 1131 1131 1131 1131 1130 1130 1130 1130 1129 1129 1129 1129 1129 1128 1128 1128 1128 1128 1127 1127 1127 1127 1127 1126 1126 1126 1126 1125 1125 1125 1125 1125 1124 1124 1124 1124 1124 1123 1123 1123 1123 1123 1122 1122 1122 1122 1122 1121 1121 1121 1121 1120 1120 1120 1120 1120 1119 1119 1119 1119 1119 1118 1118 1118 1118 1118 1117 1117
-576 1117 1117 1117 1117 1116 1116 1116 1116 1116 1115 1115 1115 1115 1114 1114 1114 1114 1114 1113 1113 1113 1113 1113 1112 1112 1112 1112 1112 1111 1111 1111 1111 1111 1110 1110 1110 1110 1110 1109 1109 1109 1109 1109 1108 1108 1108 1108 1107 1107 1107 1107 1107 1106 1106 1106 1106 1106 1105 1105 1105 1105 1105 1104 1104 1104 1104 1104 1103 1103
-581 1103 1103 1103 1103 1102 1102 1102 1102 1102 1101 1101 1101 1101 1101 1100 1100 1100 1100 1100 1099 1099 1099 1099 1099 1098 1098 1098 1098 1098 1097 1097 1097 1097 1097 1096 1096 1096 1096 1096 1095 1095 1095 1095 1095 1094 1094 1094 1094 1094 1093 1093 1093 1093 1093 1092 1092 1092 1092 1092 1091 1091 1091 1091 1091 1090 1090 1090 1090 1090
-586 1090 1089 1089 1089 1089 1089 1088 1088 1088 1088 1088 1087 1087 1087 1087 1087 1086 1086 1086 1086 1086 1085 1085 1085 1085 1085 1084 1084 1084 1084 1084 1083 1083 1083 1083 1083 1082 1082 1082 1082 1082 1081 1081 1081 1081 1081 1080 1080 1080 1080 1080 1079 1079 1079 1079 1079 1078 1078 1078 1078 1078 1077 1077 1077 1077 1077 1077 1076 1076
-592 1076 1076 1076 1076 1075 1075 1075 1075 1075 1074 1074 1074 1074 1074 1073 1073 1073 1073 1073 1072 1072 1072 1072 1072 1071 1071 1071 1071 1071 1070 1070 1070 1070 1070 1069 1069 1069 1069 1069 1069 1068 1068 1068 1068 1068 1067 1067 1067 1067 1067 1066 1066 1066 1066 1066 1065 1065 1065 1065 1065 1064 1064 1064 1064 1064 1064 1063 1063 1063
-597 1063 1063 1063 1062 1062 1062 1062 1062 1061 1061 1061 1061 1061 1060 1060 1060 1060 1060 1059 1059 1059 1059 1059 1059 1058 1058 1058 1058 1058 1057 1057 1057 1057 1057 1056 1056 1056 1056 1056 1055 1055 1055 1055 1055 1055 1054 1054 1054 1054 1054 1053 1053 1053 1053 1053 1052 1052 1052 1052 1052 1052 1051 1051 1051 1051 1051 1050 1050 1050
-602 1050 1050 1050 1049 1049 1049 1049 1049 1049 1048 1048 1048 1048 1048 1047 1047 1047 1047 1047 1046 1046 1046 1046 1046 1046 1045 1045 1045 1045 1045 1044 1044 1044 1044 1044 1043 1043 1043 1043 1043 1043 1042 1042 1042 1042 1042 1041 1041 1041 1041 1041 1040 1040 1040 1040 1040 1040 1039 1039 1039 1039 1039 1038 1038 1038 1038 1038 1037 1037
-607 1037 1037 1037 1037 1037 1036 1036 1036 1036 1036 1035 1035 1035 1035 1035 1035 1034 1034 1034 1034 1034 1033 1033 1033 1033 1033 1033 1032 1032 1032 1032 1032 1031 1031 1031 1031 1031 1031 1030 1030 1030 1030 1030 1029 1029 1029 1029 1029 1028 1028 1028 1028 1028 1028 1027 1027 1027 1027 1027 1026 1026 1026 1026 1026 1026 1025 1025 1025 1025
-612 1025 1025 1024 1024 1024 1024 1024 1024 1023 1023 1023 1023 1023 1022 1022 1022 1022 1022 1022 1021 1021 1021 1021 1021 1021 1020 1020 1020 1020 1020 1019 1019 1019 1019 1019 1019 1018 1018 1018 1018 1018 1017 1017 1017 1017 1017 1017 1016 1016 1016 1016 1016 1015 1015 1015 1015 1015 1015 1014 1014 1014 1014 1014 1014 1013 1013 1013 1013 1013
-618 1013 1012 1012 1012 1012 1012 1012 1011 1011 1011 1011 1011 1010 1010 1010 1010 1010 1010 1009 1009 1009 1009 1009 1009 1008 1008 1008 1008 1008 1007 1007 1007 1007 1007 1007 1006 1006 1006 1006 1006 1006 1005 1005 1005 1005 1005 1004 1004 1004 1004 1004 1004 1003 1003 1003 1003 1003 1003 1002 1002 1002 1002 1002 1001 1001 1001 1001 1001 1001
-623 1001 1000 1000 1000 1000 1000 1000 999 999 999 999 999 998 998 998 998 998 998 997 997 997 997 997 997 996 996 996 996 996 996 995 995 995 995 995 994 994 994 994 994 994 993 993 993 993 993 993 992 992 992 992 992 992 991 991 991 991 991 991 990 990 990 990 990 989 989 989 989 989
-628 989 989 988 988 988 988 988 988 987 987 987 987 987 987 986 986 986 986 986 986 985 985 985 985 985 985 984 984 984 984 984 983 983 983 983 983 983 982 982 982 982 982 982 981 981 981 981 981 981 980 980 980 980 980 980 979 979 979 979 979 979 978 978 978 978 978 978 977 977 977
-633 977 977 977 977 976 976 976 976 976 976 975 975 975 975 975 974 974 974 974 974 974 973 973 973 973 973 973 972 972 972 972 972 972 971 971 971 971 971 971 970 970 970 970 970 970 969 969 969 969 969 969 968 968 968 968 968 968 967 967 967 967 967 967 966 966 966 966 966 966 965
-639 965 965 965 965 965 965 964 964 964 964 964 964 963 963 963 963 963 963 962 962 962 962 962 962 962 961 961 961 961 961 961 960 960 960 960 960 960 959 959 959 959 959 959 958 958 958 958 958 958 957 957 957 957 957 957 956 956 956 956 956 956 955 955 955 955 955 955 954 954 954
-644 954 954 954 954 953 953 953 953 953 953 953 952 952 952 952 952 952 951 951 951 951 951 951 950 950 950 950 950 950 949 949 949 949 949 949 948 948 948 948 948 948 947 947 947 947 947 947 947 946 946 946 946 946 946 945 945 945 945 945 945 944 944 944 944 944 944 943 943 943 943
-649 943 943 943 943 942 942 942 942 942 942 941 941 941 941 941 941 940 940 940 940 940 940 939 939 939 939 939 939 939 938 938 938 938 938 938 937 937 937 937 937 937 936 936 936 936 936 936 936 935 935 935 935 935 935 934 934 934 934 934 934 933 933 933 933 933 933 933 932 932 932
-654 932 932 932 932 931 931 931 931 931 931 930 930 930 930 930 930 930 929 929 929 929 929 929 928 928 928 928 928 928 927 927 927 927 927 927 927 926 926 926 926 926 926 925 925 925 925 925 925 925 924 924 924 924 924 924 923 923 923 923 923 923 923 922 922 922 922 922 922 921 921
-660 921 921 921 921 921 921 920 920 920 920 920 920 919 919 919 919 919 919 918 918 918 918 918 918 918 917 917 917 917 917 917 917 916 916 916 916 916 916 915 915 915 915 915 915 915 914 914 914 914 914 914 913 913 913 913 913 913 913 912 912 912 912 912 912 911 911 911 911 911 911
-665 911 911 910 910 910 910 910 910 909 909 909 909 909 909 909 908 908 908 908 908 908 908 907 907 907 907 907 907 906 906 906 906 906 906 906 905 905 905 905 905 905 905 904 904 904 904 904 904 903 903 903 903 903 903 903 902 902 902 902 902 902 902 901 901 901 901 901 901 900 900
-670 900 900 900 900 900 900 899 899 899 899 899 899 899 898 898 898 898 898 898 897 897 897 897 897 897 897 896 896 896 896 896 896 896 895 895 895 895 895 895 895 894 894 894 894 894 894 893 893 893 893 893 893 893 892 892 892 892 892 892 892 891 891 891 891 891 891 891 890 890 890
-675 890 890 890 890 890 889 889 889 889 889 889 888 888 888 888 888 888 888 887 887 887 887 887 887 887 886 886 886 886 886 886 886 885 885 885 885 885 885 885 884 884 884 884 884 884 884 883 883 883 883 883 883 883 882 882 882 882 882 882 882 881 881 881 881 881 881 880 880 880 880
-681 880 880 880 880 879 879 879 879 879 879 879 878 878 878 878 878 878 878 877 877 877 877 877 877 877 876 876 876 876 876 876 876 875 875 875 875 875 875 875 874 874 874 874 874 874 874 873 873 873 873 873 873 873 872 872 872 872 872 872 872 871 871 871 871 871 871 871 870 870 870
-686 870 870 870 870 870 869 869 869 869 869 869 869 869 868 868 868 868 868 868 868 867 867 867 867 867 867 867 866 866 866 866 866 866 866 865 865 865 865 865 865 865 864 864 864 864 864 864 864 863 863 863 863 863 863 863 862 862 862 862 862 862 862 861 861 861 861 861 861 861 861
-691 861 860 860 860 860 860 860 860 859 859 859 859 859 859 859 858 858 858 858 858 858 858 857 857 857 857 857 857 857 856 856 856 856 856 856 856 856 855 855 855 855 855 855 855 854 854 854 854 854 854 854 853 853 853 853 853 853 853 852 852 852 852 852 852 852 852 851 851 851 851
-696 851 851 851 851 850 850 850 850 850 850 850 849 849 849 849 849 849 849 849 848 848 848 848 848 848 848 847 847 847 847 847 847 847 846 846 846 846 846 846 846 846 845 845 845 845 845 845 845 844 844 844 844 844 844 844 843 843 843 843 843 843 843 843 842 842 842 842 842 842 842
-702 842 841 841 841 841 841 841 841 841 840 840 840 840 840 840 840 839 839 839 839 839 839 839 838 838 838 838 838 838 838 838 837 837 837 837 837 837 837 836 836 836 836 836 836 836 836 835 835 835 835 835 835 835 834 834 834 834 834 834 834 834 833 833 833 833 833 833 833 832 832
-707 832 832 832 832 832 832 832 831 831 831 831 831 831 831 831 830 830 830 830 830 830 830 829 829 829 829 829 829 829 829 828 828 828 828 828 828 828 827 827 827 827 827 827 827 827 826 826 826 826 826 826 826 826 825 825 825 825 825 825 825 824 824 824 824 824 824 824 824 823 823
-712 823 823 823 823 823 823 823 822 822 822 822 822 822 822 821 821 821 821 821 821 821 821 820 820 820 820 820 820 820 820 819 819 819 819 819 819 819 818 818 818 818 818 818 818 818 817 817 817 817 817 817 817 817 816 816 816 816 816 816 816 816 815 815 815 815 815 815 815 814 814
-718 814 814 814 814 814 814 814 813 813 813 813 813 813 813 813 812 812 812 812 812 812 812 812 811 811 811 811 811 811 811 811 810 810 810 810 810 810 810 810 809 809 809 809 809 809 809 809 808 808 808 808 808 808 808 807 807 807 807 807 807 807 807 806 806 806 806 806 806 806 806
-723 806 805 805 805 805 805 805 805 805 804 804 804 804 804 804 804 804 803 803 803 803 803 803 803 803 802 802 802 802 802 802 802 802 801 801 801 801 801 801 801 801 800 800 800 800 800 800 800 800 799 799 799 799 799 799 799 799 798 798 798 798 798 798 798 798 797 797 797 797 797
-728 797 797 797 797 796 796 796 796 796 796 796 796 795 795 795 795 795 795 795 795 794 794 794 794 794 794 794 794 793 793 793 793 793 793 793 793 793 792 792 792 792 792 792 792 792 791 791 791 791 791 791 791 791 790 790 790 790 790 790 790 790 789 789 789 789 789 789 789 789 788
-733 788 788 788 788 788 788 788 788 787 787 787 787 787 787 787 787 787 786 786 786 786 786 786 786 786 785 785 785 785 785 785 785 785 784 784 784 784 784 784 784 784 783 783 783 783 783 783 783 783 783 782 782 782 782 782 782 782 782 781 781 781 781 781 781 781 781 780 780 780 780
-739 780 780 780 780 780 780 779 779 779 779 779 779 779 779 778 778 778 778 778 778 778 778 777 777 777 777 777 777 777 777 777 776 776 776 776 776 776 776 776 775 775 775 775 775 775 775 775 774 774 774 774 774 774 774 774 774 773 773 773 773 773 773 773 773 772 772 772 772 772 772
-744 772 772 772 772 771 771 771 771 771 771 771 771 770 770 770 770 770 770 770 770 770 769 769 769 769 769 769 769 769 768 768 768 768 768 768 768 768 768 767 767 767 767 767 767 767 767 766 766 766 766 766 766 766 766 766 765 765 765 765 765 765 765 765 764 764 764 764 764 764 764
-749 764 764 764 763 763 763 763 763 763 763 763 763 762 762 762 762 762 762 762 762 761 761 761 761 761 761 761 761 761 760 760 760 760 760 760 760 760 760 759 759 759 759 759 759 759 759 758 758 758 758 758 758 758 758 758 757 757 757 757 757 757 757 757 757 756 756 756 756 756 756
-754 756 756 756 755 755 755 755 755 755 755 755 755 754 754 754 754 754 754 754 754 754 753 753 753 753 753 753 753 753 753 752 752 752 752 752 752 752 752 751 751 751 751 751 751 751 751 751 750 750 750 750 750 750 750 750 750 749 749 749 749 749 749 749 749 749 748 748 748 748 748
-760 748 748 748 748 748 747 747 747 747 747 747 747 747 747 746 746 746 746 746 746 746 746 746 745 745 745 745 745 745 745 745 744 744 744 744 744 744 744 744 744 743 743 743 743 743 743 743 743 743 742 742 742 742 742 742 742 742 742 741 741 741 741 741 741 741 741 741 740 740 740
-765 740 740 740 740 740 740 740 739 739 739 739 739 739 739 739 739 738 738 738 738 738 738 738 738 738 737 737 737 737 737 737 737 737 737 737 736 736 736 736 736 736 736 736 736 735 735 735 735 735 735 735 735 735 734 734 734 734 734 734 734 734 734 733 733 733 733 733 733 733 733
-770 733 733 732 732 732 732 732 732 732 732 732 731 731 731 731 731 731 731 731 731 730 730 730 730 730 730 730 730 730 730 729 729 729 729 729 729 729 729 729 728 728 728 728 728 728 728 728 728 727 727 727 727 727 727 727 727 727 726 726 726 726 726 726 726 726 726 726 725 725 725
-776 725 725 725 725 725 725 725 724 724 724 724 724 724 724 724 724 723 723 723 723 723 723 723 723 723 722 722 722 722 722 722 722 722 722 722 721 721 721 721 721 721 721 721 721 720 720 720 720 720 720 720 720 720 720 719 719 719 719 719 719 719 719 719 718 718 718 718 718 718 718
-781 718 718 718 717 717 717 717 717 717 717 717 717 717 716 716 716 716 716 716 716 716 716 715 715 715 715 715 715 715 715 715 715 714 714 714 714 714 714 714 714 714 713 713 713 713 713 713 713 713 713 713 712 712 712 712 712 712 712 712 712 711 711 711 711 711 711 711 711 711 711
-786 711 710 710 710 710 710 710 710 710 710 710 709 709 709 709 709 709 709 709 709 708 708 708 708 708 708 708 708 708 708 707 707 707 707 707 707 707 707 707 707 706 706 706 706 706 706 706 706 706 705 705 705 705 705 705 705 705 705 705 704 704 704 704 704 704 704 704 704 704 703
-791 703 703 703 703 703 703 703 703 703 702 702 702 702 702 702 702 702 702 702 701 701 701 701 701 701 701 701 701 701 700 700 700 700 700 700 700 700 700 700 699 699 699 699 699 699 699 699 699 699 698 698 698 698 698 698 698 698 698 697 697 697 697 697 697 697 697 697 697 696 696
-797 696 696 696 696 696 696 696 696 696 695 695 695 695 695 695 695 695 695 695 694 694 694 694 694 694 694 694 694 694 693 693 693 693 693 693 693 693 693 693 692 692 692 692 692 692 692 692 692 692 691 691 691 691 691 691 691 691 691 691 690 690 690 690 690 690 690 690 690 690 689
-802 689 689 689 689 689 689 689 689 689 689 688 688 688 688 688 688 688 688 688 688 687 687 687 687 687 687 687 687 687 687 686 686 686 686 686 686 686 686 686 686 685 685 685 685 685 685 685 685 685 685 684 684 684 684 684 684 684 684 684 684 684 683 683 683 683 683 683 683 683 683
-807 683 683 682 682 682 682 682 682 682 682 682 682 681 681 681 681 681 681 681 681 681 681 680 680 680 680 680 680 680 680 680 680 679 679 679 679 679 679 679 679 679 679 679 678 678 678 678 678 678 678 678 678 678 677 677 677 677 677 677 677 677 677 677 676 676 676 676 676 676 676
-812 676 676 676 676 676 675 675 675 675 675 675 675 675 675 675 674 674 674 674 674 674 674 674 674 674 673 673 673 673 673 673 673 673 673 673 673 672 672 672 672 672 672 672 672 672 672 671 671 671 671 671 671 671 671 671 671 671 670 670 670 670 670 670 670 670 670 670 669 669 669
-818 669 669 669 669 669 669 669 669 669 668 668 668 668 668 668 668 668 668 668 667 667 667 667 667 667 667 667 667 667 667 666 666 666 666 666 666 666 666 666 666 665 665 665 665 665 665 665 665 665 665 665 664 664 664 664 664 664 664 664 664 664 663 663 663 663 663 663 663 663 663
-823 663 663 663 662 662 662 662 662 662 662 662 662 662 662 661 661 661 661 661 661 661 661 661 661 660 660 660 660 660 660 660 660 660 660 660 659 659 659 659 659 659 659 659 659 659 659 658 658 658 658 658 658 658 658 658 658 658 657 657 657 657 657 657 657 657 657 657 656 656 656
-828 656 656 656 656 656 656 656 656 656 655 655 655 655 655 655 655 655 655 655 655 654 654 654 654 654 654 654 654 654 654 654 653 653 653 653 653 653 653 653 653 653 653 652 652 652 652 652 652 652 652 652 652 652 651 651 651 651 651 651 651 651 651 651 651 650 650 650 650 650 650
-833 650 650 650 650 650 650 649 649 649 649 649 649 649 649 649 649 649 648 648 648 648 648 648 648 648 648 648 648 647 647 647 647 647 647 647 647 647 647 647 646 646 646 646 646 646 646 646 646 646 646 645 645 645 645 645 645 645 645 645 645 645 644 644 644 644 644 644 644 644 644
-839 644 644 644 643 643 643 643 643 643 643 643 643 643 643 642 642 642 642 642 642 642 642 642 642 642 641 641 641 641 641 641 641 641 641 641 641 641 640 640 640 640 640 640 640 640 640 640 640 639 639 639 639 639 639 639 639 639 639 639 638 638 638 638 638 638 638 638 638 638 638
-844 638 637 637 637 637 637 637 637 637 637 637 637 637 636 636 636 636 636 636 636 636 636 636 636 635 635 635 635 635 635 635 635 635 635 635 634 634 634 634 634 634 634 634 634 634 634 634 633 633 633 633 633 633 633 633 633 633 633 632 632 632 632 632 632 632 632 632 632 632 632
-849 632 631 631 631 631 631 631 631 631 631 631 631 630 630 630 630 630 630 630 630 630 630 630 629 629 629 629 629 629 629 629 629 629 629 629 628 628 628 628 628 628 628 628 628 628 628 628 627 627 627 627 627 627 627 627 627 627 627 626 626 626 626 626 626 626 626 626 626 626 626
-855 626 625 625 625 625 625 625 625 625 625 625 625 624 624 624 624 624 624 624 624 624 624 624 624 623 623 623 623 623 623 623 623 623 623 623 623 622 622 622 622 622 622 622 622 622 622 622 621 621 621 621 621 621 621 621 621 621 621 621 620 620 620 620 620 620 620 620 620 620 620
-860 620 620 619 619 619 619 619 619 619 619 619 619 619 619 618 618 618 618 618 618 618 618 618 618 618 618 617 617 617 617 617 617 617 617 617 617 617 616 616 616 616 616 616 616 616 616 616 616 616 615 615 615 615 615 615 615 615 615 615 615 615 614 614 614 614 614 614 614 614 614
-865 614 614 614 614 613 613 613 613 613 613 613 613 613 613 613 613 612 612 612 612 612 612 612 612 612 612 612 612 611 611 611 611 611 611 611 611 611 611 611 611 610 610 610 610 610 610 610 610 610 610 610 610 609 609 609 609 609 609 609 609 609 609 609 609 608 608 608 608 608 608
-870 608 608 608 608 608 608 608 608 607 607 607 607 607 607 607 607 607 607 607 607 606 606 606 606 606 606 606 606 606 606 606 606 605 605 605 605 605 605 605 605 605 605 605 605 604 604 604 604 604 604 604 604 604 604 604 604 603 603 603 603 603 603 603 603 603 603 603 603 603 602
-876 602 602 602 602 602 602 602 602 602 602 602 602 601 601 601 601 601 601 601 601 601 601 601 601 600 600 600 600 600 600 600 600 600 600 600 600 600 599 599 599 599 599 599 599 599 599 599 599 599 598 598 598 598 598 598 598 598 598 598 598 598 598 597 597 597 597 597 597 597 597
-881 597 597 597 597 597 596 596 596 596 596 596 596 596 596 596 596 596 596 595 595 595 595 595 595 595 595 595 595 595 595 594 594 594 594 594 594 594 594 594 594 594 594 594 593 593 593 593 593 593 593 593 593 593 593 593 592 592 592 592 592 592 592 592 592 592 592 592 592 591 591
-886 591 591 591 591 591 591 591 591 591 591 591 591 590 590 590 590 590 590 590 590 590 590 590 590 589 589 589 589 589 589 589 589 589 589 589 589 589 588 588 588 588 588 588 588 588 588 588 588 588 588 587 587 587 587 587 587 587 587 587 587 587 587 587 586 586 586 586 586 586 586
-891 586 586 586 586 586 586 585 585 585 585 585 585 585 585 585 585 585 585 585 584 584 584 584 584 584 584 584 584 584 584 584 584 583 583 583 583 583 583 583 583 583 583 583 583 583 582 582 582 582 582 582 582 582 582 582 582 582 582 581 581 581 581 581 581 581 581 581 581 581 581
-897 581 581 580 580 580 580 580 580 580 580 580 580 580 580 580 579 579 579 579 579 579 579 579 579 579 579 579 579 578 578 578 578 578 578 578 578 578 578 578 578 578 577 577 577 577 577 577 577 577 577 577 577 577 577 576 576 576 576 576 576 576 576 576 576 576 576 576 575 575 575
-902 575 575 575 575 575 575 575 575 575 575 575 575 574 574 574 574 574 574 574 574 574 574 574 574 574 573 573 573 573 573 573 573 573 573 573 573 573 573 572 572 572 572 572 572 572 572 572 572 572 572 572 571 571 571 571 571 571 571 571 571 571 571 571 571 571 570 570 570 570 570
-907 570 570 570 570 570 570 570 570 570 569 569 569 569 569 569 569 569 569 569 569 569 569 569 568 568 568 568 568 568 568 568 568 568 568 568 568 567 567 567 567 567 567 567 567 567 567 567 567 567 567 566 566 566 566 566 566 566 566 566 566 566 566 566 565 565 565 565 565 565 565
-912 565 565 565 565 565 565 565 565 564 564 564 564 564 564 564 564 564 564 564 564 564 563 563 563 563 563 563 563 563 563 563 563 563 563 563 562 562 562 562 562 562 562 562 562 562 562 562 562 561 561 561 561 561 561 561 561 561 561 561 561 561 561 560 560 560 560 560 560 560 560
-918 560 560 560 560 560 560 560 559 559 559 559 559 559 559 559 559 559 559 559 559 559 558 558 558 558 558 558 558 558 558 558 558 558 558 557 557 557 557 557 557 557 557 557 557 557 557 557 557 556 556 556 556 556 556 556 556 556 556 556 556 556 556 555 555 555 555 555 555 555 555
-923 555 555 555 555 555 555 555 554 554 554 554 554 554 554 554 554 554 554 554 554 554 553 553 553 553 553 553 553 553 553 553 553 553 553 553 552 552 552 552 552 552 552 552 552 552 552 552 552 552 551 551 551 551 551 551 551 551 551 551 551 551 551 551 550 550 550 550 550 550 550
-928 550 550 550 550 550 550 550 550 549 549 549 549 549 549 549 549 549 549 549 549 549 549 548 548 548 548 548 548 548 548 548 548 548 548 548 548 548 547 547 547 547 547 547 547 547 547 547 547 547 547 547 546 546 546 546 546 546 546 546 546 546 546 546 546 546 545 545 545 545 545
-934 545 545 545 545 545 545 545 545 545 545 544 544 544 544 544 544 544 544 544 544 544 544 544 544 544 543 543 543 543 543 543 543 543 543 543 543 543 543 543 542 542 542 542 542 542 542 542 542 542 542 542 542 542 542 541 541 541 541 541 541 541 541 541 541 541 541 541 541 540 540
-939 540 540 540 540 540 540 540 540 540 540 540 540 540 540 539 539 539 539 539 539 539 539 539 539 539 539 539 539 538 538 538 538 538 538 538 538 538 538 538 538 538 538 538 537 537 537 537 537 537 537 537 537 537 537 537 537 537 536 536 536 536 536 536 536 536 536 536 536 536 536
-944 536 536 536 535 535 535 535 535 535 535 535 535 535 535 535 535 535 535 534 534 534 534 534 534 534 534 534 534 534 534 534 534 534 533 533 533 533 533 533 533 533 533 533 533 533 533 533 532 532 532 532 532 532 532 532 532 532 532 532 532 532 532 531 531 531 531 531 531 531 531
-949 531 531 531 531 531 531 531 531 530 530 530 530 530 530 530 530 530 530 530 530 530 530 530 529 529 529 529 529 529 529 529 529 529 529 529 529 529 529 528 528 528 528 528 528 528 528 528 528 528 528 528 528 528 527 527 527 527 527 527 527 527 527 527 527 527 527 527 527 526 526
-955 526 526 526 526 526 526 526 526 526 526 526 526 526 526 525 525 525 525 525 525 525 525 525 525 525 525 525 525 525 524 524 524 524 524 524 524 524 524 524 524 524 524 524 524 523 523 523 523 523 523 523 523 523 523 523 523 523 523 523 523 522 522 522 522 522 522 522 522 522 522
-960 522 522 522 522 522 522 521 521 521 521 521 521 521 521 521 521 521 521 521 521 521 520 520 520 520 520 520 520 520 520 520 520 520 520 520 520 520 519 519 519 519 519 519 519 519 519 519 519 519 519 519 519 518 518 518 518 518 518 518 518 518 518 518 518 518 518 518 518 517 517
-965 517 517 517 517 517 517 517 517 517 517 517 517 517 517 516 516 516 516 516 516 516 516 516 516 516 516 516 516 516 516 515 515 515 515 515 515 515 515 515 515 515 515 515 515 515 514 514 514 514 514 514 514 514 514 514 514 514 514 514 514 514 513 513 513 513 513 513 513 513 513
-970 513 513 513 513 513 513 513 512 512 512 512 512 512 512 512 512 512 512 512 512 512 512 512 511 511 511 511 511 511 511 511 511 511 511 511 511 511 511 511 510 510 510 510 510 510 510 510 510 510 510 510 510 510 510 510 509 509 509 509 509 509 509 509 509 509 509 509 509 509 509
-976 509 509 508 508 508 508 508 508 508 508 508 508 508 508 508 508 508 508 507 507 507 507 507 507 507 507 507 507 507 507 507 507 507 507 506 506 506 506 506 506 506 506 506 506 506 506 506 506 506 506 505 505 505 505 505 505 505 505 505 505 505 505 505 505 505 505 504 504 504 504
-981 504 504 504 504 504 504 504 504 504 504 504 504 504 503 503 503 503 503 503 503 503 503 503 503 503 503 503 503 503 502 502 502 502 502 502 502 502 502 502 502 502 502 502 502 502 501 501 501 501 501 501 501 501 501 501 501 501 501 501 501 501 500 500 500 500 500 500 500 500 500
-986 500 500 500 500 500 500 500 500 500 499 499 499 499 499 499 499 499 499 499 499 499 499 499 499 499 498 498 498 498 498 498 498 498 498 498 498 498 498 498 498 498 497 497 497 497 497 497 497 497 497 497 497 497 497 497 497 497 497 496 496 496 496 496 496 496 496 496 496 496 496
-991 496 496 496 496 496 495 495 495 495 495 495 495 495 495 495 495 495 495 495 495 495 495 494 494 494 494 494 494 494 494 494 494 494 494 494 494 494 494 493 493 493 493 493 493 493 493 493 493 493 493 493 493 493 493 493 492 492 492 492 492 492 492 492 492 492 492 492 492 492 492
-997 492 492 492 491 491 491 491 491 491 491 491 491 491 491 491 491 491 491 491 491 490 490 490 490 490 490 490 490 490 490 490 490 490 490 490 490 489 489 489 489 489 489 489 489 489 489 489 489 489 489 0
-1001@
##END=		$$ NMR SPECTRUM
##TITLE=	
##JCAMP-DX=	6.0	$$ MestReNova 15.0.0-34764
##DATA TYPE=	NMR PEAK TABLE
##DATA CLASS=	PEAK TABLE
##BLOCK_ID=	3
##ORIGIN=	Mestrelab Research S.L.
##OWNER=	PC
##CROSS REFERENCE=	NMR SPECTRUM: BLOCK_ID=2                                     
##.OBSERVE FREQUENCY=	200.12849902499999644
##.OBSERVE NUCLEUS=	^Unknown
##NPOINTS=	53
##FIRSTX=	0.93268179046596744186
##LASTX=	4.6405377337205031552
##XFACTOR=	1
##YFACTOR=	1
##FIRSTY=	0.1100375031105290391
##XUNITS=	PPM
##YUNITS=	ARBITRARY UNITS
##PEAK TABLE=	(XYW..XYW)
0.93268179046596744186,0.1100375031105290391,0.0033551919754378333599
0.96665068517528318637,0.12038861428126908237,0.0032866157395280972894
1.3142029320582304663,0.052100920654946772381,0.0030517807008552566735
1.3457120801142365973,0.071593775325054065384,0.0025236705643142832295
1.5776943278246462476,0.0061536019417908508974,0.0025236705643142832295
1.5803970676991896394,0.022628645148041325041,0.0032866157395280972894
1.608992138869518751,0.026988278988382706503,0.0036068564600096595686
1.6726810021387661376,0.023325338263185994847,0.0032866157395280972894
1.6748425729764933045,0.0057799273741750128303,0.0020783510272118876742
1.7016437631856982104,0.022742569819356354272,0.0032866157395280972894
1.7038489940601431183,0.0055207913390507862977,0.0019244032343667780323
1.7272320926595221557,0.00047614065702722375636,0.0025236705643142832295
1.7531717181238235526,0.00047795653940788525001,0.0025236705643142832295
1.76041969728835479,0.0022051442306112523442,0.0025236705643142832295
1.7646158957520308164,0.00043395367196269365572,0.0025236705643142832295
1.7863598332456245288,0.0022352266233711258654,0.0025236705643142832295
1.7905478287307245999,0.00040833236945869369342,0.0022499968378256172442
1.7936078124101557663,0.0038278776028710923864,0.0025236705643142832295
1.796278120523403965,0.0019851488056127270833,0.0025236705643142832295
1.8004743189870799913,0.00039889903558691289622,0.0025136551893264248193
1.819547948367425505,0.0037203535529988424925,0.0025236705643142832295
1.822246354854868633,0.0021967737558294866268,0.0025236705643142832295
1.8281747634515637113,0.0043856656562756808973,0.0025236705643142832295
1.8309840778226642577,0.0018967173756250866115,0.0025236705643142832295
1.8348066438522077082,0.00038157466134936142681,0.0027007746846384509364
1.8539635699521641587,0.0047595464727282609657,0.0032781708728000439994
1.8570319829806545275,0.0017144897741874936571,0.0024841156718080291931
1.8614802748240621977,0.0034997706771229776176,0.0025236705643142832295
1.864183315513441519,0.0016681355137221638273,0.0025236705643142832295
1.8679949669935025369,0.00033897580543184517403,0.0025831504214069017644
1.887450068961454841,0.0033012092240997368588,0.0025236705643142832295
1.8901203770747032618,0.0017530625450073891551,0.0025236705643142832295
1.8935536303631652633,0.00033471077252936426265,0.0025236705643142832295
1.896223938476413684,0.001627360073397868083,0.0025236705643142832295
$$ [...]
4.5777036534647583821,0.0045768173271488613377,0.0027279855997177403573
4.5830482968906931518,0.0044880598714285542886,0.0026809318194592783244
4.6004831120217781759,0.0015504322681584722324,0.0026320559227809518094
4.6090054434549170281,0.0043302270179840333941,0.0028219667559781121124
4.6145975977632334164,0.001481738215750748669,0.0025236705643142832295
4.6405377337205031552,0.0014288572773119142742,0.0025236705643142832295
##$MNOVA/PEAK_DATA_TABLE=	(T,F,A,ST,SP,APT,APC)
$$ Complementary to PEAK TABLE
$$ T: Type
$$ F: Flags
$$ A: Annotation
$$ ST: Shape Type
$$ SP: Shape Parameter
$$ APT: Attached Peaks Type
$$ APC: Attached Peaks Count
Compound,None,,1,0.49589657807789294663,0,0
Compound,None,,1,0.49878592706825791714,0,0
Compound,None,,1,0.10380203920929265138,0,0
Compound,None,,1,-0.064462212344220393145,0,0
Compound,None,,1,0.14613738167855150341,0,0
Compound,None,,1,0.22277807860865556089,0,0
Compound,None,,1,0.66021251978695905116,0,0
Compound,None,,1,0.19418841922998053562,0,0
Compound,None,,1,0.55014013934447059118,0,0
Compound,None,,1,0.10254837739349437209,0,0
Compound,None,,1,0.29544474672577403229,0,0
Compound,None,,1,0.049990145412943942649,0,0
Compound,None,,1,0.036351820658846678569,0,0
Compound,None,,1,0,0,0
Compound,None,,1,0.037636207660070863934,0,0
Compound,None,,1,0,0,0
Compound,None,,1,0.40000000000000007772,0,0
Compound,None,,1,0,0,0
Compound,None,,1,0.067829876611892492289,0,0
Compound,None,,1,0.029786198611779907824,0,0
Compound,None,,1,-0.0067349795038809320835,0,0
Compound,None,,1,-0.092037738912073896458,0,0
Compound,None,,1,-0.039223313452101012111,0,0
Compound,None,,1,-0.0004748206074269810395,0,0
Compound,None,,1,-0.22427070763977582923,0,0
Compound,None,,1,0.60000000000000008882,0,0
Compound,None,,1,-0.021730511774354234478,0,0
Compound,None,,1,-0.096039297861206851525,0,0
Compound,None,,1,0.13010713455892936041,0,0
Compound,None,,1,0.10705038316015390298,0,0
Compound,None,,1,0,0,0
Compound,None,,1,0.050718092810133452719,0,0
Compound,None,,1,0.34251844182128432514,0,0
Compound,None,,1,-0.043898425827538251065,0,0
Compound,None,,1,0.1350588002339535576,0,0
Compound,None,,1,0.0092289553912854628559,0,0
Compound,None,,1,0.17186044930525379293,0,0
Compound,None,,1,0,0,0
Compound,None,,1,0.1355702775797880677,0,0
Compound,None,,1,0.32549348348778084361,0,0
Compound,None,,1,-0.40000000000000007772,0,0
Compound,None,,1,-0.052324058619773586298,0,0
Compound,None,,1,0.024115563922445265588,0,0
Compound,None,,1,-0.062495473328412348701,0,0
Compound,None,,1,0.14664788775933185194,0,0
Compound,None,,1,-0.41814946217258003314,0,0
Compound,None,,1,0.68839486324201215606,0,0
Compound,None,,1,0.023660385907228909108,0,0
Compound,None,,1,0.080709376369409779883,0,0
Compound,None,,1,-0.19309391852980192783,0,0
Compound,None,,1,0.42558368822188580305,0,0
Compound,None,,1,0.031582098939741003185,0,0
Compound,None,,1,0,0,0
##END=		$$ NMR PEAK TABLE
##END=		$$ LINK
