##TITLE=	Document 1
##JCAMP-DX=	6.0	$$ MestReNova 15.0.0-34764
##DATA TYPE=	LINK
##BLOCKS=	3    
##ORIGIN=	Mestrelab Research S.L.
##OWNER=	PC
##$MNOVA/METADATA=	(DOCUMENT,BASE64)
ewogICAgIm5hbWUiOiAiRG9jdW1lbnQgMSIsCiAgICAicGFnZXMiOiBbCiAgICAgICAgewogICAgICA
gICAgICAiaXRlbXMiOiBbCiAgICAgICAgICAgICAgICAiMiIsICAgICAgICAgICAgICAgICAgICAgIC
AgICAgICAgICAgICAgIAogICAgICAgICAgICAgICAgIjEiICAgICAgICAgICAgICAgICAgICAgICAgI
CAgICAgICAgICAgIAogICAgICAgICAgICBdCiAgICAgICAgfQogICAgXQp9Cg==
##TITLE=	H NMR calculated spectrum
##JCAMP-CS=	3.7	$$ MestReNova 15.0.0-34764
##BLOCK_ID=	1
##ORIGIN=	Mestrelab Research S.L.
##OWNER=	PC
##$MNOVA/METADATA=	(ITEM,BASE64)
ewogICAgImFuZ2xlIjogMCwKICAgICJwb2ludHMiOiBbCiAgICAgICAgewogICAgICAgICAgICAieCI
6IDU1NTcsCiAgICAgICAgICAgICJ5IjogNjA3MQogICAgICAgIH0sCiAgICAgICAgewogICAgICAgIC
AgICAieCI6IDYwNDAuNzQ3ODcxNDQxNDU0LAogICAgICAgICAgICAieSI6IDYwNzEKICAgICAgICB9L
AogICAgICAgIHsKICAgICAgICAgICAgIngiOiA2MDQwLjc0Nzg3MTQ0MTQ1NCwKICAgICAgICAgICAg
InkiOiA2NTM2LjAzNDM1MTI2MTQyMQogICAgICAgIH0sCiAgICAgICAgewogICAgICAgICAgICAieCI
6IDU1NTcsCiAgICAgICAgICAgICJ5IjogNjUzNi4wMzQzNTEyNjE0MjEKICAgICAgICB9LAogICAgIC
AgIHsKICAgICAgICAgICAgIngiOiA1NTU3LAogICAgICAgICAgICAieSI6IDYwNzEKICAgICAgICB9C
iAgICBdLAogICAgInoiOiAxCn0K
##NAMES=	H NMR calculated spectrum
##ATOMLIST=	
$$ AN	AS	NH
	1	C	3
	2	C	2
	3	C	2
	4	C	1
	5	C	3
	6	O	 
	7	P	 
	8	C	3
	9	F	 
	10	O	 
##BONDLIST=	
$$ AN1	AN2	BT
	1	2	S
	2	3	S
	3	4	S
	4	5	S
	4	6	S
	6	7	S
	7	8	S
	7	9	S
	7	10	D
##MAXRASTER=	32768
##XY_RASTER=	
$$ AN	X	Y	Z
	1	5803	4262	0
	2	13867	4262	0
	3	17873	11247	0
	4	25834	11247	0
	5	29840	4262	0
	6	29840	18181	0
	7	25834	25012	0
	8	32768	29070	0
	9	18849	21006	0
	10	21776	31997	0
##END=		$$ JCAMP-CS
##TITLE=	
##JCAMP-DX=	6.0	$$ MestReNova 15.0.0-34764
##DATA TYPE=	NMR SPECTRUM
##DATA CLASS=	XYDATA
##BLOCK_ID=	2
##ORIGIN=	Mnova: Peaks
##OWNER=	PC
##NUMDIM=	1
##$MNOVA/METADATA=	(ITEM,BASE64)
ewogICAgImFuZ2xlIjogMCwKICAgICJheGVzIjogewogICAgICAgICJ4IjogewogICAgICAgICAgICA
ibWF4IjogNS41MTI2NTM3OTEzNjgwMTEsCiAgICAgICAgICAgICJtaW4iOiAwLjQwNzc2MTE2MjgwNz
YzNDc1CiAgICAgICAgfSwKICAgICAgICAieSI6IHsKICAgICAgICAgICAgIm1heCI6IDAuMTIxMjY3N
DE0NjUxODExMTIsCiAgICAgICAgICAgICJtaW4iOiAtMC4wMTEwMjQzMTAyNTM1NjA1NDMKICAgICAg
ICB9CiAgICB9LAogICAgInBvaW50cyI6IFsKICAgICAgICB7CiAgICAgICAgICAgICJ4IjogNTMyMSw
KICAgICAgICAgICAgInkiOiA1ODM1CiAgICAgICAgfSwKICAgICAgICB7CiAgICAgICAgICAgICJ4Ij
ogODcyMiwKICAgICAgICAgICAgInkiOiA1ODM1CiAgICAgICAgfSwKICAgICAgICB7CiAgICAgICAgI
CAgICJ4IjogODcyMiwKICAgICAgICAgICAgInkiOiA4MjA4CiAgICAgICAgfSwKICAgICAgICB7CiAg
ICAgICAgICAgICJ4IjogNTMyMSwKICAgICAgICAgICAgInkiOiA4MjA4CiAgICAgICAgfSwKICAgICA
gICB7CiAgICAgICAgICAgICJ4IjogNTMyMSwKICAgICAgICAgICAgInkiOiA1ODM1CiAgICAgICAgfQ
ogICAgXSwKICAgICJ6IjogMAp9Cg==
##.OBSERVE FREQUENCY=	200.12849902499999644
##.OBSERVE NUCLEUS=	^Unknown
##.SOLVENT NAME=	
##.PULSE SEQUENCE=	
##.ACQUISITIONMODE=	SIMULTANEOUS
##$ORIGINAL FORMAT=	MNova
##$MNOVA/SCALES_VERSION=	9
##$PARAMETER FILE=	(originalData.xml, ASCII, , 0)
$$ <?xml version="1.0" encoding="UTF-8"?>
$$ <MnovaSpectrumParams>
$$     <itemId>{ae7b1ed7-add3-4a3a-9ff6-e593fb3ab1b1}</itemId>
$$     <spectrumIndex>0</spectrumIndex>
$$     <DataFileName/>
$$     <Title>
$$         <dim0>Simulated Unknown NMR Spectrum</dim0>
$$     </Title>
$$     <Comment/>
$$     <Origin>
$$         <dim0>Mnova: Spin Simulation</dim0>
$$     </Origin>
$$     <Owner/>
$$     <Site/>
$$     <Instrument/>
$$     <Author/>
$$     <Solvent/>
$$     <Temperature/>
$$     <PulseSequence/>
$$     <Experiment>
$$         <dim0>1D</dim0>
$$     </Experiment>
$$     <Probe/>
$$     <NumberofScans/>
$$     <ReceiverGain/>
$$     <RelaxationDelay/>
$$     <PulseWidth/>
$$     <PresaturationFrequency/>
$$     <AcquisitionTime/>
$$     <AcquisitionDate/>
$$     <ModificationDate/>
$$     <Class/>
$$     <Purity>
$$         <dim0>100</dim0>
$$     </Purity>
$$     <SpectrumQuality>
$$         <dim0>0</dim0>
$$     </SpectrumQuality>
$$     <Version/>
$$     <Algorithm/>
$$     <UseDB/>
$$     <GMMXCycles/>
$$     <LineWidth>
$$         <dim0>0</dim0>
$$     </LineWidth>
$$     <SpectrometerFrequency>
$$         <dim0>200.13</dim0>
$$     </SpectrometerFrequency>
$$     <SpectralWidth>
$$         <dim0>5003.25</dim0>
$$     </SpectralWidth>
$$     <LowestFrequency>
$$         <dim0>-1000.65</dim0>
$$     </LowestFrequency>
$$     <Nucleus>
$$         <dim0>Unknown</dim0>
$$     </Nucleus>
$$     <AcquiredSize/>
$$     <SpectralSize>
$$         <dim0>65536</dim0>
$$     </SpectralSize>
$$     <DigitalResolution>
$$         <dim0>0.0763435363769531</dim0>
$$     </DigitalResolution>
$$     <AbsoluteReference/>
$$ </MnovaSpectrumParams>
$$ 
##$PARAMETER FILE=	(parameters, ASCII, , 0)
$$ <MnovaSpectrumParams>
$$ <SpecCount>1</SpecCount>
$$ <Dimensions>1</Dimensions>
$$ <Origin>Mnova: Peaks</Origin>
$$ <Window Dim="f1">
$$ <Nucleus>Unknown</Nucleus>
$$ <Points>65536</Points>
$$ <Width>5003.25</Width>
$$ <MHz>200.128499024999996</MHz>
$$ <Hz>-1000.64999999999998</Hz>
$$ </Window>
$$ <Window Dim="f0">
$$ <Points>1</Points>
$$ </Window>
$$ </MnovaSpectrumParams>
##$PARAMETER FILE=	(title, ASCII, , 0)
$$ 
##XUNITS=	HZ
##YUNITS=	ARBITRARY UNITS
##FIRSTX=	4002.5999999999999091
##LASTX=	-1000.5736564636230241
##DELTAX=	-0.076343536376953125
##XFACTOR=	1
##YFACTOR=	5.1335945934796020954E-11
##FIRSTY=	3.2005216255015511706E-09
##MINY=	0
##MAXY=	0.11024310439825057983
##NPOINTS=	65536
##XYDATA=	(X++(Y..Y))
$$ [...]
925A08927p46p37p30p21p14p06o98o91o84o76o69o62o56o48o41o35o29o22o15o10o03n97n91
923I3646n85n79n74n67n63n56n51n46n41n35n30n25n20n15n10n06n00m96m91m87m82m77m74
922H1536m68m65m60m56m52m48m44m40m36m32m28m24m21m17m13m10m06m02l99l96l92l89l85
920G1753l83l79l75l73l69l67l63l60l58l54l51l49l46l42l40l38l34l32l29l27l24l21l19
918F3720l16l14l11l09l06l04l02k99k97k95k92k90k88k86k83k82k79k77k75k73k71k69k67
916E7035k65k63k61k59k57k55k53k52k50k48k46k44k43k41k39k37k36k34k32k31k29k28k25
915E1407k25k23k21k19k19k16k15k14k12k11k09k08k07k05k03k03k01j99j99j96j96j94j93
913D6619j92j91j89j88j87j85j85j83j82j81j79j79j77j76j75j74j73j71j71j70j68j68j66
$$ y = [108927, 108181, 107444, 106714, 105993, 105279, 104573, 103875, 103184, 102500, 101824, 101155, 100493, 99837, 99189, 98548, 97913, 97284, 96662, 96047, 95437, 94834, 94237, 93646, 93061, 92482, 91908, 91341, 90778, 90222, 89671, 89125, 88584, 88049, 87519, 86994, 86474, 85959, 85449, 84943, 84443, 83947, 83456, 82969, 82487, 82010, 81536, 81068, 80603, 80143, 79687, 79235, 78787, 78343, 77903, 77467, 77035, 76607, 76183, 75762, 75345, 74932, 74522, 74116, 73714, 73315, 72919, 72527, 72138, 71753, 71370, 70991, 70616, 70243, 69874, 69507, 69144, 68784, 68426, 68072, 67721, 67372, 67026, 66684, 66344, 66006, 65672, 65340, 65011, 64684, 64360, 64039, 63720, 63404, 63090, 62779, 62470, 62164, 61860, 61558, 61259, 60962, 60667, 60375, 60085, 59797, 59511, 59228, 58946, 58667, 58390, 58115, 57842, 57571, 57302, 57035, 56770, 56507, 56246, 55987, 55730, 55475, 55222, 54970, 54720, 54472, 54226, 53982, 53739, 53498, 53259, 53022, 52786, 52552, 52320, 52089, 51860, 51632, 51407, 51182, 50959, 50738, 50519, 50300, 50084, 49869, 49655, 49443, 49232, 49023, 48815, 48608, 48403, 48200, 47997, 47796, 47597, 47398, 47202, 47006, 46812, 46619, 46427, 46236, 46047, 45859, 45672, 45487, 45302, 45119, 44937, 44756, 44577, 44398, 44221, 44045, 43870, 43696, 43523, 43352, 43181, 43011, 42843, 42675, 42509]
911D2509j65j64j64j62j61j60j60j58j57j56j56j54j54j52j52j50j50j49j48j47j46j45j45
909C8954j43j43j42j41j40j40j38j38j37j36j35j35j33j33j33j31j31j30j29j28j28j27j26
908C5857j26j24j25j23j23j22j21j21j20j19j18j18j18j16j16j16j14j15j13j13j12j12j11
906C3141j10j10j09j09j08j07j07j06j06j05j05j04j03j03j03j02j01j01j00j00r9r8r9r7
904C0649r7r7r6r6r5r5r4r3r4r2r3r1r2r0r1r0q9q9q9q8q8q7q7q6q6q5q5q5q4q4q3q3q3q2
901B7610q2q1q1q1q0q0p9p9p9p8p8p7p7p7p7p6p5p6p5p4p4p4p4p3p3p2p2p2p2p1p0p1p0p0
899B5040o9p0o8o9o8o8o8o7o7o6o7o6o6o5o5o5o5o4o4o3o4o3o3o2o3o2o1o2o1o1o0o1o0o0
896B2847n9n9n9n9n9n8n8n8n7n7n7n7n7n6n6n6n5n6n5n4n5n4n4n4n4n3n4n3n2n3n2n2n2n2
$$ y = [42509, 42344, 42180, 42016, 41854, 41693, 41533, 41373, 41215, 41058, 40902, 40746, 40592, 40438, 40286, 40134, 39984, 39834, 39685, 39537, 39390, 39244, 39099, 38954, 38811, 38668, 38526, 38385, 38245, 38105, 37967, 37829, 37692, 37556, 37421, 37286, 37153, 37020, 36887, 36756, 36625, 36495, 36366, 36238, 36110, 35983, 35857, 35731, 35607, 35482, 35359, 35236, 35114, 34993, 34872, 34752, 34633, 34515, 34397, 34279, 34163, 34047, 33931, 33817, 33702, 33589, 33476, 33364, 33252, 33141, 33031, 32921, 32812, 32703, 32595, 32488, 32381, 32275, 32169, 32064, 31959, 31855, 31752, 31649, 31546, 31444, 31343, 31242, 31142, 31042, 30943, 30845, 30746, 30649, 30552, 30455, 30359, 30263, 30168, 30073, 29979, 29886, 29792, 29700, 29607, 29516, 29424, 29334, 29243, 29153, 29064, 28975, 28886, 28798, 28710, 28623, 28536, 28450, 28364, 28279, 28194, 28109, 28025, 27941, 27858, 27775, 27692, 27610, 27528, 27447, 27366, 27285, 27205, 27125, 27046, 26967, 26888, 26810, 26732, 26655, 26578, 26501, 26424, 26348, 26273, 26197, 26122, 26048, 25974, 25900, 25826, 25753, 25680, 25608, 25536, 25464, 25392, 25321, 25251, 25180, 25110, 25040, 24971, 24901, 24833, 24764, 24696, 24628, 24560, 24493, 24426, 24360, 24293, 24227, 24161, 24096, 24031, 23966, 23901, 23837, 23773, 23710, 23646, 23583, 23520, 23458, 23395, 23333, 23272, 23210, 23149, 23088, 23028, 22967, 22907, 22847, 22788, 22729, 22670, 22611, 22552, 22494, 22436, 22378, 22321, 22264, 22207, 22150, 22093, 22037, 21981, 21925, 21870, 21814, 21759, 21705, 21650, 21596, 21542, 21488, 21434, 21381, 21327, 21274, 21222, 21169, 21117, 21065, 21013, 20961]
894B0961n1n1n1n1n1n0n0n0n0m9n0m9m9m8m9m8m8m8m8m7m8m7m7m7m6m7m6m6m6m5m6m5m5m5
891A9327m4m5m4m5m4m3m4m3m4m3m3m3m2m3m2m2m2m2m1m2m1m1m1m1m1m0m1m0m0m0l9m0l9m0
888A7902l9l9l8l9l9l8l8l8l8l8l8l7l8l7l7l7l7l6l7l6l6l6l6l6l6l5l6l5l5l5l5l5l5l4
886A6653l5l4l4l4l4l4l3l4l3l4l3l3l3l3l2l3l2l3l2l2l2l2l1l2l2l1l1l1l1l1l1l1l1l0
883A5551l1l0l0l0l0l0l0k9l0k9l0k9k9k9k9k9k9k8k9k8k9k8k8k8k8k8k8k7k8k7k8k7k7k7
881A4575k7k7k7k7k6k7k6k7k6k6k6k6k6k6k6k6k5k6k5k5k6k5k5k5k5k4k5k5k4k5k4k5k4k4
878A3706k4k4k4k4k4k3k4k3k4k3k4k3k3k3k3k3k3k3k2k3k3k2k2k3k2k2k2k2k2k2k2k2k2k1
875A2930k2k1k2k1k1k1k2k1k1k1k1k0k1k1k0k1k0k1k0k1k0k0k0k0k0k0k0k0j9k0k0j9k0j9
$$ y = [20961, 20910, 20859, 20808, 20757, 20706, 20656, 20606, 20556, 20506, 20457, 20407, 20358, 20309, 20261, 20212, 20164, 20116, 20068, 20020, 19973, 19925, 19878, 19831, 19784, 19738, 19691, 19645, 19599, 19553, 19508, 19462, 19417, 19372, 19327, 19283, 19238, 19194, 19149, 19105, 19062, 19018, 18975, 18931, 18888, 18845, 18802, 18760, 18717, 18675, 18633, 18591, 18549, 18508, 18466, 18425, 18384, 18343, 18302, 18261, 18221, 18180, 18140, 18100, 18060, 18021, 17981, 17942, 17902, 17863, 17824, 17786, 17747, 17708, 17670, 17632, 17594, 17556, 17518, 17480, 17443, 17405, 17368, 17331, 17294, 17257, 17221, 17184, 17148, 17112, 17076, 17040, 17004, 16968, 16933, 16897, 16862, 16827, 16792, 16757, 16722, 16687, 16653, 16618, 16584, 16550, 16516, 16482, 16448, 16415, 16381, 16348, 16314, 16281, 16248, 16215, 16182, 16150, 16117, 16085, 16052, 16020, 15988, 15956, 15924, 15893, 15861, 15829, 15798, 15767, 15736, 15705, 15674, 15643, 15612, 15581, 15551, 15520, 15490, 15460, 15430, 15400, 15370, 15340, 15311, 15281, 15252, 15222, 15193, 15164, 15135, 15106, 15077, 15048, 15020, 14991, 14963, 14934, 14906, 14878, 14850, 14822, 14794, 14766, 14739, 14711, 14684, 14656, 14629, 14602, 14575, 14548, 14521, 14494, 14467, 14441, 14414, 14388, 14361, 14335, 14309, 14283, 14257, 14231, 14205, 14179, 14153, 14128, 14102, 14077, 14052, 14026, 14001, 13976, 13951, 13926, 13902, 13877, 13852, 13828, 13803, 13779, 13754, 13730, 13706, 13682, 13658, 13634, 13610, 13586, 13563, 13539, 13516, 13492, 13469, 13445, 13422, 13399, 13376, 13353, 13330, 13307, 13284, 13262, 13239, 13216, 13194, 13172, 13149, 13127, 13105, 13083, 13061, 13039, 13017, 12995, 12973, 12951, 12930, 12908, 12887, 12865, 12844, 12823, 12802, 12780, 12759, 12738, 12717, 12696, 12676, 12655, 12634, 12614, 12593, 12573, 12552, 12532, 12511, 12491, 12471, 12451, 12431, 12411, 12391, 12371, 12351, 12332, 12312, 12292, 12273, 12253, 12234]
873A2234k0j9j9j9j9j9j9j9j9j9j9j9j8j9j8j9j8j9j8j8j9j8j8j8j8j8j8j8j7j8j8j7j8j7
870A1608j8j7j8j7j7j7j8j7j7j7j7j6j7j7j7j7j6j7j6j7j6j7j6j6j7j6j6j6j6j6j6j6j6j6
868A1042j5j6j6j5j6j6j5j6j5j5j6j5j5j5j6j5j5j5j5j5j5j4j5j5j5j4j5j5j4j5j4j5j4j4
865A0531j5j4j4j4j4j5j4j4j4j4j3j4j4j4j4j3j4j4j3j4j3j4j3j4j3j3j4j3j3j3j3j4j3j3
863A0066j3j3j3j2j3j3j3j3j2j3j3j2j3j2j3j2j3j2j3j2j2j3j2j2j2j2j2j2j2j2j2j2j2j2
860I644j2j2j2j1j2j2j1j2j2j1j2j1j2j1j1j2j1j1j2j1j1j1j2j1j1j1j1j1j1j1j1j1j1j0j1
857I248j1j1j0j1j1j0j1j1j0j1j0j1j0j1j0j0j1j0j0j0j1j0j0j0j0j0j0j0j1j0rj0j0j0j0
855H887j0j0rj0j0j0rj0j0rj0rj0rj0rj0rj0rrj0rrrj0rrrrrj0rrrrrrqrrrrrqrrrqrrqrr
$$ y = [12234, 12214, 12195, 12176, 12157, 12138, 12119, 12100, 12081, 12062, 12043, 12024, 12005, 11987, 11968, 11950, 11931, 11913, 11894, 11876, 11858, 11839, 11821, 11803, 11785, 11767, 11749, 11731, 11713, 11696, 11678, 11660, 11643, 11625, 11608, 11590, 11573, 11555, 11538, 11521, 11504, 11486, 11469, 11452, 11435, 11418, 11402, 11385, 11368, 11351, 11334, 11318, 11301, 11285, 11268, 11252, 11235, 11219, 11203, 11186, 11170, 11154, 11138, 11122, 11106, 11090, 11074, 11058, 11042, 11027, 11011, 10995, 10980, 10964, 10948, 10933, 10917, 10902, 10887, 10871, 10856, 10841, 10826, 10810, 10795, 10780, 10765, 10750, 10735, 10720, 10706, 10691, 10676, 10661, 10647, 10632, 10617, 10603, 10588, 10574, 10559, 10545, 10531, 10516, 10502, 10488, 10474, 10460, 10445, 10431, 10417, 10403, 10389, 10376, 10362, 10348, 10334, 10320, 10307, 10293, 10279, 10266, 10252, 10239, 10225, 10212, 10198, 10185, 10172, 10158, 10145, 10132, 10119, 10106, 10092, 10079, 10066, 10053, 10040, 10027, 10015, 10002, 9989, 9976, 9963, 9951, 9938, 9925, 9913, 9900, 9888, 9875, 9863, 9850, 9838, 9825, 9813, 9801, 9788, 9776, 9764, 9752, 9740, 9728, 9716, 9704, 9692, 9680, 9668, 9656, 9644, 9632, 9620, 9608, 9597, 9585, 9573, 9562, 9550, 9538, 9527, 9515, 9504, 9492, 9481, 9470, 9458, 9447, 9436, 9424, 9413, 9402, 9391, 9379, 9368, 9357, 9346, 9335, 9324, 9313, 9302, 9291, 9280, 9269, 9259, 9248, 9237, 9226, 9216, 9205, 9194, 9184, 9173, 9162, 9152, 9141, 9131, 9120, 9110, 9099, 9089, 9079, 9068, 9058, 9048, 9038, 9027, 9017, 9007, 8997, 8987, 8977, 8967, 8957, 8946, 8936, 8927, 8917, 8907, 8897, 8887, 8877, 8867, 8858, 8848, 8838, 8828, 8819, 8809, 8799, 8790, 8780, 8771, 8761, 8752, 8742, 8733, 8723, 8714, 8704, 8695, 8686, 8676, 8667, 8658, 8649, 8639, 8630, 8621, 8612, 8603, 8594, 8584, 8575, 8566, 8557, 8548, 8539, 8530, 8522, 8513, 8504, 8495, 8486, 8477, 8469, 8460, 8451, 8442, 8434, 8425, 8416, 8408, 8399, 8390]
850H390qrqrqrqqrqrqqrqqqrqqqqqqqqqrpqqqqqqqqqpqqqpqqpqqpqpqpqpqpqpqppqppqppp
845G847qpppppqpppppppppppppopppppopppoppoppoppopopopopopoopoopoopoopoooopooo
840G387oooopooooooonoooooooonoooonooonoonoononoononononononnononnonnonnnonnn
835F997onnnnnonnnnnnnnnnnnnnnnnnnnnnmnnnnnmnnnnmnnmnnnmnnmnmnnmnmnmnnmnmnmmn
829F664mnmnmmnmnmmnmmnmmmnmmmnmmmmnmmmmmmnmmmmmmmmmmmmmmmmmmmmmmmmlmmmmmmlmm
824F380mmlmmmlmmmlmmlmmlmmlmmlmlmmlmlmlmlmlmlmlmlmlmlmllmlmllmllmllmllmlllml
819F137llmlllmlllllmllllllmlllllllllllllllllllllllllllllllklllllllklllllklll
814E929kllllkllklllkllkllkllkllklkllklkllklklklkllklklklkklklklklklkklklkklk
$$ y = [8390, 8382, 8373, 8365, 8356, 8348, 8339, 8331, 8323, 8314, 8306, 8297, 8289, 8281, 8272, 8264, 8256, 8248, 8239, 8231, 8223, 8215, 8207, 8199, 8191, 8183, 8175, 8167, 8158, 8151, 8143, 8135, 8127, 8119, 8111, 8103, 8095, 8087, 8079, 8072, 8064, 8056, 8048, 8041, 8033, 8025, 8018, 8010, 8002, 7995, 7987, 7980, 7972, 7965, 7957, 7950, 7942, 7935, 7927, 7920, 7912, 7905, 7898, 7890, 7883, 7876, 7868, 7861, 7854, 7847, 7839, 7832, 7825, 7818, 7811, 7804, 7796, 7789, 7782, 7775, 7768, 7761, 7754, 7747, 7740, 7733, 7726, 7719, 7712, 7705, 7699, 7692, 7685, 7678, 7671, 7664, 7658, 7651, 7644, 7637, 7631, 7624, 7617, 7611, 7604, 7597, 7591, 7584, 7577, 7571, 7564, 7558, 7551, 7545, 7538, 7532, 7525, 7519, 7512, 7506, 7500, 7493, 7487, 7481, 7474, 7468, 7462, 7455, 7449, 7443, 7436, 7430, 7424, 7418, 7412, 7405, 7399, 7393, 7387, 7381, 7375, 7369, 7363, 7356, 7350, 7344, 7338, 7332, 7326, 7320, 7314, 7309, 7303, 7297, 7291, 7285, 7279, 7273, 7267, 7261, 7256, 7250, 7244, 7238, 7232, 7227, 7221, 7215, 7209, 7204, 7198, 7192, 7187, 7181, 7175, 7170, 7164, 7159, 7153, 7147, 7142, 7136, 7131, 7125, 7120, 7114, 7109, 7103, 7098, 7092, 7087, 7082, 7076, 7071, 7065, 7060, 7055, 7049, 7044, 7039, 7033, 7028, 7023, 7018, 7012, 7007, 7002, 6997, 6991, 6986, 6981, 6976, 6971, 6966, 6960, 6955, 6950, 6945, 6940, 6935, 6930, 6925, 6920, 6915, 6910, 6905, 6900, 6895, 6890, 6885, 6880, 6875, 6870, 6865, 6860, 6855, 6850, 6846, 6841, 6836, 6831, 6826, 6821, 6817, 6812, 6807, 6802, 6797, 6793, 6788, 6783, 6779, 6774, 6769, 6764, 6760, 6755, 6750, 6746, 6741, 6737, 6732, 6727, 6723, 6718, 6714, 6709, 6705, 6700, 6695, 6691, 6686, 6682, 6677, 6673, 6669, 6664, 6660, 6655, 6651, 6646, 6642, 6638, 6633, 6629, 6624, 6620, 6616, 6611, 6607, 6603, 6598, 6594, 6590, 6586, 6581, 6577, 6573, 6569, 6564, 6560, 6556, 6552, 6548, 6543, 6539, 6535, 6531, 6527, 6523, 6519, 6514, 6510, 6506, 6502, 6498, 6494, 6490, 6486, 6482, 6478, 6474, 6470, 6466, 6462, 6458, 6454, 6450, 6446, 6442, 6438, 6434, 6430, 6426, 6422, 6418, 6415, 6411, 6407, 6403, 6399, 6395, 6391, 6388, 6384, 6380, 6376, 6372, 6369, 6365, 6361, 6357, 6354, 6350, 6346, 6342, 6339, 6335, 6331, 6328, 6324, 6320, 6317, 6313, 6309, 6306, 6302, 6298, 6295, 6291, 6288, 6284, 6280, 6277, 6273, 6270, 6266, 6263, 6259, 6256, 6252, 6249, 6245, 6242, 6238, 6235, 6231, 6228, 6224, 6221, 6217, 6214, 6210, 6207, 6204, 6200, 6197, 6193, 6190, 6187, 6183, 6180, 6177, 6173, 6170, 6167, 6163, 6160, 6157, 6153, 6150, 6147, 6144, 6140, 6137, 6134, 6131, 6127, 6124, 6121, 6118, 6114, 6111, 6108, 6105, 6102, 6099, 6095, 6092, 6089, 6086, 6083, 6080, 6077, 6073, 6070, 6067, 6064, 6061, 6058, 6055, 6052, 6049, 6046, 6043, 6040, 6037, 6034, 6031, 6028, 6025, 6022, 6019, 6016, 6013, 6010, 6007, 6004, 6001, 5998, 5995, 5992, 5989, 5986, 5983, 5980, 5978, 5975, 5972, 5969, 5966, 5963, 5960, 5957, 5955, 5952, 5949, 5946, 5943, 5940, 5938, 5935, 5932, 5929, 5927, 5924, 5921, 5918, 5915, 5913, 5910, 5907, 5905, 5902, 5899, 5896, 5894, 5891, 5888, 5886, 5883, 5880, 5878, 5875, 5872, 5870, 5867, 5864, 5862, 5859, 5857, 5854, 5851, 5849, 5846, 5844, 5841, 5838, 5836, 5833, 5831, 5828, 5826, 5823, 5821, 5818, 5815, 5813, 5810, 5808, 5805, 5803, 5800, 5798, 5796, 5793, 5791, 5788, 5786, 5783, 5781, 5778, 5776, 5773, 5771, 5769, 5766, 5764, 5761, 5759, 5757, 5754, 5752]
808E752klklkklkklkkklkklkkklkkklkkklkkkklkkkkklkkkkklkkkkkkkkklkkkkkkkkkkkkk
803E601kkkkkkkkkkkkkkkkkkkjkkkkkkkkkjkkkkkkjkkkkkjkkkkjkkkkjkkkjkkkjkkkjkkjk
798E473kkjkkjkkjkkjkkjkjkkjkkjkjkkjkjkjkkjkjkjkjkjkkjkjkjkjkjjkjkjkjkjkjkjjk
793E365jkjjkjkjjkjkjjkjjkjkjjkjjkjjkjjjkjjkjjkjjjkjjjkjjjkjjjkjjjjkjjjjkjjjj
787E276kjjjjjkjjjjjjkjjjjjjjjkjjjjjjjjjjjkjjjjjjjjjjjjjjjjjjjjjjjjjjjjjjjjjj
782E202jjjjj%jjjjjjjjjjjj%jjjjjjjj%jjjjjj%jjjjj%jjjjj%jjjj%jjjj%jjjj%jjj%jjj
777E143%jjj%jjj%jjj%jj%jjj%jj%jj%jj%jj%jj%jj%jj%jj%jj%j%jj%j%jj%jj%j%j%jj%j%
771E098jj%j%j%j%jj%j%j%j%j%j%j%j%j%j%j%j%j%j%j%j%j%j%j%%j%j%j%j%%j%j%j%%j%j%
$$ y = [5752, 5750, 5747, 5745, 5742, 5740, 5738, 5735, 5733, 5731, 5728, 5726, 5724, 5722, 5719, 5717, 5715, 5712, 5710, 5708, 5706, 5703, 5701, 5699, 5697, 5694, 5692, 5690, 5688, 5685, 5683, 5681, 5679, 5677, 5674, 5672, 5670, 5668, 5666, 5664, 5661, 5659, 5657, 5655, 5653, 5651, 5648, 5646, 5644, 5642, 5640, 5638, 5636, 5634, 5632, 5630, 5627, 5625, 5623, 5621, 5619, 5617, 5615, 5613, 5611, 5609, 5607, 5605, 5603, 5601, 5599, 5597, 5595, 5593, 5591, 5589, 5587, 5585, 5583, 5581, 5579, 5577, 5575, 5573, 5571, 5569, 5567, 5565, 5563, 5562, 5560, 5558, 5556, 5554, 5552, 5550, 5548, 5546, 5544, 5543, 5541, 5539, 5537, 5535, 5533, 5531, 5530, 5528, 5526, 5524, 5522, 5520, 5519, 5517, 5515, 5513, 5511, 5510, 5508, 5506, 5504, 5502, 5501, 5499, 5497, 5495, 5494, 5492, 5490, 5488, 5487, 5485, 5483, 5481, 5480, 5478, 5476, 5475, 5473, 5471, 5469, 5468, 5466, 5464, 5463, 5461, 5459, 5458, 5456, 5454, 5453, 5451, 5449, 5448, 5446, 5445, 5443, 5441, 5440, 5438, 5436, 5435, 5433, 5432, 5430, 5428, 5427, 5425, 5424, 5422, 5421, 5419, 5417, 5416, 5414, 5413, 5411, 5410, 5408, 5407, 5405, 5404, 5402, 5400, 5399, 5397, 5396, 5394, 5393, 5391, 5390, 5388, 5387, 5386, 5384, 5383, 5381, 5380, 5378, 5377, 5375, 5374, 5372, 5371, 5369, 5368, 5367, 5365, 5364, 5362, 5361, 5360, 5358, 5357, 5355, 5354, 5353, 5351, 5350, 5348, 5347, 5346, 5344, 5343, 5342, 5340, 5339, 5337, 5336, 5335, 5333, 5332, 5331, 5329, 5328, 5327, 5325, 5324, 5323, 5322, 5320, 5319, 5318, 5316, 5315, 5314, 5312, 5311, 5310, 5309, 5307, 5306, 5305, 5304, 5302, 5301, 5300, 5299, 5297, 5296, 5295, 5294, 5292, 5291, 5290, 5289, 5288, 5286, 5285, 5284, 5283, 5282, 5280, 5279, 5278, 5277, 5276, 5274, 5273, 5272, 5271, 5270, 5269, 5267, 5266, 5265, 5264, 5263, 5262, 5261, 5259, 5258, 5257, 5256, 5255, 5254, 5253, 5252, 5251, 5249, 5248, 5247, 5246, 5245, 5244, 5243, 5242, 5241, 5240, 5239, 5238, 5236, 5235, 5234, 5233, 5232, 5231, 5230, 5229, 5228, 5227, 5226, 5225, 5224, 5223, 5222, 5221, 5220, 5219, 5218, 5217, 5216, 5215, 5214, 5213, 5212, 5211, 5210, 5209, 5208, 5207, 5206, 5205, 5204, 5203, 5202, 5201, 5200, 5199, 5198, 5197, 5197, 5196, 5195, 5194, 5193, 5192, 5191, 5190, 5189, 5188, 5187, 5186, 5185, 5185, 5184, 5183, 5182, 5181, 5180, 5179, 5178, 5177, 5177, 5176, 5175, 5174, 5173, 5172, 5171, 5171, 5170, 5169, 5168, 5167, 5166, 5166, 5165, 5164, 5163, 5162, 5161, 5161, 5160, 5159, 5158, 5157, 5157, 5156, 5155, 5154, 5153, 5153, 5152, 5151, 5150, 5149, 5149, 5148, 5147, 5146, 5146, 5145, 5144, 5143, 5143, 5142, 5141, 5140, 5140, 5139, 5138, 5137, 5137, 5136, 5135, 5134, 5134, 5133, 5132, 5132, 5131, 5130, 5129, 5129, 5128, 5127, 5127, 5126, 5125, 5125, 5124, 5123, 5123, 5122, 5121, 5121, 5120, 5119, 5119, 5118, 5117, 5117, 5116, 5115, 5115, 5114, 5113, 5113, 5112, 5111, 5111, 5110, 5110, 5109, 5108, 5108, 5107, 5107, 5106, 5105, 5105, 5104, 5103, 5103, 5102, 5102, 5101, 5101, 5100, 5099, 5099, 5098, 5098, 5097, 5096, 5096, 5095, 5095, 5094, 5094, 5093, 5093, 5092, 5091, 5091, 5090, 5090, 5089, 5089, 5088, 5088, 5087, 5087, 5086, 5086, 5085, 5085, 5084, 5084, 5083, 5083, 5082, 5082, 5081, 5081, 5080, 5080, 5079, 5079, 5078, 5078, 5077, 5077, 5076, 5076, 5075, 5075, 5074, 5074, 5073, 5073, 5073, 5072, 5072, 5071, 5071, 5070, 5070, 5069, 5069, 5069, 5068, 5068, 5067, 5067, 5066, 5066, 5066, 5065, 5065, 5064, 5064]
766E064%j%j%%j%j%%j%%j%j%%j%%j%%j%%j%%j%%j%%j%%j%%j%%%j%%j%%%j%%j%%%j%%%j%%%
761E042j%%%j%%%j%%%j%%%%j%%%%j%%%%j%%%%j%%%%%j%%%%%j%%%%%%j%%%%%%j%%%%%%%j%%
756E029%%%%%%%j%%%%%%%%%%%%j%%%%%%%%%%%%%%%%%%%%%%%%j%%%%%%%%%%%%%%%%%J%%%%%
750E027%%%%%%%%%%%%%%%%%%J%%%%%%%%%%%%%J%%%%%%%%%J%%%%%%%%J%%%%%%J%%%%%%J%%%
745E033%%%J%%%%%J%%%%J%%%%%J%%%%J%%%%J%%%J%%%%J%%%J%%%%J%%%J%%%J%%%J%%J%%%J%
740E048%%J%%J%%%J%%J%%J%%%J%%J%%J%%J%%J%%J%%J%%J%%J%%J%%J%J%%J%%J%%J%J%%J%J%
735E071%J%%J%J%J%%J%J%%J%J%%J%J%J%J%%J%J%J%%J%J%J%J%J%J%%J%J%J%J%J%J%J%J%J%J
729E102%J%J%J%J%J%J%J%J%JJ%J%J%J%J%JJ%J%J%J%JJ%J%J%J%JJ%J%JJ%J%J%JJ%J%JJ%J%J
$$ y = [5064, 5064, 5063, 5063, 5062, 5062, 5062, 5061, 5061, 5060, 5060, 5060, 5059, 5059, 5059, 5058, 5058, 5057, 5057, 5057, 5056, 5056, 5056, 5055, 5055, 5055, 5054, 5054, 5054, 5053, 5053, 5053, 5052, 5052, 5052, 5051, 5051, 5051, 5050, 5050, 5050, 5049, 5049, 5049, 5048, 5048, 5048, 5048, 5047, 5047, 5047, 5046, 5046, 5046, 5046, 5045, 5045, 5045, 5044, 5044, 5044, 5044, 5043, 5043, 5043, 5043, 5042, 5042, 5042, 5042, 5041, 5041, 5041, 5041, 5040, 5040, 5040, 5040, 5039, 5039, 5039, 5039, 5038, 5038, 5038, 5038, 5038, 5037, 5037, 5037, 5037, 5037, 5036, 5036, 5036, 5036, 5036, 5035, 5035, 5035, 5035, 5035, 5034, 5034, 5034, 5034, 5034, 5034, 5033, 5033, 5033, 5033, 5033, 5033, 5032, 5032, 5032, 5032, 5032, 5032, 5032, 5031, 5031, 5031, 5031, 5031, 5031, 5031, 5030, 5030, 5030, 5030, 5030, 5030, 5030, 5030, 5029, 5029, 5029, 5029, 5029, 5029, 5029, 5029, 5029, 5029, 5028, 5028, 5028, 5028, 5028, 5028, 5028, 5028, 5028, 5028, 5028, 5028, 5028, 5027, 5027, 5027, 5027, 5027, 5027, 5027, 5027, 5027, 5027, 5027, 5027, 5027, 5027, 5027, 5027, 5027, 5027, 5027, 5027, 5027, 5027, 5027, 5027, 5027, 5026, 5026, 5026, 5026, 5026, 5026, 5026, 5026, 5026, 5026, 5026, 5026, 5026, 5026, 5026, 5026, 5026, 5026, 5027, 5027, 5027, 5027, 5027, 5027, 5027, 5027, 5027, 5027, 5027, 5027, 5027, 5027, 5027, 5027, 5027, 5027, 5027, 5027, 5027, 5027, 5027, 5027, 5028, 5028, 5028, 5028, 5028, 5028, 5028, 5028, 5028, 5028, 5028, 5028, 5028, 5028, 5029, 5029, 5029, 5029, 5029, 5029, 5029, 5029, 5029, 5029, 5030, 5030, 5030, 5030, 5030, 5030, 5030, 5030, 5030, 5031, 5031, 5031, 5031, 5031, 5031, 5031, 5032, 5032, 5032, 5032, 5032, 5032, 5032, 5033, 5033, 5033, 5033, 5033, 5033, 5033, 5034, 5034, 5034, 5034, 5034, 5034, 5035, 5035, 5035, 5035, 5035, 5036, 5036, 5036, 5036, 5036, 5036, 5037, 5037, 5037, 5037, 5037, 5038, 5038, 5038, 5038, 5038, 5039, 5039, 5039, 5039, 5040, 5040, 5040, 5040, 5040, 5041, 5041, 5041, 5041, 5042, 5042, 5042, 5042, 5042, 5043, 5043, 5043, 5043, 5044, 5044, 5044, 5044, 5045, 5045, 5045, 5045, 5046, 5046, 5046, 5047, 5047, 5047, 5047, 5048, 5048, 5048, 5048, 5049, 5049, 5049, 5050, 5050, 5050, 5050, 5051, 5051, 5051, 5052, 5052, 5052, 5053, 5053, 5053, 5053, 5054, 5054, 5054, 5055, 5055, 5055, 5056, 5056, 5056, 5057, 5057, 5057, 5058, 5058, 5058, 5059, 5059, 5059, 5060, 5060, 5060, 5061, 5061, 5061, 5062, 5062, 5062, 5063, 5063, 5063, 5064, 5064, 5065, 5065, 5065, 5066, 5066, 5066, 5067, 5067, 5067, 5068, 5068, 5069, 5069, 5069, 5070, 5070, 5071, 5071, 5071, 5072, 5072, 5072, 5073, 5073, 5074, 5074, 5075, 5075, 5075, 5076, 5076, 5077, 5077, 5077, 5078, 5078, 5079, 5079, 5079, 5080, 5080, 5081, 5081, 5082, 5082, 5083, 5083, 5083, 5084, 5084, 5085, 5085, 5086, 5086, 5086, 5087, 5087, 5088, 5088, 5089, 5089, 5090, 5090, 5091, 5091, 5092, 5092, 5092, 5093, 5093, 5094, 5094, 5095, 5095, 5096, 5096, 5097, 5097, 5098, 5098, 5099, 5099, 5100, 5100, 5101, 5101, 5102, 5102, 5103, 5103, 5104, 5104, 5105, 5105, 5106, 5106, 5107, 5107, 5108, 5108, 5109, 5109, 5110, 5110, 5111, 5112, 5112, 5113, 5113, 5114, 5114, 5115, 5115, 5116, 5116, 5117, 5118, 5118, 5119, 5119, 5120, 5120, 5121, 5121, 5122, 5123, 5123, 5124, 5124, 5125, 5125, 5126, 5126, 5127, 5128, 5128, 5129, 5129, 5130, 5131, 5131, 5132, 5132, 5133, 5133, 5134, 5135, 5135, 5136, 5136, 5137, 5138, 5138, 5139, 5139, 5140]
724E140J%JJ%J%JJ%JJ%J%JJ%JJ%JJ%J%JJ%JJ%JJ%JJ%JJ%JJ%JJ%JJ%JJJ%JJ%JJ%JJJ%JJ%JJ
719E186%JJJ%JJJ%JJ%JJJ%JJJ%JJJ%JJJ%JJJ%JJJ%JJJJ%JJJ%JJJJ%JJJJ%JJJJ%JJJJ%JJJJ
713E239%JJJJJ%JJJJJ%JJJJJ%JJJJJJ%JJJJJJ%JJJJJJJ%JJJJJJJ%JJJJJJJJJ%JJJJJJJJJJ
708E299%JJJJJJJJJJJJJJ%JJJJJJJJJJJJJJJJJJJJJJJ%JJJJJJJJJJJJJJJJJJJJJJJJJJJJJ
703E365JKJJJJJJJJJJJJJJJJJJJJJJJKJJJJJJJJJJJJJJKJJJJJJJJJJKJJJJJJJJJKJJJJJJJ
698E439KJJJJJJJKJJJJJJKJJJJJJKJJJJJKJJJJJKJJJJJKJJJJKJJJJKJJJJKJJJJKJJJJKJJJ
692E520KJJJJKJJJKJJJKJJJKJJJKJJJKJJJKJJJKJJKJJJKJJKJJJKJJKJJKJJJKJJKJJKJJKJJ
687E608KJJKJJKJJKJJKJJKJJKJJKJKJJKJJKJJKJKJJKJKJJKJJKJKJJKJKJJKJKJKJJKJKJJKJ
$$ y = [5140, 5141, 5141, 5142, 5143, 5143, 5144, 5144, 5145, 5146, 5146, 5147, 5148, 5148, 5149, 5149, 5150, 5151, 5151, 5152, 5153, 5153, 5154, 5155, 5155, 5156, 5156, 5157, 5158, 5158, 5159, 5160, 5160, 5161, 5162, 5162, 5163, 5164, 5164, 5165, 5166, 5166, 5167, 5168, 5168, 5169, 5170, 5170, 5171, 5172, 5172, 5173, 5174, 5175, 5175, 5176, 5177, 5177, 5178, 5179, 5179, 5180, 5181, 5182, 5182, 5183, 5184, 5184, 5185, 5186, 5186, 5187, 5188, 5189, 5189, 5190, 5191, 5192, 5192, 5193, 5194, 5194, 5195, 5196, 5197, 5197, 5198, 5199, 5200, 5200, 5201, 5202, 5203, 5203, 5204, 5205, 5206, 5206, 5207, 5208, 5209, 5209, 5210, 5211, 5212, 5212, 5213, 5214, 5215, 5216, 5216, 5217, 5218, 5219, 5219, 5220, 5221, 5222, 5223, 5223, 5224, 5225, 5226, 5227, 5227, 5228, 5229, 5230, 5231, 5231, 5232, 5233, 5234, 5235, 5235, 5236, 5237, 5238, 5239, 5239, 5240, 5241, 5242, 5243, 5244, 5244, 5245, 5246, 5247, 5248, 5249, 5249, 5250, 5251, 5252, 5253, 5254, 5254, 5255, 5256, 5257, 5258, 5259, 5260, 5260, 5261, 5262, 5263, 5264, 5265, 5266, 5266, 5267, 5268, 5269, 5270, 5271, 5272, 5273, 5273, 5274, 5275, 5276, 5277, 5278, 5279, 5280, 5280, 5281, 5282, 5283, 5284, 5285, 5286, 5287, 5288, 5289, 5289, 5290, 5291, 5292, 5293, 5294, 5295, 5296, 5297, 5298, 5299, 5299, 5300, 5301, 5302, 5303, 5304, 5305, 5306, 5307, 5308, 5309, 5310, 5311, 5312, 5313, 5313, 5314, 5315, 5316, 5317, 5318, 5319, 5320, 5321, 5322, 5323, 5324, 5325, 5326, 5327, 5328, 5329, 5330, 5331, 5332, 5333, 5334, 5335, 5336, 5336, 5337, 5338, 5339, 5340, 5341, 5342, 5343, 5344, 5345, 5346, 5347, 5348, 5349, 5350, 5351, 5352, 5353, 5354, 5355, 5356, 5357, 5358, 5359, 5360, 5361, 5362, 5363, 5364, 5365, 5366, 5368, 5369, 5370, 5371, 5372, 5373, 5374, 5375, 5376, 5377, 5378, 5379, 5380, 5381, 5382, 5383, 5384, 5385, 5386, 5387, 5388, 5389, 5390, 5391, 5393, 5394, 5395, 5396, 5397, 5398, 5399, 5400, 5401, 5402, 5403, 5404, 5405, 5406, 5407, 5409, 5410, 5411, 5412, 5413, 5414, 5415, 5416, 5417, 5418, 5419, 5421, 5422, 5423, 5424, 5425, 5426, 5427, 5428, 5429, 5430, 5432, 5433, 5434, 5435, 5436, 5437, 5438, 5439, 5441, 5442, 5443, 5444, 5445, 5446, 5447, 5448, 5450, 5451, 5452, 5453, 5454, 5455, 5456, 5458, 5459, 5460, 5461, 5462, 5463, 5464, 5466, 5467, 5468, 5469, 5470, 5471, 5473, 5474, 5475, 5476, 5477, 5478, 5480, 5481, 5482, 5483, 5484, 5485, 5487, 5488, 5489, 5490, 5491, 5493, 5494, 5495, 5496, 5497, 5499, 5500, 5501, 5502, 5503, 5505, 5506, 5507, 5508, 5509, 5511, 5512, 5513, 5514, 5515, 5517, 5518, 5519, 5520, 5522, 5523, 5524, 5525, 5526, 5528, 5529, 5530, 5531, 5533, 5534, 5535, 5536, 5538, 5539, 5540, 5541, 5543, 5544, 5545, 5546, 5548, 5549, 5550, 5551, 5553, 5554, 5555, 5556, 5558, 5559, 5560, 5561, 5563, 5564, 5565, 5567, 5568, 5569, 5570, 5572, 5573, 5574, 5576, 5577, 5578, 5579, 5581, 5582, 5583, 5585, 5586, 5587, 5589, 5590, 5591, 5592, 5594, 5595, 5596, 5598, 5599, 5600, 5602, 5603, 5604, 5606, 5607, 5608, 5610, 5611, 5612, 5614, 5615, 5616, 5618, 5619, 5620, 5622, 5623, 5624, 5626, 5627, 5628, 5630, 5631, 5632, 5634, 5635, 5636, 5638, 5639, 5641, 5642, 5643, 5645, 5646, 5647, 5649, 5650, 5651, 5653, 5654, 5656, 5657, 5658, 5660, 5661, 5663, 5664, 5665, 5667, 5668, 5669, 5671, 5672, 5674, 5675, 5676, 5678, 5679, 5681, 5682, 5683, 5685, 5686, 5688, 5689, 5691, 5692, 5693, 5695, 5696, 5698, 5699, 5700, 5702, 5703]
682E703KJKJKJJKJKJKJKJJKJKJKJKJKJKJJKJKJKJKJKJKJKJKJKJKJKJKJKJKJKJKJKKJKJKJK
677E806JKJKJKKJKJKJKJKKJKJKJKKJKJKJKKJKJKJKKJKJKKJKJKKJKKJKJKKJKKJKJKKJKKJKK
671E916JKJKKJKKJKKJKKJKKJKKJKKKJKKJKKJKKJKKKJKKJKKKJKKJKKKJKKKJKKJKKKJKKKJKK
666F033KKJKKKJKKKJKKKKJKKKJKKKKJKKKKJKKKKKJKKKKJKKKKKJKKKKKKJKKKKKKJKKKKKKJK
661F158KKKKKKJKKKKKKKKKJKKKKKKKKKKJKKKKKKKKKKKKKKJKKKKKKKKKKKKKKKKKKKKKKKKKK
656F292KKKKKKKKKKKKKKKKKKKKKKKKKKKKKKKKLKKKKKKKKKKKKKKLKKKKKKKKKKLKKKKKKKKLK
650F434KKKKKKLKKKKKKKLKKKKKLKKKKKLKKKKKLKKKKLKKKKKLKKKLKKKKLKKKKLKKKLKKKLKKK
645F584LKKKLKKKLKKKLKKLKKKLKKLKKKLKKLKKLKKLKKLKKLKKLKKLKKLKKLKKLKKLKLKKLKKLK
$$ y = [5703, 5705, 5706, 5708, 5709, 5711, 5712, 5713, 5715, 5716, 5718, 5719, 5721, 5722, 5724, 5725, 5726, 5728, 5729, 5731, 5732, 5734, 5735, 5737, 5738, 5740, 5741, 5743, 5744, 5745, 5747, 5748, 5750, 5751, 5753, 5754, 5756, 5757, 5759, 5760, 5762, 5763, 5765, 5766, 5768, 5769, 5771, 5772, 5774, 5775, 5777, 5778, 5780, 5781, 5783, 5784, 5786, 5787, 5789, 5790, 5792, 5793, 5795, 5797, 5798, 5800, 5801, 5803, 5804, 5806, 5807, 5809, 5810, 5812, 5813, 5815, 5817, 5818, 5820, 5821, 5823, 5824, 5826, 5827, 5829, 5831, 5832, 5834, 5835, 5837, 5838, 5840, 5842, 5843, 5845, 5846, 5848, 5849, 5851, 5853, 5854, 5856, 5857, 5859, 5860, 5862, 5864, 5865, 5867, 5868, 5870, 5872, 5873, 5875, 5876, 5878, 5880, 5881, 5883, 5885, 5886, 5888, 5889, 5891, 5893, 5894, 5896, 5898, 5899, 5901, 5902, 5904, 5906, 5907, 5909, 5911, 5912, 5914, 5916, 5917, 5919, 5920, 5922, 5924, 5925, 5927, 5929, 5930, 5932, 5934, 5935, 5937, 5939, 5940, 5942, 5944, 5945, 5947, 5949, 5950, 5952, 5954, 5956, 5957, 5959, 5961, 5962, 5964, 5966, 5967, 5969, 5971, 5972, 5974, 5976, 5978, 5979, 5981, 5983, 5984, 5986, 5988, 5990, 5991, 5993, 5995, 5996, 5998, 6000, 6002, 6003, 6005, 6007, 6009, 6010, 6012, 6014, 6015, 6017, 6019, 6021, 6022, 6024, 6026, 6028, 6029, 6031, 6033, 6035, 6037, 6038, 6040, 6042, 6044, 6045, 6047, 6049, 6051, 6052, 6054, 6056, 6058, 6060, 6061, 6063, 6065, 6067, 6068, 6070, 6072, 6074, 6076, 6077, 6079, 6081, 6083, 6085, 6086, 6088, 6090, 6092, 6094, 6096, 6097, 6099, 6101, 6103, 6105, 6106, 6108, 6110, 6112, 6114, 6116, 6117, 6119, 6121, 6123, 6125, 6127, 6129, 6130, 6132, 6134, 6136, 6138, 6140, 6142, 6143, 6145, 6147, 6149, 6151, 6153, 6155, 6156, 6158, 6160, 6162, 6164, 6166, 6168, 6170, 6171, 6173, 6175, 6177, 6179, 6181, 6183, 6185, 6187, 6189, 6190, 6192, 6194, 6196, 6198, 6200, 6202, 6204, 6206, 6208, 6210, 6211, 6213, 6215, 6217, 6219, 6221, 6223, 6225, 6227, 6229, 6231, 6233, 6235, 6237, 6239, 6240, 6242, 6244, 6246, 6248, 6250, 6252, 6254, 6256, 6258, 6260, 6262, 6264, 6266, 6268, 6270, 6272, 6274, 6276, 6278, 6280, 6282, 6284, 6286, 6288, 6290, 6292, 6294, 6296, 6298, 6300, 6302, 6304, 6306, 6308, 6310, 6312, 6314, 6316, 6318, 6320, 6322, 6324, 6326, 6328, 6330, 6332, 6334, 6336, 6338, 6340, 6342, 6344, 6346, 6348, 6350, 6352, 6354, 6356, 6359, 6361, 6363, 6365, 6367, 6369, 6371, 6373, 6375, 6377, 6379, 6381, 6383, 6385, 6387, 6390, 6392, 6394, 6396, 6398, 6400, 6402, 6404, 6406, 6408, 6410, 6413, 6415, 6417, 6419, 6421, 6423, 6425, 6427, 6429, 6432, 6434, 6436, 6438, 6440, 6442, 6444, 6446, 6449, 6451, 6453, 6455, 6457, 6459, 6461, 6463, 6466, 6468, 6470, 6472, 6474, 6476, 6479, 6481, 6483, 6485, 6487, 6489, 6492, 6494, 6496, 6498, 6500, 6502, 6505, 6507, 6509, 6511, 6513, 6516, 6518, 6520, 6522, 6524, 6526, 6529, 6531, 6533, 6535, 6538, 6540, 6542, 6544, 6546, 6549, 6551, 6553, 6555, 6557, 6560, 6562, 6564, 6566, 6569, 6571, 6573, 6575, 6578, 6580, 6582, 6584, 6587, 6589, 6591, 6593, 6596, 6598, 6600, 6602, 6605, 6607, 6609, 6611, 6614, 6616, 6618, 6621, 6623, 6625, 6627, 6630, 6632, 6634, 6637, 6639, 6641, 6643, 6646, 6648, 6650, 6653, 6655, 6657, 6660, 6662, 6664, 6667, 6669, 6671, 6674, 6676, 6678, 6681, 6683, 6685, 6688, 6690, 6692, 6695, 6697, 6699, 6702, 6704, 6706, 6709, 6711, 6713, 6716, 6718, 6720, 6723, 6725, 6728, 6730, 6732, 6735, 6737, 6739, 6742, 6744]
640F744LKKLKLKKLKLKKLKLKKLKLKLKKLKLKLKLKKLKLKLKLKLKLKLKLKLKKLKLKLKLLKLKLKLKL
634F914KLKLKLKLLKLKLKLKLLKLKLKLLKLKLKLLKLKLLKLLKLKLLKLKLLKLLKLLKLLKLLKLLKLLK
629G093LLKLLKLLKLLLKLLKLLLKLLKLLLKLLLKLLLKLLLKLLLLKLLLKLLLLKLLLLKLLLLLKLLLLK
624G283LLLLLLKLLLLLLKLLLLLLLKLLLLLLLLLKLLLLLLLLLLLLLLKLLLLLLLLLLLLLLLLLLLLLL
619G485LLLLLLLLLLLLLLLLLLLMLLLLLLLLLLLLLMLLLLLLLLLMLLLLLLLMLLLLLLMLLLLLMLLLL
613G698LMLLLLMLLLLMLLLMLLLLMLLLMLLLMLLLMLLMLLLMLLMLLLMLLMLLMLLMLLMLLMLLMLLML
608G924MLLMLLMLMLLMLMLLMLMLMLLMLMLMLMLMLLMLMLMLMLMLMLMLMLMLMLMLMLMMLMLMLMLMM
603H164LMLMLMMLMLMMLMLMMLMMLMLMMLMMLMMLMMLMMLMMLMMMLMMLMMMLMMLMMMLMMMMLMMMLM
$$ y = [6744, 6747, 6749, 6751, 6754, 6756, 6759, 6761, 6763, 6766, 6768, 6771, 6773, 6775, 6778, 6780, 6783, 6785, 6787, 6790, 6792, 6795, 6797, 6800, 6802, 6804, 6807, 6809, 6812, 6814, 6817, 6819, 6822, 6824, 6826, 6829, 6831, 6834, 6836, 6839, 6841, 6844, 6846, 6849, 6851, 6854, 6856, 6859, 6861, 6864, 6866, 6869, 6871, 6873, 6876, 6878, 6881, 6883, 6886, 6888, 6891, 6894, 6896, 6899, 6901, 6904, 6906, 6909, 6911, 6914, 6916, 6919, 6921, 6924, 6926, 6929, 6931, 6934, 6937, 6939, 6942, 6944, 6947, 6949, 6952, 6954, 6957, 6960, 6962, 6965, 6967, 6970, 6972, 6975, 6978, 6980, 6983, 6985, 6988, 6990, 6993, 6996, 6998, 7001, 7003, 7006, 7009, 7011, 7014, 7017, 7019, 7022, 7024, 7027, 7030, 7032, 7035, 7037, 7040, 7043, 7045, 7048, 7051, 7053, 7056, 7059, 7061, 7064, 7067, 7069, 7072, 7075, 7077, 7080, 7083, 7085, 7088, 7091, 7093, 7096, 7099, 7101, 7104, 7107, 7109, 7112, 7115, 7117, 7120, 7123, 7126, 7128, 7131, 7134, 7136, 7139, 7142, 7145, 7147, 7150, 7153, 7155, 7158, 7161, 7164, 7166, 7169, 7172, 7175, 7177, 7180, 7183, 7186, 7188, 7191, 7194, 7197, 7199, 7202, 7205, 7208, 7211, 7213, 7216, 7219, 7222, 7224, 7227, 7230, 7233, 7236, 7238, 7241, 7244, 7247, 7250, 7252, 7255, 7258, 7261, 7264, 7267, 7269, 7272, 7275, 7278, 7281, 7283, 7286, 7289, 7292, 7295, 7298, 7301, 7303, 7306, 7309, 7312, 7315, 7318, 7321, 7323, 7326, 7329, 7332, 7335, 7338, 7341, 7344, 7346, 7349, 7352, 7355, 7358, 7361, 7364, 7367, 7370, 7373, 7375, 7378, 7381, 7384, 7387, 7390, 7393, 7396, 7399, 7402, 7405, 7408, 7411, 7414, 7417, 7419, 7422, 7425, 7428, 7431, 7434, 7437, 7440, 7443, 7446, 7449, 7452, 7455, 7458, 7461, 7464, 7467, 7470, 7473, 7476, 7479, 7482, 7485, 7488, 7491, 7494, 7497, 7500, 7503, 7506, 7509, 7512, 7515, 7518, 7521, 7524, 7527, 7530, 7533, 7536, 7539, 7542, 7546, 7549, 7552, 7555, 7558, 7561, 7564, 7567, 7570, 7573, 7576, 7579, 7582, 7585, 7589, 7592, 7595, 7598, 7601, 7604, 7607, 7610, 7613, 7616, 7620, 7623, 7626, 7629, 7632, 7635, 7638, 7641, 7645, 7648, 7651, 7654, 7657, 7660, 7663, 7667, 7670, 7673, 7676, 7679, 7682, 7686, 7689, 7692, 7695, 7698, 7701, 7705, 7708, 7711, 7714, 7717, 7721, 7724, 7727, 7730, 7733, 7737, 7740, 7743, 7746, 7750, 7753, 7756, 7759, 7762, 7766, 7769, 7772, 7775, 7779, 7782, 7785, 7788, 7792, 7795, 7798, 7801, 7805, 7808, 7811, 7815, 7818, 7821, 7824, 7828, 7831, 7834, 7838, 7841, 7844, 7847, 7851, 7854, 7857, 7861, 7864, 7867, 7871, 7874, 7877, 7881, 7884, 7887, 7891, 7894, 7897, 7901, 7904, 7907, 7911, 7914, 7917, 7921, 7924, 7928, 7931, 7934, 7938, 7941, 7944, 7948, 7951, 7955, 7958, 7961, 7965, 7968, 7972, 7975, 7978, 7982, 7985, 7989, 7992, 7996, 7999, 8002, 8006, 8009, 8013, 8016, 8020, 8023, 8027, 8030, 8034, 8037, 8040, 8044, 8047, 8051, 8054, 8058, 8061, 8065, 8068, 8072, 8075, 8079, 8082, 8086, 8089, 8093, 8096, 8100, 8103, 8107, 8110, 8114, 8117, 8121, 8124, 8128, 8132, 8135, 8139, 8142, 8146, 8149, 8153, 8156, 8160, 8164, 8167, 8171, 8174, 8178, 8181, 8185, 8189, 8192, 8196, 8199, 8203, 8207, 8210, 8214, 8217, 8221, 8225, 8228, 8232, 8236, 8239, 8243, 8246, 8250, 8254, 8257, 8261, 8265, 8268, 8272, 8276, 8279, 8283, 8287, 8290, 8294, 8298, 8301, 8305, 8309, 8312, 8316, 8320, 8324, 8327, 8331, 8335, 8338, 8342, 8346, 8350, 8353, 8357, 8361, 8364, 8368, 8372, 8376, 8379, 8383, 8387, 8391, 8395, 8398, 8402, 8406, 8410, 8413, 8417]
598H417MMMLMMMMLMMMMLMMMMMLMMMMMMLMMMMMMMMLMMMMMMMMMMMLMMMMMMMMMMMMMMMMMMMMM
592H686MMMMMMMMMMMMMMNMMMMMMMMMMMNMMMMMMMMNMMMMMMNMMMMMNMMMMNMMMMNMMMNMMMNMM
587H971MNMMMNMMMNMMNMMNMMNMMNMMNMMNMMNMMNMNMMNMNMMNMNMNMMNMNMNMNMNMNMNMNMNMN
582I274MNMNMNMNMNMNNMNMNNMNMNMNNMNNMNMNNMNNMNNMNNMNNNMNNMNNNMNNNMNNNMNNNMNNN
577I595NMNNNNNMNNNNNMNNNNNNNMNNNNNNNNNNMNNNNNNNNNNNNNNNNNNNNNNNNNNNONNNNNNNN
571I936NNONNNNNNNONNNNNONNNNONNNNONNNONNNONNNONNONNNONNONNONNONONNONNONONNON
566A0299ONONONNONONONONONONONONOONONONOONONOONONOONOONOONOONOONOOONOOONOOONO
561A0680OONOOOONOOOOOONOOOOOONOOOOOOOOOOOOOOOONOOOOPOOOOOOOOOOOOOOOOPOOOOOOP
$$ y = [8417, 8421, 8425, 8429, 8432, 8436, 8440, 8444, 8448, 8451, 8455, 8459, 8463, 8467, 8470, 8474, 8478, 8482, 8486, 8490, 8493, 8497, 8501, 8505, 8509, 8513, 8517, 8520, 8524, 8528, 8532, 8536, 8540, 8544, 8548, 8552, 8555, 8559, 8563, 8567, 8571, 8575, 8579, 8583, 8587, 8591, 8595, 8599, 8602, 8606, 8610, 8614, 8618, 8622, 8626, 8630, 8634, 8638, 8642, 8646, 8650, 8654, 8658, 8662, 8666, 8670, 8674, 8678, 8682, 8686, 8690, 8694, 8698, 8702, 8706, 8710, 8714, 8718, 8722, 8726, 8730, 8734, 8738, 8742, 8747, 8751, 8755, 8759, 8763, 8767, 8771, 8775, 8779, 8783, 8787, 8791, 8796, 8800, 8804, 8808, 8812, 8816, 8820, 8824, 8828, 8833, 8837, 8841, 8845, 8849, 8853, 8857, 8862, 8866, 8870, 8874, 8878, 8882, 8887, 8891, 8895, 8899, 8903, 8908, 8912, 8916, 8920, 8924, 8929, 8933, 8937, 8941, 8946, 8950, 8954, 8958, 8963, 8967, 8971, 8975, 8980, 8984, 8988, 8992, 8997, 9001, 9005, 9009, 9014, 9018, 9022, 9027, 9031, 9035, 9040, 9044, 9048, 9053, 9057, 9061, 9066, 9070, 9074, 9079, 9083, 9087, 9092, 9096, 9100, 9105, 9109, 9113, 9118, 9122, 9127, 9131, 9135, 9140, 9144, 9149, 9153, 9157, 9162, 9166, 9171, 9175, 9180, 9184, 9188, 9193, 9197, 9202, 9206, 9211, 9215, 9220, 9224, 9229, 9233, 9238, 9242, 9247, 9251, 9256, 9260, 9265, 9269, 9274, 9278, 9283, 9287, 9292, 9296, 9301, 9305, 9310, 9314, 9319, 9323, 9328, 9333, 9337, 9342, 9346, 9351, 9356, 9360, 9365, 9369, 9374, 9378, 9383, 9388, 9392, 9397, 9402, 9406, 9411, 9415, 9420, 9425, 9429, 9434, 9439, 9443, 9448, 9453, 9457, 9462, 9467, 9471, 9476, 9481, 9486, 9490, 9495, 9500, 9504, 9509, 9514, 9519, 9523, 9528, 9533, 9538, 9542, 9547, 9552, 9557, 9561, 9566, 9571, 9576, 9580, 9585, 9590, 9595, 9600, 9604, 9609, 9614, 9619, 9624, 9629, 9633, 9638, 9643, 9648, 9653, 9658, 9662, 9667, 9672, 9677, 9682, 9687, 9692, 9697, 9701, 9706, 9711, 9716, 9721, 9726, 9731, 9736, 9741, 9746, 9751, 9755, 9760, 9765, 9770, 9775, 9780, 9785, 9790, 9795, 9800, 9805, 9810, 9815, 9820, 9825, 9830, 9835, 9840, 9845, 9850, 9855, 9860, 9865, 9870, 9875, 9880, 9885, 9890, 9896, 9901, 9906, 9911, 9916, 9921, 9926, 9931, 9936, 9941, 9946, 9952, 9957, 9962, 9967, 9972, 9977, 9982, 9987, 9993, 9998, 10003, 10008, 10013, 10018, 10024, 10029, 10034, 10039, 10044, 10050, 10055, 10060, 10065, 10070, 10076, 10081, 10086, 10091, 10097, 10102, 10107, 10112, 10118, 10123, 10128, 10133, 10139, 10144, 10149, 10155, 10160, 10165, 10170, 10176, 10181, 10186, 10192, 10197, 10202, 10208, 10213, 10218, 10224, 10229, 10235, 10240, 10245, 10251, 10256, 10261, 10267, 10272, 10278, 10283, 10288, 10294, 10299, 10305, 10310, 10316, 10321, 10327, 10332, 10337, 10343, 10348, 10354, 10359, 10365, 10370, 10376, 10381, 10387, 10392, 10398, 10403, 10409, 10414, 10420, 10425, 10431, 10437, 10442, 10448, 10453, 10459, 10464, 10470, 10476, 10481, 10487, 10492, 10498, 10504, 10509, 10515, 10520, 10526, 10532, 10537, 10543, 10549, 10554, 10560, 10566, 10571, 10577, 10583, 10588, 10594, 10600, 10605, 10611, 10617, 10623, 10628, 10634, 10640, 10646, 10651, 10657, 10663, 10669, 10674, 10680, 10686, 10692, 10697, 10703, 10709, 10715, 10721, 10726, 10732, 10738, 10744, 10750, 10756, 10762, 10767, 10773, 10779, 10785, 10791, 10797, 10803, 10808, 10814, 10820, 10826, 10832, 10838, 10844, 10850, 10856, 10862, 10868, 10874, 10880, 10886, 10892, 10898, 10904, 10909, 10915, 10921, 10927, 10933, 10940, 10946, 10952, 10958, 10964, 10970, 10976, 10982, 10988, 10994, 11000, 11006, 11012, 11018, 11024, 11030, 11036, 11043, 11049, 11055, 11061, 11067, 11073, 11079, 11086]
556A1086OOOOOPOOOOPOOOOPOOPOOOPOOOPOOPOOPOOPOPOOPOPOOPOPOPOOPOPOPOPOPOPOPPOP
550A1518OPOPPOPOPPOPPOPOPPOPPPOPPOPPPOPPPOPPPPOPPPPPOPPPPPPPOPPPPPPPPPPPPPPP
545A1979PPPPPPPPPPPPPQPPPPPPPQPPPPPQPPPQPPPPQPPQPPPQPPQPPQPQPPQPPQPQPQPQPPQP
540A2471QPQPQQPQPQPQPQQPQPQQPQQPQQPQQQPQQPQQQQPQQQQPQQQQQPQQQQQQQQQQQQPQQQQQ
535A2998RQQQQQQQQQQQQRQQQQQRQQQQRQQQRQQQRQQRQQRQQRQQRQRQQRQRQRQRQRQRQRQRQRRQ
530A3563RQRRQRRQRRQRRQRRRQRRRQRRRRRQRRRRRRRRQRRRRRRRRRRRRRRJ0RRRRRRRRJ0RRRRJ0
525A4151RRRJ0RRRJ0RRJ0RRJ0RRJ0RRJ0RJ0RJ0RRJ0RJ0RJ0RJ0J0RJ0RJ0RJ0J0RJ0J0RJ0J0
521A4595RJ0J0RJ0J0J0RJ0J0J0J0RJ0J0J0J0J0J0RJ0J0J0J0J0J0J0J0J0J0J0J0J0J0J0J0J0
$$ y = [11086, 11092, 11098, 11104, 11110, 11116, 11123, 11129, 11135, 11141, 11147, 11154, 11160, 11166, 11172, 11178, 11185, 11191, 11197, 11204, 11210, 11216, 11222, 11229, 11235, 11241, 11247, 11254, 11260, 11266, 11273, 11279, 11285, 11292, 11298, 11304, 11311, 11317, 11324, 11330, 11336, 11343, 11349, 11356, 11362, 11368, 11375, 11381, 11388, 11394, 11401, 11407, 11413, 11420, 11426, 11433, 11439, 11446, 11452, 11459, 11465, 11472, 11478, 11485, 11491, 11498, 11505, 11511, 11518, 11524, 11531, 11537, 11544, 11551, 11557, 11564, 11570, 11577, 11584, 11590, 11597, 11604, 11610, 11617, 11623, 11630, 11637, 11643, 11650, 11657, 11664, 11670, 11677, 11684, 11690, 11697, 11704, 11711, 11717, 11724, 11731, 11738, 11744, 11751, 11758, 11765, 11772, 11778, 11785, 11792, 11799, 11806, 11813, 11819, 11826, 11833, 11840, 11847, 11854, 11861, 11868, 11874, 11881, 11888, 11895, 11902, 11909, 11916, 11923, 11930, 11937, 11944, 11951, 11958, 11965, 11972, 11979, 11986, 11993, 12000, 12007, 12014, 12021, 12028, 12035, 12042, 12049, 12056, 12063, 12070, 12078, 12085, 12092, 12099, 12106, 12113, 12120, 12127, 12135, 12142, 12149, 12156, 12163, 12170, 12178, 12185, 12192, 12199, 12207, 12214, 12221, 12228, 12235, 12243, 12250, 12257, 12265, 12272, 12279, 12286, 12294, 12301, 12308, 12316, 12323, 12330, 12338, 12345, 12353, 12360, 12367, 12375, 12382, 12389, 12397, 12404, 12412, 12419, 12427, 12434, 12442, 12449, 12456, 12464, 12471, 12479, 12486, 12494, 12501, 12509, 12517, 12524, 12532, 12539, 12547, 12554, 12562, 12569, 12577, 12585, 12592, 12600, 12607, 12615, 12623, 12630, 12638, 12646, 12653, 12661, 12669, 12676, 12684, 12692, 12700, 12707, 12715, 12723, 12730, 12738, 12746, 12754, 12762, 12769, 12777, 12785, 12793, 12801, 12808, 12816, 12824, 12832, 12840, 12848, 12855, 12863, 12871, 12879, 12887, 12895, 12903, 12911, 12919, 12927, 12935, 12943, 12951, 12958, 12966, 12974, 12982, 12990, 12998, 13007, 13015, 13023, 13031, 13039, 13047, 13055, 13063, 13071, 13079, 13087, 13095, 13103, 13112, 13120, 13128, 13136, 13144, 13152, 13161, 13169, 13177, 13185, 13193, 13202, 13210, 13218, 13226, 13235, 13243, 13251, 13259, 13268, 13276, 13284, 13293, 13301, 13309, 13318, 13326, 13334, 13343, 13351, 13359, 13368, 13376, 13385, 13393, 13401, 13410, 13418, 13427, 13435, 13444, 13452, 13461, 13469, 13478, 13486, 13495, 13503, 13512, 13520, 13529, 13537, 13546, 13555, 13563, 13572, 13580, 13589, 13598, 13606, 13615, 13624, 13632, 13641, 13650, 13658, 13667, 13676, 13684, 13693, 13702, 13711, 13719, 13728, 13737, 13746, 13754, 13763, 13772, 13781, 13790, 13799, 13807, 13816, 13825, 13834, 13843, 13852, 13861, 13870, 13879, 13887, 13896, 13905, 13914, 13923, 13932, 13941, 13950, 13959, 13968, 13977, 13986, 13995, 14004, 14013, 14023, 14032, 14041, 14050, 14059, 14068, 14077, 14086, 14095, 14105, 14114, 14123, 14132, 14141, 14151, 14160, 14169, 14178, 14188, 14197, 14206, 14215, 14225, 14234, 14243, 14253, 14262, 14271, 14281, 14290, 14299, 14309, 14318, 14327, 14337, 14346, 14356, 14365, 14375, 14384, 14393, 14403, 14412, 14422, 14431, 14441, 14450, 14460, 14470, 14479, 14489, 14498, 14508, 14517, 14527, 14537, 14546, 14556, 14566, 14575, 14585, 14595, 14604, 14614, 14624, 14633, 14643, 14653, 14663, 14672, 14682, 14692, 14702, 14712, 14721, 14731, 14741, 14751, 14761, 14771, 14781, 14790, 14800, 14810, 14820, 14830, 14840, 14850, 14860, 14870, 14880, 14890, 14900, 14910, 14920, 14930, 14940, 14950, 14960]
518A4960J0J0J1J0J0J0J0J0J0J1J0J0J0J0J1J0J0J1J0J0J0J1J0J0J1J0J1J0J0J1J0J1J0J1
516A5310J0J0J1J0J1J1J0J1J0J1J0J1J1J0J1J0J1J1J0J1J1J1J0J1J1J1J0J1J1J1J1J0J1J1
513A5672J1J1J1J1J1J1J1J1J0J1J1J1J1J2J1J1J1J1J1J1J1J1J1J2J1J1J1J1J2J1J1J1J2J1
510A6049J1J1J2J1J1J2J1J2J1J1J2J1J2J1J2J1J2J1J2J1J2J1J2J2J1J2J1J2J2J1J2J2J2J1
508A6440J2J2J2J1J2J2J2J2J2J1J2J2J2J2J2J2J2J2J2J2J2J2J2J2J2J2J2J2J2J3J2J2J2J2
505A6847J3J2J2J2J3J2J2J2J3J2J3J2J2J3J2J3J2J2J3J2J3J2J3J3J2J3J2J3J2J3J3J2J3J3
503A7271J3J2J3J3J3J2J3J3J3J3J2J3J3J3J3J3J3J3J3J3J3J3J3J3J3J3J3J4J3J3J3J3J3J4
500A7712J3J3J3J4J3J3J4J3J3J4J3J3J4J3J4J3J4J3J4J3J4J4J3J4J3J4J4J3J4J4J3J4J4J4
$$ y = [14960, 14970, 14980, 14991, 15001, 15011, 15021, 15031, 15041, 15051, 15062, 15072, 15082, 15092, 15102, 15113, 15123, 15133, 15144, 15154, 15164, 15174, 15185, 15195, 15205, 15216, 15226, 15237, 15247, 15257, 15268, 15278, 15289, 15299, 15310, 15320, 15330, 15341, 15351, 15362, 15373, 15383, 15394, 15404, 15415, 15425, 15436, 15447, 15457, 15468, 15478, 15489, 15500, 15510, 15521, 15532, 15543, 15553, 15564, 15575, 15586, 15596, 15607, 15618, 15629, 15640, 15650, 15661, 15672, 15683, 15694, 15705, 15716, 15727, 15738, 15749, 15760, 15770, 15781, 15792, 15803, 15814, 15826, 15837, 15848, 15859, 15870, 15881, 15892, 15903, 15914, 15925, 15937, 15948, 15959, 15970, 15981, 15993, 16004, 16015, 16026, 16038, 16049, 16060, 16071, 16083, 16094, 16105, 16117, 16128, 16140, 16151, 16162, 16174, 16185, 16197, 16208, 16220, 16231, 16243, 16254, 16266, 16277, 16289, 16300, 16312, 16324, 16335, 16347, 16358, 16370, 16382, 16393, 16405, 16417, 16429, 16440, 16452, 16464, 16476, 16487, 16499, 16511, 16523, 16535, 16547, 16558, 16570, 16582, 16594, 16606, 16618, 16630, 16642, 16654, 16666, 16678, 16690, 16702, 16714, 16726, 16738, 16750, 16762, 16774, 16786, 16799, 16811, 16823, 16835, 16847, 16860, 16872, 16884, 16896, 16909, 16921, 16933, 16945, 16958, 16970, 16983, 16995, 17007, 17020, 17032, 17045, 17057, 17069, 17082, 17094, 17107, 17119, 17132, 17145, 17157, 17170, 17182, 17195, 17207, 17220, 17233, 17245, 17258, 17271, 17284, 17296, 17309, 17322, 17335, 17347, 17360, 17373, 17386, 17399, 17411, 17424, 17437, 17450, 17463, 17476, 17489, 17502, 17515, 17528, 17541, 17554, 17567, 17580, 17593, 17606, 17619, 17633, 17646, 17659, 17672, 17685, 17698, 17712, 17725, 17738, 17751, 17765, 17778, 17791, 17805, 17818, 17831, 17845, 17858, 17871, 17885, 17898, 17912, 17925, 17939, 17952, 17966, 17979, 17993, 18007, 18020, 18034, 18047, 18061, 18075, 18088, 18102, 18116, 18129, 18143, 18157, 18171]
497A8171J3J4J4J4J4J4J4J3J4J4J4J4J4J4J4J4J4J4J5J4J4J4J4J4J4J5J4J4J4J5J4J4J5J4
495A8649J4J5J4J5J4J5J4J5J4J5J4J5J4J5J5J4J5J5J4J5J5J4J5J5J5J5J4J5J5J5J5J5J5J5
492A9148J5J5J5J5J5J5J5J5J5J6J5J5J5J5J6J5J5J6J5J5J6J5J5J6J5J6J5J6J5J6J5J6J6J5
490A9668J6J6J5J6J6J6J5J6J6J6J6J5J6J6J6J6J6J6J6J6J6J6J6J6J7J6J6J6J6J7J6J6J6J7
487B0212J6J6J7J6J7J6J7J6J7J6J7J6J7J6J7J7J6J7J7J7J6J7J7J7J7J7J6J7J7J7J7J7J7J7
484B0779J7J8J7J7J7J7J7J8J7J7J7J8J7J7J8J7J8J7J8J7J8J7J8J7J8J8J7J8J8J8J7J8J8J8
482B1373J8J8J7J8J8J8J8J8J8J8J9J8J8J8J8J8J9J8J8J9J8J8J9J8J9J8J9J8J9J8J9J8J9J9
479B1994J8J9J9J9J8J9J9J9J9J9J9J9J9J9J9J9J9J9J9J9K0J9J9J9K0J9J9K0J9K0J9K0J9K0
$$ y = [18171, 18184, 18198, 18212, 18226, 18240, 18254, 18268, 18281, 18295, 18309, 18323, 18337, 18351, 18365, 18379, 18393, 18407, 18421, 18436, 18450, 18464, 18478, 18492, 18506, 18520, 18535, 18549, 18563, 18577, 18592, 18606, 18620, 18635, 18649, 18663, 18678, 18692, 18707, 18721, 18736, 18750, 18765, 18779, 18794, 18808, 18823, 18837, 18852, 18867, 18881, 18896, 18911, 18925, 18940, 18955, 18969, 18984, 18999, 19014, 19029, 19043, 19058, 19073, 19088, 19103, 19118, 19133, 19148, 19163, 19178, 19193, 19208, 19223, 19238, 19253, 19268, 19283, 19299, 19314, 19329, 19344, 19359, 19375, 19390, 19405, 19421, 19436, 19451, 19467, 19482, 19497, 19513, 19528, 19544, 19559, 19575, 19590, 19606, 19621, 19637, 19653, 19668, 19684, 19700, 19715, 19731, 19747, 19763, 19778, 19794, 19810, 19826, 19842, 19857, 19873, 19889, 19905, 19921, 19937, 19953, 19969, 19985, 20001, 20017, 20033, 20049, 20066, 20082, 20098, 20114, 20130, 20147, 20163, 20179, 20195, 20212, 20228, 20244, 20261, 20277, 20294, 20310, 20327, 20343, 20360, 20376, 20393, 20409, 20426, 20442, 20459, 20476, 20492, 20509, 20526, 20543, 20559, 20576, 20593, 20610, 20627, 20644, 20660, 20677, 20694, 20711, 20728, 20745, 20762, 20779, 20796, 20814, 20831, 20848, 20865, 20882, 20899, 20917, 20934, 20951, 20968, 20986, 21003, 21020, 21038, 21055, 21073, 21090, 21108, 21125, 21143, 21160, 21178, 21195, 21213, 21231, 21248, 21266, 21284, 21302, 21319, 21337, 21355, 21373, 21391, 21409, 21426, 21444, 21462, 21480, 21498, 21516, 21534, 21552, 21571, 21589, 21607, 21625, 21643, 21661, 21680, 21698, 21716, 21735, 21753, 21771, 21790, 21808, 21827, 21845, 21864, 21882, 21901, 21919, 21938, 21956, 21975, 21994, 22012, 22031, 22050, 22069, 22087, 22106, 22125, 22144, 22163, 22182, 22201, 22220, 22239, 22258, 22277, 22296, 22315, 22334, 22353, 22372, 22392, 22411, 22430, 22449, 22469, 22488, 22507, 22527, 22546, 22566, 22585, 22605, 22624, 22644]
477B2644J9K0K0J9K0K0J9K0K0K0K0J9K0K0K0K0K0K0K0K0K1K0K0K0K0K1K0K0K1K0K0K1K0K1
474B3325K0K1K1K0K1K0K1K1K1K0K1K1K1K1K1K1K1K1K1K1K1K1K1K1K2K1K1K2K1K1K2K1K2K1
471B4039K2K1K2K1K2K2K1K2K2K2K2K1K2K2K2K2K2K2K2K3K2K2K2K2K3K2K2K3K2K3K2K3K2K3
469B4789K2K3K3K2K3K3K3K2K3K3K3K3K3K3K3K3K3K4K3K3K3K4K3K3K4K3K4K3K4K3K4K4K3K4
466B5576K4K4K3K4K4K4K4K4K4K4K4K4K5K4K4K4K5K4K4K5K4K5K4K5K5K4K5K5K4K5K5K5K5K5
464B6404K5K5K5K5K5K5K6K5K5K5K6K5K6K5K6K5K6K5K6K6K6K5K6K6K6K6K6K6K6K6K6K6K7K6
461B7275K6K7K6K6K7K6K7K7K6K7K7K6K7K7K7K7K7K7K7K7K7K7K7K8K7K7K8K7K8K7K8K7K8K8
459B8193K7K8K8K8K8K8K8K8K8K8K8K8K8K9K8K8K9K8K9K8K9K9K8K9K9K9K9K9K9K9K9K9K9K9
$$ y = [22644, 22663, 22683, 22703, 22722, 22742, 22762, 22781, 22801, 22821, 22841, 22861, 22880, 22900, 22920, 22940, 22960, 22980, 23000, 23020, 23040, 23061, 23081, 23101, 23121, 23141, 23162, 23182, 23202, 23223, 23243, 23263, 23284, 23304, 23325, 23345, 23366, 23387, 23407, 23428, 23448, 23469, 23490, 23511, 23531, 23552, 23573, 23594, 23615, 23636, 23657, 23678, 23699, 23720, 23741, 23762, 23783, 23804, 23825, 23847, 23868, 23889, 23911, 23932, 23953, 23975, 23996, 24018, 24039, 24061, 24082, 24104, 24125, 24147, 24169, 24190, 24212, 24234, 24256, 24278, 24299, 24321, 24343, 24365, 24387, 24409, 24431, 24453, 24476, 24498, 24520, 24542, 24564, 24587, 24609, 24631, 24654, 24676, 24699, 24721, 24744, 24766, 24789, 24811, 24834, 24857, 24879, 24902, 24925, 24948, 24970, 24993, 25016, 25039, 25062, 25085, 25108, 25131, 25154, 25177, 25201, 25224, 25247, 25270, 25294, 25317, 25340, 25364, 25387, 25411, 25434, 25458, 25481, 25505, 25529, 25552, 25576, 25600, 25624, 25647, 25671, 25695, 25719, 25743, 25767, 25791, 25815, 25839, 25863, 25888, 25912, 25936, 25960, 25985, 26009, 26033, 26058, 26082, 26107, 26131, 26156, 26181, 26205, 26230, 26255, 26279, 26304, 26329, 26354, 26379, 26404, 26429, 26454, 26479, 26504, 26529, 26554, 26580, 26605, 26630, 26655, 26681, 26706, 26732, 26757, 26783, 26808, 26834, 26859, 26885, 26911, 26937, 26962, 26988, 27014, 27040, 27066, 27092, 27118, 27144, 27170, 27196, 27222, 27249, 27275, 27301, 27328, 27354, 27380, 27407, 27433, 27460, 27487, 27513, 27540, 27567, 27593, 27620, 27647, 27674, 27701, 27728, 27755, 27782, 27809, 27836, 27863, 27890, 27918, 27945, 27972, 28000, 28027, 28055, 28082, 28110, 28137, 28165, 28193, 28220, 28248, 28276, 28304, 28332, 28360, 28388, 28416, 28444, 28472, 28500, 28528, 28556, 28585, 28613, 28641, 28670, 28698, 28727, 28755, 28784, 28813, 28841, 28870, 28899, 28928, 28957, 28986, 29015, 29044, 29073, 29102, 29131, 29160]
456B9160K9L0K9K9L0K9L0K9L0L0L0K9L0L0L0L0L0L0L0L0L0L1L0L0L1L0L1L0L1L0L1L1L1L1
453C0182L0L1L1L1L1L2L1L1L1L2L1L2L1L2L1L2L2L1L2L2L2L2L2L2L2L2L3L2L2L3L2L3L2L3
451C1261L2L3L3L3L3L3L3L3L3L3L3L3L4L3L4L3L4L3L4L4L3L4L4L4L4L4L4L4L5L4L4L5L4L5
448C2403L4L5L5L4L5L5L5L5L5L5L5L6L5L5L6L5L6L5L6L6L5L6L6L6L6L6L6L7L6L6L7L6L7L6
446C3612L7L7L6L7L7L7L7L7L7L8L7L7L8L7L8L7L8L8L8L8L8L8L8L8L8L8L9L8L9L8L9L9L8L9
443C4895L9L9L9L9L9M0L9L9M0L9M0M0L9M0M0M0M0M0M0M0M1M0M1M0M1M0M1M1M1M1M1M1M1M2
440C6258M1M1M2M1M2M2M2M1M2M2M3M2M2M2M3M2M3M2M3M3M3M3M3M3M3M3M4M3M4M3M4M4M4M4
438C7707M4M4M4M4M4M5M4M5M5M4M5M5M5M5M5M6M5M5M6M5M6M6M6M6M6M6M6M6M7M6M7M6M7M7
$$ y = [29160, 29189, 29219, 29248, 29277, 29307, 29336, 29366, 29395, 29425, 29455, 29485, 29514, 29544, 29574, 29604, 29634, 29664, 29694, 29724, 29754, 29784, 29815, 29845, 29875, 29906, 29936, 29967, 29997, 30028, 30058, 30089, 30120, 30151, 30182, 30212, 30243, 30274, 30305, 30336, 30368, 30399, 30430, 30461, 30493, 30524, 30556, 30587, 30619, 30650, 30682, 30714, 30745, 30777, 30809, 30841, 30873, 30905, 30937, 30969, 31001, 31034, 31066, 31098, 31131, 31163, 31196, 31228, 31261, 31293, 31326, 31359, 31392, 31425, 31458, 31491, 31524, 31557, 31590, 31623, 31656, 31690, 31723, 31757, 31790, 31824, 31857, 31891, 31925, 31958, 31992, 32026, 32060, 32094, 32128, 32162, 32196, 32231, 32265, 32299, 32334, 32368, 32403, 32437, 32472, 32507, 32541, 32576, 32611, 32646, 32681, 32716, 32751, 32786, 32822, 32857, 32892, 32928, 32963, 32999, 33034, 33070, 33106, 33141, 33177, 33213, 33249, 33285, 33321, 33357, 33394, 33430, 33466, 33503, 33539, 33576, 33612, 33649, 33686, 33722, 33759, 33796, 33833, 33870, 33907, 33944, 33982, 34019, 34056, 34094, 34131, 34169, 34206, 34244, 34282, 34320, 34358, 34396, 34434, 34472, 34510, 34548, 34586, 34625, 34663, 34702, 34740, 34779, 34818, 34856, 34895, 34934, 34973, 35012, 35051, 35090, 35130, 35169, 35208, 35248, 35287, 35327, 35367, 35406, 35446, 35486, 35526, 35566, 35606, 35646, 35686, 35727, 35767, 35808, 35848, 35889, 35929, 35970, 36011, 36052, 36093, 36134, 36175, 36216, 36258, 36299, 36340, 36382, 36423, 36465, 36507, 36549, 36590, 36632, 36674, 36717, 36759, 36801, 36843, 36886, 36928, 36971, 37013, 37056, 37099, 37142, 37185, 37228, 37271, 37314, 37357, 37401, 37444, 37488, 37531, 37575, 37619, 37663, 37707, 37751, 37795, 37839, 37883, 37927, 37972, 38016, 38061, 38106, 38150, 38195, 38240, 38285, 38330, 38375, 38421, 38466, 38511, 38557, 38602, 38648, 38694, 38740, 38786, 38832, 38878, 38924, 38970, 39017, 39063, 39110, 39156, 39203, 39250]
435C9250M7M7M7M7M7M8M7M8M7M8M8M8M8M8M8M8M9M8M9M8M9M9M9M9M9M9M9N0M9N0N0M9N0N0
433D0896N0N0N1N0N1N0N1N1N0N1N2N1N1N1N2N1N2N2N2N2N2N2N2N3N2N3N2N3N3N3N3N4N3N3
430D2655N4N4N3N4N4N4N5N4N4N5N4N5N5N5N5N5N6N5N6N5N6N6N6N6N6N7N6N7N6N7N7N7N7N7
427D4538N8N7N8N8N7N8N8N9N8N8N9N9N9N9N9N9N9N9O0O0O0N9O1O0O0O0O1O1O1O0O2O1O1O2
425D6558O1O2O2O2O2O2O2O3O3O2O3O3O3O4O3O4O3O4O4O4O5O4O5O4O5O5O5O6O5O5O6O6O6O6
422D8727O6O7O6O7O7O7O7O7O7O8O8O7O8O9O8O8O9O9O9O9O9O9P0O9P0P0P0P1P0P1P0P1P1P2
420E1063P1P2P1P2P2P2P3P2P3P3P3P3P3P4P4P3P4P5P4P5P4P5P5P5P6P5P6P6P6P6P7P6P7P7
417E3583P7P7P8P7P8P8P9P8P8P9P9P9Q0P9Q0Q0Q0Q0Q0Q1Q1Q1Q1Q1Q2Q2Q2Q2Q2Q3Q2Q3Q3Q4
$$ y = [39250, 39297, 39344, 39391, 39438, 39485, 39533, 39580, 39628, 39675, 39723, 39771, 39819, 39867, 39915, 39963, 40011, 40060, 40108, 40157, 40205, 40254, 40303, 40352, 40401, 40450, 40499, 40548, 40598, 40647, 40697, 40747, 40796, 40846, 40896, 40946, 40996, 41047, 41097, 41148, 41198, 41249, 41300, 41350, 41401, 41453, 41504, 41555, 41606, 41658, 41709, 41761, 41813, 41865, 41917, 41969, 42021, 42073, 42126, 42178, 42231, 42283, 42336, 42389, 42442, 42495, 42549, 42602, 42655, 42709, 42763, 42816, 42870, 42924, 42978, 43033, 43087, 43141, 43196, 43250, 43305, 43360, 43415, 43470, 43525, 43581, 43636, 43692, 43747, 43803, 43859, 43915, 43971, 44027, 44084, 44140, 44197, 44253, 44310, 44367, 44424, 44481, 44538, 44596, 44653, 44711, 44769, 44826, 44884, 44942, 45001, 45059, 45117, 45176, 45235, 45294, 45353, 45412, 45471, 45530, 45589, 45649, 45709, 45769, 45828, 45889, 45949, 46009, 46069, 46130, 46191, 46252, 46312, 46374, 46435, 46496, 46558, 46619, 46681, 46743, 46805, 46867, 46929, 46991, 47054, 47117, 47179, 47242, 47305, 47368, 47432, 47495, 47559, 47622, 47686, 47750, 47814, 47879, 47943, 48008, 48072, 48137, 48202, 48267, 48333, 48398, 48463, 48529, 48595, 48661, 48727, 48793, 48860, 48926, 48993, 49060, 49127, 49194, 49261, 49328, 49396, 49464, 49531, 49599, 49668, 49736, 49804, 49873, 49942, 50011, 50080, 50149, 50218, 50288, 50357, 50427, 50497, 50567, 50638, 50708, 50779, 50849, 50920, 50991, 51063, 51134, 51206, 51277, 51349, 51421, 51493, 51566, 51638, 51711, 51784, 51857, 51930, 52003, 52077, 52151, 52224, 52298, 52373, 52447, 52522, 52596, 52671, 52746, 52821, 52897, 52972, 53048, 53124, 53200, 53276, 53353, 53429, 53506, 53583, 53660, 53737, 53815, 53892, 53970, 54048, 54127, 54205, 54283, 54362, 54441, 54520, 54600, 54679, 54759, 54839, 54919, 54999, 55079, 55160, 55241, 55322, 55403, 55484, 55566, 55648, 55730, 55812, 55894, 55977, 56059, 56142, 56225, 56309]
414E6309Q3Q4Q4Q4Q4Q5Q4Q5Q6Q5Q5Q6Q6Q6Q7Q6Q7Q7Q7Q8Q7Q8Q8Q8Q9Q9Q8R0Q9R0Q9R0R1R0
412E9264R1R1R1R1R2R1R2R3R2R3R3R3R3R4R4R4R4R5R5R5R5R6R5R6R7R6R7R7R7R8R7R8R8R9
409F2477R9R9R9R9J00J00J00J01J00J01J02J01J02J02J02J03J03J03J03J04J04J04J05J04
407F4917J05J06J05J06J06J06J07J07J07J08J08J08J08J09J09J09J09J10J10J11J10J11J12
406F7404J11J12J12J13J12J14J13J14J14J14J14J15J16J15J16J16J17J16J18J17J18J18J18
404G0047J19J19J19J20J20J21J20J21J22J21J22J23J22J24J23J24J24J24J25J25J26J25J27
402G2863J26J27J27J28J28J28J29J29J29J30J30J31J31J31J32J32J32J33J33J34J34J34J35
400G5866J35J35J36J37J36J37J38J38J38J39J39J39J40J40J41J41J42J42J42J43J43J44J44
$$ y = [56309, 56392, 56476, 56560, 56644, 56728, 56813, 56897, 56982, 57068, 57153, 57238, 57324, 57410, 57496, 57583, 57669, 57756, 57843, 57930, 58018, 58105, 58193, 58281, 58369, 58458, 58547, 58635, 58725, 58814, 58904, 58993, 59083, 59174, 59264, 59355, 59446, 59537, 59628, 59720, 59811, 59903, 59996, 60088, 60181, 60274, 60367, 60460, 60554, 60648, 60742, 60836, 60931, 61026, 61121, 61216, 61312, 61407, 61503, 61600, 61696, 61793, 61890, 61987, 62085, 62182, 62280, 62378, 62477, 62576, 62675, 62774, 62873, 62973, 63073, 63173, 63274, 63374, 63475, 63577, 63678, 63780, 63882, 63984, 64087, 64190, 64293, 64396, 64500, 64604, 64708, 64813, 64917, 65022, 65128, 65233, 65339, 65445, 65551, 65658, 65765, 65872, 65980, 66088, 66196, 66304, 66413, 66522, 66631, 66740, 66850, 66960, 67071, 67181, 67292, 67404, 67515, 67627, 67739, 67852, 67964, 68078, 68191, 68305, 68419, 68533, 68647, 68762, 68878, 68993, 69109, 69225, 69342, 69458, 69576, 69693, 69811, 69929, 70047, 70166, 70285, 70404, 70524, 70644, 70765, 70885, 71006, 71128, 71249, 71371, 71494, 71616, 71740, 71863, 71987, 72111, 72235, 72360, 72485, 72611, 72736, 72863, 72989, 73116, 73243, 73371, 73499, 73627, 73756, 73885, 74014, 74144, 74274, 74405, 74536, 74667, 74799, 74931, 75063, 75196, 75329, 75463, 75597, 75731, 75866, 76001, 76136, 76272, 76409, 76545, 76682, 76820, 76958, 77096, 77235, 77374, 77513, 77653, 77793, 77934, 78075, 78217, 78359, 78501, 78644, 78787, 78931, 79075]
399G9075J44J45J46J45J47J46J47J48J48J48J49J49J50J50J51J51J52J52J52J53J54J54J54
397H2510J55J55J56J56J57J57J58J58J59J59J60J60J60J61J62J62J63J63J64J64J65J65J66
395H6195J66J67J67J68J68J69J69J70J71J71J71J73J72J73J74J75J74J76J76J77J77J77J79
393I0155J79J79J80J81J81J82J82J83J84J84J85J85J86J87J87J88J88J90J89J91J91J91J93
392I4421J92J94J94J95J96J96J97J97J98J99K00K00K01K01K02K03K04K04K05K06K06K08K07
390I9026K09K09K10K11K11K13K13K13K15K15K16K16K18K18K19K20K20K21K23K22K24K25K25
388A04012K26K27K27K29K29K30K31K32K33K33K34K36K36K36K38K39K39K41K41K42K43K44K45
386A09423K45K47K47K49K49K50K52K52K53K54K55K56K57K58K59K59K61K62K63K64K64K66K67
$$ y = [79075, 79219, 79364, 79510, 79655, 79802, 79948, 80095, 80243, 80391, 80539, 80688, 80837, 80987, 81137, 81288, 81439, 81591, 81743, 81895, 82048, 82202, 82356, 82510, 82665, 82820, 82976, 83132, 83289, 83446, 83604, 83762, 83921, 84080, 84240, 84400, 84560, 84721, 84883, 85045, 85208, 85371, 85535, 85699, 85864, 86029, 86195, 86361, 86528, 86695, 86863, 87031, 87200, 87369, 87539, 87710, 87881, 88052, 88225, 88397, 88570, 88744, 88919, 89093, 89269, 89445, 89622, 89799, 89976, 90155, 90334, 90513, 90693, 90874, 91055, 91237, 91419, 91602, 91786, 91970, 92155, 92340, 92526, 92713, 92900, 93088, 93276, 93466, 93655, 93846, 94037, 94228, 94421, 94613, 94807, 95001, 95196, 95392, 95588, 95785, 95982, 96180, 96379, 96579, 96779, 96980, 97181, 97383, 97586, 97790, 97994, 98199, 98405, 98611, 98819, 99026, 99235, 99444, 99654, 99865, 100076, 100289, 100502, 100715, 100930, 101145, 101361, 101577, 101795, 102013, 102232, 102452, 102672, 102893, 103116, 103338, 103562, 103787, 104012, 104238, 104465, 104692, 104921, 105150, 105380, 105611, 105843, 106076, 106309, 106543, 106779, 107015, 107251, 107489, 107728, 107967, 108208, 108449, 108691, 108934, 109178, 109423, 109668, 109915, 110162, 110411, 110660, 110910, 111162, 111414, 111667, 111921, 112176, 112432, 112689, 112947, 113206, 113465, 113726, 113988, 114251, 114515, 114779, 115045, 115312]
385A15312K68K69K70K71K72K73K74K75K76K78K78K79K81K82K82K84K85K86K87K89K89K91K92
383A21743K93K94K95K97K97K99L00L02L02L04L05L06L07L09L10L11L12L14L15L16L18L19L20
381A28788L22L23L24L25L27L29L29L31L33L33L36L36L38L40L41L42L44L45L47L48L50L51L53
379A36535L54L56L58L58L61L62L63L66L66L69L70L71L74L75L76L78L80L82L83L85L87L89L90
378A45088L92L93L96L97L99M01M03M05M06M08M11M12M14M15M18M20M22M23M26M27M30M32M33
376A54571M36M38M39M42M44M46M49M50M52M55M57M59M61M64M66M68M70M72M75M78M79M82M84
374A65137M87M89M92M94M96M99N01N04N07N09N11N14N17N19N22N25N27N31N32N36N38N41N44
372A76972N47N49N53N55N58N62N64N67N70N73N76N79N83N85N89N91N95N99O01O05O08O11O14
$$ y = [115312, 115580, 115849, 116119, 116390, 116662, 116935, 117209, 117484, 117760, 118038, 118316, 118595, 118876, 119158, 119440, 119724, 120009, 120295, 120582, 120871, 121160, 121451, 121743, 122036, 122330, 122625, 122922, 123219, 123518, 123818, 124120, 124422, 124726, 125031, 125337, 125644, 125953, 126263, 126574, 126886, 127200, 127515, 127831, 128149, 128468, 128788, 129110, 129433, 129757, 130082, 130409, 130738, 131067, 131398, 131731, 132064, 132400, 132736, 133074, 133414, 133755, 134097, 134441, 134786, 135133, 135481, 135831, 136182, 136535, 136889, 137245, 137603, 137961, 138322, 138684, 139047, 139413, 139779, 140148, 140518, 140889, 141263, 141638, 142014, 142392, 142772, 143154, 143537, 143922, 144309, 144698, 145088, 145480, 145873, 146269, 146666, 147065, 147466, 147869, 148274, 148680, 149088, 149499, 149911, 150325, 150740, 151158, 151578, 152000, 152423, 152849, 153276, 153706, 154138, 154571, 155007, 155445, 155884, 156326, 156770, 157216, 157665, 158115, 158567, 159022, 159479, 159938, 160399, 160863, 161329, 161797, 162267, 162739, 163214, 163692, 164171, 164653, 165137, 165624, 166113, 166605, 167099, 167595, 168094, 168595, 169099, 169606, 170115, 170626, 171140, 171657, 172176, 172698, 173223, 173750, 174281, 174813, 175349, 175887, 176428, 176972, 177519, 178068, 178621, 179176, 179734, 180296, 180860, 181427, 181997, 182570, 183146, 183725, 184308, 184893, 185482, 186073, 186668, 187267, 187868, 188473, 189081, 189692, 190306]
370A90306O18O22O25O28O31O36O38O43O46O49O53O57O61O64O68O72O76O79O84O87O91O96O99
369B05429P03P08P11P16P20P24P29P33P37P41P46P51P54P60P64P68P74P77P83P87P93P97Q02
367B22707Q07Q12Q17Q22Q27Q32Q38Q43Q48Q53Q59Q65Q70Q75Q81Q87Q92Q98R05R09R16R22R28
365B42613R34R40R47R53R59R65R72R79R85R91R99J005J012J019J026J033J041J047J055J062
364B62537J070J077J084J093J100J107J116J124J132J140J148J156J165J174J182J191J199
362B81795J208J218J226J236J244J255J263J273J283J293J302J313J323J332J344J353J365
361C03626J375J385J397J408J419J430J442J453J465J477J489J502J513J526J538J552J564
360C28561J577J590J604J618J631J645J659J673J687J703J717J732J747J762J778J794J810
$$ y = [190306, 190924, 191546, 192171, 192799, 193430, 194066, 194704, 195347, 195993, 196642, 197295, 197952, 198613, 199277, 199945, 200617, 201293, 201972, 202656, 203343, 204034, 204730, 205429, 206132, 206840, 207551, 208267, 208987, 209711, 210440, 211173, 211910, 212651, 213397, 214148, 214902, 215662, 216426, 217194, 217968, 218745, 219528, 220315, 221108, 221905, 222707, 223514, 224326, 225143, 225965, 226792, 227624, 228462, 229305, 230153, 231006, 231865, 232730, 233600, 234475, 235356, 236243, 237135, 238033, 238938, 239847, 240763, 241685, 242613, 243547, 244487, 245434, 246387, 247346, 248311, 249283, 250262, 251247, 252238, 253237, 254242, 255254, 256273, 257299, 258332, 259373, 260420, 261475, 262537, 263607, 264684, 265768, 266861, 267961, 269068, 270184, 271308, 272440, 273580, 274728, 275884, 277049, 278223, 279405, 280596, 281795, 283003, 284221, 285447, 286683, 287927, 289182, 290445, 291718, 293001, 294294, 295596, 296909, 298232, 299564, 300908, 302261, 303626, 305001, 306386, 307783, 309191, 310610, 312040, 313482, 314935, 316400, 317877, 319366, 320868, 322381, 323907, 325445, 326997, 328561, 330138, 331728, 333332, 334950, 336581, 338226, 339885, 341558, 343245, 344948, 346665, 348397, 350144, 351906, 353684, 355478, 357288]
358C57288J826J842J859J876J893J910J927J945J963J982K000K018K038K056K076K096K116
357C90711K137K157K177K200K220K242K265K287K309K333K356K380K404K429K453K479K504
356D30043K531K557K583K611K638K667K695K724K753K784K813K845K876K908K940K973L006
355D76947L041L075L110L146L183L219L257L295L335L373L414L455L497L539L582L627L671
353E33766L717L763L810L859L908L958M008M061M113M168M222M278M335M394M453M514M575
352F03902M638M703M768M835M904M973N045N117N192N267N345N424N505N588N672N759N847
351F92484N937O030O124O221O320O422O524O631O740O851O965P082P201P324P450P579P711
349H07596P846P985Q129Q274Q425Q580Q737Q901R068R240R416R598R785R977J0175J0378J0588
$$ y = [357288, 359114, 360956, 362815, 364691, 366584, 368494, 370421, 372366, 374329, 376311, 378311, 380329, 382367, 384423, 386499, 388595, 390711, 392848, 395005, 397182, 399382, 401602, 403844, 406109, 408396, 410705, 413038, 415394, 417774, 420178, 422607, 425060, 427539, 430043, 432574, 435131, 437714, 440325, 442963, 445630, 448325, 451049, 453802, 456586, 459399, 462244, 465120, 468028, 470968, 473941, 476947, 479988, 483063, 486173, 489319, 492502, 495721, 498978, 502273, 505608, 508981, 512395, 515850, 519347, 522886, 526468, 530095, 533766, 537483, 541246, 545056, 548915, 552823, 556781, 560789, 564850, 568963, 573131, 577353, 581631, 585966, 590360, 594813, 599327, 603902, 608540, 613243, 618011, 622846, 627750, 632723, 637768, 642885, 648077, 653344, 658689, 664113, 669618, 675206, 680878, 686637, 692484, 698421, 704451, 710575, 716796, 723116, 729538, 736062, 742693, 749433, 756284, 763249, 770331, 777532, 784856, 792306, 799885, 807596, 815442, 823427, 831556, 839830, 848255, 856835, 865572, 874473, 883541, 892781, 902197, 911795, 921580, 931557, 941732, 952110, 962698]
348I62698J0803J1025J1254J1490J1733J1983J2241J2508J2783J3067J3359J3663J3975J4298
347A136880J4633J4978J5336J5706J6088J6486J6896J7323J7764J8222J8697J9191J9703K0236
346A378139K0788K1364K1963K2585K3235K3909K4614K5349K6114K6915K7750K8623K9536L0491
345A731375L1491L2539L3636L4788L5996L7265L8599M0002M1478M3033M4672M6400M8227N0155
344B289656N2195N4354N6641N9067O1643O4378O7289P0388P3691P7217Q0984Q5013Q9330R3960
343C275806R8932J04280J10040J16254J22967J30235J38112J46667J55976J66127J77214J89353
342D931963K02673K17324K33476K51333K71125K93131L17667L45115L75929M10642M49904
341H300282M94493N45353O03646O70794P48567Q39180R45431J070886J220142J399200J615969
$$ y = [962698, 973501, 984526, 995780, 1007270, 1019003, 1030986, 1043227, 1055735, 1068518, 1081585, 1094944, 1108607, 1122582, 1136880, 1151513, 1166491, 1181827, 1197533, 1213621, 1230107, 1247003, 1264326, 1282090, 1300312, 1319009, 1338200, 1357903, 1378139, 1398927, 1420291, 1442254, 1464839, 1488074, 1511983, 1536597, 1561946, 1588060, 1614975, 1642725, 1671348, 1700884, 1731375, 1762866, 1795405, 1829041, 1863829, 1899825, 1937090, 1975689, 2015691, 2057169, 2100202, 2144874, 2191274, 2239501, 2289656, 2341851, 2396205, 2452846, 2511913, 2573556, 2637934, 2705223, 2775611, 2849302, 2926519, 3007503, 3092516, 3181846, 3275806, 3374738, 3479018, 3589058, 3705312, 3828279, 3958514, 4096626, 4243293, 4399269, 4565396, 4742610, 4931963, 5134636, 5351960, 5585436, 5836769, 6107894, 6401025, 6718692, 7063807, 7439736, 7850378, 8300282, 8794775, 9340128, 9943774, 10614568, 11363135, 12202315, 13147746, 14218632, 15438774, 16837974, 18453943]
340A8453943J881054K208844K619218L140104L811487M691765N867914P471932R706693J2883554
339G2736508J7461768K4021276L2882483M2565483M6603876L5310290J4344498P300176K1467973
339C14694331M5932923O2395848L7580582l1711480q0897396q1533752o3618419m6608575
338A56234062l3733811k4530160j8077774j3553479j0345944q035169o340591n075565m114938
337C2426631l373694k793140k332117j961277j659371j410796j203908j029932q82146p55351
337A5024899o45480n49303m64240l88188l19427k56518j98245j43559r1537m1348P777N6566
336A1991397J05737J56012K08144K62940L21291L84200M52815N28493O12842P07800Q15759
335A6547430R39661J083226J251159J449541J686303J971958K320664K751839L292630L981864
$$ y = [18453943, 20334997, 22543841, 25163059, 28303163, 32114650, 36806415, 42674329, 50146261, 59852954, 72736508, 90198276, 114219552, 147102035, 189667518, 236271394, 271581684, 285926182, 293226358, 314694331, 360627254, 423023102, 460603684, 428892204, 347994808, 266461056, 202842637, 156234062, 122500251, 97970091, 79892317, 66338838, 55992894, 47957725, 41617134, 36541569, 32426631, 29052937, 26259797, 23927680, 21966403, 20307032, 18896236, 17692328, 16662396, 15780250, 15024899, 14379419, 13830116, 13365876, 12977688, 12658261, 12401743, 12203498, 12059939, 11968402, 11927054, 11934831, 11991397, 12097134, 12253146, 12461290, 12724230, 13045521, 13429721, 13882536, 14411029, 15023871, 15731671, 16547430, 17487091, 18570317, 19821476, 21271017, 22957320, 24929278, 27249942, 30001781, 33294411, 37276275]
334C7276275M876402O061817P670326R911232J3119378J7817350K4744169L4830859M8313843
333B04621651N0745940K4939791J8620357L8009398N3313992N1549637K5647246j7105904
333D50342108n4144593o9907466o6919831n5213141m2496499l1941834k4000422j8216232
332H7502090j4021803j0956735q688434o985508n688274m686086l901505l279638k781063
332B6513044k377092k046561j773669j546480j355875j194815j057809r40540q39577p52183
331A2628443o76148o09673n51295m99807m54211m13675l77507l45120l16021k89792k66076
330G829118k44566k25000k07152j90826j75849j62075j49375j37632j26746j16631j07206
329E986060r8402r0159q2418p5131o8256o1748n5575m9702m4100l8741l3601k8655k3887j9271
$$ y = [37276275, 42152677, 48214494, 55884820, 65796052, 78915430, 96732780, 121476949, 156307808, 204621651, 255367591, 280307382, 298927739, 336937137, 390251129, 441800766, 467448012, 450342108, 396197515, 326290049, 259370218, 204157077, 161660578, 129718744, 105718322, 87502090, 73480287, 62523552, 53835118, 46849610, 41161336, 36475250, 32573745, 29294107, 26513044, 24135952, 22089391, 20315722, 18769242, 17413367, 16218552, 15160743, 14220203, 13380626, 12628443, 11952295, 11342622, 10791327, 10291520, 9837309, 9423634, 9046127, 8701007, 8384986, 8095194, 7829118, 7584552, 7359552, 7152400, 6961574, 6785725, 6623650, 6474275, 6336643, 6209897, 6093266, 5986060, 5887658, 5797499, 5715081, 5639950, 5571694, 5509946, 5454371, 5404669, 5360569, 5321828, 5288227, 5259572, 5235685, 5216414]
328E216414j4794j0436o184k021K066O090J0066J4002J7913K1810K5704K9605L3524L7473
327E381232M1462M5502M9603N3779N8038O2394O6858P1445P6165Q1033Q6066R1276R6682J02300
326F363835J08147J14246J20618J27283J34267J41598J49303J57413J65965J74990J84535
325G942200J94639K05352K16725K28821K41697K55428K70092K85773L02566L20581L39936
324A0803810L60758L83201M07429M33627M62008M92807N26292N62771O02590O46145O93889
323A6375327P46344Q04111Q67886R38471J016810J103996J201320J310304J432741J570780
323B7368090J726986J904432K106857K338797K605807K914741L274114L694575M189578M776244
322E6900221N476574O319152P341507Q593463J0142058J2078706J4529825J7672969K1761624
$$ y = [5216414, 5201620, 5191184, 5185000, 5182979, 5185045, 5191135, 5201201, 5215203, 5233116, 5254926, 5280630, 5310235, 5343759, 5381232, 5422694, 5468196, 5517799, 5571578, 5629616, 5692010, 5758868, 5830313, 5906478, 5987511, 6073577, 6164853, 6261535, 6363835, 6471982, 6586228, 6706846, 6834129, 6968396, 7109994, 7259297, 7416710, 7582675, 7757665, 7942200, 8136839, 8342191, 8558916, 8787737, 9029434, 9284862, 9554954, 9840727, 10143293, 10463874, 10803810, 11164568, 11547769, 11955198, 12388825, 12850833, 13343640, 13869932, 14432703, 15035293, 15681438, 16375327, 17121671, 17925782, 18793668, 19732139, 20748949, 21852945, 23054265, 24364569, 25797310, 27368090, 29095076, 30999508, 33106365, 35445162, 38050969, 40965710, 44239824, 47934399, 52123977, 56900221, 62376795, 68695947, 76037454, 84630917, 94772975, 106851681, 121381506, 139054475, 160816099]
321A60816099K7163567L4421328M4347118N8170205P7755031J05881779J46466122K04247877
321H59269126K82556484L72530293M06614819K26512925j48510912l89791781l89880312l02923110
320I16377532k20216875j57894610j13810402q3226430o1974924m7028120l6338581k8554022
319A67333568k2782305j8429334j5093733j2499975j0455719q824525p508080o434497n550493
319E9754907m816047m200739l681219l239313k860792k534376k251057k003583j786057j593656
318C0788068j422390j268941j130531j004793q89713p83537o84737n91946n03932m19554l37740
317B1750254k57452j77655r7301j5284O9580J58604K53270L55290M66675N89835P27692Q83840
316B4707348J062763J270124J513161J801237K146613K565569L079988L719725M526065N556969
$$ y = [160816099, 187979666, 222400994, 266748112, 324918317, 402673348, 508555127, 655021249, 859269126, 1141825610, 1514355903, 1920970722, 2147483647, 1998972735, 1609180954, 1219300642, 916377532, 696160657, 538266047, 424455645, 341229215, 279254291, 232226171, 195887590, 167333568, 144551263, 126121929, 111028196, 98528221, 88072502, 79247977, 71739897, 65305400, 59754907, 54938860, 50738121, 47056902, 43817589, 40956797, 38422421, 36171364, 34167781, 32381724, 30788068, 29365678, 28096737, 26966206, 25961413, 25071700, 24288163, 23603426, 23011480, 22507548, 22087994, 21750254, 21492802, 21315147, 21217846, 21202562, 21272142, 21430746, 21684016, 22039306, 22505981, 23095816, 23823508, 24707348, 25770111, 27040235, 28553396, 30354633, 32501246, 35066815, 38146803, 41866528, 46392593, 51949562]
315E1949562O894908Q658695J1020903J4231765J8646527K4736123L3010400M3662014N5601537
315B68412434O4988954O5527218N3615689L2744724Q903740j4095575l2623537m0871491l7616720
314C68985436l5859948m5623515n6554213n4304657m1372021k8771378k0163492j4626738
313G1709474j0979304q481732o708465n410143m434795l686092l100720k635759k261330j956129
313B2055005j704671j495488j319955j171496j045029r36586q43031p61869o91091o29070
312A1456719n74475n26216m83390m45239m11138l80554l53039l28213l05749k85368k66830
311G096508k49929k34483k20337k07355j95414j84414j74260j64868j56170j48099j40600
310E020579j33620j27115j21043j15369j10058j05083j00415r6030r1908q8028q4370q0920
$$ y = [51949562, 58844470, 67503165, 78524068, 92755833, 111402360, 136138483, 169148883, 212810897, 268412434, 333401388, 398928606, 452544295, 485289019, 494192759, 480097184, 447473647, 406602156, 368985436, 333125488, 287501973, 230947760, 176643103, 135271082, 106499704, 86336212, 71709474, 60730170, 52248438, 45539973, 40129830, 35695035, 32008943, 28908223, 26272464, 24011134, 22055005, 20350334, 18854846, 17534891, 16363395, 15318366, 14381780, 13538749, 12776880, 12085789, 11456719, 10882244, 10356028, 9872638, 9427399, 9016261, 8635707, 8282668, 7954455, 7648706, 7363338, 7096508, 6846579, 6612096, 6391759, 6184404, 5988990, 5804576, 5630316, 5465448, 5309278, 5161179, 5020579, 4886959, 4759844, 4638801, 4523432, 4413374, 4308291, 4207876, 4111846, 4019938, 3931910, 3847540, 3766620]
309C766620p7662p4583p1670o8911o6297o3816o1461n9223n7095n5070n3141n1302m9548m7874
308B908967m6276m4747m3286m1887m0548l9263l8033l6853l5719l4630l3585l2579l1611l0679
307B379271k9783k8919k8085k7283k6507k5758k5036k4337k3662k3009k2377k1766k1173k0600
306B030976k0043j9503j8981j8473j7979j7501j7036j6584j6143j5716j5300j4894j4499j4114
305A794210j3740j3374j3016j2669j2329j1997j1672j1355j1045j0742j0445j0154r869r591
304A632212r317r048q786q527q274q024p780p538p302p069o839o614o390o171n954n740n530
303A507309n320n115m910m709m509m312m116l921l728l538l347l158k971k784k597k413k228
301A443633k045j860j677j494j311j127r44p60n76l92k05k0J68L57N45P37R30J123J320J517
$$ y = [3766620, 3688958, 3614375, 3542705, 3473794, 3407497, 3343681, 3282220, 3222997, 3165902, 3110832, 3057691, 3006389, 2956841, 2908967, 2862691, 2817944, 2774658, 2732771, 2692223, 2652960, 2614927, 2578074, 2542355, 2507725, 2474140, 2441561, 2409950, 2379271, 2349488, 2320569, 2292484, 2265201, 2238694, 2212936, 2187900, 2163563, 2139901, 2116892, 2094515, 2072749, 2051576, 2030976, 2010933, 1991430, 1972449, 1953976, 1935997, 1918496, 1901460, 1884876, 1868733, 1853017, 1837717, 1822823, 1808324, 1794210, 1780470, 1767096, 1754080, 1741411, 1729082, 1717085, 1705413, 1694058, 1683013, 1672271, 1661826, 1651672, 1641803, 1632212, 1622895, 1613847, 1605061, 1596534, 1588260, 1580236, 1572456, 1564918, 1557616, 1550547, 1543708, 1537094, 1530704, 1524533, 1518579, 1512839, 1507309, 1501989, 1496874, 1491964, 1487255, 1482746, 1478434, 1474318, 1470397, 1466669, 1463131, 1459784, 1456626, 1453655, 1450871, 1448274, 1445861, 1443633, 1441588, 1439728, 1438051, 1436557, 1435246, 1434119, 1433175, 1432415, 1431839, 1431447, 1431242, 1431222, 1431390, 1431747, 1432292, 1433029, 1433959, 1435082, 1436402, 1437919]
300A437919J718J920K125K333K544K757K975L195L419L648L880M118M360M606M859N118N382
298A496876N652N931O215O508O809P118P436P766Q103Q454Q814R188R575R976J0390J0823
297A625634J1270J1737J2222J2727J3255J3805J4382J4983J5615J6277J6972J7702J8470J9281
296A834332K0135K1036K1992K3002K4073K5211K6421K7710K9084L0553L2123L3807L5615L7559
295B222653L9653M1915M4362M7013M9893N3030N6452O0197O4302O8818P3798P9307Q5418R2222
294C079033R9822J08342J17934J28773J41080J55116J71207J89754K11256K36340K65806L00672
293E205135L42261L92308M53111N27770O20514P37215Q86175J079357J334335J677524K149469
292A5405174K813682L771109N181884P288059J0387096J4536810J8479079J8144164Q812778
$$ y = [1437919, 1439637, 1441557, 1443682, 1446015, 1448559, 1451316, 1454291, 1457486, 1460905, 1464553, 1468433, 1472551, 1476911, 1481517, 1486376, 1491494, 1496876, 1502528, 1508459, 1514674, 1521182, 1527991, 1535109, 1542545, 1550311, 1558414, 1566868, 1575682, 1584870, 1594445, 1604421, 1614811, 1625634, 1636904, 1648641, 1660863, 1673590, 1686845, 1700650, 1715032, 1730015, 1745630, 1761907, 1778879, 1796581, 1815051, 1834332, 1854467, 1875503, 1897495, 1920497, 1944570, 1969781, 1996202, 2023912, 2052996, 2083549, 2115672, 2149479, 2185094, 2222653, 2262306, 2304221, 2348583, 2395596, 2445489, 2498519, 2554971, 2615168, 2679470, 2748288, 2822086, 2901393, 2986811, 3079033, 3178855, 3287197, 3405131, 3533904, 3674984, 3830100, 4001307, 4191061, 4402317, 4638657, 4904463, 5205135, 5547396, 5939704, 6392815, 6920585, 7541099, 8278314, 9164489, 10243846, 11578181, 13255705, 15405174, 18218856, 21989965, 27171849, 34459908, 44847004, 59383814, 77862893, 96007057, 104819835]
292A04819835o083882j5203073j5077097j0343491m927714J37628N189803J0587156J5399109
291H4498274J5721201O449392q989969j8469826j8600383j4568027j0423607p328859n213206
290B3074990l787480k815132k137984j655378j303515j041450q42390o88451n67427m70839
289G764944l92668l28576k75382k30719j92798j60251j32020j07270q5347o5718m7955l1702
289E714538j6671k608J0696K3426L5746M7805N9735P1670Q3731R6042J08729J21920J35752
288F490511J50376J65952J82663K00715K20344K41822K65471K91666L20858L53586L90509
287I274473M32427M80332N35464N99374O74049P62045Q66693R92399J145067J332747J566579
286A8661649J862265K242351K739813L403739M308295N566196P346777R891067J3489348J8298727
$$ y = [104819835, 98735953, 83532880, 68455783, 58112292, 53184578, 53322206, 58512009, 69099165, 84498274, 100219475, 106668867, 97678898, 79209072, 60608689, 46040662, 35617055, 28288196, 23074990, 19287510, 16472378, 14334394, 12679016, 11375501, 10334051, 9491661, 8803210, 8235783, 7764944, 7372276, 7043700, 6768318, 6537599, 6344801, 6184550, 6052530, 5945260, 5859913, 5794195, 5746240, 5714538, 5697867, 5695259, 5705955, 5729381, 5765127, 5812932, 5872667, 5944337, 6028068, 6124110, 6232839, 6354759, 6490511, 6640887, 6806839, 6989502, 7190217, 7410561, 7652383, 7917854, 8209520, 8530378, 8883964, 9274473, 9706900, 10187232, 10722696, 11322070, 11996119, 12758164, 13624857, 14617256, 15762323, 17095070, 18661649, 20523914, 22766265, 25506078, 28909817, 33218112, 38784308, 46131085, 56022152, 69511500, 87810227]
285H7810227K3538052K5012422J5205160k282329j0756192o326700M041650J6888666L3140050
284A86271006M5720193J4052471j4540773K926241K3609586L5908985L4915563J9948349l755409
284C45056212k8415129m6306189n2325086m7229802l7257251k7663354k0241710j4921723
283G0695968j1176608q524012o615774n217252m172732l378363k763942k281202j896390j585490
282B3084203j331119j120524r44183p94913o67212n56817m60389l75282k99372k30937j68568
282A6134887j11093n7530p037M1113Q7554J32867J77568K22153K67087L12825L59830M08564
281A7968788M59518N13203N70183O31071O96545P67370Q44409R28663J021273J123567J237113
280B6761703J363743J505634J665390J846131K051636K286500K556357K868152L230560L654428
$$ y = [87810227, 111348279, 136360701, 151565861, 149283532, 138527340, 132200640, 136242290, 153130956, 186271006, 231991199, 246043670, 231502897, 234429138, 258038724, 293947709, 328863272, 348811621, 345056212, 316641083, 270334894, 218009808, 170780006, 133522755, 105859401, 85617691, 70695968, 59519360, 50995348, 44379574, 39162322, 34989590, 31611227, 28847285, 26566083, 24669693, 23084203, 21753084, 20632560, 19688377, 18893464, 18226252, 17669435, 17209046, 16833764, 16534392, 16303455, 16134887, 16023794, 15966264, 15959227, 16000340, 16087894, 16220761, 16398329, 16620482, 16887569, 17200394, 17560224, 17968788, 18428306, 18941509, 19511692, 20142763, 20839308, 21606678, 22451087, 23379750, 24401023, 25524590, 26761703, 28125446, 29631080, 31296470, 33142601, 35194237, 37480737, 40037094, 42905246, 46135806, 49790234]
279D9790234M153512M745362N452672O305012P341420Q614117J0193799J2177677J4701491
278A23475296J7957840K2224737K7910118L5621529M6271756O1225199Q2440748J12364071
278E29491294J52682021J99854459K36765538K32908100J69781576N9535044o4418651j61315486
277A355283895k00798191j77512418j21518566p7847155o8303882q2458854j01799346j07673637
277D17371846r2117653o8447746m8893742l5407204k6388462k0242490j5920652j2784355
276I7169542j0443574q653765p256604o146384n250465m517593l910834l402997k973692k607424
275D2006210k292207k018666j779370j568370j380841j212831j061064r22802p95716o77809
274B8296534n67342m62768l62694k65839j70991p6977J7354J13191K11762L14385M22509N37750
$$ y = [49790234, 53943746, 58689108, 64141780, 70446792, 77788212, 86402329, 96596128, 108773805, 123475296, 141433136, 163657873, 191567991, 227189520, 273461276, 334686475, 417127223, 529491294, 682173315, 882027774, 1118793312, 1351701412, 1521482988, 1581018032, 1516599381, 1355283895, 1154485704, 976973286, 855454720, 777607565, 709303683, 626844829, 525045483, 417371846, 325254193, 256806447, 207912705, 172505501, 146117039, 125874549, 109953897, 97169542, 86725968, 78072203, 70815599, 64669215, 59418750, 54901157, 50990323, 47587326, 44613634, 42006210, 39714003, 37695337, 35915967, 34347597, 32966756, 31753925, 30692861, 29770059, 28974343, 28296534, 27729192, 27266424, 26903730, 26637891, 26466900, 26389923, 26407277, 26520468, 26732230, 27046615, 27469124, 28006874]
273B8006874O61944P97227R46104J111562J297192J507380J747527K024346K346288K724084
273D3170528L171518L706495M352562N141038O114219P329983Q868854J0844660J3421320
272A06121177J6839203K1457805K7824860L6788641M9675143O8539761R6404034J36923902
271E60574526J91263010K45848447K46718161J14252080j07239651k38894143k36285799j78625630
271E97611001j19133946p0551677l2612253r912493j5594590m2135171n3764723m4070947
270B09835201k8462787j4499628k425276Q905355J8850231K1308653O089414k0589115l5379156
269A63632892l3763617k6386866j9453879j4268688j0625962q091304o307098n025933m085194
269C5624351l378953k837609k414690k078561j807265j585260j401342j247290j116971j005753
$$ y = [28006874, 28668818, 29466045, 30412149, 31523711, 32820903, 34328283, 36075810, 38100156, 40446444, 43170528, 46342046, 50048541, 54401103, 59542141, 65656360, 72986343, 81855197, 92699857, 106121177, 122960380, 144418185, 172243045, 209031686, 258706829, 327246590, 423650624, 560574526, 751837536, 997685983, 1244404144, 1358656224, 1251416573, 1012522430, 776236631, 597611001, 478477055, 407925378, 375313125, 365400632, 349806042, 307670871, 253906148, 209835201, 181372414, 166872786, 164447510, 173352865, 192203096, 213511749, 219601163, 199012048, 163632892, 129869275, 103482409, 84028530, 69759842, 59133880, 51042576, 44735478, 39709545, 35624351, 32245398, 29407789, 26993099, 24914538, 23107273, 21522013, 20120671, 18873381, 17756410, 16750657]
268A6750657r10070q27158p54839o91383o35399n85763n41549n02001m66488m34481m05539
267I995987l79285l55397l33607l13676k95401k78610k63143k48871k35675k23452k12108
266F856762k01566j91749j82599j74053j66065j58583j51571j44989j38803j32985j27505
266E086294j22338j17463j12857j08501j04380j00476r6774r3261q9928q6757q3743q0875
265C888941p8142p5539p3055p0685o8422o6259o4192o2214o0321n8508n6770n5105n3507n1973
264B994249n0501m9087m7727m6421m5163m3953m2787m1666m0585l9542l8538l7567l6633l5728
262B398351l4857l4013l3199l2412l1650l0913l0201k9510k8842k8195k7568k6960k6372k5799
261A977860k5246k4708k4186k3680k3188k2710k2246k1796k1357k0931k0517k0114j9722j9340
$$ y = [16750657, 15840587, 15013429, 14258590, 13567207, 12931808, 12346045, 11804496, 11302495, 10836007, 10401526, 9995987, 9616702, 9261305, 8927698, 8614022, 8318621, 8040011, 7776868, 7527997, 7292322, 7068870, 6856762, 6655196, 6463447, 6280848, 6106795, 5940730, 5782147, 5630576, 5485587, 5346784, 5213799, 5086294, 4963956, 4846493, 4733636, 4625135, 4520755, 4420279, 4323505, 4230244, 4140316, 4053559, 3969816, 3888941, 3810799, 3735260, 3662205, 3591520, 3523098, 3456839, 3392647, 3330433, 3270112, 3211604, 3154834, 3099729, 3046222, 2994249, 2943748, 2894661, 2846934, 2800513, 2755350, 2711397, 2668610, 2626944, 2586359, 2546817, 2508279, 2470712, 2434079, 2398351, 2363494, 2329481, 2296282, 2263870, 2232220, 2201307, 2171106, 2141596, 2112754, 2084559, 2056991, 2030031, 2003659, 1977860, 1952614, 1927906, 1903720, 1880040, 1856852, 1834142, 1811896, 1790100, 1768743, 1747812, 1727295, 1707181, 1687459, 1668119]
260A668119j8970j8608j8256j7913j7580j7255j6938j6629j6328j6034j5748j5469j5197j4931
259A432263j4672j4419j4171j3930j3695j3465j3240j3020j2805j2596j2391j2190j1995j1803
258A247871j1615j1432j1253j1077j0906j0737j0573j0412j0254j0099r949r800r655r513
257A100596r373r238r103q972q843q718q594q472q354q237q123q010p901p792p686p582p480
256I58118p380p281p185p090o996o905o815o726o640o554o471o388o308o227o150o072n998
255H44932n922n850n778n707n638n569n502n436n370n307n244n181n121n061n001m943m886
253G53416m829m774m719m666m612m560m508m458m408m359m310m263m215m169m124m078m034
252F78330l990l947l905l862l822l780l741l701l661l624l585l548l510l475l438l403l368
$$ y = [1668119, 1649149, 1630541, 1612285, 1594372, 1576792, 1559537, 1542599, 1525970, 1509642, 1493608, 1477860, 1462391, 1447194, 1432263, 1417591, 1403172, 1389001, 1375071, 1361376, 1347911, 1334671, 1321651, 1308846, 1296250, 1283859, 1271669, 1259674, 1247871, 1236256, 1224824, 1213571, 1202494, 1191588, 1180851, 1170278, 1159866, 1149612, 1139513, 1129564, 1119764, 1110109, 1100596, 1091223, 1081985, 1072882, 1063910, 1055067, 1046349, 1037755, 1029283, 1020929, 1012692, 1004569, 996559, 988658, 980866, 973180, 965598, 958118, 950738, 943457, 936272, 929182, 922186, 915281, 908466, 901740, 895100, 888546, 882075, 875687, 869379, 863152, 857002, 850930, 844932, 839010, 833160, 827382, 821675, 816037, 810468, 804966, 799530, 794160, 788853, 783609, 778428, 773307, 768246, 763245, 758302, 753416, 748587, 743813, 739094, 734428, 729816, 725256, 720748, 716290, 711882, 707523, 703213, 698950, 694735, 690566, 686442, 682364, 678330, 674340, 670393, 666488, 662626, 658804, 655024, 651283, 647582, 643921, 640297, 636712, 633164, 629654, 626179, 622741, 619338, 615970]
251F15970l333l299l266l232l200l167l136l104l072l042l012k982k952k924k894k866k838
249E63651k810k783k755k729k703k676k651k625k601k575k551k526k503k479k455k433k409
248E19387k387k365k343k320k299k278k257k236k215k195k175k155k135k116k096k077k059
247D81679k040k021k003j985j967j950j932j914j898j881j864j847j831j814j799j782j767
245D49384j751j736j721j705j690j676j661j646j632j617j604j589j576j562j548j535j522
244D21613j508j495j483j469j457j444j431j420j407j394j383j371j359j347j336j324j313
243C97672j301j290j279j268j258j246j235j225j214j204j194j183j172j163j153j143j132
242C77012j123j114j103j094j085j075j065j057j047j038j029j020j011j002r93r85r76r67
$$ y = [615970, 612637, 609338, 606072, 602840, 599640, 596473, 593337, 590233, 587161, 584119, 581107, 578125, 575173, 572249, 569355, 566489, 563651, 560841, 558058, 555303, 552574, 549871, 547195, 544544, 541919, 539318, 536743, 534192, 531666, 529163, 526684, 524229, 521796, 519387, 517000, 514635, 512292, 509972, 507673, 505395, 503138, 500902, 498687, 496492, 494317, 492162, 490027, 487911, 485815, 483738, 481679, 479639, 477618, 475615, 473630, 471663, 469713, 467781, 465867, 463969, 462088, 460224, 458377, 456546, 454732, 452933, 451151, 449384, 447633, 445897, 444176, 442471, 440781, 439105, 437444, 435798, 434166, 432549, 430945, 429356, 427780, 426218, 424670, 423135, 421613, 420105, 418610, 417127, 415658, 414201, 412757, 411326, 409906, 408499, 407105, 405722, 404351, 402992, 401645, 400309, 398985, 397672, 396371, 395081, 393802, 392534, 391276, 390030, 388795, 387570, 386356, 385152, 383958, 382775, 381603, 380440, 379287, 378144, 377012, 375889, 374775, 373672, 372578, 371493, 370418, 369353, 368296, 367249, 366211, 365182, 364162, 363151, 362149, 361156, 360171, 359195, 358228]
240C58228r59r50r42r34r25r17r08r01q92q85q76q69q60q53q45q38q29q23q14q07q00p92p85
238C38224p77p70p63p56p49p41p35p27p21p13p07p00o93o86o79o73o66o59o53o46o40o33o27
237C22110o20o14o08o01n95n88n83n76n70n64n57n52n45n40n33n28n21n16n09n04m98m92m86
235C09410m81m74m69m63m58m51m46m41m35m29m23m18m13m06m02l96l90l85l79l74l68l63l58
233B99788l52l47l42l36l31l25l20l15l10l04k99k94k88k84k78k72k68k62k57k52k47k42k36
231B93027k31k26k21k16k10k06k00j95j90j85j79j75j69j65j59j54j48j44j39j33j28j24j18
230B89012j13j07j03r7r3q7q2p6p2o6o2n6n0m6m0l6l0k4k0j4rmKPJ2J8K2K9L3L9M4N0N5O1
227B88097O6P1P7Q3Q8R3R9J05J10J15J22J27J32J39J44J50J55J61J67J73J79J85J90J96K03
$$ y = [358228, 357269, 356319, 355377, 354443, 353518, 352601, 351693, 350792, 349900, 349015, 348139, 347270, 346410, 345557, 344712, 343874, 343045, 342222, 341408, 340601, 339801, 339009, 338224, 337447, 336677, 335914, 335158, 334409, 333668, 332933, 332206, 331485, 330772, 330065, 329365, 328672, 327986, 327307, 326634, 325968, 325309, 324656, 324010, 323370, 322737, 322110, 321490, 320876, 320268, 319667, 319072, 318484, 317901, 317325, 316755, 316191, 315634, 315082, 314537, 313997, 313464, 312936, 312415, 311899, 311390, 310886, 310388, 309896, 309410, 308929, 308455, 307986, 307523, 307065, 306614, 306168, 305727, 305292, 304863, 304440, 304022, 303609, 303203, 302801, 302405, 302015, 301630, 301251, 300877, 300509, 300146, 299788, 299436, 299089, 298747, 298411, 298080, 297755, 297435, 297120, 296810, 296506, 296207, 295913, 295625, 295341, 295063, 294791, 294523, 294261, 294004, 293752, 293505, 293263, 293027, 292796, 292570, 292349, 292133, 291923, 291717, 291517, 291322, 291132, 290947, 290768, 290593, 290424, 290259, 290100, 289946, 289798, 289654, 289515, 289382, 289254, 289130, 289012, 288899, 288792, 288689, 288592, 288499, 288412, 288330, 288254, 288182, 288116, 288054, 287998, 287948, 287902, 287862, 287826, 287796, 287772, 287752, 287738, 287729, 287725, 287727, 287734, 287746, 287764, 287786, 287815, 287848, 287887, 287931, 287981, 288036, 288097, 288163, 288234, 288311, 288394, 288482, 288575, 288674, 288779, 288889, 289004, 289126, 289253, 289385, 289524, 289668, 289818, 289973, 290134, 290301, 290474, 290653, 290838, 291028, 291224, 291427]
225B91427K08K14K21K26K32K39K45K50K58K63K69K76K82K89K95L01L08L14L21L28L34L41L47
223B97788L54L61L68L75L81L89L95M03M09M17M24M31M39M46M53M60M68M76M83M91M99N06N14
222C07730N22N30N38N46N54N62N71N79N87N95O05O12O22O30O39O48O56O66O75O84O93P03P12
220C21859P21P31P41P51P60P70P81P90Q01Q11Q21Q32Q43Q53Q64Q76Q86Q97R08R20R32R43R54
218C41045R67R78R91J003J015J027J041J053J065J079J092J106J118J133J146J160J174J188
217C60381J203J217J232J247J262J277J292J308J324J340J356J372J389J406J422J440J457
215C82925J475J492J511J529J547J566J585J604J624J643J664J683J705J724J746J768J789
214D10580J811J833J855J879J901J926J948J974J997K022K048K073K099K125K152K179K207
$$ y = [291427, 291635, 291849, 292070, 292296, 292528, 292767, 293012, 293262, 293520, 293783, 294052, 294328, 294610, 294899, 295194, 295495, 295803, 296117, 296438, 296766, 297100, 297441, 297788, 298142, 298503, 298871, 299246, 299627, 300016, 300411, 300814, 301223, 301640, 302064, 302495, 302934, 303380, 303833, 304293, 304761, 305237, 305720, 306211, 306710, 307216, 307730, 308252, 308782, 309320, 309866, 310420, 310982, 311553, 312132, 312719, 313314, 313919, 314531, 315153, 315783, 316422, 317070, 317726, 318392, 319067, 319751, 320444, 321147, 321859, 322580, 323311, 324052, 324803, 325563, 326333, 327114, 327904, 328705, 329516, 330337, 331169, 332012, 332865, 333729, 334605, 335491, 336388, 337296, 338216, 339148, 340091, 341045, 342012, 342990, 343981, 344984, 345999, 347026, 348067, 349120, 350185, 351264, 352356, 353462, 354580, 355713, 356859, 358019, 359193, 360381, 361584, 362801, 364033, 365280, 366542, 367819, 369111, 370419, 371743, 373083, 374439, 375811, 377200, 378606, 380028, 381468, 382925, 384400, 385892, 387403, 388932, 390479, 392045, 393630, 395234, 396858, 398501, 400165, 401848, 403553, 405277, 407023, 408791, 410580, 412391, 414224, 416079, 417958, 419859, 421785, 423733, 425707, 427704, 429726, 431774, 433847, 435946, 438071, 440223, 442402, 444609]
213D44609K234K263K291K321K350K380K411K442K473K505K537K571K603K638K672K708K743
212D86751K779K816K854K891K931K969L010L050L091L134L176L220L264L309L354L402L449
210E39450L497L546L596L647L699L752L805L860L916L973M031M089M150M211M273M338M402
209F06235M468M535M605M675M746M819M894M970N048N126N208N291N374N461N549N639N730
208F92373N825N920O019O119O221O326O433O543O656O770O887P008P131P257P386P518P654
206H06046P792P935Q081Q230Q383Q541Q702Q867R037R212R390R574R762R957J0155J0360J0571
205I60595J0786J1009J1238J1473J1716J1964J2222J2485J2759J3038J3328J3627J3934J4251
204A134425J4578J4917J5265J5625J5998J6383J6780J7191J7617J8057J8512J8985J9473J9980
$$ y = [444609, 446843, 449106, 451397, 453718, 456068, 458448, 460859, 463301, 465774, 468279, 470816, 473387, 475990, 478628, 481300, 484008, 486751, 489530, 492346, 495200, 498091, 501022, 503991, 507001, 510051, 513142, 516276, 519452, 522672, 525936, 529245, 532599, 536001, 539450, 542947, 546493, 550089, 553736, 557435, 561187, 564992, 568852, 572768, 576741, 580772, 584861, 589011, 593222, 597495, 601833, 606235, 610703, 615238, 619843, 624518, 629264, 634083, 638977, 643947, 648995, 654121, 659329, 664620, 669994, 675455, 681004, 686643, 692373, 698198, 704118, 710137, 716256, 722477, 728803, 735236, 741779, 748435, 755205, 762092, 769100, 776231, 783488, 790874, 798392, 806046, 813838, 821773, 829854, 838084, 846467, 855008, 863710, 872577, 881614, 890826, 900216, 909790, 919552, 929509, 939664, 950024, 960595, 971381, 982390, 993628, 1005101, 1016817, 1028781, 1041003, 1053488, 1066247, 1079285, 1092613, 1106240, 1120174, 1134425, 1149003, 1163920, 1179185, 1194810, 1210808, 1227191, 1243971, 1261162, 1278779, 1296836, 1315348, 1334333, 1353806, 1373786]
203A373786K0504K1049K1614K2201K2809K3441K4098K4781K5492K6230K7000K7802K8636K9507
202A718950L0415L1363L2352L3385L4466L5595L6778L8016L9313M0672M2099M3597M5170M6823
201B248994M8563N0393N2323N4356N6503N8769O1164O3697O6381O9223P2239P5441P8844Q2466
200C139356Q6324R0437R4828R9522J04546J09928J15705J21911J28590J35787J43556J51955
199D522445J61051J70917J81642J93320K06064K19998K35268K52042K70512K90904L13475
198G017638L38535L66440L97613M32556M71869N16269N66624O23982O89635P65165Q52538
197A3038864R54224J073337J213857J380925J581257J823747K120334K487303K947248L532085
196C2153181M287819N282145O616853Q448162J1019451J4710557K0092749K7898570L8501465
$$ y = [1373786, 1394290, 1415339, 1436953, 1459154, 1481963, 1505404, 1529502, 1554283, 1579775, 1606005, 1633005, 1660807, 1689443, 1718950, 1749365, 1780728, 1813080, 1846465, 1880931, 1916526, 1953304, 1991320, 2030633, 2071305, 2113404, 2157001, 2202171, 2248994, 2297557, 2347950, 2400273, 2454629, 2511132, 2569901, 2631065, 2694762, 2761143, 2830366, 2902605, 2978046, 3056890, 3139356, 3225680, 3316117, 3410945, 3510467, 3615013, 3724941, 3840646, 3962557, 4091147, 4226934, 4370490, 4522445, 4683496, 4854413, 5036055, 5229375, 5435439, 5655437, 5890705, 6142747, 6413259, 6704163, 7017638, 7356173, 7722613, 8120226, 8552782, 9024651, 9540920, 10107544, 10731526, 11421161, 12186326, 13038864, 13993088, 15066425, 16280282, 17661207, 19242464, 21066211, 23186545, 25673848, 28621096, 32153181, 36441000, 41723145, 48339998, 56788160, 67807611, 82518168, 102610917, 130509487, 169010952]
196A69010952M9820658N3555023L7910434Q535790o426560M715288L1534707O0344128P1623455
195D80623875L8716870k8617010p0846880o5904312l7835473p478418M177567k5854986n8033780
194B28947453n5209548m0702627k8845759k0524794j4870118j1032659q386012o517491n165190
194C7693255m163015l404045k817950k357410j989846j692346j448492j246277j076798r33334
193A6563742q10752p05076o13186n32611m61374l97867l40783k89037k41723j98081j57455
192A1815797j19290q3084m8408j4861J7920N0274Q2526J14995J48001J81860K16915K53516
191A2616161K92049L32933L76632M23670M74641N30228N91221O58545P33287Q16737R10436
190A8756540J016245J136414J273690J431472J613967J826446K075583K369892K720365L141353
$$ y = [169010952, 218831610, 272386633, 310297067, 318832857, 312406297, 317121585, 348656292, 409000420, 480623875, 519340745, 490723735, 419876855, 353972543, 316137070, 308658652, 312836219, 286981233, 228947453, 173737905, 133035278, 104189519, 83664725, 68794607, 57761948, 49375936, 42858445, 37693255, 33530240, 30126195, 27308245, 24950835, 22960989, 21268643, 19820151, 18573874, 17497076, 16563742, 15752990, 15047914, 14434728, 13902117, 13440743, 13042876, 12702093, 12413056, 12171333, 11973252, 11815797, 11696507, 11613423, 11565015, 11550154, 11568074, 11618348, 11700874, 11815869, 11963870, 12145730, 12362645, 12616161, 12908210, 13241143, 13617775, 14041445, 14516086, 15046314, 15637535, 16296080, 17029367, 17846104, 18756540, 19772785, 20909199, 22182889, 23614361, 25228328, 27054774, 29130357, 31500249, 34220614, 37361967]
189C7361967L651823M277174N051944O023833P259810Q855778J0951669J3756108J7586578
189A14776684K2935802L0578856M1731880N8215904Q2277491J14572390J46624463J48843051
188G60556521Q4092262k1627040p8444017n9625026k733160N4116691P1768008J0297388r4607351
187G23794276j48105372j37458139j05318007p5935361n4325375l9371751k9114247k1997448
187A12168576j6965769j3333260j0656317q645108p107002n911590m968828m215425l606062
186C6759215l107795k696280k353294k065005j820787j612403j433373j278574j143913j026081
185A8221710r22397q30661p49062o76091o10490n51193m97301m48041m02752l60853l21839
185A1851030k85258k50711k17827j86273j55724j25884r6454o7136l7633p631K3203N5231
$$ y = [37361967, 41013790, 45290964, 50342908, 56366741, 63626551, 72482329, 83433998, 97190106, 114776684, 137712486, 168291342, 210023222, 268239126, 350516617, 465089007, 611713470, 760556521, 844648783, 823021743, 744577726, 684952700, 682219540, 736336231, 808104239, 818401627, 723794276, 575688904, 438230765, 332912758, 256977397, 202652022, 163280271, 134166024, 112168576, 95202807, 81869547, 71213230, 62568122, 55461120, 49549530, 44580702, 40365277, 36759215, 33651420, 30955140, 28601846, 26536841, 24716054, 23103651, 21670278, 20391704, 19247791, 18221710, 17299313, 16468652, 15719590, 15043499, 14433009, 13881816, 13384515, 12936474, 12533722, 12172869, 11851030, 11565772, 11315061, 11097234, 10910961, 10755237, 10629353, 10532899, 10465763, 10428130, 10420499, 10443702, 10498933]
184A0498933Q8854J24522J62753K04146K49408K99381L55085M17754M88920N70486O64850
183A4125092P75072R05091J060055J246772J474381J755343K106919K553459L129953L887674
182C3019811M903123O292267Q231893J0986674J4919296K0376839K7118612L2911201L2734420
181A91494136K2871380R640132O213504J6516933L3305557M1250471K0553848k3393681n1421592
181B67030688m9596354l4185412j7161074j638560J0943469J5244817L322457j9304354l2754321
180A41901356l1781471k4882962j8117918j3058427r547018p135857n458999m268365l403614
179B4246725k761585k275100j899579j604848j370049j180475j025567q97614p90889p01081
179I739938o24901n59806n03809m55341m13152l76235l43775l15105k89674k67028k46791
$$ y = [10498933, 10587787, 10712309, 10875062, 11079208, 11328616, 11627997, 11983082, 12400836, 12889756, 13460242, 14125092, 14900164, 15805255, 16865310, 18112082, 19586463, 21341806, 23448725, 26002184, 29132137, 33019811, 37922934, 44215201, 52447094, 63433768, 78353064, 98729903, 125848515, 158759716, 191494136, 214365516, 224005648, 230219152, 246736085, 280041642, 321292113, 341845961, 318452280, 267030688, 217434334, 183248922, 166087848, 164449288, 175392757, 190637574, 193960031, 174655677, 141901356, 110119885, 85236923, 67119005, 54060578, 44513560, 37377703, 31918704, 27650339, 24246725, 21485140, 19210040, 17310461, 15705613, 14335564, 13155089, 12129522, 11231908, 10441019, 9739938, 9115037, 8555231, 8051422, 7596081, 7182929, 6806694, 6462919, 6147814, 5858140, 5591112, 5344321]
178E344321k28638k12308j97568j84227j72119j61102j51051j41864j33444j25712j18599
177C517689j12040j05984j00380r5187r0366q5885q1712p7820p4188p0791o7612o4631o1835
176B429258n9208n6736n4410n2218n0148m8195m6348m4600m2946m1378l9891l8478l7137l5861
175A781704l4647l3492l2390l1341l0338k9382k8468k7594k6759k5959k5192k4460k3755k3081
174A384846k2433k1811k1214k0639k0088j9556j9046j8553j8079j7622j7181j6757j6347j5951
173A119569j5569j5201j4843j4499j4166j3843j3531j3229j2937j2653j2380j2113j1855j1605
172I31145j1363j1128j0899j0677j0462j0253j0050r852r660r474r292r115q944q776q613
170G82587q455q301q150q004p861p722p586p454p324p199p076o957o839o725o614o505o399
$$ y = [5344321, 5115683, 4903375, 4705807, 4521580, 4349461, 4188359, 4037308, 3895444, 3762000, 3636288, 3517689, 3405649, 3299665, 3199285, 3104098, 3013732, 2927847, 2846135, 2768315, 2694127, 2623336, 2555724, 2491093, 2429258, 2370050, 2313314, 2258904, 2206686, 2156538, 2108343, 2061995, 2017395, 1974449, 1933071, 1893180, 1854702, 1817565, 1781704, 1747057, 1713565, 1681175, 1649834, 1619496, 1590114, 1561646, 1534052, 1507293, 1481334, 1456142, 1431682, 1407927, 1384846, 1362413, 1340602, 1319388, 1298749, 1278661, 1259105, 1240059, 1221506, 1203427, 1185805, 1168624, 1151867, 1135520, 1119569, 1104000, 1088799, 1073956, 1059457, 1045291, 1031448, 1017917, 1004688, 991751, 979098, 966718, 954605, 942750, 931145, 919782, 908654, 897755, 887078, 876616, 866363, 856313, 846461, 836801, 827327, 818035, 808920, 799976, 791200, 782587, 774132, 765831, 757681, 749677, 741816, 734094, 726508, 719054, 711730, 704531, 697455, 690498, 683659, 676934, 670320, 663815, 657416]
169F57416o294o193o095n997n902n810n719n631n544n460n376n296n215n139n062m987m915
168E62781m844m773m705m637m572m507m444m383m321m262m203m147m090m035l980l928l876
167D89074l825l775l725l677l630l583l538l492l449l405l362l321l280l240l199l161l123
165D30289l084l048l012k975k941k906k872k838k805k773k742k709k679k649k619k589k560
164C82488k532k504k477k449k422k396k370k345k319k294k270k246k223k199k176k153k131
163C42982k109k087k066k045k024k003j984j963j944j924j906j886j868j850j832j813j797
161C09881j779j761j745j729j712j695j680j664j648j633j618j603j588j573j560j544j531
160B81818j517j504j489j477j463j450j438j425j412j400j387j376j363j352j340j329j317
$$ y = [657416, 651122, 644929, 638834, 632837, 626935, 621125, 615406, 609775, 604231, 598771, 593395, 588099, 582884, 577745, 572683, 567696, 562781, 557937, 553164, 548459, 543822, 539250, 534743, 530299, 525916, 521595, 517333, 513130, 508983, 504893, 500858, 496878, 492950, 489074, 485249, 481474, 477749, 474072, 470442, 466859, 463321, 459829, 456380, 452975, 449613, 446292, 443012, 439772, 436573, 433412, 430289, 427205, 424157, 421145, 418170, 415229, 412323, 409451, 406613, 403808, 401035, 398293, 395584, 392905, 390256, 387637, 385048, 382488, 379956, 377452, 374975, 372526, 370104, 367708, 365338, 362993, 360674, 358380, 356110, 353864, 351641, 349442, 347266, 345113, 342982, 340873, 338786, 336720, 334675, 332651, 330648, 328664, 326701, 324757, 322833, 320927, 319041, 317173, 315323, 313491, 311678, 309881, 308102, 306341, 304596, 302867, 301155, 299460, 297780, 296116, 294468, 292835, 291217, 289614, 288026, 286453, 284893, 283349, 281818, 280301, 278797, 277308, 275831, 274368, 272918, 271480, 270055, 268643, 267243, 265856, 264480, 263117, 261765, 260425, 259096, 257779]
159B57779j306j295j284j274j262j252j241j231j221j211j201j191j181j171j162j153j143
157B37000j134j125j116j107j098j090j081j072j064j055j048j039j031j023j015j008j000
156B18894r92r84r77r70r62r55r48r41r34r27r20r13r06r00q93q87q80q74q67q62q55q48q43
154A97856q37q31q25q19q13q08q01p97p90p86p79p75p69p63p59p53p48p43p38p33p28p23p18
153A80020p14p09p04o99o94o90o86o81o76o72o68o63o59o55o51o46o42o38o34o30o26o22o18
151A64743o14o10o07o02n99n95n92n87n84n81n77n73n70n66n63n60n56n52n50n46n43n39n36
149A51541n34n29n27n24n20n18n14n12n08n06n02n00m96m94m91m88m86m82m80m77m74m72m69
147A40038m66m64m61m58m56m54m50m49m46m43m41m38m36m34m31m29m27m24m22m19m18m15m13
$$ y = [257779, 256473, 255178, 253894, 252620, 251358, 250106, 248865, 247634, 246413, 245202, 244001, 242810, 241629, 240458, 239296, 238143, 237000, 235866, 234741, 233625, 232518, 231420, 230330, 229249, 228177, 227113, 226058, 225010, 223971, 222940, 221917, 220902, 219894, 218894, 217902, 216918, 215941, 214971, 214009, 213054, 212106, 211165, 210231, 209304, 208384, 207471, 206565, 205665, 204772, 203885, 203005, 202131, 201264, 200402, 199547, 198699, 197856, 197019, 196188, 195363, 194544, 193731, 192923, 192122, 191325, 190535, 189749, 188970, 188195, 187426, 186663, 185904, 185151, 184403, 183660, 182922, 182189, 181461, 180738, 180020, 179306, 178597, 177893, 177194, 176500, 175810, 175124, 174443, 173767, 173095, 172427, 171764, 171105, 170450, 169799, 169153, 168511, 167873, 167239, 166609, 165983, 165361, 164743, 164129, 163519, 162912, 162310, 161711, 161116, 160524, 159937, 159353, 158772, 158195, 157622, 157052, 156486, 155923, 155363, 154807, 154255, 153705, 153159, 152616, 152077, 151541, 151007, 150478, 149951, 149427, 148907, 148389, 147875, 147363, 146855, 146349, 145847, 145347, 144851, 144357, 143866, 143378, 142892, 142410, 141930, 141453, 140979, 140507, 140038, 139572, 139108, 138647, 138189, 137733, 137279, 136829, 136380, 135934, 135491, 135050, 134612, 134176, 133742, 133311, 132882, 132455, 132031, 131609, 131190, 130772, 130357, 129944]
146A29944m11m08m06m04m02m00l98l95l94l91l90l87l85l84l81l79l77l76l73l72l69l68l66
144A21028l64l62l60l58l57l55l52l52l49l48l46l44l42l41l39l37l36l34l32l31l29l28l26
142A13106l24l23l21l19l19l16l15l13l12l11l09l07l06l05l03l02l00k99k97k96k95k93k92
140A06029k90k89k88k87k85k84k82k81k80k79k77k76k75k74k72k71k70k68k68k66k65k64k62
139I9676k62k60k59k58k57k56k54k54k52k51k50k49k48k47k46k44k44k42k42k40k40k38k37
137I3946k37k35k34k34k32k31k31k29k28k28k26k26k24k24k23k21k21k20k19k18k17k17k15
135H8756k14k14k13k12k11k10k09k08k08k07k06k05k04k03k03k01k01k00k00j98j98j97j96
133H4038j96j94j94j93j92j92j91j90j89j89j87j88j86j86j84j85j83j83j82j81j81j80j79
$$ y = [129944, 129533, 129125, 128719, 128315, 127913, 127513, 127115, 126720, 126326, 125935, 125545, 125158, 124773, 124389, 124008, 123629, 123252, 122876, 122503, 122131, 121762, 121394, 121028, 120664, 120302, 119942, 119584, 119227, 118872, 118520, 118168, 117819, 117471, 117125, 116781, 116439, 116098, 115759, 115422, 115086, 114752, 114420, 114089, 113760, 113432, 113106, 112782, 112459, 112138, 111819, 111500, 111184, 110869, 110556, 110244, 109933, 109624, 109317, 109011, 108706, 108403, 108101, 107801, 107502, 107205, 106909, 106614, 106321, 106029, 105739, 105450, 105162, 104875, 104590, 104306, 104024, 103743, 103463, 103184, 102907, 102631, 102356, 102082, 101810, 101539, 101269, 101001, 100733, 100467, 100202, 99938, 99676, 99414, 99154, 98895, 98637, 98380, 98124, 97870, 97616, 97364, 97113, 96863, 96614, 96366, 96119, 95873, 95629, 95385, 95143, 94901, 94661, 94421, 94183, 93946, 93709, 93474, 93240, 93006, 92774, 92543, 92312, 92083, 91855, 91627, 91401, 91175, 90951, 90727, 90504, 90283, 90062, 89842, 89623, 89405, 89188, 88971, 88756, 88542, 88328, 88115, 87903, 87692, 87482, 87273, 87065, 86857, 86650, 86444, 86239, 86035, 85832, 85629, 85428, 85227, 85027, 84827, 84629, 84431, 84234, 84038, 83842, 83648, 83454, 83261, 83069, 82877, 82686, 82496, 82307, 82118, 81931, 81743, 81557, 81371, 81187, 81002, 80819, 80636, 80454, 80273, 80092, 79912, 79733]
132G9733j79j78j77j77j76j75j74j74j74j72j72j71j71j70j69j69j68j68j67j66j65j65j65
130G5791j64j63j62j62j62j61j60j59j60j58j58j57j57j56j56j55j54j54j54j52j53j51j52
128G2171j50j50j50j49j49j48j47j47j47j46j45j45j44j44j44j42j43j42j41j41j40j40j40
126F8837j39j38j38j38j37j37j36j35j36j34j35j34j33j33j32j32j32j31j31j30j30j29j29
125F5758j29j28j28j27j27j26j26j26j25j25j24j24j23j24j22j23j22j21j21j21j20j20j20
123F2906j19j19j18j18j18j17j17j17j16j16j15j15j15j14j14j13j14j13j12j12j12j12j11
121F0259j10j11j10j10j09j09j09j08j08j08j07j07j07j06j06j06j05j06j04j05j04j04j03
119E7797j03j03j03j02j02j01j02j01j00j01j00j00r9r9r9r9r8r8r8r7r7r7r7r6r6r6r5r5
$$ y = [79733, 79554, 79376, 79199, 79022, 78846, 78671, 78497, 78323, 78149, 77977, 77805, 77634, 77463, 77293, 77124, 76955, 76787, 76619, 76452, 76286, 76121, 75956, 75791, 75627, 75464, 75302, 75140, 74978, 74817, 74657, 74498, 74338, 74180, 74022, 73865, 73708, 73552, 73396, 73241, 73087, 72933, 72779, 72627, 72474, 72323, 72171, 72021, 71871, 71721, 71572, 71423, 71275, 71128, 70981, 70834, 70688, 70543, 70398, 70254, 70110, 69966, 69824, 69681, 69539, 69398, 69257, 69117, 68977, 68837, 68698, 68560, 68422, 68284, 68147, 68010, 67874, 67739, 67603, 67469, 67334, 67200, 67067, 66934, 66802, 66670, 66538, 66407, 66276, 66146, 66016, 65887, 65758, 65629, 65501, 65373, 65246, 65119, 64993, 64867, 64741, 64616, 64491, 64367, 64243, 64120, 63996, 63874, 63751, 63629, 63508, 63387, 63266, 63146, 63026, 62906, 62787, 62668, 62550, 62432, 62314, 62197, 62080, 61963, 61847, 61731, 61616, 61501, 61386, 61272, 61158, 61045, 60931, 60818, 60706, 60594, 60482, 60370, 60259, 60149, 60038, 59928, 59818, 59709, 59600, 59491, 59383, 59275, 59167, 59060, 58953, 58846, 58740, 58634, 58528, 58423, 58317, 58213, 58108, 58004, 57900, 57797, 57694, 57591, 57488, 57386, 57284, 57183, 57081, 56980, 56880, 56779, 56679, 56579, 56480, 56381, 56282, 56183, 56085, 55987, 55889, 55792, 55695, 55598, 55501, 55405, 55309, 55213, 55118, 55023]
117E5023r5r5r4r4r4r4r3r3r2r3r2r2r2r1r1r1r0r1r0q9r0q9q9q9q9q8q8q8q7q7q7q7q7q6
115E1946q6q6q5q6q5q5q4q5q4q4q3q4q3q3q3q2q2q2q2q2q1q1q1q1q0q1q0q0p9q0p9p9p9p8
112D9151p8p9p7p8p8p7p7p7p6p7p6p6p6p6p5p5p5p5p5p4p5p4p3p4p4p3p3p3p3p2p2p2p2p2
109D6602p2p1p1p1p1p1p0p1p0p0o9p0o9o9o9o9o9o8o9o8o8o8o7o8o7o7o7o7o7o6o6o6o6o6
107D4269o6o5o5o6o4o5o5o4o5o4o4o4o3o4o3o3o3o3o3o3o2o2o3o2o1o2o2o1o1o1o1o1o1o0
104D2127o0o1o0o0n9o0n9o0n9n9n9n9n8n9n8n8n8n8n8n8n7n8n7n7n7n7n6n7n6n7n6n6n6n6
102D0154n5n6n5n5n6n5n4n5n5n4n5n4n4n4n4n4n3n4n3n3n4n3n3n2n3n2n3n2n2n2n2n2n2n1
99C8333n2n1n1n2n1n0n1n1n0n1n0n0n1n0m9n0n0m9n0m9m9m9m9m9m9m9m8m9m8m8m9m8m7m8m8
$$ y = [55023, 54928, 54833, 54739, 54645, 54551, 54457, 54364, 54271, 54179, 54086, 53994, 53902, 53810, 53719, 53628, 53537, 53447, 53356, 53266, 53177, 53087, 52998, 52909, 52820, 52731, 52643, 52555, 52467, 52380, 52293, 52206, 52119, 52032, 51946, 51860, 51774, 51689, 51603, 51518, 51433, 51349, 51264, 51180, 51096, 51013, 50929, 50846, 50763, 50680, 50598, 50516, 50434, 50352, 50270, 50189, 50108, 50027, 49946, 49866, 49785, 49705, 49625, 49546, 49466, 49387, 49308, 49229, 49151, 49073, 48994, 48917, 48839, 48761, 48684, 48607, 48530, 48454, 48377, 48301, 48225, 48149, 48073, 47998, 47923, 47848, 47773, 47698, 47624, 47549, 47475, 47402, 47328, 47254, 47181, 47108, 47035, 46962, 46890, 46818, 46746, 46674, 46602, 46530, 46459, 46388, 46317, 46246, 46175, 46105, 46034, 45964, 45894, 45825, 45755, 45686, 45617, 45548, 45479, 45410, 45342, 45273, 45205, 45137, 45069, 45002, 44934, 44867, 44800, 44733, 44666, 44599, 44533, 44467, 44401, 44335, 44269, 44203, 44138, 44073, 44007, 43943, 43878, 43813, 43749, 43684, 43620, 43556, 43492, 43429, 43365, 43302, 43239, 43176, 43113, 43050, 42987, 42925, 42863, 42800, 42738, 42677, 42615, 42553, 42492, 42431, 42370, 42309, 42248, 42187, 42127, 42067, 42006, 41946, 41886, 41827, 41767, 41708, 41648, 41589, 41530, 41471, 41412, 41354, 41295, 41237, 41179, 41121, 41063, 41005, 40947, 40890, 40832, 40775, 40718, 40661, 40604, 40548, 40491, 40435, 40378, 40322, 40266, 40210, 40154, 40099, 40043, 39988, 39933, 39877, 39822, 39768, 39713, 39658, 39604, 39549, 39495, 39441, 39387, 39333, 39279, 39226, 39172, 39119, 39066, 39012, 38959, 38906, 38854, 38801, 38749, 38696, 38644, 38592, 38540, 38488, 38436, 38384, 38333, 38281, 38230, 38179, 38127, 38076, 38026, 37975, 37924, 37874, 37823, 37773, 37723, 37672, 37622, 37573, 37523, 37473, 37424, 37374, 37325, 37276, 37227, 37178, 37129, 37080, 37031, 36983, 36934, 36886, 36838, 36789, 36741, 36694, 36646, 36598]
96C6598m8m7m8m7m7m7m7m7m7m7m6m7m6m6m6m7m6m5m6m6m6m5m5m6m5m5m5m5m5m5m4m5m4m5m4
94C4991m4m4m4m4m4m3m4m4m3m3m4m3m3m3m3m2m3m3m2m3m2m2m2m3m2m1m2m2m2m1m2m1m1m2m1
91C3499m1m1m1m0m1m1m0m1m0m1m0m0m0m0m0m0l9m0m0l9m0l9l9l9m0l9l9l8l9l9l9l8l9l8l8
88C2111l9l8l8l8l8l8l8l7l8l7l8l7l8l7l7l7l7l7l7l7l7l7l6l7l6l7l6l6l7l6l6l6l6l6l5
86C0816l6l6l5l6l5l6l5l5l5l6l5l5l4l5l5l5l4l5l4l5l4l5l4l4l4l4l4l4l4l4l4l3l4l3l4
83B9605l3l4l3l3l3l3l3l3l3l3l3l3l2l3l3l2l2l3l2l2l3l2l2l2l2l2l2l1l2l2l1l2l1l2l1
80B8472l2l1l1l1l1l1l1l1l1l1l1l0l1l1l0l1l0l0l1l0l0l0l0l0l0l0l0l0l0l0k9l0k9l0k9
78B7409l0k9k9l0k9k9k9k9k9k9k9k9k9k8k9k9k8k9k8k9k8k8k9k8k8k8k8k8k8k8k8k8k8k8k7
$$ y = [36598, 36550, 36503, 36455, 36408, 36361, 36314, 36267, 36220, 36173, 36126, 36080, 36033, 35987, 35941, 35895, 35848, 35802, 35757, 35711, 35665, 35619, 35574, 35529, 35483, 35438, 35393, 35348, 35303, 35258, 35213, 35169, 35124, 35080, 35035, 34991, 34947, 34903, 34859, 34815, 34771, 34728, 34684, 34640, 34597, 34554, 34510, 34467, 34424, 34381, 34338, 34296, 34253, 34210, 34168, 34125, 34083, 34041, 33999, 33956, 33914, 33873, 33831, 33789, 33747, 33706, 33664, 33623, 33582, 33540, 33499, 33458, 33417, 33376, 33336, 33295, 33254, 33214, 33173, 33133, 33092, 33052, 33012, 32972, 32932, 32892, 32852, 32813, 32773, 32733, 32694, 32654, 32615, 32576, 32537, 32497, 32458, 32419, 32381, 32342, 32303, 32264, 32226, 32187, 32149, 32111, 32072, 32034, 31996, 31958, 31920, 31882, 31844, 31807, 31769, 31732, 31694, 31657, 31619, 31582, 31545, 31508, 31471, 31434, 31397, 31360, 31323, 31286, 31250, 31213, 31177, 31140, 31104, 31068, 31031, 30995, 30959, 30923, 30887, 30851, 30816, 30780, 30744, 30709, 30673, 30638, 30602, 30567, 30532, 30497, 30461, 30426, 30391, 30357, 30322, 30287, 30252, 30218, 30183, 30149, 30114, 30080, 30045, 30011, 29977, 29943, 29909, 29875, 29841, 29807, 29773, 29739, 29706, 29672, 29639, 29605, 29572, 29538, 29505, 29472, 29439, 29406, 29373, 29340, 29307, 29274, 29241, 29208, 29176, 29143, 29110, 29078, 29046, 29013, 28981, 28949, 28916, 28884, 28852, 28820, 28788, 28756, 28724, 28693, 28661, 28629, 28598, 28566, 28535, 28503, 28472, 28440, 28409, 28378, 28347, 28316, 28285, 28254, 28223, 28192, 28161, 28130, 28100, 28069, 28038, 28008, 27977, 27947, 27917, 27886, 27856, 27826, 27796, 27766, 27736, 27706, 27676, 27646, 27616, 27586, 27556, 27527, 27497, 27468, 27438, 27409, 27379, 27350, 27321, 27291, 27262, 27233, 27204, 27175, 27146, 27117, 27088, 27059, 27030, 27002, 26973, 26944, 26916, 26887, 26859, 26830, 26802, 26774, 26745, 26717, 26689, 26661, 26633, 26605, 26577, 26549, 26521, 26493, 26465, 26437, 26410]
75B6410k8k8k7k8k7k8k7k7k8k7k7k7k7k7k7k7k7k7k7k7k6k7k7k6k7k6k7k6k6k7k6k6k6k7k6
72B5469k6k6k6k6k5k6k6k6k6k5k6k5k6k5k6k5k6k5k5k5k6k5k5k5k5k5k5k5k5k5k4k5k5k4k5
70B4583k5k4k5k4k4k5k4k4k5k4k4k4k4k4k4k4k4k4k4k4k4k3k4k4k3k4k4k3k4k3k3k4k3k3k4
67B3746k3k3k3k3k3k3k3k3k3k3k3k3k3k2k3k3k2k3k2k3k2k3k2k3k2k2k3k2k2k2k2k2k3k2k2
64B2955k2k1k2k2k2k2k2k1k2k2k1k2k1k2k1k2k1k2k1k1k2k1k1k1k1k2k1k1k1k1k1k1k1k0k1
62B2207k1k1k1k0k1k1k0k1k0k1k0k1k0k1k0k0k1k0k0k0k0k1k0k0k0k0k0k0k0k0k0j9k0k0k0
59B1497j9k0k0j9k0k0j9k0j9k0j9j9k0j9j9k0j9j9j9k0j9j9j9j9j9j9j9j9j9j9j9j9j8j9j9
56B0824j9j8j9j9j8j9j8j9j8j9j8j9j8j9j8j8j9j8j8j8j8j9j8j8j8j8j8j8j8j8j8j8j8j8j7
$$ y = [26410, 26382, 26354, 26327, 26299, 26272, 26244, 26217, 26190, 26162, 26135, 26108, 26081, 26054, 26027, 26000, 25973, 25946, 25919, 25892, 25865, 25839, 25812, 25785, 25759, 25732, 25706, 25679, 25653, 25627, 25600, 25574, 25548, 25522, 25495, 25469, 25443, 25417, 25391, 25365, 25340, 25314, 25288, 25262, 25236, 25211, 25185, 25160, 25134, 25109, 25083, 25058, 25032, 25007, 24982, 24957, 24931, 24906, 24881, 24856, 24831, 24806, 24781, 24756, 24731, 24706, 24682, 24657, 24632, 24608, 24583, 24558, 24534, 24509, 24485, 24461, 24436, 24412, 24388, 24363, 24339, 24315, 24291, 24267, 24243, 24219, 24195, 24171, 24147, 24123, 24099, 24075, 24052, 24028, 24004, 23981, 23957, 23933, 23910, 23886, 23863, 23840, 23816, 23793, 23770, 23746, 23723, 23700, 23677, 23654, 23631, 23608, 23585, 23562, 23539, 23516, 23493, 23470, 23447, 23425, 23402, 23379, 23357, 23334, 23312, 23289, 23267, 23244, 23222, 23199, 23177, 23155, 23132, 23110, 23088, 23066, 23044, 23022, 22999, 22977, 22955, 22933, 22912, 22890, 22868, 22846, 22824, 22802, 22781, 22759, 22737, 22716, 22694, 22673, 22651, 22630, 22608, 22587, 22565, 22544, 22523, 22501, 22480, 22459, 22438, 22417, 22395, 22374, 22353, 22332, 22311, 22290, 22269, 22248, 22228, 22207, 22186, 22165, 22144, 22124, 22103, 22082, 22062, 22041, 22021, 22000, 21980, 21959, 21939, 21918, 21898, 21878, 21857, 21837, 21817, 21797, 21777, 21756, 21736, 21716, 21696, 21676, 21656, 21636, 21616, 21596, 21576, 21557, 21537, 21517, 21497, 21478, 21458, 21438, 21419, 21399, 21379, 21360, 21340, 21321, 21301, 21282, 21263, 21243, 21224, 21205, 21185, 21166, 21147, 21128, 21108, 21089, 21070, 21051, 21032, 21013, 20994, 20975, 20956, 20937, 20918, 20899, 20880, 20862, 20843, 20824, 20805, 20787, 20768, 20749, 20731, 20712, 20694, 20675, 20657, 20638, 20620, 20601, 20583, 20564, 20546, 20528, 20509, 20491, 20473, 20455, 20437, 20418, 20400, 20382, 20364, 20346, 20328, 20310, 20292, 20274, 20256, 20238, 20220, 20202, 20185]
54B0185j8j8j8j7j8j8j7j8j8j7j8j7j8j7j8j7j8j7j7j8j7j7j7j8j7j7j7j7j7j7j8j7j7j7j7
51A9576j6j7j7j7j7j7j7j6j7j7j6j7j7j6j7j7j6j7j6j7j6j7j6j6j7j6j7j6j6j6j7j6j6j6j6
48A8998j7j6j6j6j6j6j6j6j6j6j6j6j5j6j6j6j6j5j6j6j6j5j6j5j6j6j5j6j5j6j5j6j5j6j5
46A8446j5j6j5j5j6j5j5j5j6j5j5j5j5j5j6j5j5j5j5j5j5j5j5j4j5j5j5j5j5j5j4j5j5j4j5
43A7920j5j5j4j5j4j5j4j5j5j4j5j4j4j5j4j5j4j4j5j4j4j5j4j4j4j5j4j4j4j4j4j4j4j4j4
40A7418j4j4j4j4j4j4j4j4j4j4j4j3j4j4j4j4j3j4j4j3j4j4j3j4j3j4j4j3j4j3j4j3j4j3j3
38A6938j4j3j4j3j3j4j3j3j3j4j3j3j3j3j4j3j3j3j3j3j3j3j3j3j3j3j3j3j3j3j3j3j3j3j2
35A6479j3j3j3j3j2j3j3j3j2j3j3j2j3j2j3j3j2j3j2j3j2j3j2j3j2j3j2j2j3j2j2j3j2j2j3
$$ y = [20185, 20167, 20149, 20131, 20114, 20096, 20078, 20061, 20043, 20025, 20008, 19990, 19973, 19955, 19938, 19920, 19903, 19885, 19868, 19851, 19833, 19816, 19799, 19782, 19764, 19747, 19730, 19713, 19696, 19679, 19662, 19644, 19627, 19610, 19593, 19576, 19560, 19543, 19526, 19509, 19492, 19475, 19458, 19442, 19425, 19408, 19392, 19375, 19358, 19342, 19325, 19308, 19292, 19275, 19259, 19242, 19226, 19209, 19193, 19177, 19160, 19144, 19127, 19111, 19095, 19079, 19062, 19046, 19030, 19014, 18998, 18981, 18965, 18949, 18933, 18917, 18901, 18885, 18869, 18853, 18837, 18821, 18805, 18790, 18774, 18758, 18742, 18726, 18711, 18695, 18679, 18663, 18648, 18632, 18617, 18601, 18585, 18570, 18554, 18539, 18523, 18508, 18492, 18477, 18461, 18446, 18431, 18415, 18400, 18385, 18369, 18354, 18339, 18324, 18308, 18293, 18278, 18263, 18248, 18233, 18217, 18202, 18187, 18172, 18157, 18142, 18127, 18112, 18097, 18083, 18068, 18053, 18038, 18023, 18008, 17993, 17979, 17964, 17949, 17935, 17920, 17905, 17890, 17876, 17861, 17847, 17832, 17818, 17803, 17788, 17774, 17759, 17745, 17731, 17716, 17702, 17687, 17673, 17659, 17644, 17630, 17616, 17601, 17587, 17573, 17559, 17544, 17530, 17516, 17502, 17488, 17474, 17460, 17446, 17432, 17418, 17404, 17390, 17376, 17362, 17348, 17334, 17320, 17306, 17292, 17278, 17264, 17251, 17237, 17223, 17209, 17195, 17182, 17168, 17154, 17141, 17127, 17113, 17100, 17086, 17073, 17059, 17045, 17032, 17018, 17005, 16991, 16978, 16964, 16951, 16938, 16924, 16911, 16897, 16884, 16871, 16857, 16844, 16831, 16818, 16804, 16791, 16778, 16765, 16752, 16738, 16725, 16712, 16699, 16686, 16673, 16660, 16647, 16634, 16621, 16608, 16595, 16582, 16569, 16556, 16543, 16530, 16517, 16504, 16491, 16479, 16466, 16453, 16440, 16427, 16415, 16402, 16389, 16376, 16364, 16351, 16338, 16326, 16313, 16301, 16288, 16275, 16263, 16250, 16238, 16225, 16213, 16200, 16188, 16175, 16163, 16150, 16138, 16126, 16113, 16101, 16089, 16076, 16064, 16052, 16039]
32A6039j2j2j2j3j2j2j2j2j3j2j2j2j2j2j2j2j2j2j2j2j2j2j2j2j2j2j2j2j2j1j2j2j2j2j1
30A5619j2j2j2j1j2j2j1j2j2j1j2j2j1j2j1j2j1j2j1j2j1j2j1j2j1j2j1j1j2j1j2j1j1j1j2
27A5215j1j1j2j1j1j1j1j2j1j1j1j1j1j1j2j1j1j1j1j1j1j1j1j1j1j1j1j1j0j1j1j1j1j1j1
24A4828j0j1j1j1j1j0j1j1j1j0j1j1j0j1j1j0j1j0j1j1j0j1j0j1j0j1j0j1j0j1j0j1j0j1j0
22A4457j0j1j0j0j1j0j0j1j0j0j1j0j0j0j1j0j0j0j0j1j0j0j0j0j0j0j0j0j1j0j0j0j0j0j0
19A4100j0j0j0j0j0rj0j0j0j0j0j0j0rj0j0j0j0rj0j0j0j0rj0j0rj0j0rj0j0rj0j0rj0rj0
16A3719rj0j0rj0rj0rj0rrj0rj0rj0rrj0rrj0rrj0rrj0rrrj0rrrrj0rrrrrrj0rrrrrrrrrr
12A3218rrrrrrrrrrrrrqrrrrrqrrrrqrrrqrrrqrrqrrqrrqrqrrqrqrqrqrqrqrqrqrqrqqrqr
$$ y = [16039, 16027, 16015, 16003, 15990, 15978, 15966, 15954, 15942, 15929, 15917, 15905, 15893, 15881, 15869, 15857, 15845, 15833, 15821, 15809, 15797, 15785, 15773, 15761, 15749, 15737, 15725, 15713, 15701, 15689, 15678, 15666, 15654, 15642, 15630, 15619, 15607, 15595, 15583, 15572, 15560, 15548, 15537, 15525, 15513, 15502, 15490, 15478, 15467, 15455, 15444, 15432, 15421, 15409, 15398, 15386, 15375, 15363, 15352, 15340, 15329, 15317, 15306, 15295, 15283, 15272, 15260, 15249, 15238, 15227, 15215, 15204, 15193, 15181, 15170, 15159, 15148, 15137, 15125, 15114, 15103, 15092, 15081, 15070, 15059, 15047, 15036, 15025, 15014, 15003, 14992, 14981, 14970, 14959, 14948, 14937, 14926, 14915, 14904, 14894, 14883, 14872, 14861, 14850, 14839, 14828, 14818, 14807, 14796, 14785, 14774, 14764, 14753, 14742, 14731, 14721, 14710, 14699, 14689, 14678, 14667, 14657, 14646, 14636, 14625, 14614, 14604, 14593, 14583, 14572, 14562, 14551, 14541, 14530, 14520, 14509, 14499, 14488, 14478, 14467, 14457, 14447, 14436, 14426, 14416, 14405, 14395, 14385, 14374, 14364, 14354, 14343, 14333, 14323, 14313, 14302, 14292, 14282, 14272, 14262, 14251, 14241, 14231, 14221, 14211, 14201, 14191, 14181, 14171, 14160, 14150, 14140, 14130, 14120, 14110, 14100, 14090, 14080, 14070, 14060, 14050, 14041, 14031, 14021, 14011, 14001, 13991, 13981, 13971, 13962, 13952, 13942, 13932, 13922, 13913, 13903, 13893, 13883, 13873, 13864, 13854, 13844, 13835, 13825, 13815, 13806, 13796, 13786, 13777, 13767, 13757, 13748, 13738, 13729, 13719, 13710, 13700, 13690, 13681, 13671, 13662, 13652, 13643, 13633, 13624, 13615, 13605, 13596, 13586, 13577, 13567, 13558, 13549, 13539, 13530, 13521, 13511, 13502, 13493, 13483, 13474, 13465, 13455, 13446, 13437, 13428, 13418, 13409, 13400, 13391, 13382, 13372, 13363, 13354, 13345, 13336, 13327, 13318, 13308, 13299, 13290, 13281, 13272, 13263, 13254, 13245, 13236, 13227, 13218, 13209, 13200, 13191, 13182, 13173, 13164, 13155, 13146, 13137, 13128, 13119, 13110, 13101, 13093, 13084, 13075, 13066, 13057, 13048, 13040, 13031, 13022, 13013, 13004, 12996, 12987, 12978, 12969, 12961, 12952, 12943, 12934, 12926, 12917, 12908, 12900, 12891, 12882, 12874, 12865, 12856, 12848, 12839, 12831, 12822, 12813, 12805, 12796, 12788, 12779, 12771, 12762, 12754, 12745, 12737, 12728, 12720, 12711, 12703, 12694, 12686, 12677, 12669, 12660, 12652, 12644, 12635, 12627, 12618]
6A2618qqrqqrqqrqqqrqqqrqqqqrqqqqqqrqqqqqqqqqqqqqqqqqqqqqqqqqqqqqpqqqqqqpqqqq
1A2053pqqqpqqqpqqpqqpqqpqqpqqpqpqpqqpqpqpqpqpqpqpqppqpqppqpqppqppqppqppqpppq
-4A1527pppqppppqpppppqpppppppqpppppppppppppppppppppppppoppppppppopppppoppppo
-9A1044pppopppopppoppoppoppoppopoppopoppopopopopopopopopopopoopopopoopoopopo
-15A0591opoopooopoopooopooopoooopoooopoooooopoooooooopoooooooooooooooooooooo
-20A0173oooooonoooooooonoooooonoooonoooonoooonooonoonooonoonoonoonoononoonon
-25I781oononoononononononononononononononnononnononnonnononnonnonnonnnonnonn
-30I406nonnnonnnonnnnonnnnnonnnnnonnnnnnnonnnnnnnnnnnonnnnnnnnnnnnnnnnnnnnnn
$$ y = [12618, 12610, 12602, 12593, 12585, 12577, 12568, 12560, 12552, 12543, 12535, 12527, 12519, 12510, 12502, 12494, 12486, 12477, 12469, 12461, 12453, 12445, 12436, 12428, 12420, 12412, 12404, 12396, 12388, 12379, 12371, 12363, 12355, 12347, 12339, 12331, 12323, 12315, 12307, 12299, 12291, 12283, 12275, 12267, 12259, 12251, 12243, 12235, 12227, 12219, 12211, 12203, 12195, 12187, 12179, 12171, 12163, 12155, 12147, 12140, 12132, 12124, 12116, 12108, 12100, 12092, 12085, 12077, 12069, 12061, 12053, 12046, 12038, 12030, 12022, 12015, 12007, 11999, 11991, 11984, 11976, 11968, 11961, 11953, 11945, 11938, 11930, 11922, 11915, 11907, 11899, 11892, 11884, 11876, 11869, 11861, 11854, 11846, 11839, 11831, 11823, 11816, 11808, 11801, 11793, 11786, 11778, 11771, 11763, 11756, 11748, 11741, 11733, 11726, 11718, 11711, 11704, 11696, 11689, 11681, 11674, 11667, 11659, 11652, 11644, 11637, 11630, 11622, 11615, 11608, 11600, 11593, 11586, 11578, 11571, 11564, 11556, 11549, 11542, 11535, 11527, 11520, 11513, 11506, 11498, 11491, 11484, 11477, 11470, 11462, 11455, 11448, 11441, 11434, 11427, 11419, 11412, 11405, 11398, 11391, 11384, 11377, 11370, 11362, 11355, 11348, 11341, 11334, 11327, 11320, 11313, 11306, 11299, 11292, 11285, 11278, 11271, 11264, 11257, 11250, 11243, 11236, 11229, 11222, 11215, 11208, 11201, 11194, 11187, 11181, 11174, 11167, 11160, 11153, 11146, 11139, 11132, 11125, 11119, 11112, 11105, 11098, 11091, 11084, 11078, 11071, 11064, 11057, 11050, 11044, 11037, 11030, 11023, 11017, 11010, 11003, 10996, 10990, 10983, 10976, 10969, 10963, 10956, 10949, 10943, 10936, 10929, 10923, 10916, 10909, 10903, 10896, 10889, 10883, 10876, 10870, 10863, 10856, 10850, 10843, 10837, 10830, 10823, 10817, 10810, 10804, 10797, 10791, 10784, 10778, 10771, 10765, 10758, 10752, 10745, 10739, 10732, 10726, 10719, 10713, 10706, 10700, 10693, 10687, 10681, 10674, 10668, 10661, 10655, 10648, 10642, 10636, 10629, 10623, 10617, 10610, 10604, 10597, 10591, 10585, 10578, 10572, 10566, 10559, 10553, 10547, 10541, 10534, 10528, 10522, 10515, 10509, 10503, 10497, 10490, 10484, 10478, 10472, 10465, 10459, 10453, 10447, 10441, 10434, 10428, 10422, 10416, 10410, 10403, 10397, 10391, 10385, 10379, 10373, 10367, 10360, 10354, 10348, 10342, 10336, 10330, 10324, 10318, 10312, 10305, 10299, 10293, 10287, 10281, 10275, 10269, 10263, 10257, 10251, 10245, 10239, 10233, 10227, 10221, 10215, 10209, 10203, 10197, 10191, 10185, 10179, 10173, 10167, 10161, 10155, 10149, 10143, 10137, 10132, 10126, 10120, 10114, 10108, 10102, 10096, 10090, 10084, 10079, 10073, 10067, 10061, 10055, 10049, 10043, 10038, 10032, 10026, 10020, 10014, 10009, 10003, 9997, 9991, 9985, 9980, 9974, 9968, 9962, 9956, 9951, 9945, 9939, 9933, 9928, 9922, 9916, 9911, 9905, 9899, 9893, 9888, 9882, 9876, 9871, 9865, 9859, 9854, 9848, 9842, 9837, 9831, 9825, 9820, 9814, 9809, 9803, 9797, 9792, 9786, 9781, 9775, 9769, 9764, 9758, 9753, 9747, 9741, 9736, 9730, 9725, 9719, 9714, 9708, 9703, 9697, 9692, 9686, 9681, 9675, 9670, 9664, 9659, 9653, 9648, 9642, 9637, 9631, 9626, 9620, 9615, 9609, 9604, 9598, 9593, 9588, 9582, 9577, 9571, 9566, 9561, 9555, 9550, 9544, 9539, 9534, 9528, 9523, 9518, 9512, 9507, 9501, 9496, 9491, 9485, 9480, 9475, 9469, 9464, 9459, 9453, 9448, 9443, 9438, 9432, 9427, 9422, 9416, 9411, 9406, 9401, 9395, 9390, 9385, 9380, 9374, 9369, 9364, 9359, 9353, 9348, 9343, 9338, 9333, 9327, 9322, 9317, 9312, 9307, 9302, 9296, 9291, 9286, 9281, 9276, 9271, 9265, 9260, 9255, 9250, 9245, 9240, 9235, 9230, 9224, 9219, 9214, 9209, 9204, 9199, 9194, 9189, 9184, 9179, 9174, 9169, 9163, 9158, 9153, 9148, 9143, 9138, 9133, 9128, 9123, 9118, 9113, 9108, 9103, 9098, 9093, 9088, 9083, 9078, 9073, 9068, 9063, 9058, 9053]
-36I053nnnmnnnnnnnnnnnmnnnnnnnmnnnnnnmnnnnmnnnnmnnnnmnnnmnnnmnnnmnnmnnnmnnmn
-41H721nmnnmnnmnnmnmnnmnnmnmnmnnmnmnnmnmnmnmnmnmnmnnmnmnmmnmnmnmnmnmnmmnmnmn
-46H407mmnmnmmnmnmmnmmnmmnmnmmnmmnmmmnmmnmmnmmmnmmmnmmmnmmmnmmmnmmmmnmmmmnmm
-51H111mmmnmmmmmnmmmmmmmnmmmmmmmmmnmmmmmmmmmmmmmmmmmnmmmmmmmmmmmmmmmmlmmmmmm
-57G831mmmmmmmmmmmlmmmmmmmmmlmmmmmmmlmmmmmmlmmmmmlmmmmmlmmmmlmmmlmmmmlmmmlmm
-62G565mlmmmlmmlmmmlmmlmmlmmmlmmlmmlmmlmmlmlmmlmmlmmlmlmmlmlmmlmlmmlmlmlmlmm
-67G313lmlmlmlmlmmlmlmlmlmlmlmlmlmlmlmllmlmlmlmlmllmlmlmllmlmlmllmlmllmllmlm
-73G074llmllmlmllmllmllmllmllmllmlllmllmllmlllmlllmllmlllmlllmllllmlllmllllm
$$ y = [9053, 9048, 9043, 9038, 9034, 9029, 9024, 9019, 9014, 9009, 9004, 8999, 8994, 8989, 8984, 8979, 8975, 8970, 8965, 8960, 8955, 8950, 8945, 8940, 8936, 8931, 8926, 8921, 8916, 8911, 8906, 8902, 8897, 8892, 8887, 8882, 8878, 8873, 8868, 8863, 8858, 8854, 8849, 8844, 8839, 8834, 8830, 8825, 8820, 8815, 8811, 8806, 8801, 8796, 8792, 8787, 8782, 8777, 8773, 8768, 8763, 8759, 8754, 8749, 8744, 8740, 8735, 8730, 8726, 8721, 8716, 8712, 8707, 8702, 8698, 8693, 8688, 8684, 8679, 8674, 8670, 8665, 8661, 8656, 8651, 8647, 8642, 8637, 8633, 8628, 8624, 8619, 8615, 8610, 8605, 8601, 8596, 8592, 8587, 8582, 8578, 8573, 8569, 8564, 8560, 8555, 8551, 8546, 8542, 8537, 8533, 8528, 8524, 8519, 8514, 8510, 8505, 8501, 8496, 8492, 8488, 8483, 8479, 8474, 8470, 8465, 8461, 8456, 8452, 8447, 8443, 8438, 8434, 8430, 8425, 8421, 8416, 8412, 8407, 8403, 8399, 8394, 8390, 8385, 8381, 8377, 8372, 8368, 8363, 8359, 8355, 8350, 8346, 8342, 8337, 8333, 8329, 8324, 8320, 8315, 8311, 8307, 8302, 8298, 8294, 8289, 8285, 8281, 8277, 8272, 8268, 8264, 8259, 8255, 8251, 8246, 8242, 8238, 8234, 8229, 8225, 8221, 8217, 8212, 8208, 8204, 8200, 8195, 8191, 8187, 8183, 8178, 8174, 8170, 8166, 8161, 8157, 8153, 8149, 8145, 8140, 8136, 8132, 8128, 8124, 8119, 8115, 8111, 8107, 8103, 8099, 8094, 8090, 8086, 8082, 8078, 8074, 8069, 8065, 8061, 8057, 8053, 8049, 8045, 8041, 8036, 8032, 8028, 8024, 8020, 8016, 8012, 8008, 8004, 8000, 7995, 7991, 7987, 7983, 7979, 7975, 7971, 7967, 7963, 7959, 7955, 7951, 7947, 7943, 7939, 7935, 7931, 7927, 7922, 7918, 7914, 7910, 7906, 7902, 7898, 7894, 7890, 7886, 7882, 7878, 7874, 7870, 7866, 7862, 7858, 7855, 7851, 7847, 7843, 7839, 7835, 7831, 7827, 7823, 7819, 7815, 7811, 7807, 7803, 7799, 7795, 7791, 7787, 7784, 7780, 7776, 7772, 7768, 7764, 7760, 7756, 7752, 7748, 7745, 7741, 7737, 7733, 7729, 7725, 7721, 7717, 7714, 7710, 7706, 7702, 7698, 7694, 7690, 7687, 7683, 7679, 7675, 7671, 7667, 7664, 7660, 7656, 7652, 7648, 7644, 7641, 7637, 7633, 7629, 7625, 7622, 7618, 7614, 7610, 7607, 7603, 7599, 7595, 7591, 7588, 7584, 7580, 7576, 7573, 7569, 7565, 7561, 7558, 7554, 7550, 7546, 7543, 7539, 7535, 7532, 7528, 7524, 7520, 7517, 7513, 7509, 7506, 7502, 7498, 7495, 7491, 7487, 7483, 7480, 7476, 7472, 7469, 7465, 7461, 7458, 7454, 7450, 7447, 7443, 7439, 7436, 7432, 7429, 7425, 7421, 7418, 7414, 7410, 7407, 7403, 7399, 7396, 7392, 7389, 7385, 7381, 7378, 7374, 7371, 7367, 7363, 7360, 7356, 7353, 7349, 7345, 7342, 7338, 7335, 7331, 7328, 7324, 7321, 7317, 7313, 7310, 7306, 7303, 7299, 7296, 7292, 7289, 7285, 7282, 7278, 7274, 7271, 7267, 7264, 7260, 7257, 7253, 7250, 7246, 7243, 7239, 7236, 7232, 7229, 7225, 7222, 7218, 7215, 7211, 7208, 7204, 7201, 7198, 7194, 7191, 7187, 7184, 7180, 7177, 7173, 7170, 7166, 7163, 7160, 7156, 7153, 7149, 7146, 7142, 7139, 7136, 7132, 7129, 7125, 7122, 7118, 7115, 7112, 7108, 7105, 7101, 7098, 7095, 7091, 7088, 7085, 7081, 7078, 7074, 7071, 7068, 7064, 7061, 7058, 7054, 7051, 7047, 7044, 7041, 7037, 7034, 7031, 7027, 7024, 7021, 7017, 7014, 7011, 7007, 7004, 7001, 6997, 6994, 6991, 6987, 6984, 6981, 6978, 6974, 6971, 6968, 6964, 6961, 6958, 6954, 6951, 6948, 6945, 6941, 6938, 6935, 6932, 6928, 6925, 6922, 6918, 6915, 6912, 6909, 6905, 6902, 6899, 6896, 6892, 6889, 6886, 6883, 6880, 6876, 6873, 6870, 6867, 6863, 6860, 6857, 6854, 6851, 6847]
-78F847llllmllllmllllmlllllmllllllmllllllmlllllllmlllllllllmlllllllllllllmll
-83F631llllllllllllllllllllllllllllllllllllllllllllllllllllklllllllllllllkll
-88F426lllllllklllllllklllllllkllllllklllllklllllkllllklllllkllllklllkllllkl
-94F230llklllklllklllklllklllklllkllklllkllkllklllkllkllkllkllkllkllkllkllkl
-99F043lklkllkllkllklkllklkllklkllklkllklkllklklkllklklklkllklklklklkllklklk
-104E865lklklklklklklklklklklklklklklklklklkklklklklklkklklklklkklklklkklklk
-109E697klklkklklkklklkklklkklklkklkklkklklkklkklkklkklkklkklkklkklkklkklkkl
-115E536kklkkklkklkkklkklkkklkklkkklkkklkklkkklkkklkkklkkkklkkklkkklkkkklkkk
$$ y = [6847, 6844, 6841, 6838, 6835, 6831, 6828, 6825, 6822, 6819, 6815, 6812, 6809, 6806, 6803, 6799, 6796, 6793, 6790, 6787, 6784, 6780, 6777, 6774, 6771, 6768, 6765, 6762, 6758, 6755, 6752, 6749, 6746, 6743, 6740, 6736, 6733, 6730, 6727, 6724, 6721, 6718, 6715, 6711, 6708, 6705, 6702, 6699, 6696, 6693, 6690, 6687, 6684, 6680, 6677, 6674, 6671, 6668, 6665, 6662, 6659, 6656, 6653, 6650, 6647, 6644, 6641, 6637, 6634, 6631, 6628, 6625, 6622, 6619, 6616, 6613, 6610, 6607, 6604, 6601, 6598, 6595, 6592, 6589, 6586, 6583, 6580, 6577, 6574, 6571, 6568, 6565, 6562, 6559, 6556, 6553, 6550, 6547, 6544, 6541, 6538, 6535, 6532, 6529, 6526, 6523, 6520, 6517, 6514, 6511, 6508, 6505, 6502, 6499, 6496, 6493, 6490, 6487, 6484, 6481, 6478, 6475, 6473, 6470, 6467, 6464, 6461, 6458, 6455, 6452, 6449, 6446, 6443, 6440, 6437, 6434, 6432, 6429, 6426, 6423, 6420, 6417, 6414, 6411, 6408, 6405, 6403, 6400, 6397, 6394, 6391, 6388, 6385, 6382, 6380, 6377, 6374, 6371, 6368, 6365, 6362, 6359, 6357, 6354, 6351, 6348, 6345, 6342, 6339, 6337, 6334, 6331, 6328, 6325, 6322, 6320, 6317, 6314, 6311, 6308, 6305, 6303, 6300, 6297, 6294, 6291, 6289, 6286, 6283, 6280, 6277, 6274, 6272, 6269, 6266, 6263, 6260, 6258, 6255, 6252, 6249, 6247, 6244, 6241, 6238, 6235, 6233, 6230, 6227, 6224, 6222, 6219, 6216, 6213, 6211, 6208, 6205, 6202, 6200, 6197, 6194, 6191, 6189, 6186, 6183, 6180, 6178, 6175, 6172, 6169, 6167, 6164, 6161, 6158, 6156, 6153, 6150, 6148, 6145, 6142, 6139, 6137, 6134, 6131, 6129, 6126, 6123, 6121, 6118, 6115, 6112, 6110, 6107, 6104, 6102, 6099, 6096, 6094, 6091, 6088, 6086, 6083, 6080, 6078, 6075, 6072, 6070, 6067, 6064, 6062, 6059, 6056, 6054, 6051, 6048, 6046, 6043, 6040, 6038, 6035, 6033, 6030, 6027, 6025, 6022, 6019, 6017, 6014, 6011, 6009, 6006, 6004, 6001, 5998, 5996, 5993, 5991, 5988, 5985, 5983, 5980, 5978, 5975, 5972, 5970, 5967, 5965, 5962, 5959, 5957, 5954, 5952, 5949, 5946, 5944, 5941, 5939, 5936, 5934, 5931, 5928, 5926, 5923, 5921, 5918, 5916, 5913, 5911, 5908, 5905, 5903, 5900, 5898, 5895, 5893, 5890, 5888, 5885, 5883, 5880, 5877, 5875, 5872, 5870, 5867, 5865, 5862, 5860, 5857, 5855, 5852, 5850, 5847, 5845, 5842, 5840, 5837, 5835, 5832, 5830, 5827, 5825, 5822, 5820, 5817, 5815, 5812, 5810, 5807, 5805, 5802, 5800, 5797, 5795, 5792, 5790, 5787, 5785, 5782, 5780, 5777, 5775, 5773, 5770, 5768, 5765, 5763, 5760, 5758, 5755, 5753, 5750, 5748, 5746, 5743, 5741, 5738, 5736, 5733, 5731, 5728, 5726, 5724, 5721, 5719, 5716, 5714, 5711, 5709, 5707, 5704, 5702, 5699, 5697, 5695, 5692, 5690, 5687, 5685, 5683, 5680, 5678, 5675, 5673, 5671, 5668, 5666, 5663, 5661, 5659, 5656, 5654, 5651, 5649, 5647, 5644, 5642, 5639, 5637, 5635, 5632, 5630, 5628, 5625, 5623, 5621, 5618, 5616, 5613, 5611, 5609, 5606, 5604, 5602, 5599, 5597, 5595, 5592, 5590, 5588, 5585, 5583, 5581, 5578, 5576, 5574, 5571, 5569, 5567, 5564, 5562, 5560, 5557, 5555, 5553, 5550, 5548, 5546, 5543, 5541, 5539, 5536, 5534, 5532, 5529, 5527, 5525, 5523, 5520, 5518, 5516, 5513, 5511, 5509, 5507, 5504, 5502, 5500, 5497, 5495, 5493, 5491, 5488, 5486, 5484, 5481, 5479, 5477, 5475, 5472, 5470, 5468, 5466, 5463, 5461, 5459, 5456, 5454, 5452, 5450, 5447, 5445, 5443, 5441, 5438, 5436, 5434, 5432, 5429, 5427, 5425, 5423, 5421, 5418, 5416, 5414, 5412, 5409, 5407, 5405, 5403, 5400, 5398, 5396, 5394, 5392, 5389, 5387, 5385, 5383]
-120E383klkkklkkkklkkkkklkkkklkkkkklkkkkklkkkkklkkkkklkkkkkklkkkkkkklkkkkkkk
-125E236lkkkkkkkklkkkkkkkkklkkkkkkkkkklkkkkkkkkkkkkkklkkkkkkkkkkkkkkkkkkkklk
-130E094kkkkkkkkkkkkkkkkkkkkkkkkkkkkkkkkkkkkkkkkkkkkkkkkkkkkjkkkkkkkkkkkkkkk
-135D959kkkkkkjkkkkkkkkkkkkkkjkkkkkkkkkkkjkkkkkkkkkjkkkkkkkkkjkkkkkkkjkkkkkk
-140D829kjkkkkkkkjkkkkkkjkkkkkjkkkkkkjkkkkkjkkkkkjkkkkjkkkkkjkkkkjkkkkjkkkkj
-146D705kkkkjkkkkjkkkjkkkkjkkkjkkkkjkkkjkkkjkkkjkkkjkkkjkkkjkkkjkkkjkkkjkkkj
-151D585kkjkkkjkkjkkkjkkjkkkjkkjkkkjkkjkkjkkjkkkjkkjkkjkkjkkjkkjkkjkkjkkjkkj
-156D470kkjkkjkkjkkjkkjkkjkjkkjkkjkkjkjkkjkkjkkjkjkkjkjkkjkkjkjkkjkjkkjkjkkj
$$ y = [5383, 5381, 5378, 5376, 5374, 5372, 5369, 5367, 5365, 5363, 5361, 5358, 5356, 5354, 5352, 5350, 5348, 5345, 5343, 5341, 5339, 5337, 5334, 5332, 5330, 5328, 5326, 5324, 5321, 5319, 5317, 5315, 5313, 5311, 5308, 5306, 5304, 5302, 5300, 5298, 5295, 5293, 5291, 5289, 5287, 5285, 5282, 5280, 5278, 5276, 5274, 5272, 5270, 5267, 5265, 5263, 5261, 5259, 5257, 5255, 5253, 5250, 5248, 5246, 5244, 5242, 5240, 5238, 5236, 5233, 5231, 5229, 5227, 5225, 5223, 5221, 5219, 5217, 5214, 5212, 5210, 5208, 5206, 5204, 5202, 5200, 5198, 5196, 5193, 5191, 5189, 5187, 5185, 5183, 5181, 5179, 5177, 5175, 5173, 5170, 5168, 5166, 5164, 5162, 5160, 5158, 5156, 5154, 5152, 5150, 5148, 5146, 5144, 5142, 5139, 5137, 5135, 5133, 5131, 5129, 5127, 5125, 5123, 5121, 5119, 5117, 5115, 5113, 5111, 5109, 5107, 5105, 5103, 5101, 5099, 5096, 5094, 5092, 5090, 5088, 5086, 5084, 5082, 5080, 5078, 5076, 5074, 5072, 5070, 5068, 5066, 5064, 5062, 5060, 5058, 5056, 5054, 5052, 5050, 5048, 5046, 5044, 5042, 5040, 5038, 5036, 5034, 5032, 5030, 5028, 5026, 5024, 5022, 5020, 5018, 5016, 5014, 5012, 5010, 5008, 5006, 5004, 5002, 5000, 4998, 4996, 4994, 4992, 4990, 4989, 4987, 4985, 4983, 4981, 4979, 4977, 4975, 4973, 4971, 4969, 4967, 4965, 4963, 4961, 4959, 4957, 4955, 4953, 4951, 4949, 4947, 4946, 4944, 4942, 4940, 4938, 4936, 4934, 4932, 4930, 4928, 4926, 4924, 4922, 4920, 4918, 4917, 4915, 4913, 4911, 4909, 4907, 4905, 4903, 4901, 4899, 4897, 4895, 4894, 4892, 4890, 4888, 4886, 4884, 4882, 4880, 4878, 4876, 4875, 4873, 4871, 4869, 4867, 4865, 4863, 4861, 4859, 4857, 4856, 4854, 4852, 4850, 4848, 4846, 4844, 4842, 4841, 4839, 4837, 4835, 4833, 4831, 4829, 4827, 4826, 4824, 4822, 4820, 4818, 4816, 4814, 4812, 4811, 4809, 4807, 4805, 4803, 4801, 4799, 4798, 4796, 4794, 4792, 4790, 4788, 4787, 4785, 4783, 4781, 4779, 4777, 4775, 4774, 4772, 4770, 4768, 4766, 4764, 4763, 4761, 4759, 4757, 4755, 4753, 4752, 4750, 4748, 4746, 4744, 4743, 4741, 4739, 4737, 4735, 4733, 4732, 4730, 4728, 4726, 4724, 4723, 4721, 4719, 4717, 4715, 4714, 4712, 4710, 4708, 4706, 4705, 4703, 4701, 4699, 4697, 4696, 4694, 4692, 4690, 4688, 4687, 4685, 4683, 4681, 4680, 4678, 4676, 4674, 4672, 4671, 4669, 4667, 4665, 4664, 4662, 4660, 4658, 4656, 4655, 4653, 4651, 4649, 4648, 4646, 4644, 4642, 4641, 4639, 4637, 4635, 4634, 4632, 4630, 4628, 4627, 4625, 4623, 4621, 4620, 4618, 4616, 4614, 4613, 4611, 4609, 4607, 4606, 4604, 4602, 4600, 4599, 4597, 4595, 4593, 4592, 4590, 4588, 4586, 4585, 4583, 4581, 4580, 4578, 4576, 4574, 4573, 4571, 4569, 4568, 4566, 4564, 4562, 4561, 4559, 4557, 4556, 4554, 4552, 4550, 4549, 4547, 4545, 4544, 4542, 4540, 4538, 4537, 4535, 4533, 4532, 4530, 4528, 4527, 4525, 4523, 4522, 4520, 4518, 4516, 4515, 4513, 4511, 4510, 4508, 4506, 4505, 4503, 4501, 4500, 4498, 4496, 4495, 4493, 4491, 4490, 4488, 4486, 4485, 4483, 4481, 4480, 4478, 4476, 4475, 4473, 4471, 4470, 4468, 4466, 4465, 4463, 4461, 4460, 4458, 4456, 4455, 4453, 4451, 4450, 4448, 4446, 4445, 4443, 4441, 4440, 4438, 4437, 4435, 4433, 4432, 4430, 4428, 4427, 4425, 4423, 4422, 4420, 4419, 4417, 4415, 4414, 4412, 4410, 4409, 4407, 4405, 4404, 4402, 4401, 4399, 4397, 4396, 4394, 4393, 4391, 4389, 4388, 4386, 4384, 4383, 4381, 4380, 4378, 4376, 4375, 4373, 4372, 4370, 4368, 4367, 4365, 4364, 4362, 4360, 4359]
-161D359kjkkjkjkkjkjkkjkjkjkkjkjkkjkjkjkkjkjkjkjkkjkjkjkjkkjkjkjkjkkjkjkjkjk
-166D252jkkjkjkjkjkjkjkjkjkjkkjkjkjkjkjkjkjkjkjkjkjkjkjkjkjkjkjkjkjkjkjkjkjk
-172D149jkjkjjkjkjkjkjkjkjkjkjjkjkjkjkjkjkjjkjkjkjkjjkjkjkjkjjkjkjkjkjjkjkjk
-177D050jjkjkjkjjkjkjjkjkjkjjkjkjjkjkjjkjkjjkjkjjkjkjjkjkjjkjkjjkjjkjkjjkjkj
-182C955jkjjkjkjjkjjkjjkjkjjkjjkjjkjkjjkjjkjjkjjkjjkjjkjjkjkjjkjjkjjkjjkjjkj
-187C863jkjjjkjjkjjkjjkjjkjjkjjkjjjkjjkjjkjjkjjjkjjkjjkjjjkjjkjjjkjjkjjjkjjk
-192C774jjjkjjkjjjkjjjkjjkjjjkjjjkjjjkjjkjjjkjjjkjjjkjjjkjjjkjjjkjjjkjjjkjjj
-198C689jkjjjkjjjkjjjkjjjjkjjjkjjjjkjjjkjjjjkjjjjkjjjkjjjjkjjjjkjjjjkjjjjkjj
$$ y = [4359, 4357, 4356, 4354, 4352, 4351, 4349, 4348, 4346, 4344, 4343, 4341, 4340, 4338, 4336, 4335, 4333, 4332, 4330, 4329, 4327, 4325, 4324, 4322, 4321, 4319, 4317, 4316, 4314, 4313, 4311, 4310, 4308, 4306, 4305, 4303, 4302, 4300, 4299, 4297, 4296, 4294, 4292, 4291, 4289, 4288, 4286, 4285, 4283, 4282, 4280, 4278, 4277, 4275, 4274, 4272, 4271, 4269, 4268, 4266, 4264, 4263, 4261, 4260, 4258, 4257, 4255, 4254, 4252, 4251, 4249, 4247, 4246, 4244, 4243, 4241, 4240, 4238, 4237, 4235, 4234, 4232, 4231, 4229, 4228, 4226, 4225, 4223, 4222, 4220, 4218, 4217, 4215, 4214, 4212, 4211, 4209, 4208, 4206, 4205, 4203, 4202, 4200, 4199, 4197, 4196, 4194, 4193, 4191, 4190, 4188, 4187, 4185, 4184, 4182, 4181, 4179, 4178, 4176, 4175, 4173, 4172, 4170, 4169, 4167, 4166, 4164, 4163, 4161, 4160, 4158, 4157, 4155, 4154, 4152, 4151, 4149, 4148, 4146, 4145, 4143, 4142, 4141, 4139, 4138, 4136, 4135, 4133, 4132, 4130, 4129, 4127, 4126, 4124, 4123, 4121, 4120, 4118, 4117, 4116, 4114, 4113, 4111, 4110, 4108, 4107, 4105, 4104, 4102, 4101, 4099, 4098, 4097, 4095, 4094, 4092, 4091, 4089, 4088, 4086, 4085, 4084, 4082, 4081, 4079, 4078, 4076, 4075, 4073, 4072, 4071, 4069, 4068, 4066, 4065, 4063, 4062, 4060, 4059, 4058, 4056, 4055, 4053, 4052, 4050, 4049, 4048, 4046, 4045, 4043, 4042, 4040, 4039, 4038, 4036, 4035, 4033, 4032, 4031, 4029, 4028, 4026, 4025, 4023, 4022, 4021, 4019, 4018, 4016, 4015, 4014, 4012, 4011, 4009, 4008, 4007, 4005, 4004, 4002, 4001, 4000, 3998, 3997, 3995, 3994, 3993, 3991, 3990, 3988, 3987, 3986, 3984, 3983, 3981, 3980, 3979, 3977, 3976, 3974, 3973, 3972, 3970, 3969, 3968, 3966, 3965, 3963, 3962, 3961, 3959, 3958, 3956, 3955, 3954, 3952, 3951, 3950, 3948, 3947, 3945, 3944, 3943, 3941, 3940, 3939, 3937, 3936, 3935, 3933, 3932, 3930, 3929, 3928, 3926, 3925, 3924, 3922, 3921, 3920, 3918, 3917, 3915, 3914, 3913, 3911, 3910, 3909, 3907, 3906, 3905, 3903, 3902, 3901, 3899, 3898, 3897, 3895, 3894, 3893, 3891, 3890, 3889, 3887, 3886, 3884, 3883, 3882, 3880, 3879, 3878, 3876, 3875, 3874, 3872, 3871, 3870, 3868, 3867, 3866, 3864, 3863, 3862, 3860, 3859, 3858, 3857, 3855, 3854, 3853, 3851, 3850, 3849, 3847, 3846, 3845, 3843, 3842, 3841, 3839, 3838, 3837, 3835, 3834, 3833, 3831, 3830, 3829, 3828, 3826, 3825, 3824, 3822, 3821, 3820, 3818, 3817, 3816, 3814, 3813, 3812, 3811, 3809, 3808, 3807, 3805, 3804, 3803, 3801, 3800, 3799, 3798, 3796, 3795, 3794, 3792, 3791, 3790, 3789, 3787, 3786, 3785, 3783, 3782, 3781, 3780, 3778, 3777, 3776, 3774, 3773, 3772, 3771, 3769, 3768, 3767, 3765, 3764, 3763, 3762, 3760, 3759, 3758, 3757, 3755, 3754, 3753, 3751, 3750, 3749, 3748, 3746, 3745, 3744, 3743, 3741, 3740, 3739, 3738, 3736, 3735, 3734, 3732, 3731, 3730, 3729, 3727, 3726, 3725, 3724, 3722, 3721, 3720, 3719, 3717, 3716, 3715, 3714, 3712, 3711, 3710, 3709, 3707, 3706, 3705, 3704, 3702, 3701, 3700, 3699, 3697, 3696, 3695, 3694, 3692, 3691, 3690, 3689, 3688, 3686, 3685, 3684, 3683, 3681, 3680, 3679, 3678, 3676, 3675, 3674, 3673, 3671, 3670, 3669, 3668, 3667, 3665, 3664, 3663, 3662, 3660, 3659, 3658, 3657, 3656, 3654, 3653, 3652, 3651, 3649, 3648, 3647, 3646, 3645, 3643, 3642, 3641, 3640, 3639, 3637, 3636, 3635, 3634, 3632, 3631, 3630, 3629, 3628, 3626, 3625, 3624, 3623, 3622, 3620, 3619, 3618, 3617, 3616, 3614, 3613, 3612, 3611, 3610, 3608, 3607, 3606]
-203C606jjkjjjjjkjjjjkjjjjkjjjjjkjjjjkjjjjjkjjjjjkjjjjjkjjjjjkjjjjjkjjjjjkjj
-208C526jjjjkjjjjjkjjjjjjkjjjjjjkjjjjjjkjjjjjjjkjjjjjjkjjjjjjjkjjjjjjjkjjjjj
-213C449jjjkjjjjjjjjkjjjjjjjjkjjjjjjjjjkjjjjjjjjjkjjjjjjjjjjkjjjjjjjjjjjkjjj
-218C374jjjjjjjjjkjjjjjjjjjjjjjkjjjjjjjjjjjjjjjkjjjjjjjjjjjjjjjjjkjjjjjjjjjj
-224C302jjjjjjjjjjjjkjjjjjjjjjjjjjjjjjjjjjjjjjjjjjjjkjjjjjjjjjjjjjjjjjjjjjjj
-229C232jjjjjjjjjjjjjjjjjjjjjjjjjjjjjjjjjjjjjjjjjjjjjjjjjjjjjjjjjjjjjjjjjjjj
-234C164jj%jjjjjjjjjjjjjjjjjjjjjjjjjjjjjjjj%jjjjjjjjjjjjjjjjjjjjjjj%jjjjjjjj
-239C099jjjjjjjjjj%jjjjjjjjjjjjjjjj%jjjjjjjjjjjjjj%jjjjjjjjjjjj%jjjjjjjjjjjj
$$ y = [3606, 3605, 3604, 3602, 3601, 3600, 3599, 3598, 3597, 3595, 3594, 3593, 3592, 3591, 3589, 3588, 3587, 3586, 3585, 3583, 3582, 3581, 3580, 3579, 3578, 3576, 3575, 3574, 3573, 3572, 3570, 3569, 3568, 3567, 3566, 3565, 3563, 3562, 3561, 3560, 3559, 3558, 3556, 3555, 3554, 3553, 3552, 3551, 3549, 3548, 3547, 3546, 3545, 3544, 3542, 3541, 3540, 3539, 3538, 3537, 3535, 3534, 3533, 3532, 3531, 3530, 3528, 3527, 3526, 3525, 3524, 3523, 3522, 3520, 3519, 3518, 3517, 3516, 3515, 3513, 3512, 3511, 3510, 3509, 3508, 3507, 3505, 3504, 3503, 3502, 3501, 3500, 3499, 3497, 3496, 3495, 3494, 3493, 3492, 3491, 3489, 3488, 3487, 3486, 3485, 3484, 3483, 3482, 3480, 3479, 3478, 3477, 3476, 3475, 3474, 3472, 3471, 3470, 3469, 3468, 3467, 3466, 3465, 3463, 3462, 3461, 3460, 3459, 3458, 3457, 3456, 3454, 3453, 3452, 3451, 3450, 3449, 3448, 3447, 3446, 3444, 3443, 3442, 3441, 3440, 3439, 3438, 3437, 3436, 3434, 3433, 3432, 3431, 3430, 3429, 3428, 3427, 3426, 3424, 3423, 3422, 3421, 3420, 3419, 3418, 3417, 3416, 3415, 3413, 3412, 3411, 3410, 3409, 3408, 3407, 3406, 3405, 3404, 3402, 3401, 3400, 3399, 3398, 3397, 3396, 3395, 3394, 3393, 3392, 3390, 3389, 3388, 3387, 3386, 3385, 3384, 3383, 3382, 3381, 3380, 3379, 3377, 3376, 3375, 3374, 3373, 3372, 3371, 3370, 3369, 3368, 3367, 3366, 3365, 3363, 3362, 3361, 3360, 3359, 3358, 3357, 3356, 3355, 3354, 3353, 3352, 3351, 3350, 3348, 3347, 3346, 3345, 3344, 3343, 3342, 3341, 3340, 3339, 3338, 3337, 3336, 3335, 3334, 3333, 3331, 3330, 3329, 3328, 3327, 3326, 3325, 3324, 3323, 3322, 3321, 3320, 3319, 3318, 3317, 3316, 3315, 3314, 3312, 3311, 3310, 3309, 3308, 3307, 3306, 3305, 3304, 3303, 3302, 3301, 3300, 3299, 3298, 3297, 3296, 3295, 3294, 3293, 3292, 3291, 3290, 3288, 3287, 3286, 3285, 3284, 3283, 3282, 3281, 3280, 3279, 3278, 3277, 3276, 3275, 3274, 3273, 3272, 3271, 3270, 3269, 3268, 3267, 3266, 3265, 3264, 3263, 3262, 3261, 3260, 3259, 3258, 3257, 3255, 3254, 3253, 3252, 3251, 3250, 3249, 3248, 3247, 3246, 3245, 3244, 3243, 3242, 3241, 3240, 3239, 3238, 3237, 3236, 3235, 3234, 3233, 3232, 3231, 3230, 3229, 3228, 3227, 3226, 3225, 3224, 3223, 3222, 3221, 3220, 3219, 3218, 3217, 3216, 3215, 3214, 3213, 3212, 3211, 3210, 3209, 3208, 3207, 3206, 3205, 3204, 3203, 3202, 3201, 3200, 3199, 3198, 3197, 3196, 3195, 3194, 3193, 3192, 3191, 3190, 3189, 3188, 3187, 3186, 3185, 3184, 3183, 3182, 3181, 3180, 3179, 3178, 3177, 3176, 3175, 3174, 3173, 3172, 3171, 3170, 3169, 3168, 3167, 3166, 3165, 3164, 3163, 3162, 3162, 3161, 3160, 3159, 3158, 3157, 3156, 3155, 3154, 3153, 3152, 3151, 3150, 3149, 3148, 3147, 3146, 3145, 3144, 3143, 3142, 3141, 3140, 3139, 3138, 3137, 3136, 3135, 3134, 3133, 3132, 3131, 3130, 3130, 3129, 3128, 3127, 3126, 3125, 3124, 3123, 3122, 3121, 3120, 3119, 3118, 3117, 3116, 3115, 3114, 3113, 3112, 3111, 3110, 3109, 3108, 3107, 3107, 3106, 3105, 3104, 3103, 3102, 3101, 3100, 3099, 3098, 3097, 3096, 3095, 3094, 3093, 3092, 3091, 3090, 3089, 3089, 3088, 3087, 3086, 3085, 3084, 3083, 3082, 3081, 3080, 3079, 3078, 3077, 3076, 3075, 3074, 3073, 3073, 3072, 3071, 3070, 3069, 3068, 3067, 3066, 3065, 3064, 3063, 3062, 3061, 3060, 3059, 3059, 3058, 3057, 3056, 3055, 3054, 3053, 3052, 3051, 3050, 3049, 3048, 3047, 3047, 3046, 3045, 3044, 3043, 3042, 3041, 3040, 3039, 3038, 3037, 3036, 3035]
-244C035%jjjjjjjjjjj%jjjjjjjjjj%jjjjjjjjjj%jjjjjjjjj%jjjjjjjjj%jjjjjjjj%jjjj
-250B974jjjj%jjjjjjjj%jjjjjjjj%jjjjjjj%jjjjjjj%jjjjjjj%jjjjjjj%jjjjjj%jjjjjj
-255B914j%jjjjjj%jjjjjj%jjjjjj%jjjjjj%jjjjjj%jjjjj%jjjjjj%jjjjj%jjjjj%jjjjj%
-260B857jjjjjj%jjjjj%jjjjj%jjjj%jjjjj%jjjjj%jjjjj%jjjj%jjjjj%jjjj%jjjjj%jjjj
-265B800%jjjj%jjjj%jjjjj%jjjj%jjjj%jjjj%jjjj%jjjj%jjjj%jjjj%jjjj%jjj%jjjj%jj
-270B746jj%jjjj%jjj%jjjj%jjj%jjjj%jjjj%jjj%jjjj%jjj%jjj%jjjj%jjj%jjj%jjjj%jj
-275B693j%jjj%jjj%jjjj%jjj%jjj%jjj%jjj%jjj%jjj%jjj%jjj%jjj%jjj%jjj%jjj%jjj%j
-281B642jj%jjj%jjj%jjj%jj%jjj%jjj%jjj%jj%jjj%jjj%jjj%jj%jjj%jjj%jj%jjj%jjj%j
$$ y = [3035, 3035, 3034, 3033, 3032, 3031, 3030, 3029, 3028, 3027, 3026, 3025, 3024, 3024, 3023, 3022, 3021, 3020, 3019, 3018, 3017, 3016, 3015, 3014, 3014, 3013, 3012, 3011, 3010, 3009, 3008, 3007, 3006, 3005, 3004, 3004, 3003, 3002, 3001, 3000, 2999, 2998, 2997, 2996, 2995, 2995, 2994, 2993, 2992, 2991, 2990, 2989, 2988, 2987, 2986, 2986, 2985, 2984, 2983, 2982, 2981, 2980, 2979, 2978, 2978, 2977, 2976, 2975, 2974, 2973, 2972, 2971, 2970, 2970, 2969, 2968, 2967, 2966, 2965, 2964, 2963, 2962, 2962, 2961, 2960, 2959, 2958, 2957, 2956, 2955, 2954, 2954, 2953, 2952, 2951, 2950, 2949, 2948, 2947, 2947, 2946, 2945, 2944, 2943, 2942, 2941, 2940, 2940, 2939, 2938, 2937, 2936, 2935, 2934, 2933, 2933, 2932, 2931, 2930, 2929, 2928, 2927, 2926, 2926, 2925, 2924, 2923, 2922, 2921, 2920, 2920, 2919, 2918, 2917, 2916, 2915, 2914, 2913, 2913, 2912, 2911, 2910, 2909, 2908, 2907, 2907, 2906, 2905, 2904, 2903, 2902, 2901, 2901, 2900, 2899, 2898, 2897, 2896, 2895, 2895, 2894, 2893, 2892, 2891, 2890, 2889, 2889, 2888, 2887, 2886, 2885, 2884, 2883, 2883, 2882, 2881, 2880, 2879, 2878, 2878, 2877, 2876, 2875, 2874, 2873, 2872, 2872, 2871, 2870, 2869, 2868, 2867, 2867, 2866, 2865, 2864, 2863, 2862, 2862, 2861, 2860, 2859, 2858, 2857, 2857, 2856, 2855, 2854, 2853, 2852, 2851, 2851, 2850, 2849, 2848, 2847, 2846, 2846, 2845, 2844, 2843, 2842, 2841, 2841, 2840, 2839, 2838, 2837, 2837, 2836, 2835, 2834, 2833, 2832, 2832, 2831, 2830, 2829, 2828, 2827, 2827, 2826, 2825, 2824, 2823, 2822, 2822, 2821, 2820, 2819, 2818, 2818, 2817, 2816, 2815, 2814, 2813, 2813, 2812, 2811, 2810, 2809, 2809, 2808, 2807, 2806, 2805, 2804, 2804, 2803, 2802, 2801, 2800, 2800, 2799, 2798, 2797, 2796, 2796, 2795, 2794, 2793, 2792, 2792, 2791, 2790, 2789, 2788, 2787, 2787, 2786, 2785, 2784, 2783, 2783, 2782, 2781, 2780, 2779, 2779, 2778, 2777, 2776, 2775, 2775, 2774, 2773, 2772, 2771, 2771, 2770, 2769, 2768, 2767, 2767, 2766, 2765, 2764, 2763, 2763, 2762, 2761, 2760, 2759, 2759, 2758, 2757, 2756, 2755, 2755, 2754, 2753, 2752, 2752, 2751, 2750, 2749, 2748, 2748, 2747, 2746, 2745, 2744, 2744, 2743, 2742, 2741, 2740, 2740, 2739, 2738, 2737, 2737, 2736, 2735, 2734, 2733, 2733, 2732, 2731, 2730, 2730, 2729, 2728, 2727, 2726, 2726, 2725, 2724, 2723, 2722, 2722, 2721, 2720, 2719, 2719, 2718, 2717, 2716, 2715, 2715, 2714, 2713, 2712, 2712, 2711, 2710, 2709, 2709, 2708, 2707, 2706, 2705, 2705, 2704, 2703, 2702, 2702, 2701, 2700, 2699, 2699, 2698, 2697, 2696, 2695, 2695, 2694, 2693, 2692, 2692, 2691, 2690, 2689, 2689, 2688, 2687, 2686, 2686, 2685, 2684, 2683, 2682, 2682, 2681, 2680, 2679, 2679, 2678, 2677, 2676, 2676, 2675, 2674, 2673, 2673, 2672, 2671, 2670, 2670, 2669, 2668, 2667, 2667, 2666, 2665, 2664, 2664, 2663, 2662, 2661, 2661, 2660, 2659, 2658, 2658, 2657, 2656, 2655, 2655, 2654, 2653, 2652, 2652, 2651, 2650, 2649, 2649, 2648, 2647, 2646, 2646, 2645, 2644, 2643, 2643, 2642, 2641, 2640, 2640, 2639, 2638, 2637, 2637, 2636, 2635, 2634, 2634, 2633, 2632, 2631, 2631, 2630, 2629, 2629, 2628, 2627, 2626, 2626, 2625, 2624, 2623, 2623, 2622, 2621, 2620, 2620, 2619, 2618, 2618, 2617, 2616, 2615, 2615, 2614, 2613, 2612, 2612, 2611, 2610, 2609, 2609, 2608, 2607, 2607, 2606, 2605, 2604, 2604, 2603, 2602, 2601, 2601, 2600, 2599, 2599, 2598, 2597, 2596, 2596, 2595, 2594, 2593, 2593, 2592]
-286B592j%jjj%jj%jjj%jj%jjj%jj%jjj%jj%jjj%jj%jjj%jj%jjj%jj%jjj%jj%jj%jjj%jj%
-291B544jj%jjj%jj%jj%jjj%jj%jj%jjj%jj%jj%jj%jjj%jj%jj%jj%jj%jjj%jj%jj%jj%jj%
-296B497jj%jj%jjj%jj%jj%jj%jj%jj%jj%jj%jj%jj%jj%jj%jj%jj%jj%jj%jj%jj%jj%jj%j
-301B451j%jj%jj%jj%jj%jj%jj%jj%jj%jj%jj%jj%j%jj%jj%jj%jj%jj%jj%jj%j%jj%jj%jj
-307B406%jj%j%jj%jj%jj%jj%j%jj%jj%jj%j%jj%jj%jj%j%jj%jj%jj%j%jj%jj%j%jj%jj%j
-312B363%jj%jj%j%jj%jj%j%jj%jj%j%jj%jj%j%jj%jj%j%jj%j%jj%jj%j%jj%j%jj%j%jj%j
-317B321j%j%jj%j%jj%j%jj%j%jj%jj%j%jj%j%jj%j%jj%j%jj%j%jj%j%jj%j%jj%j%jj%j%j
-322B280%jj%j%jj%j%jj%j%jj%j%j%jj%j%jj%j%jj%j%j%jj%j%jj%j%j%jj%j%jj%j%j%jj%j
$$ y = [2592, 2591, 2591, 2590, 2589, 2588, 2588, 2587, 2586, 2586, 2585, 2584, 2583, 2583, 2582, 2581, 2581, 2580, 2579, 2578, 2578, 2577, 2576, 2576, 2575, 2574, 2573, 2573, 2572, 2571, 2571, 2570, 2569, 2568, 2568, 2567, 2566, 2566, 2565, 2564, 2563, 2563, 2562, 2561, 2561, 2560, 2559, 2558, 2558, 2557, 2556, 2556, 2555, 2554, 2553, 2553, 2552, 2551, 2551, 2550, 2549, 2549, 2548, 2547, 2546, 2546, 2545, 2544, 2544, 2543, 2542, 2542, 2541, 2540, 2539, 2539, 2538, 2537, 2537, 2536, 2535, 2535, 2534, 2533, 2532, 2532, 2531, 2530, 2530, 2529, 2528, 2528, 2527, 2526, 2525, 2525, 2524, 2523, 2523, 2522, 2521, 2521, 2520, 2519, 2519, 2518, 2517, 2516, 2516, 2515, 2514, 2514, 2513, 2512, 2512, 2511, 2510, 2510, 2509, 2508, 2508, 2507, 2506, 2505, 2505, 2504, 2503, 2503, 2502, 2501, 2501, 2500, 2499, 2499, 2498, 2497, 2497, 2496, 2495, 2495, 2494, 2493, 2493, 2492, 2491, 2490, 2490, 2489, 2488, 2488, 2487, 2486, 2486, 2485, 2484, 2484, 2483, 2482, 2482, 2481, 2480, 2480, 2479, 2478, 2478, 2477, 2476, 2476, 2475, 2474, 2474, 2473, 2472, 2472, 2471, 2470, 2470, 2469, 2468, 2468, 2467, 2466, 2466, 2465, 2464, 2464, 2463, 2462, 2462, 2461, 2460, 2460, 2459, 2458, 2458, 2457, 2456, 2456, 2455, 2454, 2454, 2453, 2452, 2452, 2451, 2450, 2450, 2449, 2448, 2448, 2447, 2446, 2446, 2445, 2444, 2444, 2443, 2442, 2442, 2441, 2440, 2440, 2439, 2438, 2438, 2437, 2436, 2436, 2435, 2434, 2434, 2433, 2432, 2432, 2431, 2430, 2430, 2429, 2428, 2428, 2427, 2427, 2426, 2425, 2425, 2424, 2423, 2423, 2422, 2421, 2421, 2420, 2419, 2419, 2418, 2417, 2417, 2416, 2415, 2415, 2414, 2413, 2413, 2412, 2412, 2411, 2410, 2410, 2409, 2408, 2408, 2407, 2406, 2406, 2405, 2404, 2404, 2403, 2403, 2402, 2401, 2401, 2400, 2399, 2399, 2398, 2397, 2397, 2396, 2395, 2395, 2394, 2394, 2393, 2392, 2392, 2391, 2390, 2390, 2389, 2388, 2388, 2387, 2387, 2386, 2385, 2385, 2384, 2383, 2383, 2382, 2381, 2381, 2380, 2380, 2379, 2378, 2378, 2377, 2376, 2376, 2375, 2374, 2374, 2373, 2373, 2372, 2371, 2371, 2370, 2369, 2369, 2368, 2368, 2367, 2366, 2366, 2365, 2364, 2364, 2363, 2363, 2362, 2361, 2361, 2360, 2359, 2359, 2358, 2358, 2357, 2356, 2356, 2355, 2354, 2354, 2353, 2353, 2352, 2351, 2351, 2350, 2349, 2349, 2348, 2348, 2347, 2346, 2346, 2345, 2344, 2344, 2343, 2343, 2342, 2341, 2341, 2340, 2339, 2339, 2338, 2338, 2337, 2336, 2336, 2335, 2335, 2334, 2333, 2333, 2332, 2331, 2331, 2330, 2330, 2329, 2328, 2328, 2327, 2327, 2326, 2325, 2325, 2324, 2324, 2323, 2322, 2322, 2321, 2320, 2320, 2319, 2319, 2318, 2317, 2317, 2316, 2316, 2315, 2314, 2314, 2313, 2313, 2312, 2311, 2311, 2310, 2310, 2309, 2308, 2308, 2307, 2306, 2306, 2305, 2305, 2304, 2303, 2303, 2302, 2302, 2301, 2300, 2300, 2299, 2299, 2298, 2297, 2297, 2296, 2296, 2295, 2294, 2294, 2293, 2293, 2292, 2291, 2291, 2290, 2290, 2289, 2288, 2288, 2287, 2287, 2286, 2285, 2285, 2284, 2284, 2283, 2282, 2282, 2281, 2281, 2280, 2280, 2279, 2278, 2278, 2277, 2277, 2276, 2275, 2275, 2274, 2274, 2273, 2272, 2272, 2271, 2271, 2270, 2269, 2269, 2268, 2268, 2267, 2267, 2266, 2265, 2265, 2264, 2264, 2263, 2262, 2262, 2261, 2261, 2260, 2259, 2259, 2258, 2258, 2257, 2257, 2256, 2255, 2255, 2254, 2254, 2253, 2252, 2252, 2251, 2251, 2250, 2250, 2249, 2248, 2248, 2247, 2247, 2246, 2245, 2245, 2244, 2244, 2243, 2243, 2242, 2241, 2241, 2240]
-327B240%j%jj%j%jj%j%j%jj%j%j%jj%j%j%jj%j%j%jj%j%j%jj%j%j%jj%j%j%j%jj%j%j%jj
-333B201%j%j%j%jj%j%j%jj%j%j%j%jj%j%j%j%jj%j%j%j%jj%j%j%j%jj%j%j%j%jj%j%j%j%
-338B164j%jj%j%j%j%j%jj%j%j%j%j%jj%j%j%j%j%jj%j%j%j%j%j%jj%j%j%j%j%j%jj%j%j%
-343B127j%j%j%j%jj%j%j%j%j%j%j%j%jj%j%j%j%j%j%j%j%j%jj%j%j%j%j%j%j%j%j%j%jj%
-348B091j%j%j%j%j%j%j%j%j%j%j%j%jj%j%j%j%j%j%j%j%j%j%j%j%j%j%j%j%j%j%j%j%jj%
-353B056j%j%j%j%j%j%j%j%j%j%j%j%j%j%j%j%j%j%j%j%j%j%j%j%j%j%j%j%j%j%j%j%j%j%
-359B022j%j%j%j%j%j%j%%j%j%j%j%j%j%j%j%j%j%j%j%j%j%j%j%j%j%j%j%j%%j%j%j%j%j%
-364A989j%j%j%j%j%j%j%j%j%%j%j%j%j%j%j%j%j%j%j%%j%j%j%j%j%j%j%j%j%%j%j%j%j%j
$$ y = [2240, 2240, 2239, 2239, 2238, 2237, 2237, 2236, 2236, 2235, 2234, 2234, 2233, 2233, 2232, 2232, 2231, 2230, 2230, 2229, 2229, 2228, 2228, 2227, 2226, 2226, 2225, 2225, 2224, 2224, 2223, 2222, 2222, 2221, 2221, 2220, 2220, 2219, 2218, 2218, 2217, 2217, 2216, 2216, 2215, 2214, 2214, 2213, 2213, 2212, 2212, 2211, 2210, 2210, 2209, 2209, 2208, 2208, 2207, 2207, 2206, 2205, 2205, 2204, 2204, 2203, 2203, 2202, 2201, 2201, 2200, 2200, 2199, 2199, 2198, 2198, 2197, 2196, 2196, 2195, 2195, 2194, 2194, 2193, 2192, 2192, 2191, 2191, 2190, 2190, 2189, 2189, 2188, 2187, 2187, 2186, 2186, 2185, 2185, 2184, 2184, 2183, 2182, 2182, 2181, 2181, 2180, 2180, 2179, 2179, 2178, 2177, 2177, 2176, 2176, 2175, 2175, 2174, 2174, 2173, 2172, 2172, 2171, 2171, 2170, 2170, 2169, 2169, 2168, 2167, 2167, 2166, 2166, 2165, 2165, 2164, 2164, 2163, 2163, 2162, 2161, 2161, 2160, 2160, 2159, 2159, 2158, 2158, 2157, 2157, 2156, 2155, 2155, 2154, 2154, 2153, 2153, 2152, 2152, 2151, 2151, 2150, 2149, 2149, 2148, 2148, 2147, 2147, 2146, 2146, 2145, 2145, 2144, 2143, 2143, 2142, 2142, 2141, 2141, 2140, 2140, 2139, 2139, 2138, 2138, 2137, 2136, 2136, 2135, 2135, 2134, 2134, 2133, 2133, 2132, 2132, 2131, 2131, 2130, 2129, 2129, 2128, 2128, 2127, 2127, 2126, 2126, 2125, 2125, 2124, 2124, 2123, 2123, 2122, 2121, 2121, 2120, 2120, 2119, 2119, 2118, 2118, 2117, 2117, 2116, 2116, 2115, 2115, 2114, 2114, 2113, 2112, 2112, 2111, 2111, 2110, 2110, 2109, 2109, 2108, 2108, 2107, 2107, 2106, 2106, 2105, 2105, 2104, 2104, 2103, 2102, 2102, 2101, 2101, 2100, 2100, 2099, 2099, 2098, 2098, 2097, 2097, 2096, 2096, 2095, 2095, 2094, 2094, 2093, 2093, 2092, 2091, 2091, 2090, 2090, 2089, 2089, 2088, 2088, 2087, 2087, 2086, 2086, 2085, 2085, 2084, 2084, 2083, 2083, 2082, 2082, 2081, 2081, 2080, 2080, 2079, 2079, 2078, 2077, 2077, 2076, 2076, 2075, 2075, 2074, 2074, 2073, 2073, 2072, 2072, 2071, 2071, 2070, 2070, 2069, 2069, 2068, 2068, 2067, 2067, 2066, 2066, 2065, 2065, 2064, 2064, 2063, 2063, 2062, 2062, 2061, 2061, 2060, 2060, 2059, 2059, 2058, 2058, 2057, 2056, 2056, 2055, 2055, 2054, 2054, 2053, 2053, 2052, 2052, 2051, 2051, 2050, 2050, 2049, 2049, 2048, 2048, 2047, 2047, 2046, 2046, 2045, 2045, 2044, 2044, 2043, 2043, 2042, 2042, 2041, 2041, 2040, 2040, 2039, 2039, 2038, 2038, 2037, 2037, 2036, 2036, 2035, 2035, 2034, 2034, 2033, 2033, 2032, 2032, 2031, 2031, 2030, 2030, 2029, 2029, 2028, 2028, 2027, 2027, 2026, 2026, 2025, 2025, 2024, 2024, 2023, 2023, 2022, 2022, 2021, 2021, 2020, 2020, 2019, 2019, 2018, 2018, 2017, 2017, 2016, 2016, 2015, 2015, 2015, 2014, 2014, 2013, 2013, 2012, 2012, 2011, 2011, 2010, 2010, 2009, 2009, 2008, 2008, 2007, 2007, 2006, 2006, 2005, 2005, 2004, 2004, 2003, 2003, 2002, 2002, 2001, 2001, 2000, 2000, 1999, 1999, 1998, 1998, 1997, 1997, 1996, 1996, 1995, 1995, 1994, 1994, 1994, 1993, 1993, 1992, 1992, 1991, 1991, 1990, 1990, 1989, 1989, 1988, 1988, 1987, 1987, 1986, 1986, 1985, 1985, 1984, 1984, 1983, 1983, 1982, 1982, 1981, 1981, 1980, 1980, 1980, 1979, 1979, 1978, 1978, 1977, 1977, 1976, 1976, 1975, 1975, 1974, 1974, 1973, 1973, 1972, 1972, 1971, 1971, 1970, 1970, 1970, 1969, 1969, 1968, 1968, 1967, 1967, 1966, 1966, 1965, 1965, 1964, 1964, 1963, 1963, 1962, 1962, 1961, 1961, 1961, 1960, 1960, 1959, 1959, 1958, 1958, 1957, 1957, 1956]
-369A956%j%j%j%%j%j%j%j%j%j%j%j%%j%j%j%j%j%j%%j%j%j%j%j%j%j%%j%j%j%j%j%j%%j%
-374A925j%j%j%j%%j%j%j%j%j%%j%j%j%j%j%%j%j%j%j%j%%j%j%j%j%j%%j%j%j%j%%j%j%j%
-379A894j%j%%j%j%j%j%%j%j%j%j%%j%j%j%j%%j%j%j%j%%j%j%j%j%%j%j%j%%j%j%j%j%%j%
-384A864j%j%%j%j%j%j%%j%j%j%%j%j%j%%j%j%j%%j%j%j%j%%j%j%j%%j%j%j%%j%j%j%%j%j
-390A834%j%%j%j%%j%j%j%%j%j%j%%j%j%j%%j%j%j%%j%j%%j%j%j%%j%j%%j%j%j%%j%j%j%%
-395A806j%j%%j%j%j%%j%j%%j%j%%j%j%j%%j%j%%j%j%%j%j%j%%j%j%%j%j%%j%j%%j%j%j%%
-400A778j%j%%j%j%%j%j%%j%j%%j%j%%j%j%%j%j%j%%j%j%%j%j%%j%j%%j%j%%j%j%%j%j%%j
-405A750%%j%j%%j%j%%j%j%%j%j%%j%j%%j%j%%j%j%%j%%j%j%%j%j%%j%j%%j%j%%j%%j%j%%
$$ y = [1956, 1956, 1955, 1955, 1954, 1954, 1953, 1953, 1953, 1952, 1952, 1951, 1951, 1950, 1950, 1949, 1949, 1948, 1948, 1947, 1947, 1946, 1946, 1945, 1945, 1945, 1944, 1944, 1943, 1943, 1942, 1942, 1941, 1941, 1940, 1940, 1939, 1939, 1939, 1938, 1938, 1937, 1937, 1936, 1936, 1935, 1935, 1934, 1934, 1933, 1933, 1932, 1932, 1932, 1931, 1931, 1930, 1930, 1929, 1929, 1928, 1928, 1927, 1927, 1926, 1926, 1926, 1925, 1925, 1924, 1924, 1923, 1923, 1922, 1922, 1921, 1921, 1921, 1920, 1920, 1919, 1919, 1918, 1918, 1917, 1917, 1916, 1916, 1916, 1915, 1915, 1914, 1914, 1913, 1913, 1912, 1912, 1911, 1911, 1911, 1910, 1910, 1909, 1909, 1908, 1908, 1907, 1907, 1906, 1906, 1906, 1905, 1905, 1904, 1904, 1903, 1903, 1902, 1902, 1901, 1901, 1901, 1900, 1900, 1899, 1899, 1898, 1898, 1897, 1897, 1897, 1896, 1896, 1895, 1895, 1894, 1894, 1893, 1893, 1892, 1892, 1892, 1891, 1891, 1890, 1890, 1889, 1889, 1888, 1888, 1888, 1887, 1887, 1886, 1886, 1885, 1885, 1884, 1884, 1884, 1883, 1883, 1882, 1882, 1881, 1881, 1880, 1880, 1880, 1879, 1879, 1878, 1878, 1877, 1877, 1876, 1876, 1876, 1875, 1875, 1874, 1874, 1873, 1873, 1872, 1872, 1872, 1871, 1871, 1870, 1870, 1869, 1869, 1869, 1868, 1868, 1867, 1867, 1866, 1866, 1865, 1865, 1865, 1864, 1864, 1863, 1863, 1862, 1862, 1862, 1861, 1861, 1860, 1860, 1859, 1859, 1858, 1858, 1858, 1857, 1857, 1856, 1856, 1855, 1855, 1855, 1854, 1854, 1853, 1853, 1852, 1852, 1852, 1851, 1851, 1850, 1850, 1849, 1849, 1849, 1848, 1848, 1847, 1847, 1846, 1846, 1845, 1845, 1845, 1844, 1844, 1843, 1843, 1842, 1842, 1842, 1841, 1841, 1840, 1840, 1839, 1839, 1839, 1838, 1838, 1837, 1837, 1836, 1836, 1836, 1835, 1835, 1834, 1834, 1833, 1833, 1833, 1832, 1832, 1831, 1831, 1831, 1830, 1830, 1829, 1829, 1828, 1828, 1828, 1827, 1827, 1826, 1826, 1825, 1825, 1825, 1824, 1824, 1823, 1823, 1822, 1822, 1822, 1821, 1821, 1820, 1820, 1819, 1819, 1819, 1818, 1818, 1817, 1817, 1817, 1816, 1816, 1815, 1815, 1814, 1814, 1814, 1813, 1813, 1812, 1812, 1812, 1811, 1811, 1810, 1810, 1809, 1809, 1809, 1808, 1808, 1807, 1807, 1806, 1806, 1806, 1805, 1805, 1804, 1804, 1804, 1803, 1803, 1802, 1802, 1801, 1801, 1801, 1800, 1800, 1799, 1799, 1799, 1798, 1798, 1797, 1797, 1797, 1796, 1796, 1795, 1795, 1794, 1794, 1794, 1793, 1793, 1792, 1792, 1792, 1791, 1791, 1790, 1790, 1790, 1789, 1789, 1788, 1788, 1787, 1787, 1787, 1786, 1786, 1785, 1785, 1785, 1784, 1784, 1783, 1783, 1783, 1782, 1782, 1781, 1781, 1781, 1780, 1780, 1779, 1779, 1778, 1778, 1778, 1777, 1777, 1776, 1776, 1776, 1775, 1775, 1774, 1774, 1774, 1773, 1773, 1772, 1772, 1772, 1771, 1771, 1770, 1770, 1770, 1769, 1769, 1768, 1768, 1768, 1767, 1767, 1766, 1766, 1766, 1765, 1765, 1764, 1764, 1763, 1763, 1763, 1762, 1762, 1761, 1761, 1761, 1760, 1760, 1759, 1759, 1759, 1758, 1758, 1757, 1757, 1757, 1756, 1756, 1755, 1755, 1755, 1754, 1754, 1753, 1753, 1753, 1752, 1752, 1751, 1751, 1751, 1750, 1750, 1750, 1749, 1749, 1748, 1748, 1748, 1747, 1747, 1746, 1746, 1746, 1745, 1745, 1744, 1744, 1744, 1743, 1743, 1742, 1742, 1742, 1741, 1741, 1740, 1740, 1740, 1739, 1739, 1738, 1738, 1738, 1737, 1737, 1736, 1736, 1736, 1735, 1735, 1735, 1734, 1734, 1733, 1733, 1733, 1732, 1732, 1731, 1731, 1731, 1730, 1730, 1729, 1729, 1729, 1728, 1728, 1727, 1727, 1727, 1726, 1726, 1726, 1725, 1725, 1724, 1724, 1724]
-410A724j%j%%j%j%%j%%j%j%%j%j%%j%%j%j%%j%j%%j%%j%j%%j%j%%j%%j%j%%j%%j%j%%j%j
-416A697%%j%%j%j%%j%%j%j%%j%%j%j%%j%%j%j%%j%%j%j%%j%%j%j%%j%%j%j%%j%%j%j%%j%
-421A672%j%j%%j%%j%%j%j%%j%%j%j%%j%%j%%j%j%%j%%j%%j%j%%j%%j%j%%j%%j%%j%j%%j%
-426A647%j%%j%%j%j%%j%%j%%j%j%%j%%j%%j%%j%j%%j%%j%%j%j%%j%%j%%j%%j%%j%j%%j%%
-431A623j%%j%%j%j%%j%%j%%j%%j%%j%j%%j%%j%%j%%j%%j%%j%j%%j%%j%%j%%j%%j%%j%%j%
-436A599j%%j%%j%%j%%j%%j%%j%%j%%j%%j%j%%j%%j%%j%%j%%j%%j%%j%%j%%j%%j%%j%%j%%
-442A576j%%j%%j%j%%j%%j%%j%%j%%j%%j%%j%%j%%j%%j%%j%%j%%j%%j%%j%%j%%j%%j%%j%%
$$ y = [1724, 1723, 1723, 1722, 1722, 1722, 1721, 1721, 1720, 1720, 1720, 1719, 1719, 1719, 1718, 1718, 1717, 1717, 1717, 1716, 1716, 1715, 1715, 1715, 1714, 1714, 1714, 1713, 1713, 1712, 1712, 1712, 1711, 1711, 1710, 1710, 1710, 1709, 1709, 1709, 1708, 1708, 1707, 1707, 1707, 1706, 1706, 1705, 1705, 1705, 1704, 1704, 1704, 1703, 1703, 1702, 1702, 1702, 1701, 1701, 1701, 1700, 1700, 1699, 1699, 1699, 1698, 1698, 1697, 1697, 1697, 1696, 1696, 1696, 1695, 1695, 1694, 1694, 1694, 1693, 1693, 1693, 1692, 1692, 1691, 1691, 1691, 1690, 1690, 1690, 1689, 1689, 1688, 1688, 1688, 1687, 1687, 1687, 1686, 1686, 1685, 1685, 1685, 1684, 1684, 1684, 1683, 1683, 1682, 1682, 1682, 1681, 1681, 1681, 1680, 1680, 1679, 1679, 1679, 1678, 1678, 1678, 1677, 1677, 1676, 1676, 1676, 1675, 1675, 1675, 1674, 1674, 1673, 1673, 1673, 1672, 1672, 1672, 1671, 1671, 1670, 1670, 1670, 1669, 1669, 1669, 1668, 1668, 1668, 1667, 1667, 1666, 1666, 1666, 1665, 1665, 1665, 1664, 1664, 1663, 1663, 1663, 1662, 1662, 1662, 1661, 1661, 1661, 1660, 1660, 1659, 1659, 1659, 1658, 1658, 1658, 1657, 1657, 1657, 1656, 1656, 1655, 1655, 1655, 1654, 1654, 1654, 1653, 1653, 1652, 1652, 1652, 1651, 1651, 1651, 1650, 1650, 1650, 1649, 1649, 1648, 1648, 1648, 1647, 1647, 1647, 1646, 1646, 1646, 1645, 1645, 1645, 1644, 1644, 1643, 1643, 1643, 1642, 1642, 1642, 1641, 1641, 1641, 1640, 1640, 1639, 1639, 1639, 1638, 1638, 1638, 1637, 1637, 1637, 1636, 1636, 1636, 1635, 1635, 1634, 1634, 1634, 1633, 1633, 1633, 1632, 1632, 1632, 1631, 1631, 1630, 1630, 1630, 1629, 1629, 1629, 1628, 1628, 1628, 1627, 1627, 1627, 1626, 1626, 1626, 1625, 1625, 1624, 1624, 1624, 1623, 1623, 1623, 1622, 1622, 1622, 1621, 1621, 1621, 1620, 1620, 1619, 1619, 1619, 1618, 1618, 1618, 1617, 1617, 1617, 1616, 1616, 1616, 1615, 1615, 1615, 1614, 1614, 1613, 1613, 1613, 1612, 1612, 1612, 1611, 1611, 1611, 1610, 1610, 1610, 1609, 1609, 1609, 1608, 1608, 1608, 1607, 1607, 1606, 1606, 1606, 1605, 1605, 1605, 1604, 1604, 1604, 1603, 1603, 1603, 1602, 1602, 1602, 1601, 1601, 1601, 1600, 1600, 1600, 1599, 1599, 1598, 1598, 1598, 1597, 1597, 1597, 1596, 1596, 1596, 1595, 1595, 1595, 1594, 1594, 1594, 1593, 1593, 1593, 1592, 1592, 1592, 1591, 1591, 1591, 1590, 1590, 1590, 1589, 1589, 1588, 1588, 1588, 1587, 1587, 1587, 1586, 1586, 1586, 1585, 1585, 1585, 1584, 1584, 1584, 1583, 1583, 1583, 1582, 1582, 1582, 1581, 1581, 1581, 1580, 1580, 1580, 1579, 1579, 1579, 1578, 1578, 1578, 1577, 1577, 1577, 1576, 1576, 1576, 1575, 1575, 1575, 1574, 1574, 1574, 1573, 1573, 1572, 1572, 1572, 1571, 1571, 1571, 1570, 1570, 1570, 1569, 1569, 1569, 1568, 1568, 1568, 1567, 1567, 1567, 1566, 1566, 1566, 1565, 1565, 1565, 1564, 1564, 1564, 1563, 1563, 1563, 1562, 1562, 1562, 1561, 1561, 1561, 1560, 1560, 1560, 1559, 1559, 1559, 1558, 1558, 1558, 1557, 1557, 1557, 1556, 1556, 1556, 1555, 1555, 1555, 1554, 1554, 1554, 1553, 1553, 1553]
$$ [...]
-1001@
##END=		$$ NMR SPECTRUM
##TITLE=	
##JCAMP-DX=	6.0	$$ MestReNova 15.0.0-34764
##DATA TYPE=	NMR PEAK TABLE
##DATA CLASS=	PEAK TABLE
##BLOCK_ID=	3
##ORIGIN=	Mestrelab Research S.L.
##OWNER=	PC
##CROSS REFERENCE=	NMR SPECTRUM: BLOCK_ID=2                                     
##.OBSERVE FREQUENCY=	200.12849902499999644
##.OBSERVE NUCLEUS=	^Unknown
##NPOINTS=	29
##FIRSTX=	0.90019901223477938323
##LASTX=	4.7965652175801691826
##XFACTOR=	1
##YFACTOR=	1
##FIRSTY=	0.0076870889869910296113
##XUNITS=	PPM
##YUNITS=	ARBITRARY UNITS
##PEAK TABLE=	(XYW..XYW)
0.90019901223477938323,0.0076870889869910296113,0.0025336371564884398698
0.90359721311030527513,0.014730984229772954922,0.0025336371564884398698
0.90595497308574080009,0.0071346388455203512205,0.0027403458509380313433
0.9372420702169111939,0.035348416632758637712,0.0025336371564884398698
0.93987216134589768313,0.036558011911285902273,0.0025336371564884398698
0.97135014574344469285,0.01009801374027377921,0.0021355861105299168978
0.97378711773682358199,0.022793486441176045304,0.0025336371564884398698
0.97645778976152963757,0.011293942584501854426,0.0025336371564884398698
1.347296388777961651,0.0084440668963097417765,0.0025336371564884398698
1.3510996107861434901,0.0086813658059051359434,0.0021786082953259050705
1.3545329295044612472,0.068486152636718783393,0.0025336371564884398698
1.3826377873300212951,0.016892774148816316199,0.002572874329414507992
1.3854779184506198497,0.078524105566463636707,0.0032965823317022547971
1.418034292016701281,0.016606576996497354748,0.0032965823317022547971
1.4207244666644411879,0.0072728080927602772876,0.0017706919812746264604
1.4235794024314558648,0.0057281824252825696425,0.0025336371564884398698
1.4529527916771878271,0.0049637356430702354523,0.0025336371564884398698
1.4571489901408636314,0.0048699089661351450259,0.0025336371564884398698
1.5683346634184138768,0.0059349139613518306011,0.002073797459650868636
1.5705812273387040889,0.024170429781730735919,0.0038271539303858697137
1.6001576874869765099,0.11027530583989404722,0.0025336371564884398698
1.6634390765046123128,0.022956048829752172952,0.0032214341376383755396
1.6657375144348096629,0.0059025979853612785611,0.0018635576404385423201
1.6912960802383680825,0.021530913488407219664,0.0025336371564884398698
1.6936495608517552203,0.008834991188768102216,0.0025336371564884398698
4.7038710305094086905,0.0061581758969062134687,0.0025336371564884398698
4.734888837226413294,0.017068728630163506471,0.002810513246179893905
4.7657814665068682913,0.012937100995319208985,0.0030517807008552566735
4.7965652175801691826,0.0058266952181072091677,0.0025336371564884398698
##$MNOVA/PEAK_DATA_TABLE=	(T,F,A,ST,SP,APT,APC)
$$ Complementary to PEAK TABLE
$$ T: Type
$$ F: Flags
$$ A: Annotation
$$ ST: Shape Type
$$ SP: Shape Parameter
$$ APT: Attached Peaks Type
$$ APC: Attached Peaks Count
Compound,None,,1,0.012651344523936958186,0,0
Compound,None,,1,-0.020461720468821942287,0,0
Compound,None,,1,0.096466094505008925797,0,0
Compound,None,,1,-0.02454258158025895975,0,0
Compound,None,,1,0.054308114763533643643,0,0
Compound,None,,1,-0.2000000000000000111,0,0
Compound,None,,1,0,0,0
Compound,None,,1,0.05193304165085631946,0,0
Compound,None,,1,-0.052669373138139963242,0,0
Compound,None,,1,0.052565196522160018144,0,0
Compound,None,,1,-0.0072617163873346102232,0,0
Compound,None,,1,0.49373573111636065436,0,0
Compound,None,,1,0.3846129927631423695,0,0
Compound,None,,1,0.4126550031095171378,0,0
Compound,None,,1,-0.42739655687852390331,0,0
Compound,None,,1,-0.087839818289608795343,0,0
Compound,None,,1,0.048008801957111546521,0,0
Compound,None,,1,0.084277834519236871635,0,0
Compound,None,,1,0.31689697693187046657,0,0
Compound,None,,1,0.60000000000000008882,0,0
Compound,None,,1,-0.13861345479502418243,0,0
Compound,None,,1,0.094259364431274861307,0,0
Compound,None,,1,-0.29668627531719832247,0,0
Compound,None,,1,-0.16809476602676692858,0,0
Compound,None,,1,0.00373703670293871245,0,0
Compound,None,,1,0.02726978325835993644,0,0
Compound,None,,1,0.31060952755210863296,0,0
Compound,None,,1,0.066628492296946062456,0,0
Compound,None,,1,0.03575429877491231867,0,0
##END=		$$ NMR PEAK TABLE
##END=		$$ LINK
