##TITLE=	1H NMR: Isopropyl methylphosphonofluoridate (Sarin); S.1.A.01; [107-44-8]

##JCAMP-DX=	6.0	$$ MestReNova 14.1.2-25024
##DATA TYPE=	LINK
##BLOCK_ID=	1
##BLOCKS=	1    
##ORIGIN=	Mestrelab Research S.L.
##OWNER=	HGL
##$MNOVA/LINK_BLOCK_TYPE=	ITEM	$$ NMR Spectrum
##$MNOVA/ITEM/POLYGON=	(XY..XY)
5321,5835
8722,5835
8722,8208
5321,8208
5321,5835
##$MNOVA/ITEM/Z=	0
##$MNOVA/ITEM/ANGLE=	0
##TITLE=	1H NMR: Isopropyl methylphosphonofluoridate (Sarin); S.1.A.01; [107-44-8]
##JCAMP-DX=	6.0	$$ MestReNova 14.1.2-25024
##BLOCK_ID=	2
##DATA TYPE=	NMR SPECTRUM
##DATA CLASS=	XYDATA
##NUMDIM=	1
##ORIGIN=	UXNMR, Bruker Analytische Messtechnik GmbH
##OWNER=	markku
##.OBSERVE FREQUENCY=	400.13649223679101397
##.OBSERVE NUCLEUS=	^1H
##.SOLVENT NAME=	CDCl3
##.PULSE SEQUENCE=	zg45
##LONGDATE=	1992/10/13 17:05:18.000
##.ACQUISITIONMODE=	SIMULTANEOUS
##$ORIGINAL FORMAT=	JCAMP-DX NMR
##$MNOVA/SCALES_VERSION=	9
##$PARAMETER FILE=	(datafile, ASCII, h:/OPCW-Database/OCAD_VGWD_2025_v27/NMR%20DXFiles/05-3-0009.dx, 0)
$$ 
##$PARAMETER FILE=	(format.temp, ASCII, format.temp, 0)
$$ EDIT_PAR COMMAND FILE
$$ 
$$ DI_MODE         LONG
$$ ED_ENTRY        ACQU
$$ ORDER           FILE
$$ 
$$ 
$$ HEADER		"F2 - Acquisition Parameters"
$$ T_NAME		Date
$$ TYPE	R32
$$ CLASS	ACQU
$$ SUBRANGE 0.0 1000000
$$ REL	"Date=itodate(DATE)"
$$ INV_REL	"DATE=datetoi(Date,DATE)"
$$ FORMAT	"%14.0f"
$$ TEXT	" "
$$ END
$$ T_NAME		Time
$$ TYPE	R32
$$ CLASS	ACQU
$$ SUBRANGE 0.0 1000000
$$ REL	"Time=itotime(DATE)"
$$ INV_REL	"DATE=timetoi(Time,DATE)"
$$ FORMAT	"%14.2f"
$$ TEXT	" "
$$ END
$$ NAME		PULPROG
$$ TEXT	" "
$$ END
$$ NAME		SOLVENT
$$ TEXT	" "
$$ END
$$ NAME		TE
$$ FORMAT	"%14.1f K"
$$ TEXT	" "
$$ END
$$ T_NAME          AQ
$$ TYPE	R32
$$ CLASS	ACQU
$$ SUBRANGE 0.0 1000
$$ REL	"AQ=TD/(2*SW*SFO1)+2e-5;if(DIGTYP>2){AQ=(TD+2)/(2*SW*SFO1);if(SW*SFO1>125000){AQ=(TD+2)/(2*SW*SFO1)+4.0e-6*(TD-TD/((2*SW*SFO1)*(3/(2*SW*SFO1)+8e-6)));}}if(DIGTYP==2){AQ=8.0e-6+TD*(1.0e-5+0.5/(SW*SFO1));}"
$$ INV_REL	"TD=(AQ-2.0e-5)*2*SW*SFO1;if(DIGTYP>2){TD=AQ*2*SW*SFO1-2;if(SW*SFO1>125000){TD=(AQ-1/(SW*SFO1))/(1/(2*SW*SFO1)+4.0e-6-(2.0e-6/((SW*SFO1)*(3/(2*SW*SFO1)+8e-6))));}}if(DIGTYP==2){TD=(AQ-8.0e-6)*2.0*SW*SFO1/(1.0+2.0e-5*SW*SFO1);}"
$$ UNIT	"sec"
$$ FORMAT	"%14.7f sec"
$$ TEXT	" "
$$ END
$$ T_NAME          FIDRES
$$ TYPE    R32
$$ CLASS   ACQU
$$ SUBRANGE 0.0 100000
$$ REL     "FIDRES=SW*SFO1/TD"
$$ INV_REL "TD = nextpow(SW*SFO1/FIDRES)"
$$ UNIT	"Hz"
$$ FORMAT	"%14.6f Hz"
$$ TEXT	" "
$$ END
$$ T_NAME          DW
$$ TYPE	R32
$$ CLASS	ACQU
$$ SUBRANGE 0.0 1000000
$$ REL	"DW=1000000/(2*SW*SFO1)"
$$ INV_REL	"SW=1000000/(2*DW*SFO1)"
$$ UNIT	"usec"
$$ FORMAT	"%14.1f usec"
$$ TEXT	" "
$$ END
$$ NAME		RG
$$ TEXT	" "
$$ END
$$ NAME		NUCLEUS
$$ TEXT	" "
$$ END
$$ NAME		DECNUC
$$ TEXT	" "
$$ END
$$ NAME		PROBHD
$$ TEXT	" "
$$ END
$$ NAME		HL1
$$ FORMAT	"%14d dB"
$$ TEXT	" "
$$ END
$$ T_NAME		D1
$$ TYPE	R32
$$ CLASS	ACQU
$$ SUBRANGE 0.0 1000000
$$ REL	"D1=D[1]"
$$ INV_REL	"D[1]=D1"
$$ UNIT	"sec"
$$ FORMAT	"%14.7f sec"
$$ [...]
$$ ##$COROFFS= 0
$$ ##$CY= 15
$$ ##$DATMOD= 1
$$ ##$DC= 2
$$ ##$DFILT= <>
$$ ##$DTYPP= 0
$$ ##$ERETIC= no
$$ ##$F1P= 11.0313701629639
$$ ##$F2P= -0.539169635430179
$$ ##$FCOR= 0.5
$$ ##$FTSIZE= 0
$$ ##$FT_mod= 7
$$ ##$GAMMA= 1
$$ ##$GB= 0
$$ ##$INTBC= 1
$$ ##$INTSCL= 4.404202e-010
$$ ##$ISEN= 128
$$ ##$LB= 0.1
$$ ##$LEV0= 0
$$ ##$LPBIN= 0
$$ ##$MAXI= 18.44205
$$ ##$MC2= 0
$$ ##$MEAN= 0
$$ ##$ME_mod= 0
$$ ##$MI= 1
$$ ##$MddCEXP= no
$$ ##$MddCT_SP= no
$$ ##$MddF180= no
$$ ##$MddLAMBDA= 0
$$ ##$MddMEMORY= 0
$$ ##$MddMERGE= 0
$$ ##$MddNCOMP= 0
$$ ##$MddNITER= 0
$$ ##$MddNOISE= 0
$$ ##$MddPHASE= 0
$$ ##$MddSEED= 0
$$ ##$MddSRSIZE= 0
$$ ##$Mdd_CsALG= 0
$$ ##$Mdd_CsLAMBDA= 1
$$ ##$Mdd_CsNITER= 0
$$ ##$Mdd_CsNORM= 0
$$ ##$Mdd_CsVE= yes
$$ ##$Mdd_CsZF= 0
$$ ##$Mdd_mod= 0
$$ ##$NCOEF= 0
$$ ##$NC_proc= -2
$$ ##$NLEV= 6
$$ ##$NOISF1= 6.5
$$ ##$NOISF2= 5.6
$$ ##$NSP= 1
$$ ##$NTH_PI= -2928810
$$ ##$NZP= 0
$$ ##$OFFSET= 11.03137
$$ ##$PC= 1
$$ ##$PHC0= 61.54339
$$ ##$PHC1= 40.6
$$ ##$PH_mod= 1
$$ ##$PKNL= yes
$$ ##$PPARMOD= 0
$$ ##$PPDIAG= 0
$$ ##$PPIPTYP= 0
$$ ##$PPMPNUM= 100
$$ ##$PPRESOL= 1
$$ ##$PSCAL= 0
$$ ##$PSIGN= 0
$$ ##$PYNMP= <proc.py>
$$ ##$RDF1= 0
$$ ##$RDF2= 0
$$ ##$RDFWHM= 0
$$ ##$RDINT= 0
$$ ##$RDPOS= 0
$$ ##$REVERSE= no
$$ ##$SF= 400.134393009733
$$ ##$SI= 32768
$$ ##$SIGF1= 2
$$ ##$SIGF2= 1
$$ ##$SINO= 6459.115
$$ ##$SIOLD= 1024
$$ ##$SPECTYP= <>
$$ ##$SREF_mod= 1
$$ ##$SREGLST= <1H.CDCl3>
$$ ##$SSB= 0
$$ ##$STSI= 32768
$$ ##$STSR= 0
$$ ##$SW_p= 4629.77091902536
$$ ##$SYMM= 0
$$ ##$S_DEV= 0
$$ ##$TDeff= 0
$$ ##$TDoff= 0
$$ ##$TI= <>
$$ ##$TILT= no
$$ ##$TM1= 0
$$ ##$TM2= 0
$$ ##$TOPLEV= 0
$$ ##$USERP1= <user>
$$ ##$USERP2= <user>
$$ ##$USERP3= <user>
$$ ##$USERP4= <user>
$$ ##$USERP5= <user>
$$ ##$WDW= 1
$$ ##$XDIM= 32768
$$ ##$YMAX_p= 392283486
$$ ##$YMIN_p= -359814
$$ ##$CURPLOT= <A4>
$$ ##$CURPRIN= <$1#1#0#1#1#1#1#1#0#-1#-1#1#-1>
$$ ##$DFORMAT= <normdp>
$$ ##$LAYOUT= <+/1D_H.xwp>
$$ ##$LFORMAT= <normlp>
$$ ##$PFORMAT= <normpl>
$$ $$ End of Bruker specific parameters
$$ $$ ---------------------------------
$$ ##NTUPLES= NMR SPECTRUM
$$ ##VAR_NAME=  FREQUENCY,     SPECTRUM/REAL,   SPECTRUM/IMAG
$$ ##SYMBOL=    X,             R,               I
$$ ##VAR_TYPE=  INDEPENDENT,   DEPENDENT,       DEPENDENT
$$ ##VAR_FORM=  AFFN,          ASDF,            ASDF
$$ ##VAR_DIM=   32768,         32768,           32768
$$ ##UNITS=     HZ,            ARBITRARY UNITS, ARBITRARY UNITS
$$ ##FACTOR=    0.141289395722209, 1,           1
$$ ##FIRST=     4629.62962962964, 30523,        -108638
$$ ##LAST=      0,             50886,           -2912089
$$ ##MIN=       0,             -359814,         0
$$ ##MAX=       4629.62962962964, 392283486,    0
$$ $$ Real data points
$$ ##PAGE= N=1
$$ 
##XUNITS=	HZ
##YUNITS=	ARBITRARY UNITS
##FIRSTX=	4414.1125175235902134
##LASTX=	-215.51711210604779012
##DELTAX=	-0.14128939572220947096
##XFACTOR=	1
##YFACTOR=	374.44655342781783247
##FIRSTY=	30523
##MINY=	-359814
##MAXY=	392283488
##NPOINTS=	32768
##XYDATA=	(X++(Y..Y))
$$ [...]
2947A9J09j28J01o3Q8n9J10m6m5j83K14Oj15Q8m1o9J2om2qK14k3p3L1j17jq7J64m4m7O3L9
2942F1n5Q2p0Jm0J58j9j62R6o1p0Q4J12n9m4J71j26K3j4k6J2L7J47r7j57N2O4p5J05l7J2j31
2938b6O3N9j2P9o9JJ0j3k4r5k0K4L0L4j31MM5J58k2j95J37J1m5J11n2k38K08JO2p0QO3k6N
2933G5j05K8l5K56p8m0n3N9j05l8L9J17r0K64J08M58N39o19n45J6n1j29n9L8N1m7L3l4j13
2929f0Q5L0OR1j29M8l6q2N6J9Lm8P9J4J4P5l4o7m0N2P4q1oLk09Q1J18p9R3n6J43j77R4mj0
2924F0J06m3k9j2K0K3r2P0p5J28k9kQ4j48J2r2N7Q8O5q1j20Q0J08L7l14R2O1N0r8n3N5J72
2919A80k25J48j03K5M9k1J12O7P9n8j51l2J39J05j98pJ03K8J14k72k0rM3J13p2j0p3l0Q9K
2915A15O2p2K23Qj55k1O2N4j63K8K6J77l3k4ql3J71j1l5q8j5j5R1M6j7R3R4j97PN6J24o6l8
$$ y = [19, 128, 0, 101, 38, 126, 67, 177, 131, 86, -97, 117, 123, 8, 96, 55, -14, -2, -8, -50, -58, 156, 133, 60, 91, -26, -27, -114, 50, 6, -41, 22, 61, 6, 88, 18, 19, -21, 137, 118, -44, 52, -9, -79, 5, 117, 58, 14, 185, 59, 82, 68, 42, 54, 91, 238, 141, -16, 36, 100, 25, 130, 93, 105, -26, 37, 96, 84, 163, 94, 95, 105, 92, 68, -27, -47, -23, 7, 41, -90, -86, -41, 117, 95, -100, 37, 48, 3, 114, 62, -176, 32, 33, 95, 25, 33, 96, 70, 75, -30, -2, -37, 219, 141, 101, 48, 107, 2, -36, 3, 120, 30, 294, 402, 860, 1399, 780, 235, 251, 200, 71, 12, 50, 101, 54, 87, 53, -60, 25, 55, 61, 152, 23, 71, 35, -47, 9, 28, 31, -17, 62, 76, 90, 165, 131, 64, 24, 76, 150, 69, 63, 66, -143, -62, 56, -23, 70, 14, 157, -20, 74, 70, 60, 166, 123, 94, 82, 102, 125, 33, 103, 28, 156, 127, 125, 209, 61, 73, -19, 38, 126, 191, 110, -10, 70, 178, 215, -99, -7, 54, 104, 6, -47, 8, 180, -45, 103, 0, 25, 74, 53, 165, 232, 311, 253, 102, 70, 209, 314, 116, 109, 212, 240, 354, 82, 62, 53, 96, 209, 137, 127, 54, 24, 113, 115, 177, 105, 328, 336, 181, 160, 222, 276, 113, 141, 167, 344, 311, 287, 279, 246, 417, 406, 371, 283, 268, 253, 344, 390, 373, 466, 560, 363, 370, 426, 550, 484, 446]
2911D46Q7OK81J56Po1J85M62J80L91L36M80R24J153K039L614O546J5563N6579Q8182q7486
2908I0070n8145j7084o237l103j718q98n03p28m14k97k03n3j23j00n7p1j29q0j0j67M9r2K67
2904A74m2j32rO3J8R5j19q2K7o1k2J01N8j18J9J1l4N2L9J6r1O0j48J37m0R8mj09J19n5m7J27
2900A01o2m2o6R4j7m7K9J67k21k9O1J20p0l8k6n7o0L0m5J06o4l6P6K1N8Rpk0J2m9j02J64R5
2895H5j01j14K6m8J33j1m1J43M3o2qj31P9j2J0k2m6P2n4K87j73k06Q4M5J01r1jj04J27Mj66
2891a52J69J10l2L8k5m6L1j77n4K23k6l5m1J26O4j66k04K51J4L2j43N1r6J88j03j22Q4J59
2887A18k8q5j7M9O7p5J27k65R8N0J07K04L96L18l35l70k77j04J0j9L2q8NM5M7K5j03l7J68
2883F3o1j4r5OJ9o3J59M8p6m2R6r7N4j15l0J18J29j46k4P2K6M3m0J34j08l3M2k33J56r2J30
$$ y = [446, 533, 539, 820, 976, 983, 922, 1107, 1569, 1749, 2140, 2476, 2956, 3880, 5033, 7072, 10686, 17232, 32795, 89374, 177556, 90070, 31925, 14841, 8604, 5501, 3783, 2885, 2382, 1654, 1240, 943, 740, 687, 564, 464, 407, 336, 207, 127, 117, -50, -1, -93, 174, 132, 0, -9, 54, 72, 167, 48, -34, -7, -68, -90, 11, 69, -49, -30, -19, -53, -1, 38, 54, -37, 23, -125, 12, -28, 70, 66, -43, 76, 21, -26, 101, 39, -3, -69, 25, 8, -39, -10, 157, -64, -93, -32, 88, 18, -20, -46, -103, -163, -133, -178, -72, -136, -172, -96, -75, -17, -8, -15, -35, -23, -72, -174, -10, 85, -16, -130, -104, -152, -19, -30, -71, 72, 115, 53, 45, -86, -7, -19, -9, -31, -77, -5, -59, 228, 55, -151, -67, -22, 79, -12, -13, -117, 10, 14, -152, 17, 127, 95, 133, 108, 62, 93, -84, -138, 85, 59, 24, -17, 109, 173, 7, -197, 54, 68, 100, -43, 8, -88, 100, -3, -125, -41, 118, 90, 5, -12, 37, 104, 29, 156, -109, -11, 39, 146, 350, 746, 1064, 729, 359, 82, -22, -12, -31, 1, -87, -82, -37, 10, 35, -68, -105, 63, 2, -12, -107, -101, -82, -145, 14, 62, -14, -56, 40, -57, -3, -118, -148, -30, 99, -47, -71, 1, 27, 70, 30, 164, 56, 23, 65, -168, -12, -104, 26]
2878B6p8N6K02j40P4J35j56o5o8pJ48q4Pl7K5J7P3n4p2l2J3q9J73K5k1%J7j24m8Q6N6J07r5
2874G0o2k1k3p9J91j06L2n3J15l3N2K7m4q2J70j54q4R6%k1J9j87J18J39o8M4K1j20K2L0L1
2869D0j85Q3J7K8j59Q2J54L9j03J12N0j9m5k16j8RJ26j4K0n9m4J44m8l4J7l9M9N8K05k40k3
2865a3J60j08o6J2j9m1J54m1j7M3O5j07k2J05j89K7J06l7j22L6k4j24K64p2N2j22K26M1j95
2861b8N1m1Nl6rO1m7l5P9J4j15J41o8n1L5l1P0O9Or9P6j10QJ32k01O7N2j46J45m0J95q8j20
2856e9M5L2O7j80r3J97m3jj16R4R7p3m1Q0K4J23L8j06p6m8%m6j19O8N0O0J7om4O2N5K9n0j22
2851h5M1M0r2P3M0j1n4m6J03J77l5qj20K35j80j78J05o5j7Q2L9O9o9j8nK26j28j37rN9n4L0
2847HL9M7J36j16L8k01K04q2o0L4j13K07P0k61J69k8J3k06J65p6j4N9k6O7o3jl8J8j24Q2J45
$$ y = [26, -52, 4, 206, 66, 140, 275, 119, 54, -14, -21, 127, 43, 50, 13, 38, 55, 128, 74, 2, -30, -17, -106, 67, 92, 71, 71, 88, -36, -84, 2, 58, 165, 70, 8, -13, -36, -115, 76, -30, 2, -51, 64, 31, 83, 110, 66, -16, 154, 0, -84, 12, 12, -9, 10, -177, -59, 80, 12, 56, 77, -43, -21, 9, 40, -145, -62, -45, -17, -176, -94, 60, 99, -4, 108, 158, 139, 94, -122, -140, -131, -5, -19, 1, -58, -102, 42, -6, -40, -23, -62, -13, 45, 250, 10, -13, 147, 39, -27, -15, -34, -75, 79, 38, 21, 64, 129, 22, 0, 105, -84, -57, 49, 12, -110, -74, -98, -222, 42, -30, 22, -100, 126, 167, -28, 23, -18, -13, -49, -58, 3, -44, -79, 0, 14, -101, 40, -28, -79, -44, -75, -5, 64, 70, -29, 47, -63, -55, 77, -124, -57, -5, -151, -6, -46, 149, 61, -59, -14, 18, 85, -95, -188, 9, -34, -35, -151, -57, 40, -33, -74, 6, 30, 153, 191, 85, 9, -39, -39, -85, -204, -136, -86, -26, -9, -15, -59, 3, 58, 87, 37, -85, -44, -4, -96, -23, 17, 6, -48, -94, 9, 186, 151, 143, 23, 258, 78, -100, 5, -60, -77, 5, 44, 113, 44, 26, 21, 247, 119, -18, -27, 32, -22, 8, 47, 94, 230, 114, 152, -49, 155, 73, 13, 47, -66, 141, 211, -50, 119, 91, 104, -102, 63, -13, -27, 32, 6, 73, 10, 9, -29, -11, -135, -53, 92]
2842I2o8Q9o8Oj23K37q0R3O2j56l8j28J29M6pr1Nq6J09R2pj8N0m5j29K1J05j18N0j46J42r9
2838g9P9p2K23o8qLo0K3m6L5j04J48p6k2o6J4J27j62j3j3K99m4k3j09R6O4p2m2N6J4J32j72
2833F2P1j12L3qj15M5J35k3Nk48J27P1Q9N7j02q1O8L3n0p9J29l2k9n8LR1j12N9N1m8j18J5
2829g1KQ9J5L2q5K0j05J14j07O5J87j80J5J36J6p7q5N7j12J26P9j71O9j6M9j17q8K64j23n2
2825e4P6J95k3p5j32L1o5M6kJ02j36k9J61M0j47L1n9J60l5l3Q7Pj6J3M3q7j94J05j79K3L3
2820a13J87O8j31j1K8n9o4P6p9K8J32o5k7P0r5J0J06j80p2J86PN8n5L0M7j44J37Jl3Q3j56
2816c0m7J45j68P7Nl8J2l1j0pK1Q4l2J55j12q2L1m2j9P1k7O9J29o6j03R6PJ9j5ML7j29j4J44
2811A34k58J83L4k6m6o5J69o7R6j18j35J01L2on1JQ5k54P3R7k3Q7q3k4L9n2J48k54K56K3k9
$$ y = [92, 24, 113, 45, 51, -72, 165, 85, 178, 240, 84, 46, -82, 47, 93, 86, -5, 0, -86, 23, 115, 108, 90, 140, 95, -34, -13, 92, -26, 24, -122, 20, -79, 0, -72, 151, 83, 75, 78, 18, 41, -5, 30, -74, 74, -2, -24, -90, -76, 51, -111, -124, -137, 162, 118, 95, -14, 82, 146, 74, 32, 88, 102, 234, 62, 133, 21, 54, 46, -69, -24, 111, 88, 93, -155, -28, 43, 132, 189, 87, 6, 74, 107, 57, -22, 107, 75, 46, -12, -9, 82, -30, 29, 80, 32, -86, -71, -69, 20, 35, 67, -18, 2, -103, 11, -96, -31, 156, -24, -9, 127, 143, 66, -19, 38, -74, 52, 131, -40, 29, 13, 62, -55, -143, 121, -2, -54, 22, 217, 194, 119, -13, 18, -47, -1, -3, 99, -37, -66, 95, 135, -12, 19, -40, 120, 85, 52, 139, 146, 130, 143, 186, 99, -95, 10, -169, -146, -113, 74, 142, 11, 0, 28, -31, -95, -19, -98, -70, 62, -3, -30, 40, -55, -45, 61, -119, -191, -5, 2, 60, 5, 35, 82, -62, 75, 76, 43, 126, -30, -77, 68, -100, -23, -18, -56, -44, -75, -85, -92, -71, 13, -19, 136, 24, -58, -27, -69, -88, -17, -44, 25, 154, 88, -15, 81, 88, 107, 92, 96, 133, 4, -10, 134, -124, 59, 93, 67, 21, -44, 125, 58, 154, 36, -99, 2, 34, 28, -23, -22, 63, -191, -118, -21, -44, 43, -40, -64, -25, -77, 71, -183, 73, 96, 67]
2807F7P1m0K2k34J03o1O2P9m5k7j26J7J06l2OM9J3j06N1Q8k9o3P6P0J91n3J25j55j02K0J19
2802B62M99P2m62j28j27J9j33o3N9j7M7mk1Qk8J13O8j1m5J5o9k0m6n6J54j12J55k40m3J10
2798d4N4J99r5L4j22N5k8q1Ro1O1J34o7k8K8mj48P5K8l5Q5Q5j09J32j57o8LJ15K4J74j24j08
2794A6L6j68P8Qk4O3P6j07n2O4K4J1l0L7j28K07k00l4Q4p1lJ37Q4m1J5j14J8N3k7N6r6QL1
2789A1O7j29RO9p5R1O5K7j11PN2m1Q1j11j4R1O2p3l2R0O2j98%Rl1Q5j1r7J65j59Pl0M1P4l7
2784A6k3L0n6L2Q2L7n9m4qJ7nj18Q4J00OJ8j12J4J08l2lMO1j41K7m4M2J21j50K5n5p3j3J06
2779fJ23Kn9j37J3K0J18j69M4%J14J3r1L9N8p3n0J44j1j05r8O6R0rQJ46k68J07J32q1k07p5
2775b02L08r0MRR0Po0Mn2m5M5J10J8J3M5p9j92j63K12J21j3r6n4j1J44o9N3l1M8j09J17O8
$$ y = [67, 138, 98, 120, -114, -11, -72, -10, 69, 24, -3, -129, -112, -6, -38, -32, 17, 30, -76, -25, 63, 34, -29, 47, 117, 308, 255, 380, 225, 123, 143, 262, 761, 833, 371, 243, 116, 135, 2, -61, -2, -19, 28, 24, 3, 11, -17, 96, 164, 153, 108, 123, 54, 34, -12, -68, 86, -26, 129, -111, -154, -44, 10, 209, 114, 148, 26, 81, 53, -28, -19, -80, -19, 115, 48, 20, 48, 44, -104, -29, -1, -36, 49, 134, 25, 157, 0, -68, -65, 50, 74, 248, 124, 16, 52, -116, -38, -30, -54, 9, 85, -22, -74, -10, 14, 25, -5, 32, -96, 111, -89, -123, -39, -110, -113, 24, 108, 67, 82, -32, -14, 39, 12, 68, -28, -20, 11, 78, -51, -42, 27, -48, 43, 108, 135, 24, 31, 83, 42, 123, 12, -2, 89, 151, 78, 46, 136, 198, 0, 0, 9, -22, 63, 52, -45, 120, -39, -32, -62, -21, 53, 16, -7, 23, -33, -1, 81, 118, 59, 15, 7, 24, 19, -99, -15, 85, 91, 109, -3, 11, 119, 87, 84, 88, 149, 8, 35, -9, 33, 154, 4, 29, -26, -99, -112, -6, 117, 119, 60, -77, -64, -44, 74, -95, -51, -51, 63, 76, -15, 24, 82, 9, -41, 103, 92, -13, -111, -45, 45, 36, 44, 190, -78, 29, 161, 80, -127, -202, 106, 16, 20, 29, 119, 126, 66, 70, 18, -27, 18, 128, 146, 159, 204, 125, -67, -230, -18, 103, 90, -6, -60, -71, 73, 4, 57, 26, 74, -35, 82, 150]
2770A50J6j09K2k5J1L2j51J2J5M3P9J08n1On2mq4j53K32j12k6j7O3Q4l3o5q3R2N9P8qj9n2
2765E8R0p3J0k2k0r8nL2Q9l7L4R0l2r2oO0j12m7J07P2j29lP0j18O3r7J87k4p4o3R3JJ08j06
2761FJ36rJ1j44k5O3N4j17J59j30pj02Q8R5kp8O3n6o2J34j45m8J22K6m8N6M1k0L3N2o2l9K
2756D7J28k9j55mJ3J9m8L6J32K8j96M0k0M1l5J31j6k8Qp3L8l5p0j17P3J01j0l5J98N4r6o3
2751E7m8Q3J30k71J7K32k00M1kl6q6K94n3k02J05p8J16k54J81p0N1j11J52K4o5q3J9Q0j09
2747h6O8J22j66J30n9J22j64J7k2J46m8Kj8P1j0O5j70J51p3l8o1P8l7J5j03O9L9j10J12k9
2743A3L1p8P1J24p5p0o7M6pRj8M0N7j09K1o9j01J00N0K37pk69K9r9K16J3q2L4j3K2q9K20l
2738A77j00j56j5J43j62K70j04n0N7K6m6k1j07N0J10j16p0M3J29j02MJ04m9n9K3p5P1q0K2
$$ y = [150, 166, 57, 79, 54, 65, 97, -54, -42, -27, 16, 95, 203, 152, 158, 106, 102, 18, -135, 97, -15, -41, -58, 5, 89, 56, -9, -92, 0, 59, 137, 129, 110, 58, 148, 75, 85, 63, 43, -55, -60, -28, 61, 24, 58, 148, 116, 24, 18, 78, -34, -81, 26, 98, -31, -34, 36, -82, -19, -116, 71, 47, -27, -90, 3, 4, 112, 6, 142, 133, 144, 0, -25, 38, 92, -25, 134, 4, -3, -105, -17, 78, 76, -2, 61, 5, -57, 77, -68, -116, 6, 32, -16, 40, 81, 61, 94, 146, 84, 45, 47, 175, 146, -9, -13, 0, 19, -29, 7, 139, 167, -29, 11, -9, 32, -3, 128, 112, 84, 92, 19, 57, 22, -48, -165, -92, 9, -1, -36, 162, 216, 120, 57, 9, 92, 222, -49, -32, 200, 0, 41, 39, 3, -83, 211, 158, -44, 61, -17, 99, -155, 26, -44, 7, -104, 48, 72, 7, -76, -57, 23, -86, -18, 104, -62, 68, 9, 131, -33, -16, -38, 108, 60, 62, 44, 115, 105, 170, 0, 151, 78, 40, -21, 57, 20, 35, -68, 1, 40, -70, 42, 13, 44, -34, 37, 161, 86, 16, -51, -5, -12, -3, -21, 19, 76, -33, -12, -81, -182, -82, -32, 205, 198, -71, -42, -141, 75, 88, 6, 40, 27, 49, -40, 180, 177, 77, -79, -94, 49, -113, 157, 53, 3, 60, 86, 40, 19, -88, -38, 72, -44, -114, -71, 58, -44, -40, 64, 15, -44, -21, -96, -25, -105, -83]
2734h3N5J12R4j37r3J02K6M8m9j82K94m2j33l2q7R2N4j29R5P0K5r1J07J35k33r4M7m3K9j3
2730e6L9J50LJ1k03J42L6o7j2o3R3Pj32L7o3Q3Qo8M2r1J18R9Q2j32J26r2n7j70K1J29K1r6
2726e5R6J6Q4Jq8Q1j65J03p1j90K04m1N4lJ1q4n9J58k5Q1l3p0j47J08j34J77j7R9l0k3l6q8
2721h6J02N9o2k5P2j31J7J2olJ00j7m9J52n6p6k9J2n9l7pM5N7OJ49J2Jo0o3P0O3J6k58J28
2716D9j0kO0j71O2oj00R1L0lJ39p7j2P1l4j3m8M5N1j64nN7L2J5j9P9P6l0j31K07j65L1q2J05
2711A28q2J6j28jP9O1J1j06k7O6NJ2j63M1J18KKq1J78k23P3J97J1j71M4l5j15J00o5J46jr3
2707aJ4J18o1o5R5j5m6J4n0M1j68J16J31r4j66J49N9ql6k6l8R2L4n6N5P5k28PJ07j11J20j58
2702a00N5J90j79P5P1j12R9K1j87r5K51M3j04K17j97j03J33K07j65m6o0k8L7RK5q1q1J06O
$$ y = [-83, -28, 84, 178, 41, -52, 50, 76, 124, 75, -107, 187, 145, 12, -20, -107, -15, 39, -90, 5, 75, 100, 9, 116, 251, 18, -76, -29, -72, -43, -56, -17, 133, 136, 147, -56, 86, 122, 55, 43, -20, 73, 80, -52, -15, -78, 5, 13, -55, -13, -104, 14, 113, 195, 63, 189, 97, 40, -130, -109, 20, 41, -55, 41, 57, 141, 142, 54, 135, -30, 73, 2, -188, 16, -25, 29, 26, 37, -47, -106, 52, 27, 108, 75, 5, -142, -34, -168, 9, -8, 91, 61, 38, 2, -86, 16, 75, 13, -12, 60, -71, -54, -42, -48, -51, 49, 32, -17, 135, 79, 3, -26, -14, -73, -110, -117, -72, -15, -9, 140, 152, 153, 93, 30, 100, 163, 179, -79, 49, 39, 37, 97, -74, -12, -18, -118, -27, 3, 0, 139, 62, 50, 121, 87, 74, 26, 71, 122, -42, -47, 10, 42, 57, 38, 117, 193, 163, 32, 239, 74, 105, 23, 128, 46, 62, -66, -67, 12, 73, 84, -22, -49, 17, 22, 34, -129, -88, 30, 32, 34, -47, 131, -92, -19, 178, 189, 18, 62, 27, -88, 12, -53, 93, 92, -1, 13, 131, 70, 5, 100, 85, 39, 53, 3, 44, -124, -8, 123, 29, -137, 12, 71, 63, 27, 1, -37, 55, 89, 33, 88, 163, -65, -58, 49, -62, 58, -100, -45, 145, -34, 41, 112, 0, 99, 120, -67, -162, 89, 132, 28, 245, 48, -55, 78, 285, 120, 74, 14, -14, 23, 32, 57, -24, -105, 1, 7]
2698GkN9m2j85qk2j4J8J30N5N2P8o7J9j85J3J21l3J01p4k3Lj39J26J18m1o1n5J9j2R5L6j23
2694c6Q7N1n8m9J15k32J81kJ2n5j13J54pN0Ok8M0o2K3j8on5Rr8J55J13n6l6l7L9j19j2O4O5
2689H5l1r7J38j6N1k27J35p3P2J3r1O1J42j14M2j26J71Q3q7l1l3m3L5J35p4m3j4nr0n0J47
2684F5q4K6J01l1O4o8j4N5o9j65m9J72R2k7qM6l2J5j87J84J1P2J0k01NJ03l3m6j58P3J95j34
2680a7N5K0J39k47J41l2J0n8O7j27J56n4n0PN5m1J10j36N8j23Qj6J18J3R0l7j0j98J30M5o0
2676A6K3N2j76Q7N2J1R8l9No2Q3q0R2J4rp8j65J26o6J41q3l6J38J22j11j46j0Kq1O9QJ53j89
2671c9J02N0j0pM9j05m1J29R3j92q0o6O3k9K9J40qj8O8l7l3Q7N0r3Lo0NJ02j4p2j05R4Q3j15
2666B3j6p1mL6J34j43N7Q7k2m0p0J2N6o5R7j19R7j01jK7K27k4m9p8j06m4P3k4J06j82l2J83
$$ y = [7, 5, 64, 22, -163, -171, -193, -207, -189, -59, -4, 48, 126, 59, 78, -107, -94, 27, -6, 95, 21, -2, 1, -138, -12, 106, 65, 4, -51, -32, -44, 51, 87, -36, 51, 102, 44, -5, 110, -122, 59, 57, 69, 14, -99, 55, 48, 98, 104, 76, 116, 54, 77, 59, 53, -2, 7, -91, 64, 177, 121, 85, 48, 87, -32, -44, 20, 85, 54, -43, 95, 79, 130, -97, 38, -35, 37, 50, -41, 20, 162, 48, 90, -36, 135, 218, 131, 100, 67, 24, 59, 194, 120, 77, 63, 58, -32, -82, 65, -19, 7, 108, 77, 141, 73, 59, 114, 45, -120, -169, 3, 95, 68, 60, 106, 74, 89, -98, 86, 97, 169, 179, -22, -17, 86, 53, 7, -151, -78, 117, -17, 38, 58, 197, -50, 91, 59, 69, 11, 78, -49, 107, 53, 3, 10, 65, 24, 134, -2, 56, -67, -59, -75, 43, 56, 146, 109, 99, -99, 31, 76, 16, 39, 91, -85, 2, 54, 65, 163, 124, 129, 67, 150, 70, 162, 176, 167, 89, -76, 50, -16, 125, 42, 6, 144, 266, 155, 9, -1, 1, -80, -11, -3, 150, -39, 63, 113, 103, 96, 145, 40, -1, 128, 221, 29, -51, -117, -54, -83, -54, 86, 78, 60, 128, 91, 58, 145, 195, 102, 105, 45, 50, 152, 138, 66, -39, 55, 138, 23, 7, -64, -68, -32, 102, -41, 16, 103, 81, 41, -29, -17, 39, -26, 71, -48, 49, -52, -53, -26, 201, 177, 128, 50, -56, -100, -27, -51, 55, -127, -159, 24]
2662B4J43o4P9j2r3l4r8O1K8J4J6L1N1k5j18Q7J40j20j06J61k01M8n3J52j12kJ23k2%j18o
2657b6K9r9J18j17J09Q3J4J32j35m5j16O7QrM0Mj03K30q2k79P3J9K32l0o5J3k8N1Q8j29r9
2653e2J3N7l5J00J4k00M5R7K14j49j24L6J0R7l9m0m2J35q7O3m8M7J7o1j04m3J42J82j8k77
2649e0K10j48O2q3J76l4j70r0P1pJ17N2j60R1j3M0j5o6K4k8q7J44R9j97J70k01L0K9N4J63
2644A83q1o5j3k06kJ18J53q5o6O5o1P3O1q7L3p2J56K6K0J04r2m7M6o3q0O9lP7l0r2o7K17m2
2640A47k8m9Q9k03J00j08Q7o2j0J03m3Q1O8l8j11J9o1O1J39j56m1J03R8j18Ll2M3n0p5M4K1
2635B1j03J58j05k4J05m0J80L5m1j24m5m7o1Q2K8O4j21N3o2J76P5j49n5J22J15j30J7PN1L5
2631B17r6o4P9p5J4jO0%l9p3J9P6o7M9p9kp2O9NP4L3j21Q0l0J10j08j2p1R4k0p1J8n2m6O7
$$ y = [24, 167, 103, 182, 170, 77, 43, -55, 6, 34, 48, 64, 95, 146, 121, 3, 90, 230, 110, 4, 165, -36, 12, -41, 111, -1, -3, 120, 98, 98, -20, -26, 3, -96, 22, -95, 14, 97, 111, 243, 108, 63, -53, 14, 22, 13, 53, 57, -46, 184, 102, -177, -104, -85, 147, 117, 52, 65, 37, 88, 176, 47, -52, -39, 18, -17, 83, 97, -103, -58, 39, 253, 104, -20, 16, 26, 123, 84, 44, 2, 137, 50, 113, 65, 112, 129, 68, -36, -79, 63, 245, 227, -50, 160, 12, 74, -9, 167, 133, -37, -127, -56, -63, 54, 106, -54, 37, 24, 64, 49, -17, 7, -21, -108, 36, 135, -62, 108, -93, -63, -34, 20, 183, 102, 37, 24, -182, -184, -66, 87, 2, -64, 1, -60, 13, 74, -13, 20, -52, 104, 130, 150, 254, 162, 115, 161, 98, 18, 87, 84, 161, 131, 39, -28, 189, 147, 119, 70, 159, -44, 56, -52, 35, -27, -37, 66, 23, 104, 172, 134, 23, 42, -19, 42, 181, 25, -16, 87, 185, 67, 70, 38, 81, 31, -44, 0, 21, -82, 76, -29, -53, 52, 12, 192, 227, 186, 62, 17, -30, -91, -9, 19, 83, -38, 15, -47, 129, 204, 55, 0, 122, 237, 107, 124, 131, 182, 217, 121, 57, 136, 61, 75, 74, 134, 134, 95, 22, 41, 117, 50, 99, 20, 18, -54, 15, 20, 94, 127, 6, 86, 56, 166, 58, 46, -25, 69, 49, -22, -4, -56, -102, -35]
2626c5Rj29J84l4J42L9l3j98J03m3N4n4N7K7k04J23j9o6J86j27J36j08q0L9J09O7l1j39qo7
2622a00M2J2l2K76J20j71p7o0r8J64k8oO5J15l2j42k3Q9op4j20J32P7l4j46M0K1O0o9Q1o5
2617A1l6J01j70K07j76J21o7K34k01J06m9J06n6m7K7n0M8k0j07O9qq0M5M4Nq4R0j05%J59k5
2613I2p4L8J75j91N3j17N8M5kN6r1q1P9R0p1J05p6m8j08J61n8J36o4j6k0q9j5L9k6J45L0q1
2609G4M2j22Q7J2j43NJ92j10P1j69K0P9N3o8jJ0n6l3J11J17q5j8j3r2J58q4j22Q9J81L2j8
2604A99k69O6M5j7L8m7l3k0J89r6M9l6k0K9l6n4NM0O1o0o6n8K4J55j1q1J72p2m3O8j47M1K5
2600D0j56J62R2Q9k25o5O5k5L2J8J4j3j06K07m1j43J36n7l7o1pM2PM9Q0k3j40J49J4r3p8K6
2595d8M1rN8J8LM9j40l4n6J69mo3R8k3M9q0N6q1J09j40J10k5o1M8J66k02l0k6J91j87N2J64
$$ y = [-35, -26, -155, 29, -5, 137, 176, 143, -55, 48, 5, 59, 5, 62, 89, -115, 8, -11, -77, 109, -18, 118, 10, -70, -31, 78, 145, 114, -25, -33, -100, -58, -46, -78, 198, 318, 147, 70, 10, -88, 76, 48, 42, 107, 222, 190, 48, 25, 114, 108, 34, -86, 46, 123, 89, -57, -17, 4, 64, -5, 76, 11, -25, 76, -94, 113, -63, 58, -9, 225, 24, 130, 81, 187, 131, 84, 111, 61, 109, 89, -18, 51, 43, -37, 8, 52, 57, -27, 63, -42, -42, 117, 92, 18, 56, 231, 40, 93, -24, 34, 79, 77, 133, 42, -39, 40, 130, 59, 164, 88, 40, -68, 93, 35, 171, 107, 91, 71, -18, -33, 6, -20, 125, 155, 74, 116, -6, 81, 93, -50, -45, 147, 37, 108, -61, -41, 38, 91, 23, 22, 32, -24, -57, 54, 171, 86, 68, 55, -37, 121, 37, -85, 4, 185, 217, 199, -70, -4, 41, 24, 62, 15, -18, -38, 151, 55, 104, 68, 48, 77, 41, -13, -8, 32, 93, 33, -33, -91, -67, 88, 77, -4, 168, 96, 53, 121, -26, 15, 40, -116, 46, 138, 227, 2, -63, 2, -23, 9, 27, 41, 28, -78, 129, 88, -55, 81, 24, -13, -74, -81, -39, -32, 17, 97, 74, -66, 83, 97, 4, -74, -48, -7, -16, 42, 60, 63, 112, -28, -62, -118, 51, 47, -16, 82, 59, 108, 28, 84, 3, 112, -28, 82, 57, -4, 44, 210, 8, -22, -48, 143, -44, 8, 172]
2590A72o8q8jn6LP1n2M2J00l9j54j7L2O4l4J23k3l4O5L0o0lK6j1J5K4J0rl1q9J08n4r3j4J86
2586A41l5j65K38J1k00J44rqj50pN8Lp5J10J43j67l9N0j18jJ27M8N2r9p4p5J94oq3R2j75K6
2581d9J9L0o9J88j4J8j73r2J99j75K60j14n0J55j16O0o2ON7o7l5J35L5p1p5J7r2J04m6Q0r
2577E4Lj8p1o3J49q1J2k6J3J06pr1k6J88L6m5k43j6Q3J40l7k2K6k03J49J51k5j48J32l1J9
2572A08q5J32J9p1lL7K3m4k5l1nn2Q4n6M4R1j06l2k0Q6O8O1l1j39k9R2k4M3J7qm1r1j84P0
2567a02J04K8L3k01J16P8n3rP5J88l8k09q5m6K1Q6L6L2j5j56K2J5J01Q4q3n5l6J72j44J74
2563A33r9k9MNK4l0O5J4j01q3N2K8J56l9N9L1j61J55j05o6J04p2QL5k0K7Pk15R1o2Q0P8M1
2559A15M0r8n2J7p9OJ66K4J17j24n8nj71J64K8R8k9o4k79K32O3o0l3J07l8p1N7Q7n5j4j43
$$ y = [172, 104, 16, 15, -41, -38, 33, -19, 23, 123, 84, -70, -87, -55, 9, -25, 98, 75, 41, 106, 136, 76, 73, 99, 88, 103, 127, 137, 128, 97, 8, 116, 62, -31, -45, 141, 106, -59, 179, 190, -10, 134, 125, 117, -33, -40, 18, 21, -54, 56, 199, 32, -7, 43, -75, -76, 51, 99, 151, 52, -22, -97, 97, 91, 8, 100, -75, -49, -30, 0, -69, 119, 105, 123, -50, -142, 57, -118, 142, 28, -22, 133, 17, 77, 15, 21, 78, 11, -24, 111, 146, 75, 0, 17, -75, 29, -17, 63, 54, 57, 39, -32, -95, 54, -27, -15, -41, -28, 78, 71, -20, -46, 142, 178, 133, -110, -126, -43, 97, 60, 38, 64, -139, 10, 161, 136, -12, 120, 89, 108, 23, 155, 174, 103, 100, 137, 160, 116, 91, 60, 55, 3, 87, 31, 75, 166, 60, 28, 8, 94, 162, 223, 192, 53, 24, 116, 92, 135, 152, 144, 103, 12, -172, -102, 2, 30, 63, -138, -22, 56, 3, -6, 69, 257, 219, 10, -75, -121, -100, -14, 22, 54, 39, -117, -95, -80, 21, 105, 22, -33, -69, 103, -41, 133, 34, 5, 9, 14, 38, 8, 73, 87, -14, -97, -45, -17, 139, 100, 159, 190, 29, 184, 79, 13, 117, 45, 53, 88, 68, 95, 102, -113, -22, -84, -4, 74, 115, 155, 57, 5, 22, -57, -51, 115, 139, 256, 132, 74, 69, -102, 62, 90, 188, 159, 95, -184, 48, 111, 51, 18, 125, 87, 16, 73, 160, 105, 91, -52]
2554e2R7K1r4m5J01M3k4o7p2RJ34r7n6K39J5qj13k8l9P1R0n1k08J97J7k70J38K8J05mO7p2
2550G2J8J09l8l5r5Q0j7o6p6L3J80k03J34N0Onn9k9lr6M4P0m2JK3m1r7J59n3P9j09o7R9p1
2545d5n5P7k4J3J00L2j21j3k1J04p4P2n2O2R4ml2Kj5J3l6qJ63j64L2nM9j2r0p1K02n6K4p6
2540F5Kj11J27K3M4m3p3j06R7oP1J4o4j13K8L9R0j18M7l8qR1J6QJ4j7r3l4mKRP9K4j36J27
2535E3%o7Q8J04q9j05N9j44P4N0kQ1n1l4k6J14l1J29r0n1P5r0j43J71J36j60r5M4J14K2K7
2531A63J0m3j14J1N6j07qP6Q5l3Q1n4oj24J66q1j13L5l0JK40j14r3r9J8L4N2J99j03On6L0
2526H5J40l5j31L0n1J65j37M6Jq1M6l0n4M3l7j2J88K8k66N5r4M0J16Qj04R8p0o3J34P0k1l7
2522G0kK3k3OR6j34M4j2J33q5j34j7P5jKPj8q3J1J96j37R3j21J35L3j62J66J7p3n4K1l1r8
$$ y = [-52, 45, 66, -28, -73, 28, 71, 47, -20, -92, -83, 51, -46, -102, 137, 152, 144, 31, 3, -36, 35, 125, 74, -134, 63, 80, -190, -52, -24, 81, 77, 144, 72, 90, 199, 161, 126, 31, 111, 94, 28, -48, -15, 165, -38, 96, 146, 152, 147, 88, 59, 56, -40, 4, 74, 32, 33, 56, 15, -82, 77, 24, 103, -6, -73, 26, -45, -100, -23, -47, -34, 66, 98, -23, -36, -57, 47, -27, 45, -7, 55, 149, 145, 113, 115, 100, 113, 77, 69, 232, 68, 100, 95, 144, 132, 42, -29, 173, 117, 141, 65, 67, -44, 83, 106, 150, 107, 34, -72, 25, 19, 90, 104, 40, -73, -45, -6, 84, -34, 13, -25, -33, 58, 74, 82, 96, 79, -14, -48, -52, -50, -41, 38, 62, -74, 53, 53, -14, 74, 178, 89, -16, 43, -101, -27, 23, 21, 102, 51, 17, -9, 105, 74, 203, 113, 62, 137, 47, -96, 75, 211, 51, -44, 0, 114, 136, 163, 173, 130, 16, 27, 83, -24, -32, 44, 129, 96, 177, 123, 117, -7, 159, 78, -35, 0, -30, -29, 211, 97, 4, -95, -77, -43, 9, 208, 105, 111, 55, 85, 225, 190, 59, 89, 38, 203, 66, 112, 113, 32, 78, 48, -6, 37, 0, -12, 176, 204, -62, -7, -101, -61, 55, 63, -41, 57, -13, -76, 58, 128, 107, 70, 68, 91, 68, 74, 170, 36, 80, 68, 201, 116, -18, -35, 40, 39, 41, 48, 30, -53, -42, 154, 17, 110, -11, 124, 157, -5, 161, 178, 105, 51, 72, 41, -57]
2517e7J15Pk1J4L1n9K3Jr8J8N2j7M0j1q1l5M2PO3L5K4L9r7m7Pk6R7o7m0N4J05P7l9j98QQ0
2512D6j75J51P0n2K4q4K70j96j06J07j54O5J33J06n9r5q5Q6p7j2J57qJ8L6j35K1n2J80q9q1
2508A0J7J01m2j09O7J01L6oj85n2L4m8J46J5m6j7L1P2j38l5j47j7J78K5k6l1N7p3K7J24m8
2503B1p4M7K7o5L5K7j3P3K1k6J8q5R3lm1J26q2j2j74J67J5r5j03J58j4rR3Jj34k4K1L0j11
2499i2J63k2k84K44R0j75J81l8j02J1jJ98m3j1j5J44k03J52k18R9MJ19l8K4j04r1K59j85k5
2495D1J35o5j20J17j4MR6k57O7M6M0J4j34R8m4P8p6J66r0j33n9qK01j20N1N7L2j04r2Q6ML
2490B0k2q3Q1O6m1J01J31r8o1N0k28J97j66%PM4q6R4o3k8J66o3m3Q3O7k5p1m5J48j47O8or2
2485d5OP7n0R1j4r6R6j37M0l7J19k8J03J20n5p2j12n8J28j21J37j18K47m7r3JJ2j8l7P0m7
$$ y = [-57, 58, 65, 44, 58, 89, 30, 53, 54, -44, -26, 26, 9, 49, 38, -43, -78, -36, -29, 34, 69, 93, 132, 35, -12, -5, -31, 66, -1, -41, 13, 118, 195, 156, -42, -34, 46, -129, 22, 92, 40, 64, -20, 250, 54, -52, 55, -99, -34, 99, 205, 146, 51, -34, 52, -25, -37, 120, 112, 130, 166, 31, 52, 0, 180, 91, 10, 27, 128, 86, -23, 44, 145, 181, 175, -10, -62, -28, -76, 70, 85, 39, 22, 53, 125, -13, -48, -195, -212, -34, -9, -35, -66, -9, -82, -55, 69, 21, -53, -6, 21, -44, -9, 18, 5, 78, 99, 73, 91, 6, 99, 96, 55, 181, 99, 87, -87, 80, 95, 0, -103, 55, 41, 32, 125, 126, -8, -32, -11, 19, -92, 71, 49, -235, 9, 99, -76, 105, 67, -35, -24, -25, 173, 130, 119, 104, 248, 45, 197, -21, 78, 82, 201, 163, 187, 83, -8, 251, 66, 41, 176, 111, -9, 108, 94, 98, 194, -63, 4, 50, 90, 104, -30, 68, 24, 102, 26, 192, 102, -31, -90, -98, 103, -17, 34, 91, 123, 19, -73, 13, 17, 20, -2, -85, -4, 62, 21, 122, 253, 155, 94, 144, -84, 113, -53, -53, -46, -2, -88, 6, -57, -85, 81, 18, -25, 58, 125, 100, 29, -16, 132, -15, 53, 47, -45, -39, 38, -12, 79, 65, -31, 65, -72, -32, -69, 50, 22, 125, 245, 190, 118, 6, -52, 76, -45, 92, -26, 221, 174, 81, 82, 94, 76, 39, 109, 62]
2481F2l6J4J2r7RJ90j30lJ60j26M2p8p8R0M5j2j12J30K6j14L0m0M6L5l0j47J23J45k46J56
2477F6m2N5M4J05j69J01J0N6r8j34P4rL2o0j2O9J20j34J1j5k2j86K8J41L8P6p3K8K1j76J15
2472F0m4Q3j5kj50M3R2m8m0P0Mm6J3q1OJ08q3m0K94r4l0j9j24Q9l5n4o5J15q3O1L6M6l5l6
2468dO6q3j6O0J8n5P9o1N7O3m5k5o7J85j13L1j4lK8j01jM3J9k0J57p2J6O0m9q0O7o7j8J00
2463A55Lm8q8O4jJ6M9n8n6j08J49k2J06m1l5q7oq7Q1l3Q2o4J25j62Q2Q5j24M8q3J30J18m3
2458A47q3j8K6j5k9j46K13j34k4P0j4Or2J60o5P3P3K0m5l5O5kq8q2P3j03N8K53r0j21K9j06
2454b6J10r1l8OQ1J8kP0P5o6j09l7l2J65j20J9Q2k5l1R5p6j17l4J27L0j6J7r6N8j15o1K45
2449A06K6j81N9j5Q3j6m5j38K14j95l7O7K07j39m4M2J54j20L8m4L4n7Q8m0j34N5J03j06K39
$$ y = [62, 26, 40, 52, -45, -36, 154, 24, 21, 181, 55, 97, 19, -59, 31, 76, 64, -48, 82, 108, -6, 24, -16, 30, 65, 35, -112, 11, 156, -90, 66, 24, 79, 123, 228, 59, 160, 170, 226, 128, -6, 68, 59, 91, 31, 19, 88, 208, 74, 85, 70, 48, -138, -110, 31, 69, 145, 72, 100, 121, -55, 60, 16, 99, 84, 82, -68, -25, 67, 19, -21, 49, 53, 7, 20, -61, -55, 53, -30, -70, 224, 130, 100, 81, -43, 46, 11, -43, -108, 7, -76, -15, 21, 67, 32, -4, 62, -21, -37, 23, 41, -14, 65, 4, 61, 124, 79, 54, -13, 172, 59, 90, 76, 73, 101, 0, -1, 42, 61, 41, 198, 126, 142, 202, 153, 73, 140, 73, 55, 155, 158, 110, 22, 86, 85, 101, 150, 92, 36, -72, 77, 55, 161, 120, 85, -2, -8, -95, -14, -47, 35, -29, 96, -66, 16, 101, -23, 25, -58, 72, 190, 147, 64, 46, 72, 57, 28, -118, 95, -39, -63, 7, -7, -1, -93, 67, 2, 75, 148, 168, 123, 88, 153, 151, 63, -19, 54, -49, 9, 262, 172, 51, 80, -26, 84, -7, -45, -39, 42, 60, 58, 128, 203, 137, 28, -9, -41, 124, 4, 23, 105, 80, 49, 144, 68, -49, -83, 44, 74, 58, 75, -21, 37, -78, -139, 106, 132, -49, 10, -5, 78, 62, 17, -121, 93, -102, -139, -72, 135, -4, -48, -6, 148, 28, 66, 22, 56, -1, 87, 47, -87, -32, 71, -35, 204]
2445B04l6L5n0q6j09n0J70j8n9J67j06k1q5O7ql5R1m6K0M5j10O7QJ5q7M4LM4O8j81L6J3J0
2440B0p4N1O4j0Q9j9n5l7k05J78k2J34j04P8j13R3oj4P8r8l9K2N0o1kMQ7m9K1j73J62jO2j54
2436d3Q8m5P7L2jn6j23J01k8P4m7M4j0pL8L7l1j06J49j71l0J05k9n8Q1L7n9M3o6m8R9k4j2
2431A1K09j48j55o0K16J3o0kL2j56M9K12j76n6K8J10k0j6jJ91j55R9j50MJ39J04j41j47K7
2427AP0N6nQj79J0J38lo7p5J36r0J49j58L5R1j56J80k3j02N6M3p5N0j13l4Q2j2J1Nj0J52m9
2422A22n1m1L3K9J34k18j03J8j2R1j02R3k9%R2p2K14q2j21p2O2kL3O8Nk1lR1j05nM1J30j31
2418H6K0j30J47k8j10j5J60m8q6P4O6l9J39n7j04M4N5J2o6n6j2O5p7j38O2LJ43l5j24m9K07
2413A09n0J16j09Pp4j48J14J6M4n2O8p4J25N8l0k05L6m0L6J30r6J05j11Rj0J12j28K22j35
$$ y = [204, 168, 203, 153, 67, -42, -92, 78, 60, 1, 168, 62, 41, -44, 23, 15, -20, 71, 25, 45, 90, -20, 47, 55, 70, -17, 27, 30, 74, 142, -39, -3, 10, 20, -54, -3, 61, 51, 140, 121, 66, 29, -176, 2, -20, 114, 10, 88, -25, 68, 62, 48, 126, 28, -11, 11, 61, 0, -2, 2, 89, 40, 61, -112, 50, 49, 111, -43, 45, 0, 77, 109, 108, 52, -71, 30, 2, 76, 29, 73, 63, 56, 94, 131, 100, -6, 143, -28, -58, 47, 18, -40, 41, 78, 19, 62, -4, -52, 47, 23, 11, 220, 72, -83, -143, 73, 86, 26, 24, 56, -100, -51, 161, -15, -71, -43, 67, 47, 31, 30, 221, 66, 165, 15, 19, 158, 262, 121, -26, 1, 71, 127, 122, 130, -49, -39, 99, 96, 29, -46, 90, 0, 149, -9, 26, 117, -39, 141, 118, 16, 72, 115, 40, 90, -23, -57, 25, 13, 24, 29, 19, 171, 122, 71, 30, 63, 92, 226, 8, -95, -77, -89, 2, -100, -7, -36, -36, 56, -16, 198, 116, -5, -77, -15, -17, 16, 84, 89, 68, 65, 156, 51, 46, 87, 217, 86, 106, -24, 123, 95, -15, -30, 130, 82, -4, 70, 136, 97, 236, 179, 75, 119, 174, 186, 120, 64, 52, 117, 40, -98, -36, -33, 110, 75, -49, -98, 109, 59, 175, 66, 73, -1, -149, -35, -19, 25, -27, 41, -33, 92, 150, 120, -85, -49, -89, -53, 77, -19, 86, -25, -16, -26, 86, -42, 180, 45]
2409D5j2J88m8n8k16J46j00K53j57L9p9R0J27j77M2j8M9K0r4J01n9J5l9J03j61L1R3j83L33
2405B74k27o3K3k4N5l0M1p2Oj2O8n1L0Np0J02o0K9j5K9p9Q9l6R0j04k5o2K3J35l5j24J25J6
2400E1O2p6j6J29k51K90k5n5r1R3P1Nr2j2q6J15n6p7K4L5kj43J49Q2j46o0N5J70j47J56j04
2396D8k1k6N1j08L0jJ07N9j7M4o0o1J9J29q8j56Km0J20j62j8J36J6j1N9q0J49k4j65J39o5
2392EL6J51j55j2m8j5l7M5n0j7J06o1mj8J26oN4l9J04j59R5Q0q8qpj60K08j17M8l8O2j6j17
2387e2o9J47l6J6j5R5j26J69m3J12j14r8qR5j03M0O8Q8lL0j35Jj4j2j4o3j19L3K17j21K14
2383A80o4r3J7P8q0J3J09Q1p6k85M2M3L5k1J04o3n8K7J3J64no0m5l1q4O7R7r7o0K8r5J25O4
2378G0j2O2j10M0n8K19r3j4mL4k38J79o7J76M1p4o7J4j9r4o4n5J46M8M3j2j24n7J36Q0P9k0
$$ y = [45, 33, 221, 173, 115, -101, 45, -55, 198, 41, 80, 1, 91, 218, 41, 83, 65, 114, 134, 40, 141, 82, 97, 58, 161, 0, 31, 124, -59, 274, 47, -16, 7, -17, 38, 8, 49, -23, -17, -29, 39, -12, 18, 23, -47, 55, -5, 24, 9, 38, -41, 48, 12, 102, -2, -27, -89, -66, 69, 34, -90, 35, 51, 113, 37, 21, 150, -101, 189, 164, 109, 18, 111, 182, 187, 95, 83, -3, 112, 56, -21, 3, 38, 36, -107, 42, 124, -22, -82, -27, 143, -4, 152, 48, 27, 1, 52, -56, -26, -27, 80, 139, 122, 166, 106, 45, 64, 193, 105, -51, -49, -89, 31, -131, -149, -13, 3, -8, 51, -29, 120, 96, -69, 70, 5, 41, 192, 37, 25, -23, -38, -75, -30, -80, -97, 9, -52, -56, -74, 52, 46, 100, 61, 165, 6, 101, 181, 93, 85, 78, -82, 126, 9, 57, 19, 81, 65, -52, -121, 26, -10, 6, -9, 86, -40, 129, 86, 198, 84, -14, -22, 73, -30, 10, 78, 166, 163, 193, 58, 59, 45, 33, 19, -44, -163, -130, 87, -34, 180, 116, 23, 40, 118, 38, 51, 160, 241, 165, -120, -78, -35, 0, -21, 83, 20, -38, -11, 2, 166, 161, 101, 56, 25, -59, 8, 105, 8, -52, -24, -119, 6, 70, 58, 120, 10, 50, -8, 211, 118, 104, 100, 134, -104, 75, 8, 184, 225, 151, 84, 98, 79, -15, -79, -134, 12, 60, 103, 91, -33, -90, 46, 126, 205, 185]
2373A85m6Rr3j31Q0N2k7M3j3Oj28Q5O5r8j14J02m0J39J20j11K4o0J07j07n5N5K5j69M0K02
2369A47j98J57l9O1l3j27K3n3J86j25N9P3q2o1Q1j28J81j09M1r0pO3M6o7J69k02M1j05R6l3
2365c5Q2jJ18J9j08oO6m6q8L9l3r6Q3ll1R7j19L8O2R4q6P4l0l4kL2o2J22j36p6l8P5k3R3L0
2360G1P5p7K3n4O1k9p2N8k3o2Q2n3J2N1n0K13m4j36M5J4O2j56o2N7J59j38J7OJ09j80QJ10
2355I7o5j23K42j72R1R8m1Oj32J41p8j15J36k3PJ4nj23O8J62q0k3P7j16K0L0P2p8JJ11j57
2351D2k8k3J53L9j05j07J71J1j52L2k60M6J61j2mJ85j73J4l5J9J02l1p1L3k1PJ09j23M4mO9
2347H8j46R2L3R7R2j45q2J9p9N8R3p9m3J45n0l3mPR9l6q4m5J16L0j15p4M7J23j03m1k8K8l0
2342e0Q2L0o8O0K7k3K6R9j07J32q1L7j82M7J52j58l8P4j5O3J7p6n5pO7J8j12j07P3N4J05n0
$$ y = [185, 139, 148, 55, -76, 4, 56, 29, 72, 59, 65, -63, 22, 87, -11, -125, -23, -63, 76, 196, 85, 109, 49, 156, 49, -6, 49, 74, -95, -55, 147, -51, 106, 67, 128, 95, -32, -9, -62, 124, -1, 58, 131, 49, -12, 69, -59, 122, 13, 54, -36, -43, 20, 66, -1, 168, -34, 7, -98, -2, -35, 47, 46, 164, 183, 75, 69, 135, 89, 1, 40, 7, -89, -6, -9, -40, 57, -62, -24, 38, 132, 46, 120, 90, 56, 54, 86, 24, 146, 10, -66, -104, -29, -52, 41, 71, 146, 69, 92, 38, 99, 70, -2, 56, 33, -29, 53, 0, 12, 63, 13, 226, 182, 46, 91, 105, 167, 11, -51, 6, 165, 27, 44, 50, 159, -21, -13, 97, 32, -91, 151, -21, 70, 168, 127, 133, 1, 142, 64, -51, 85, 62, 69, 83, 78, -45, 23, 185, 105, 82, 159, 43, 63, 93, 165, 87, 88, 199, 42, 14, -9, 144, 183, 78, -29, 142, 153, 1, 33, -227, -181, -20, -32, -36, 149, -24, -10, -45, -26, 76, 45, -26, 7, -14, -7, 102, -21, 23, 19, 88, -58, 34, 67, 164, 256, 111, 29, 48, -31, 27, 120, 41, -2, 143, 93, 60, 56, 63, 162, 126, 42, -3, 113, 143, 28, -46, 1, 124, 21, -20, -48, -20, -50, 32, 62, -6, 54, 81, 58, 84, 183, 76, 208, 127, 164, -18, 29, 181, 23, -15, 59, 44, 107, 124, 48, -7, -14, 53, 71, -41, -148, -75, -21, 84, 34]
2337C4j01J35J29p5K2l8r8M0oJ27l0j09l6k1R3l9K8r6l2J6l1Q7L9k5PO8j34R1K34q6q9MPL1
2333A46j71K0K52pj42r0n2J31j20n4J28p5k5M0J9R2mq8Q9R0j16J10j83M1L7P0q7k6O0QQ4r3
2328H4m1P4n8QP6j0q1O9l3q3R3J70r2j08%j20l7N4K20K6q6j27L6L5K8l0n0L3j15K10M4o8n
2323A16k5P9K6%m8j98J75m8o2R1m0j38J7KN4J49j00k2J50j95J49q6q2J80Mjq4O3q2K6q0J7
2319GN1j51J87m3M6m6Q0Jj07Q6J07j04K8J59k70J6k2k7L9rOJ15r1pK2Rm6O4p3o4k8oP8L2J11
2314A50O8j00N3o3j95O6Q0qN5k1L6Oj84J59j9O8p2l6J2m5l8k4J15rm3J05rn6j1J04Q6j0p8
2309A42n6n4O5n5O6O1Qj27O6M8q8j06j8p9K1m7R9L3N7m6P3J5J47j58j1M3q7L0O8r0Lq8O6k2
2305b1K5J32J2j23j9J44j58k8J82j53j1n8J70J9p8j1l4j06l4J61n6J33j42O2JN0K4l8p5R1
$$ y = [34, -67, 68, 197, 122, 144, 106, 8, 48, 42, 169, 139, 30, -6, -27, 66, 27, 55, -41, -73, -57, -88, -1, 38, 13, 20, 88, -46, 45, 279, 193, 104, 108, 115, 146, -25, -5, 247, 240, 98, 8, -44, 87, -33, -87, 41, -34, -59, -19, 0, 92, 88, 0, 89, 179, 63, 173, -10, 31, 68, 138, 51, 25, 85, 93, 177, 84, 43, 117, 59, 67, 143, 133, 52, 121, 88, 5, 98, 268, 176, 68, 68, -52, -89, -35, 185, 211, 125, -2, 34, 69, 97, 67, 17, 50, -65, 145, 189, 121, 116, 91, 170, 196, 196, 148, -50, 125, 77, 15, 106, 66, -72, -55, -53, 1, 150, 50, 28, 178, -17, 132, 46, -36, 144, 148, 147, 63, 126, 44, 70, -10, 7, 58, -93, 94, 51, 97, 51, 131, 132, 25, 111, 218, 114, 142, 301, 31, 47, 25, -2, 37, 28, 34, 149, 58, 51, 73, 82, 36, 100, 27, -37, -65, -71, 7, 39, 150, 218, 118, 171, 108, -87, -21, 59, 51, 106, 85, 121, 127, -57, 102, 83, 151, 79, 43, 55, 10, -28, -52, 63, 54, 11, 116, 107, 51, 40, 144, 230, 220, 142, 86, 32, 97, 42, 108, 169, 177, 50, 116, 164, 76, -30, -48, -127, -106, -153, -54, -21, 36, -10, 63, 78, 225, 67, 56, 99, 12, 42, 110, 20, 23, -65, 1, -21, 4, 136, 148, 25, 6, 150, -8, -36, 146, -7, -18, -76, 94, 113, 35, 24, -10, -116, -150, 11, -45, 88, -54, 8, 9, 59, 83, 45, -30, 61]
2300F1k3J7M0J4k3o2L8Om4m2J33l7J00J9j57k6k2P1RM0r1P2o7n1J54J25j22op6O0R8j6J5L3
2295B40j11k17J86l8k4q5J1J11Pj3k2%k5K8o6J90J3K4j04j41J17p2Nj03mk6J34j65J55J59
2291A64k2q0P0Q1j36q6k0j67J89oR9k3o8L1Pp3o6J40R8M8m0l0Q9j39p2L5q3J28J1n1Jk7Q6
2287H8l6j40NO4q0J63o9M8q5j3l4m2K46M1N5r4n8o9O4N3q9J67j63l8n2m5J5J64j4J38j62R0
2282A18Ln8LP5o5N5q1l1q1N4l0R8Q7k46O3N6j01J95j38m6R6L2P0n4p8j20L05j16r5J00n0k
2278A8l3k4R7o7j9J28mj9P2o2KN3L0L5j39R9o0Jm2J08j41P8Q2k0j81N6n2J25M7r7Q5j67k1
2273c2K34mlm5j04m4q4N4J16q7NP9j94J17J25j58J44q3k9k1K2J36q6Lr8l5j39K73j34p4P1
2268g5J3K2k8J18Q0j06R3j90J9K2P2q7K4N6L8N8j9k9LJ9p2j9j1J11l1p6J69Oj72J04n9Qk2
$$ y = [61, 38, 55, 95, 109, 86, 24, 62, 68, 24, -18, 115, 78, 178, 197, 40, 14, -8, 63, 72, 112, 21, 93, 26, -25, 129, 254, 132, 126, 50, 110, 208, 192, 207, 240, 129, -88, 98, 60, 36, -49, -38, 73, 80, 67, 45, 45, 20, 48, -18, 172, 185, 209, 105, -36, 81, 9, 14, -89, -93, -119, 15, -150, 5, 164, 142, 62, 132, 213, 77, -9, -29, -196, -7, -13, 86, 63, -5, 26, 33, -40, -106, 34, 132, 180, 140, 110, 199, 60, -12, 23, -60, 68, 79, 28, 29, 2, 88, 52, -88, -83, -19, -99, 64, -5, 43, -42, -55, -89, -131, 115, 156, 211, 117, 59, -10, 54, 107, 18, 185, 22, -16, -68, -113, -98, 66, 52, 190, 28, 118, 121, 63, 66, 141, 76, 131, 50, 19, -62, -8, -38, 60, 147, -99, -36, 20, -81, 114, -24, -70, 26, 58, 128, 74, -4, -124, 181, 65, -30, 70, 20, 18, -15, -39, 58, -9, -28, 100, 96, 77, 149, 87, 89, 142, 172, 207, 68, 167, 107, 108, 66, 174, 33, 111, 193, 173, -8, 48, -4, 121, 168, 71, 156, -11, -32, 202, 198, 195, 150, 46, 2, -82, -28, 88, 1, 6, 85, -109, 8, 133, -25, 119, 36, 7, -14, 8, 144, 58, 61, -37, -72, -211, 62, -72, -146, -75, -62, -40, -68, 50, 130, 24, 117, -73, -54, -32, 40, -47, -23, 33, 71, 129, 110, 81, 84, 103, 31, 12, 1, 112, 81, 5, 174, 180, 8, 112, 53, 61, 39]
2264C9L2J3j04k3j71K74J8j35J51p3p0R6j80J14Qp3q6N7M3l4K30k5n6n0j7p5L36j23j87N7
2260a4j20lJ06J08M7J3J8l3L8k5J4n9j01J10m3J4mJ05j08o8J3m2l5LJ49Q8j9p0O0M1j32ko
2255D3K8l6l4n9J16l3m1rO5r6O0J71k27J94Pr7J8l3M7q6MN4n3J12j85J8J12K8Po2J92j57J12
2250A80p0oJ8j06j0R7r2J48m8R6P8J0k61p5J01J6m4M3j41K46k0kj36M1j27N5Q8n1P0K8k8J8
2246A16K8L8r5q5R1O7j0o2q5N8q3M3J8Q5K9r8J18J00j88R4j24J43l9q6r6K0L1R3j64P3J53
2241A83j00k9L3M7n2j8P0ON9j33q2J19p0r7J34m7J10M3J32j98J01j53o3J5j51Q0K47j90J06
2237A02m9J3j09J51l4o5PM2J6j2P7Nmk27O8K4M7rQ2o3J3L3M5k2j09L8Mj13P4o2J74m6j09L2
2232A4J17j13J09j18Ol7J20M1lk3q4p0Q6J12n0k14J5J37N0jJ5j12J2L3l3J46j19L3k1n3o0
$$ y = [39, 71, 84, -20, -43, -214, 60, 78, -57, 94, 21, -49, 47, -133, -19, -11, -84, -170, -113, -70, -104, 126, 101, 45, -5, -22, -97, 239, 116, -71, -14, -134, -137, -31, 77, 124, 137, 155, 122, 160, 135, 149, 90, -11, 99, 56, 70, 66, 171, 63, -5, 8, -34, -69, -66, 83, 171, 152, 82, 142, 183, 51, 49, 43, 71, 35, 1, -58, 58, 25, -16, -25, 40, -56, 4, 175, -52, 142, 149, 52, 70, 37, 84, -2, 2, 56, 3, 115, -70, -52, 60, 88, 95, 33, 225, 68, 180, 110, 104, 122, 16, 6, 103, 11, 159, 111, 207, 285, 295, 34, -41, 60, 76, 32, 75, -66, 180, 160, 158, 22, 63, -64, -9, 79, 28, 98, 126, 98, 116, 144, 182, 87, 2, 93, 160, 150, 88, 3, 61, -22, 21, 39, 124, 153, 55, 173, 273, 85, 179, 55, 198, 159, 73, -23, -3, 28, 121, -43, 30, 183, 83, 54, 87, 134, 82, 64, 134, 140, 199, 66, -16, 103, 33, -64, 70, 23, 133, 176, 308, 110, 211, 58, -5, 10, -141, -61, 186, -4, 102, 53, 66, -43, 108, 74, 9, 16, 58, 74, 62, 139, 144, 140, -87, -19, 5, 52, 43, 125, 62, 75, 108, 153, 131, 22, 60, 64, -49, 25, -37, 137, 91, -18, 14, 131, 18, 127, 9, 15, -22, 98, 139, 136, 113, 29, -41, 45, 157, 107, -107, -92, 45, 95, 94, 109, -3, 9, 42, 9, 155, 36, 69, 48, -5, -65]
2228f5N9J5L2oJ1qo3LJ25P1r2j5j41Q6o2J26R1k52%J52J10r0nj6jk6P5N1M5r1j00Q5q5p9K24
2223A64j5j91qm8Q7O6K9N3r6o2J39n2L5R6Qr5j26J74j95o4J53j84J27M5J7P2M1j38LqL3J00
2219A60r7K4J27j19P0k73NJ09Q5L0r7oJ08j19M9kK3j17J32j44M9j16R6L2OM6n6Q9K8r0j09
2214g7m9J41J1r5P0K4K8J01N2l9r2J9J51j57m7k7R6J00j28rpl9J1m7O9J6r2m1J38j50J16K4
2210G1j81J03J59j05J70q6o2j8J23rpk2j18O5j10O4K1m9j31KJ80p7o3J11m9P4MKJ06m8ln7
2205F0Kk8K2J75j35k8kj03P8j9J30k33J07P4m2m0K2N3J18j49j35j8P5P5O6j65J15Mj81rO1
2201e0o4K35r1J5P2j55j5R7J28K8k14K2q2R0R0l5L3Q0j19m1o4J06j41Q9J02R4q3Rj31O9p7
2196cP0j34J66m6K3j19O7L1J1L4j33j3R3Kp5p1j7J0R9j17K35O3k06Q3r2j3J08O4j16k9J97
$$ y = [-65, -6, 9, 41, 35, 46, 38, -25, -22, 103, 174, 82, 67, -74, 12, -50, 76, 167, -85, -85, 67, 177, 87, 82, 66, 65, 39, 114, 165, 210, 119, 19, 104, 19, -60, 164, 149, -42, -50, -98, -11, 55, 84, 137, 41, -21, 118, 66, 101, 197, 205, 110, -16, 158, -37, -101, 52, -132, -5, 40, 57, 129, 170, 32, 35, 27, 60, 160, 63, 87, 214, 95, 165, -108, -103, 6, 91, 121, 24, 18, 126, 7, 56, 54, 77, -40, 92, -52, -3, -119, -23, 9, 15, 61, 5, 94, 122, 32, -77, -126, 15, 26, -69, 1, 25, 53, 154, 206, 167, 75, 94, 245, 88, 41, 14, 110, 210, 82, 73, 66, 27, 38, -9, 60, 76, -16, -57, 81, -69, 47, 71, -110, -7, 152, 47, 217, 131, 69, 51, 174, 165, 158, 136, 18, 83, -27, 37, 58, 9, -122, -120, 60, -17, -80, 31, -18, 56, 60, 62, 168, 120, 117, 60, 62, 34, 56, 231, 96, 68, 66, -37, 41, 22, 152, -81, 26, 100, 58, 18, 40, 93, 211, 62, -73, -91, -16, 59, 125, -40, 75, 79, -102, -111, -50, -114, 121, 30, 45, 117, -38, -53, 44, 172, 200, -14, 8, -74, 16, 106, 71, 104, 184, 65, 24, -40, 66, -75, 14, 116, 210, 127, 136, 5, 74, -3, 67, -67, 99, 53, 76, -43, 24, 55, 66, 100, -33, -46, 47, 49, -26, -97, -114, -104, -5, -122, 113, 176, -30, 53, -39, -52, 56, 120, 4, -25, 172]
2192A72j54P2L8j28N1J04j44J24j42L8o4J70m3j47J13q2J5O3J8J21Jj36l7m6J81j42J32q4
2188F4r9J12o1j33l9J04L0L6O2K7j29QJ55k45l3J44J1O4o3L3L1L8P2l3o0K3o0M9q2r7O9R0
2184H8P0o2o9l8m6N1p5P3J78n4j17j1p5J42qn1MJ24k7J2nm6J04j29Klj2Q7l7Lo8Q5q9J12n8
2179E5j25K58o9p4RM9P2j56R9l8P2k28L4p3J56q0P2J46j03L5j08P8r9J8j31J29L9R7j21j3
2174@j3Jj4n8n9N2l9K4Q3J4O8O3j9p4M8o3L3n0N3J0L3J34j62l4lm0K5J45L4j8L8n4j29j53
2170a24J32L8m0J06J4J62j88k50J51j8P2j0J13q4K3j12r3PK34P1j07o8J21k21J96k76R6J17
2166F2q8Q0J1k3m2J22p2J7j15K7QO3k7J49o2p4m6L5P1k6o7j16M3o0J14N5o4J1N8j0Pm6j3L2
2161A4O6p9M6Lo2l4%J25P9r9N6M7K2o0j06j9j8M5n6k5R8O1l2J3m0J06l6pJ20j31J6K6o5j90
$$ y = [172, 18, 90, 128, 0, 51, 155, 11, 135, -7, 31, -33, 137, 94, -53, 60, -22, -7, 56, 74, 195, 196, 60, 23, -23, 158, 16, 148, 64, -35, 77, 16, -117, -156, -52, -22, 14, 76, 103, -26, -18, 137, -108, -141, 3, 14, 78, 15, 48, 79, 117, 189, 156, 96, 119, 59, 108, 26, -71, -2, 88, 158, 96, 27, -11, -57, -6, -81, -8, 170, 116, -1, -12, -87, 55, 47, -4, 0, 124, 97, 109, 104, 58, 162, 33, 35, 32, 20, 107, 70, 73, 5, 90, 1, 113, 55, -70, 188, 119, 45, 54, 103, 175, 19, 118, 80, 152, -76, -42, -115, 41, -39, 33, 179, 76, 111, 3, 81, -18, 0, -131, -2, 37, 134, 13, 0, -13, -12, -26, -84, -143, -91, -130, -106, -23, -9, 59, 122, 103, 29, 77, 14, 47, -3, 50, 60, 93, 227, 65, 31, 28, -12, 13, 158, 192, 174, 212, 158, 29, -124, 8, 46, 6, 112, 126, 288, 100, -150, 1, -17, 55, 45, 158, 74, 97, -15, -108, -101, 133, 204, 97, 29, 150, -71, 125, -151, -55, 62, -26, 54, 65, 42, 0, 122, 50, 67, -48, -21, -13, 50, 23, 172, 110, 36, -10, 25, 96, 70, 3, -113, -70, -130, -16, 39, -25, -14, 44, 34, 41, -5, -18, 14, 80, 1, 47, 50, -12, -46, -46, 79, 158, 59, 115, 162, 184, 124, 18, -1, -19, 26, -30, -55, 43, 104, 72, 85, 45, 151, 115, 108, 228, 97, 113, 139, 74, -116]
2156a16J63Q3K2m9j26J26j51J10j14J72k53J25o6P2r7J10P4j17J68j79J4Q1n2m3O6k9Km0k5
2152f9J62k17MJ44P1j08l1J42r4L8o1J14l6M0q3J01n5J98N85n49j53j95O0K22j27o6ql7J13
2148A05j4O2l9M2m7N3k28J37k3r2R3k2J36k46R2J4N2J30j54n6M7j1n6J38j5k8q0J52q4j03
2144d5J29m6J9Q2J6Mp3jr6l7O2J4N3R6k28N4L3J27j35j4O6R4J08j84O1p7j58Q4j3N2j4k0N0
2139F3L4p5n2P8l3Q6j6M6m3o6k0J73j06j42J05Mo0k9oN4rL7L1Nj7K6m3P8n7r3l5R0J09L9j08
2134D8O8j07k7M1J30kr7k7J31j42J43p1K5N9r4j43J91J2o0k8nj0m2pJ6M9J6P9n7j8o7pm5K04
2129A56L0j8j39l1q8K06j06L9K6j16L0l5rL2J32o0J09j30L4l9qJ10l2j56J35j62L7L2J6M4
2125C9L1p1j6J04j21J13q6K3L0N5j13L9Jpq6J02j3L3j03O8k8J34n7k8j37j7Q9o5N8n3R4k1
$$ y = [-116, 47, 130, 152, 103, -23, 103, -48, 62, -52, 120, -133, -8, -74, -2, -99, 11, 85, -32, 136, -43, -29, 52, 0, -43, 23, -6, -4, -44, -69, 93, -124, -120, 24, 95, -13, -44, 98, 4, 42, -19, 95, 59, 99, 16, 117, 62, 260, 845, 296, 143, -52, 8, 230, 103, 37, 29, -8, 105, 91, 153, 114, 156, 109, 162, -66, 71, 48, -44, 49, 27, 163, -83, 9, 23, 75, 205, 51, -5, 42, 31, -25, 113, 98, 70, -10, 142, 58, -45, 84, 38, 57, 139, 155, 159, 86, 85, -11, -48, 14, 28, 81, 177, -51, 3, 36, 163, 28, 14, 80, 174, 282, 98, 159, 82, -76, 8, -5, 47, 33, 13, 63, 97, 22, -30, 48, 15, 101, 85, 131, 88, 22, 2, 175, 69, -73, 32, 36, -24, -53, -59, -5, -14, 23, 54, 59, 42, 68, 25, 103, 46, -47, -82, 8, 117, 156, 48, 116, 9, -18, 23, 153, 151, 54, 27, 158, 16, 159, 88, 113, 172, 78, -65, 126, 138, 78, 50, 45, 35, -7, -14, 2, 51, 67, 146, 89, 71, 4, -3, -48, 156, 186, 168, 29, -2, -90, 116, 10, 49, 75, -41, -11, -46, -55, -23, 109, 49, 158, 28, 62, 23, 15, 125, 93, -63, 72, -90, -53, -21, -5, 39, 70, -1, -17, 87, -34, 79, -7, 16, 46, 101, -12, 27, 28, 21, -65, 37, 24, 57, -46, 22, -6, 128, 71, 43, -94, -111, -22, -87, -29, -82, 12, -9]
2120iK6LJ39n9j0K9J8j0j10k4J17p1p0J10o3LK6OQ9o8J0mk13Q3P6J47j34n9O4j7q0Q1N9k9
2116E6pj10L1R3J9p4k9L5Q4o2j03L5l6J31P8Rj60P3r8R7j17J39M2q4j7r1J14o3JQ4j30P2Q1
2111I3p4m8Q4M6o7M7m3J15j87O2j8O2N5l7J12k13O5q6l3o6J84j03p6N3J53q1%p8K18q6o3k0
2106c0o7J08m2m9P0n9J41k5kq9p7Q8J24J8n0L3k0K01j95j03r3K9JR5N1p4n2R1n4O1j3L7J30
2102A84j19m6j16oJ22M4j58L1J82r5L2p8j00K03j33n8K6r5K62q7P4K4j00Q7q9p0J09J0K4o3
2098AM4n3m0J02k3Rj8Q8q5K4l5J2j5Ol2j7M7pq4p1K47J30j31R7l2j72J01m4k0M7OPOj8L5j8
2092I4j60J9j17J43N1jL6N5j9M4j31M4l6j00J23qP5J7j13K5Rk1Rk9R8M4j22kp0Q0j9J05K6
2088A49k36L8NJ19r0O9J04j41o9J1J23n1j6J97j56K7j10Q7n1P8j2j15L6j6j14K20J09j32M3
$$ y = [-9, 17, 20, 159, 100, 90, 119, 137, 127, 17, -7, 110, 39, -31, 79, 16, 19, 45, 51, 140, 72, 82, 78, -135, -52, 24, 171, 37, -22, 42, 25, -55, 26, 85, 56, 49, -61, -30, 63, 82, 8, -21, 14, 98, 36, -67, -32, -68, 63, 141, 150, -10, 63, -35, 62, -55, 84, 126, 42, 25, -66, 48, -15, -14, 70, -60, 12, 93, 19, -29, 55, 101, 34, 81, 38, 153, -34, 28, 10, 72, 127, 90, 202, -11, 54, -32, -65, -131, 53, -50, -126, -73, 80, -1, -1, -79, 139, 53, -10, -30, -97, 11, -31, -80, -10, -69, 72, 47, 45, -44, -121, -33, 91, 109, 59, 92, 72, 273, 78, -25, -118, -89, -88, 7, 58, -16, -68, 23, -31, 30, 17, 54, 184, 65, 19, -97, -103, 19, 63, -95, -64, 118, 23, 55, -23, -123, 80, -53, -111, -85, -180, 82, -5, 69, 93, -7, 80, -9, -79, 30, 40, 64, 1, 45, -8, -48, 54, 31, 40, 22, 110, 25, 49, 14, 26, 11, 17, -15, -32, 15, 8, -76, -147, 100, 230, 99, 196, 164, -8, 93, 49, 29, 76, 82, 89, 95, 77, 112, 94, -66, -47, -164, -21, 30, 29, 65, 120, 101, 145, 14, 58, 22, -78, 45, 37, 112, 129, 16, 41, 50, 29, 38, 9, 107, 151, 29, 27, -43, 37, 18, 123, 149, -87, -49, -44, 75, -15, 54, 158, 17, -52, -41, 82, 31, 15, 212, 56, 83, -27, 60, 9, 87, 75, -40, -4, -20, -134, 86, 195, 63, 106]
2084A06l3M1k2L1j7n5L7r1J31M8j84L6K9j51J92m9j5R1P5n2m9p6p4N0J94j61K5q0nl0O5l8
2079c1J53L4q7m0j2N0j62OJ51J8p1P0o0Q1j01k03J72k9n1O3J00n6rQ8k8K4j01J6k7jJ61K7
2075A45k57J17O2J16r1jJ4OK0J6K1%m8o8J34q6p8qj4n5M0J18p7J3J1m1N3k1l7N8l1P5mj1p0
2070B1j2oj36J21K3j7L4L1N4L3qN0kj93K06k9o9l0J44nl7L7r0J3N3n9j27r5K47j22l0J70j67
2065Clk8l1J19K0j33K42j07L6j79J22l3Q9M7j04l5O4K5L7p4N5J18j00O3M2p2Q8k71J53L9j81
2061A1J49P8j29j57J44pJ1J3K3j60j9J43J3q1n0O5L1R3q0MP0q5j41O7L5L4q0l8Q5l7O2N7Q3
2056B07j53l6J5K5J58j7L2p4O1lP6j63P6o4O3n8k1j15J10J27k9M9p8J16j52n1J1J46j30j15
2052A3L7L8J0kn0P5n4J48l1k6k2K6k6o9Q5j19J80j173Q04K31k5k5P9m7P4j9J45j48j46J70
$$ y = [106, 73, 114, 92, 123, 106, 51, 88, -3, 128, 176, -8, 28, 57, -94, 98, 49, 34, 125, 200, 148, 99, 23, -51, -1, 193, 32, 57, -23, -28, -58, 7, -31, 122, 156, 69, 29, 17, 67, -95, -89, 62, 80, 9, 79, 19, 100, -1, -204, -32, -61, -112, -49, 51, -5, -14, 74, 46, 70, -31, -15, -42, -43, 118, 145, -112, 5, 67, 183, 92, 91, 105, 111, 131, 147, 168, 168, 120, 52, 186, 100, 22, 14, 0, -55, -15, 103, 26, 39, 50, 9, 62, 41, 4, 62, 31, 106, 102, 91, 21, 9, 3, -133, -12, 11, -6, 28, 59, 113, 146, 138, 188, 186, -7, 199, 170, 101, 71, 215, 210, 173, 210, 120, 133, 186, 127, 0, -95, 152, 30, 0, 170, 3, 0, -28, -59, 60, 80, -53, 189, 82, 118, -61, 61, 28, 117, 164, 60, 25, 89, 114, 151, 77, 132, 250, 150, 213, 255, 183, 271, 0, 153, 192, 11, 160, 238, 109, -48, 96, 89, 100, 113, 136, -24, -43, 100, 113, 32, -18, 47, 78, 171, 91, 95, 165, 80, -61, 6, 41, 75, -5, -43, 42, 5, 67, 124, 207, 54, 18, 33, 58, 216, 199, 231, 157, 218, 215, 291, 128, 204, 140, 203, 145, 124, 9, 119, 246, 217, 266, 188, 304, 152, 101, 112, 258, 128, 13, 50, 88, 98, 96, 46, 121, 67, 215, 184, 158, 136, 162, 136, 67, 152, 33, 213, -960, -156, 75, 50, 25, 104, 57, 131, 112, 257, 109, -37, 133]
2048A33J22J30m1p2J16O3J23k09q0j04O2J77j06R5L4k26L1j22m2J95q0M4M9k30J11P8j33p6
2044D2N0O1l6J89N7j69m1N0j53J06m6L2M4J67N0p7oJ80J00J08qJ9m4k11j67L6J02j11J41K3
2039D88J0J13Kj59j41q4j7N1m7j25J42r2J93q4q7N2J21j63j6P7R0k63j6J52J6P5j42J16J00
2035C62R7n2o1P2N3R3o4l5p3N1j9m8J44J51mo2J51j58k61N2l7j10j83K16q6J36j33q9Q8N6
2031B47P2j27K3j57P1k2K8L1R3n9llk5J90j76L2o9N8J08P2k5k11M3J79l1J13P5L6O9j7M1j3
2026F43r8j48l1Q5k08K9J8n6PP6rO5O2k26J94j29o6j09K2K1P8j03L7P5k8N4p5J52q2l2o5L9
2022A92R6r8m2J76Q9p5l0J16m6Qj47M7l3j6K6j35OJ19l1J28j9j46K1K17o7nJ6j06om5q6J7
2017A41p6M4n7J43P5L8j46P5j1k0j36O5K1J60j13l3L2Q6J32k53M1k8k0K46j10j01J27k17O2
$$ y = [133, 255, 385, 344, 272, 388, 451, 574, 365, 285, 181, 243, 420, 314, 409, 443, 217, 248, 126, 84, 279, 199, 243, 292, 62, 173, 251, 118, 42, 92, 153, 117, 306, 363, 194, 153, 203, 50, 156, 110, 142, 186, 353, 403, 326, 320, 500, 600, 708, 700, 719, 675, 464, 297, 333, 435, 324, 465, 488, 498, 611, 613, 454, 313, 229, 212, 263, 216, 91, 233, 141, 334, 250, 163, 215, 336, 173, 157, 234, 324, 61, 45, 197, 213, 288, 146, 262, 362, 459, 407, 346, 418, 471, 564, 500, 465, 392, 443, 424, 376, 520, 671, 667, 605, 756, 598, 337, 389, 352, 242, 59, 275, 189, 325, 192, 103, 191, 247, 319, 192, 215, 58, 129, 107, 135, 166, 259, 200, 197, 194, 169, 359, 183, 215, 146, 204, 312, 384, 359, 148, 191, 370, 339, 452, 527, 563, 632, 615, 656, 643, 545, 397, 366, 451, 243, 272, 290, 234, 241, 317, 308, 373, 435, 209, 403, 274, 208, 99, 121, 142, 220, 117, 154, 229, 201, 255, 180, 332, 250, 218, 153, 192, 288, 190, 148, 324, 413, 338, 308, 424, 378, 386, 239, 286, 253, 237, 263, 128, 134, 253, 222, 350, 331, 185, 206, 423, 356, 351, 367, 261, 255, 210, 124, 141, 65, 109, 52, 195, 270, 308, 162, 237, 226, 206, 70, 135, 156, 316, 203, 170, 202, 288, 420, 167, 208, 180, 160, 406, 296, 195, 322, 105, 167]
2013A67R0j4P9j16R6K6l1m8R3j74KL9M9j32m9JP3o3Q0P5J13p7j80N1o0J07n4O2k3J66j46p5
2009A27R2m4M2j78j9J08Q5p5r4Q0L2R3L1j03J42l5n3n9j26K40k4o8M2n1J49R4l06J80k2M8
2005C28L7Q8k41J8J68q1K9J2J62j2O3q0J28j30j45k07J66J7NK2L5rl9q7O1LQ9l9Q6j44O9j02
2000B70M9m5J28j14o6j40J92J74J9nN8r5n7j3NJ32P2P8J5j1R4K57O7O1j00j07j10k44O1j60
1996D65J02J81l9m4q5k7p1MJ1o1Q8j23J23M6m1M7j18O7o7n2k3J37rJ29j05L8J8k9R3J78q5
1991G48J32M7J84J99K80J02k33J10k98j92l5N7j44J57K03J10J68j14j45j64k08r4P3J25j48
1988I20R3k2L6K05K82Q0L47P78J270J468M25j14J00j094j372r19m25l94n0j20P3O2Q4K90j03
1984A900O1K4k61j89q3J11J82K24K23J14j10K00j79j40q6j38Q9P9M96J71J77N09O80R91J539
$$ y = [167, 257, 243, 322, 206, 302, 328, 297, 249, 342, 168, 170, 209, 258, 126, 77, 78, 151, 88, 168, 243, 356, 279, 99, 150, 90, 197, 143, 205, 182, 348, 202, 127, 219, 175, 217, 39, 20, 128, 213, 138, 44, 124, 156, 249, 280, 177, 319, 284, 231, 172, 46, 286, 262, 194, 236, 185, 334, 428, 122, 302, 280, 328, 365, 453, 212, 230, 398, 317, 346, 358, 520, 508, 571, 491, 619, 489, 344, 137, 303, 320, 325, 347, 382, 373, 334, 247, 308, 311, 400, 361, 447, 303, 372, 270, 319, 274, 402, 288, 222, 82, 274, 448, 467, 462, 520, 425, 368, 355, 360, 492, 564, 642, 657, 646, 740, 997, 1064, 1125, 1025, 918, 808, 564, 625, 465, 567, 748, 709, 665, 580, 553, 482, 486, 497, 436, 524, 401, 524, 570, 529, 576, 458, 525, 458, 406, 383, 520, 511, 640, 535, 573, 591, 562, 655, 833, 748, 880, 927, 1111, 1310, 1590, 1692, 1459, 1569, 1271, 1079, 1044, 1101, 957, 1114, 1317, 1427, 1595, 1481, 1336, 1172, 964, 870, 943, 1068, 920, 1013, 991, 1027, 1232, 1514, 1594, 1941, 2719, 3989, 5457, 5882, 5768, 5868, 4774, 3402, 2483, 2058, 1664, 1614, 1494, 1567, 1629, 1713, 2003, 1900, 1961, 1985, 1724, 1535, 1452, 1563, 1745, 1969, 2192, 2306, 2196, 2396, 2217, 2077, 1991, 1853, 1942, 2021, 2517, 2688, 2865, 3374, 4054, 5045, 6584]
1981F584K304M094P544R782K555r90O29o793r405n414k639j109N3R85K35l74k7p92j615j330
1978D277n86l82k86j07q1J8J63K65J42n0J79j38m0J54J90K16L31P45M61Q10J282J700K394
1975A1657L966O115J0594J9674K5388N797k745J995j8227k3903j2423n278l77M039Q237L581
1972C8090k995L76m383j0385o923l784k026j205q56n65n03k11j71N5L4j6J13K33K09K88L61
1970E736N03O26R22J329J601K360L646N263Q641J4816K7327L3927O786l214K440k5691l0919
1967E6099j4679l873L630J3780K4002R887p396J911j1837k6579j7243q877m890k874k111j342
1965G608j071p42n01k45k19j77q1J39J11K89K13L12O32Q50R30J461J927K933M272O724J1989
1962C7354K0975K5008M334j317J297j9394k1286q490N52Q514K1259L3837J2687r517L527j7547
$$ y = [6584, 8888, 12982, 20526, 30308, 32863, 31873, 32502, 25709, 16304, 10890, 8251, 7142, 7195, 8180, 8415, 8041, 8014, 7222, 5607, 4277, 3691, 3309, 3023, 2916, 2835, 2853, 3016, 3281, 3423, 3373, 3552, 3414, 3374, 3528, 3718, 3934, 4265, 5010, 5471, 6281, 7563, 9263, 11657, 15623, 21738, 32332, 52006, 77394, 83191, 80446, 82441, 64214, 40311, 27888, 22610, 22233, 26272, 34509, 38090, 35095, 35471, 31088, 20703, 13780, 9996, 7970, 6765, 5909, 5344, 4841, 4630, 4459, 4514, 4548, 4532, 4645, 4878, 5087, 5375, 5736, 6239, 6865, 7787, 9116, 10717, 13077, 16723, 21986, 30627, 45443, 72770, 106697, 113483, 110269, 112709, 87018, 56099, 41420, 37547, 41177, 54957, 78959, 88846, 81450, 83361, 71524, 44945, 27702, 18825, 13935, 11061, 8950, 7608, 6537, 5795, 5294, 5049, 4830, 4653, 4572, 4711, 4822, 5111, 5324, 5636, 6268, 7118, 8048, 9509, 11436, 14369, 18641, 25365, 37354, 58329, 83337, 87671, 86354, 87651, 68257, 46971, 38481, 39033, 47547, 68806, 102643, 115330, 105813, 109340, 91793]
1960I1793l6140k2397j1426o105l695k665j838j327j044n93n01l60l44j71q2K71M3J37R4J28
1957C778L66M97P13O54J409J944K827N006Q786R491J712K11N05p210p050j532L040Q288J7322
1954E0757K5759Q499o374K595j4593k7027j6135q430m426k516j919j483j082p72m11m61k04
1952A777j55q5J14P2J44j0l2l35p3Q5R1M48L10L84O30Q43J357J477N89J39J31p47n24P68J827
1948I225L922P587R986K656k051O83o675j0267o182l144j789r37p80n92n05k06j51o4j38J88
1945G66ON4K35q8M0J8k31j58j70m5L52N6P3R6j84R6q4l15J39L6P6J00L05L82O45J259J704
1942E163K41j62mj201j562r76o14l15n9j75r5j99p5P8R6j17J77J94J20J71Q1j73l8j26n6n9
1938C15N7R8R4J18K36J9j33k35k76q1nq6k2K1o5K1J86l37N6K3j38j0k4J11L2L5j3P3R5j37
$$ y = [91793, 55653, 33256, 21830, 15725, 12030, 9365, 7527, 6200, 5156, 4563, 4062, 3702, 3358, 3187, 3105, 3376, 3419, 3556, 3650, 3778, 4144, 4641, 5354, 6008, 7417, 9361, 12188, 17194, 25980, 35471, 37183, 37394, 37899, 30689, 23639, 22107, 25147, 33435, 50757, 76516, 85015, 78641, 81236, 66643, 39616, 23481, 15051, 10625, 8109, 6190, 4707, 3625, 2853, 2442, 1981, 1777, 1622, 1537, 1651, 1723, 1867, 1857, 1825, 1490, 1417, 1502, 1593, 2041, 2351, 2735, 3365, 4208, 5565, 7042, 7631, 7770, 7901, 7154, 6630, 7398, 9225, 13147, 20734, 30720, 33376, 31325, 32008, 25333, 15066, 8884, 5740, 3951, 3014, 2234, 1642, 1137, 931, 780, 716, 578, 766, 772, 826, 1061, 973, 1013, 1031, 800, 642, 472, 427, 779, 835, 908, 1004, 820, 916, 832, 517, 656, 692, 768, 868, 1173, 1555, 2200, 3459, 5163, 5404, 5242, 5238, 4037, 2475, 1499, 885, 570, 511, 336, 241, 42, -33, 45, 141, 24, 201, 395, 515, 686, 767, 594, 556, 430, 374, 315, 372, 470, 564, 682, 918, 937, 804, 569, 293, 212, 207, 121, 99, 120, 55, 76, 262, -75, -19, 4, -134, -144, -168, -57, -25, 10, -3, 70, 165, 28]
1934B8j67J12P1Q6pm5J85J1r5Q9Nr1Q9l4K2L6J22L47M5pj69j6l18j16q6N9M4N6l5p8n7j07
1929b1J8M5l2j5J43K0l9R0J78K9%J1L6n3j52Q8k45N1L9J36j73J07J0M2n9R1R4Q9j12N5O8j71
1925C68Q7op9q2J00N8k0j8j15O2p6o8n6J05n3q4K08J24p3J94P4J85l9j82q1j47r6q2L6J41
1920C85O6l9o6J13MN1L1K8o8L2j93j5J37j25j1O7J40n7P8J28J25k3j26j53k06np9N7J43j74
1916B45K10K2J07J75O7P4L8k89j56j45o5j6n3O5K31r2L7J18J8J71j4j03Q2k29j04r4Q7K6n9
1912C54k7M5J07J00O8k8l4l8r1j00N7r4J47n4J16L5k5%L09J65m6r4k84j04L0j36p3L3j0M8
1908C76J24p6K32j09NJ25kj98oq7P5j47M4J6L3J06r8J62O3Q8o2j9Q1p6j44O3p4L1J98k4M9
1903G49l5K7J15O5j29l36R8J10r7r0J63j47j06J89J77k2J34j12J17m0q2j80R0O5L2J43j27
$$ y = [28, -139, -27, 44, 130, 123, 78, 263, 274, 179, 268, 273, 182, 271, 237, 259, 295, 417, 764, 809, 802, 633, 617, 299, 183, 97, 156, 200, 256, 221, 143, 86, -21, -3, 42, 10, -5, 138, 158, 119, 209, 387, 416, 416, 427, 463, 410, 258, 346, 101, 152, 191, 327, 154, 261, 271, 313, 254, 345, 439, 528, 416, 471, 539, 368, 455, 449, 370, 288, 388, 446, 426, 408, 293, 355, 279, 211, 155, 260, 207, 123, 331, 455, 382, 576, 650, 835, 796, 614, 533, 386, 290, 208, 244, 385, 451, 412, 346, 459, 463, 514, 545, 573, 505, 537, 344, 329, 466, 341, 330, 397, 537, 480, 558, 686, 811, 788, 662, 509, 303, 298, 219, 276, 419, 245, 455, 477, 584, 759, 826, 900, 938, 649, 493, 348, 283, 267, 214, 279, 510, 418, 455, 573, 591, 762, 748, 645, 727, 498, 394, 300, 387, 413, 354, 327, 372, 479, 579, 647, 619, 585, 547, 456, 356, 413, 319, 466, 412, 528, 563, 538, 538, 847, 1012, 966, 872, 588, 484, 514, 378, 305, 338, 328, 376, 500, 424, 656, 547, 552, 677, 675, 477, 471, 384, 459, 312, 356, 372, 405, 511, 413, 575, 638, 726, 664, 645, 726, 650, 506, 569, 495, 526, 724, 700, 749, 714, 741, 856, 921, 792, 456, 554, 664, 567, 477, 640, 493, 387, 576, 753, 731, 865, 753, 870, 830, 748, 568, 658, 723, 755, 898, 771]
1900G71J33M6J09j11J11J47J40J17%k2n3n0k24j04N6J29J0R7N8j18l9P8q5o5k5n8O4J22O7
1895A301O7J58N4L7N3J18J4J44J3J28J74J4J33J44J95K57J33J32K15K83K67K43Nk15j04k01
1892C762j18j31J5j02q1O4OJ46j76r8qm6M4j25L7JJ41K5M2J09K37K25J6J33J84K94J49L46
1888E091K75K42L06M02N75L68M88M49M67J80K01K57m2k42k22m34k88j75r1J01j33Op9m4Mj32
1884G530k85j99j29j92k61M4j6o4LN0J25L5N6K20J49J80K85L69M09K95N12N36N38N90O48M69
1881A1897N54M38J72J86j16k88j28k91j72k86j46N8j88J32j4N0j06k65n44n36k63m14m75m19
1877H836l68j21l58n4j50p7j6j54J18K20J09K40K44K72J18N56M52M78L65M25L38K29L09j1
1874A2000j02k8j95o3k58J36q0J27K64R8j4L7o9k91o22n08o12o43n60o05l48l75m86l06k26
$$ y = [771, 904, 950, 1059, 948, 1059, 1206, 1346, 1463, 1463, 1441, 1388, 1338, 1114, 1010, 1066, 1195, 1205, 1302, 1360, 1242, 1203, 1281, 1196, 1131, 1106, 1048, 1112, 1234, 1301, 1368, 1526, 1580, 1617, 1670, 1788, 1802, 1946, 1959, 2087, 2261, 2275, 2408, 2552, 2747, 3004, 3137, 3269, 3484, 3767, 4034, 4277, 4282, 4067, 3963, 3762, 3644, 3513, 3528, 3426, 3345, 3409, 3415, 3561, 3385, 3287, 3279, 3233, 3277, 3152, 3189, 3190, 3331, 3356, 3398, 3507, 3744, 3969, 3985, 4118, 4302, 4596, 4745, 5091, 5366, 5608, 5914, 6316, 6891, 7259, 7747, 8196, 8663, 8843, 9044, 9301, 9259, 9017, 8795, 8361, 8073, 7898, 7807, 7908, 7775, 7781, 7702, 7658, 7662, 7530, 7245, 7046, 6917, 6725, 6464, 6508, 6492, 6428, 6431, 6481, 6606, 6641, 6697, 6917, 7066, 7246, 7531, 7900, 8309, 8604, 9116, 9652, 10190, 10780, 11428, 11897, 12451, 12889, 13061, 13247, 13131, 12843, 12715, 12424, 12252, 11966, 11820, 11878, 11690, 11822, 11808, 11858, 11752, 11487, 10943, 10407, 10144, 9730, 9255, 8836, 8468, 8347, 7989, 7935, 7785, 7708, 7692, 7538, 7656, 7876, 7985, 8225, 8469, 8741, 8859, 9415, 9867, 10345, 10710, 11135, 11473, 11702, 12011, 12000, 11898, 11870, 11675, 11612, 11354, 11490, 11410, 11537, 11801, 11899, 11885, 11922, 11853, 11562, 10940, 10432, 9820, 9177, 8617, 8012, 7664, 7289, 6803, 6497, 6271]
1870F271j67m58J3n7o3k2j7P3K11j53K16J5J36L49PK31R7l7J54Jj30J56J57j38L6K68J70J74
1866G493j1O0j4j90j55l22l83m25k31o46k68l89l18k64k56l84j59k20j88o0n8k04N9p7l1o1
1863B298Lm6R2M0q4O0n6M5J8l6J41m4J9N9J6K6R7J32L6L3l2Pj02r5j24k42j70j15k19m9j58
1858A550k52j48m5j33J6J5qj05k25l1J56j0j23kQr0m6R0L0q7j22m3Q5k4j6m2j4k3K00Nn2J02
1854F16j1j46L1o0k7K4j26r9R2o8k5J26O5q1n6mQ4r9M3r1j3l5M7q1o9Q2Q8k01J48M2Mk00J37
1849A37Q6n2l7L2Om2p4J20O0j24m9N9j29r8J59k20O0J54n0K50m9j71J4pQ2o4m4L5K0o9k0K03
1844A78J11j42l4l3Q6j1rq5J71j73J15r5k8J39j00m7q1K8j0K30q6j2M5j88n1n5O2J2j00K42
1840G9j82J31M5k8qr5J23m8j11N5N3n3P3P6j55J08j2n5L8M7m6J02j47J14j08J52l8j83J4J05
$$ y = [6271, 6104, 5646, 5659, 5602, 5539, 5517, 5500, 5573, 5784, 5631, 5847, 5862, 5998, 6347, 6354, 6585, 6682, 6645, 6799, 6800, 6670, 6826, 6983, 6845, 6881, 7149, 7319, 7493, 7482, 7542, 7528, 7338, 7183, 6861, 6478, 6053, 5822, 5176, 4908, 4519, 4201, 3937, 3681, 3297, 3138, 2918, 2730, 2670, 2612, 2408, 2467, 2390, 2359, 2298, 2301, 2255, 2347, 2387, 2303, 2363, 2307, 2352, 2370, 2334, 2475, 2431, 2450, 2509, 2525, 2551, 2648, 2780, 2816, 2849, 2817, 2824, 2722, 2627, 2503, 2261, 2091, 1976, 1757, 1708, 1550, 1298, 1150, 1105, 972, 988, 1003, 995, 890, 665, 634, 790, 780, 657, 655, 663, 573, 527, 617, 647, 560, 438, 395, 480, 456, 440, 398, 384, 361, 561, 566, 514, 616, 605, 459, 490, 430, 403, 427, 301, 202, 294, 226, 201, 327, 392, 311, 255, 251, 335, 236, 279, 188, 175, 140, 187, 106, 37, 119, 207, 6, 154, 196, 200, 0, 137, 223, 171, 134, 166, 172, 130, 56, 176, 236, 112, 63, 122, -7, -105, 54, -166, -106, 48, -2, 248, 199, 28, 42, 35, 117, 53, 9, 44, 64, -5, -25, 178, 289, 147, 113, 80, 166, 155, 146, 61, 232, 59, 174, 79, 51, 190, 90, 43, -38, -10, -20, 210, 124, 112, 157, -31, -82, -137, -75, -63, -163, 79, -103, 28, 73, 45, 37, -58, 65, 17, -94, -39, 14, -39, 34, 110, -45, 63, 51, -4, 34, 81, 35, 137, -10, 104, -4, 148, 110, -73, -59, 46]
1836D6L0j23N0jO2kr5P1n5J00j7J6j38J62j53J07L2r6o5J54L6k2j39%J34m2o1q8R5o4j01P0
1831i7N9J13j17l3Lk6J5O7J5j06rQ4p4O6Q6o9R0j35N0o8Q6n0J37j01m6O5P3r1N3p1J64j05
1827B8J2o8K4m9L1%l4pK6R8p9k1j9RJ63j26M3q5K8N0k8J2l9j3j8l1R3K0L2J6p9k4m7j9J02
1822AK1N1K7k00O6j13L7L2j02J57N7k7o4p2M8J27l0m2lL7N2O7n2KM6n4L2p6n7j4j6J31k3p2
1817b6p4O0N6R4p6k6nm6R5J12j37J7n8o5pN8K1PM3n3m9q6Q9J9J48k3lo7N7j40po4M8J62r6
1812b2O4Jm2Q0j7L8J1j08J53n8j43R8k9J5l1N8q6J9L0j31n5qj0O6M1n0O5J58m0n1j14R2l1
1808c7J35o3Rj75l4J62NM3r7J11j07J76j22J41n3l9n8J18p0r8L7qN8J65k52l0k6J06K2O5m1
1803D3j26J02ok3K1M7j77J6J01r9Q1J37k6j27j55J26NM4M4M8j5J55n8o5o2O8P9l5M7q9J29
$$ y = [46, 76, -47, 3, 2, 64, 62, -33, 38, -17, 83, 66, 82, -56, 106, -47, 60, 92, -4, -69, 85, 121, 99, -40, -40, 94, 52, -9, -97, -2, -66, -167, -97, -38, 75, -42, -75, -72, -98, -83, -16, -1, -107, -116, -32, -106, -40, 46, -23, 67, -68, -18, -86, 0, -50, 87, -14, -60, 5, 78, -13, 40, -31, 133, 28, 40, -28, -4, -53, -22, -22, -56, -63, -37, 61, -18, -39, -58, -49, 114, -12, 31, -54, -26, 24, -4, 8, -31, -44, -62, -93, 0, 20, 52, 68, -11, -35, -82, -101, 1, 22, 73, 100, -100, -34, -147, -110, -78, -180, -23, 34, 7, -57, -129, -81, 46, 16, -26, -29, 8, 60, 127, 75, 77, 123, 69, 101, 25, -32, -46, -62, 69, 46, -26, -100, -40, 16, 110, 34, 8, 3, -43, 52, 164, 27, 44, -14, -79, -86, -28, -7, 0, 43, -10, -59, -145, -56, -37, 111, 88, 85, 18, 75, -65, -72, -136, -88, 74, -22, 42, 43, 1, 81, 64, 102, 113, 5, 158, 100, -43, 55, 26, 41, 10, 68, -18, 1, 31, -100, -155, -163, -173, -107, -66, -116, -51, 107, 67, 16, -98, -6, -37, 98, 35, 44, -131, -165, -3, 2, 45, -52, 59, -48, 128, 6, 147, 94, 55, -3, 115, 45, -53, -16, -24, 34, 199, -53, -83, -109, -3, 19, 84, 43, -83, 19, 13, -10, 11, 58, -119, -103, -2, -101, -20, 117, 91, -36, -191, -65, -60, -16, 28, 76, 61, 216, 158, 93, 31, 99, 178, 143, 190, 101, 230]
1799B30j26n3N2j6j01K8j02K50jM4j63o8L4m6P9Kp7P2m5q4J66n1p2j41J55N6J42j03p0r8O2
1794d5m2j13K94r6J00q8p1m1J24P2k0L0j34Ko1O9M8K8q8j38J93J8j27Q4j6l0J3O1j99RL3L1
1790a00P7J9j41J16J20j27M2j81m9O4J11n4K05p4J5r8J16oK5k0k0rLl4l5q2R0j5Jo3J40j31
1785i5J29J21r2j34O0J9K3p1N7k5k8R6m1O3j35RO3R0j05q3R2o8j13Q4N8M5ok7J10k44O8K9
1781e1L8k6O7j05K6N4l0j1j22N5O9P5p8M7J0j7j06J38K9k1Lq0N6o6Q5op6J34r1r0N1O1LM8
1776G3j52N0Q2l8o1o7o9J75M3l1l9k5N8o5l8PJ89o9j13P5LJ1P1j05r4n4jm3J37l2J04J42p8
1771D6L7l18Q3O4Q2j22n0J42j31R5q3O9Q5qN2k7l2m3J17j53po9J29Q2l5M1o5K8M2j17P4j3
1767eP7j2K9p8J10o0K0k00J59j48M1n0J38o1p3kJ56m1r4k6Q0O3j39R6O9n3r3L8j9J64r1j78
$$ y = [230, 104, 51, 103, 87, -14, 14, -88, 162, 161, 205, 42, -26, 8, -38, 41, 43, -34, 38, -7, -91, 75, 24, -48, -189, -34, 22, 164, 61, -9, -107, -45, -87, -200, 94, -2, 98, 10, -61, -102, 22, 94, 74, 104, -30, -28, -89, -20, 28, 56, -32, -170, 23, 41, -86, -2, -18, -48, -35, 26, -173, -164, -131, -100, -23, -4, -145, -29, 91, -36, 6, -175, -224, -160, -49, -103, 102, 28, 43, -55, 61, 55, 80, 60, 40, 31, 34, 0, -35, -117, -27, -42, -41, -104, 36, -95, 34, 155, 63, -71, -11, 8, 31, -40, 17, -8, -36, 60, 19, 82, -53, -44, 19, 109, 4, -79, 13, -55, -168, -84, -26, 19, 13, -14, 96, -148, -80, -51, -13, -39, 28, -77, -51, 3, -27, -38, -160, -105, -36, 39, -39, 8, 18, 1, -105, 33, 62, 41, 44, -36, 20, -46, 39, 33, -43, 91, 0, -90, -39, 22, 25, 73, -79, -29, 53, 15, -46, -113, -182, -7, 36, 5, -34, -59, -1, -66, -104, -97, 92, 23, -90, -15, -12, -1, 70, -35, -129, -183, -184, -227, -90, -122, -18, 124, 46, 83, -235, -152, -88, -6, -128, -178, -36, -167, -72, -155, -86, -1, -9, 43, 16, -16, -59, 58, -95, -102, -171, -42, 40, 5, 46, -19, 9, 51, -66, 8, -5, 72, 60, 89, 11, 121, 61, 81, -119, 40, -108, -67, -117, 21, -40, -113, -115, 41, 0, -94, -120, -40, 23, -116, -20, 49, -4, -97, -59, -78, 86, -5, -183]
1762a83Q1J21J9p9L5qK0j0l6J05j10Q4r0J0K0M6Km0Qoj00O7J03m4j02O6k2n1KR2n3mj43J37
1758f3p4J9M8j2MrL1p9N1j53J87P2k0j4LL6q2O2p3j8p9J68N4o5K4P1Jj84J24J8m7j20l0Q6
1753f3P0J7k9m2M0m8R0R6j90M3k9L9Op0J02rM3j31l3M0L6q5L9J32r7J43j14J55k06J5P4j83
1748a49M2k1N4M1k2Q1l3j24o1K08j6r5n5J39j1K1qJ54j48r2K07q2N7l0j5j24O9L8J0j41P6
1744c0J3l3J06Kpo7j48K57J2p5j60M2L1j33J57M2K04j91O5j53l8O9m8Pl8M0Q6l0Q3qo8k4L2
1739ck39J21Q2k9L2O5l3OrK5k8j33O7O1m9m4J05p6O9j97J64l8MK1M4k9N9J7j5l8j43J45Mp1
1734h3k5Q4J0R2l5j17P9O9m9J3q3n2L8J84p5j07J0J05o1m9r5J38J1rJ3l6j3m3J46j06K1N1
1730B6L1O0q2j51L6L9r1nJ37o1lj1j01K20j05l6nJ7n3Q6R4n7m3m9P7L5K9M9Ko9Nj56J23q2
$$ y = [-183, -102, 19, 38, -41, -6, -14, 6, -4, -40, 65, -45, 39, -51, -41, -21, 25, 27, -13, -5, -11, -111, -44, 59, 15, -87, -21, -43, -94, -92, 0, -53, -57, -200, -63, -137, -118, -70, -82, -78, -87, -56, -135, -84, -237, -50, 22, 2, -12, -9, 27, -55, 7, -66, -84, -163, 5, 59, -6, 18, 89, 90, -94, 30, 48, 1, -119, -149, -63, 7, 24, -5, -47, -7, -55, 35, 131, -59, -16, -45, -6, 0, -70, 32, 23, 66, -65, -98, -58, -22, -107, -68, 64, -33, 110, -4, 151, -55, -40, 34, -149, -107, -128, -74, -33, -55, 26, -7, -131, -192, 16, 0, -95, -150, -11, -22, -1, -9, 145, -3, -95, 112, 30, 87, 57, 42, -82, -13, 25, 35, -106, -30, -17, -50, 56, 58, 51, -16, -164, 93, 105, 30, -130, -88, -57, -190, -33, 9, 213, 22, 87, -66, -104, -35, -83, -76, -114, -74, 12, -18, 65, 57, -11, -35, -3, -242, -121, -39, -68, -36, 29, -4, 2, -7, 18, -10, -143, -76, -15, -64, -108, -3, -79, -10, -207, -43, -81, -77, -56, -12, -41, 18, 35, 20, -18, -161, -16, -12, -83, -108, -24, -14, 78, 43, -74, 5, 74, 25, 38, -45, -97, -59, 125, 50, -57, -47, 58, -3, -52, -147, -9, 2, -7, 6, -30, -43, -86, 60, -46, -25, 26, 57, 117, 35, -116, -80, -41, -132, -137, 0, -61, -64, -75, -176, 44, -61, -97, -102, -85, -138, -52, 42, -15, -58, -107, -30, 5, 34, 83, 85, 16, 21, -135, -12, -94]
1725i4j2qJ60K6j71N4j8n5K05j19j55J66j45J86j30o7K0J3J35j36R6J51j48J45n1L3q2r5p5
1721a71K3k8M1J55j45R7Q2j49P0n0j11J46j5q9n2J14mj20J53J12l3j1o8O1j0MM8k6ol3K6J7
1716B8j15L5L7m6O1n8M1j41R5q6l2J83j67JO3n7J51R6j72p0O8kJ56o1L2j28N4j16P6J92j55
1712c7O1Q6j12k6q6J57j4l8n8K3k7j3M3P8n9N1p9M0o7l3R6o3L7n2J36j62O3k4L9p7J34q0O
1707e7j8Pj26J48J16q8Jk48J11L4J67o0J0Jj21M1pmJ95j01JM5r7J3J62k52R1O6o3L6M1j4j9
1703A1k6P4j08P3j44Q4J15r0K7j50n3Q3j1plL1m6L4J00q4J44L1J31o2j3o7K2l5M3p6p7j9J7
1698e1k3R3n7j09J22l2n4o3N4K8J00j6L2L9r9J03o9Nj9J3K7m8j0P7k6m9MM6O8O8o5J26J4R8
1693C27L31R04o7q09l62j82j01l3J57m1k5j24P5K8N2mq8L9k21P0J84j34n2N0j19J5k7J59K9
$$ y = [-94, -106, -114, 46, 72, -99, -45, -63, -118, 87, -32, -187, -21, -166, 20, -110, -177, -157, -144, -9, -145, -49, 102, -46, 99, 48, 81, -1, -96, -171, -148, -176, -135, 20, -125, -28, 54, -95, -25, -75, -186, -40, -55, -144, -196, -82, -86, -206, -53, 59, 26, 15, -53, 8, -2, 2, 50, 24, 18, -15, 11, 28, -87, -52, -15, -61, 0, -58, -17, -158, -63, -149, -181, 2, -165, -164, -101, -158, -7, 89, -83, -153, -85, -87, 69, 8, 40, -88, -34, -150, -74, 118, -37, 24, 110, -2, -28, -114, 43, 29, -9, -67, -44, -71, -84, -41, 37, -22, 29, -50, -10, -77, -110, -14, -77, -40, -92, 44, -118, -55, -79, -40, -117, 17, -63, -57, -75, -68, -194, -46, 70, -18, -17, -265, -154, -120, 47, -13, -3, -2, -123, -82, -89, -93, 102, 1, 2, 47, -50, -37, 125, -127, -36, 30, -33, 3, 44, 30, 11, -15, 59, -49, 24, -120, -36, 79, -11, 16, -134, -187, -104, -115, -122, -125, -94, -140, -106, -6, -90, 54, 85, 216, 154, 141, 74, 96, 61, 104, 28, -49, -68, -51, -74, 19, -38, -147, -25, -57, -111, -174, -120, -92, 8, -8, 24, 63, -36, 67, -2, 3, -16, -3, 24, -24, -34, 43, 17, -32, -28, 18, 86, 154, 89, 215, 229, 327, 658, 1562, 1495, 686, 324, 142, 41, 8, 165, 124, 99, -25, 50, 78, 130, 126, 38, 77, -144, -74, 110, -24, -76, -26, -145, -130, -157, 2, 31]
1689C1p8M0j2l4N3P6r1n7J3R1J47l6J68l9J05K24M33J111K100l14j912j184m25j84r1P0M8
1685B53o6m0j4o5j53J95l5j48K29n5n2r5m2L6Q5n4J44l4q6O7M6j10l9j67J56R6OQL7O4O8J21
1681C56J31J5K05P72J464K823o16k622j587m49k21o3j10R8m5k92R5m7Q2m0j7M5J27j72J66
1677I8j90J77n0o4P3l0N3l3n9L1J02j2pJ1m1J01j13Q2j09Q4J24kO5L22M46J388K147p78k027
1673A789j096k01k71j18l1r8O0J00M2j88M5K2j90Q4J5nN5KR2K3j29k9O3k3j21J36Q3n1pj59
1669a06N1n9J83j3M1pk7J07o3nJ47J67O16R01o70o22m51j29q8pP2O9k67J39p9K26l4j20N9
1665C1Mj8j18K22o6r6L1m4J60k51pK0R4R6n7K2j55P9P0N7j97jo3J70J15j11L0k7PM6K17j8
1660B42j36l8%j66J94j62O7j23J29o0q1J00k2O2Rj37P3J32k8j50k5J28n3J01n9jKk9o3J52
$$ y = [31, -47, -7, -19, -53, 0, 76, -15, -72, -59, 32, 179, 143, 311, 272, 377, 601, 1034, 2145, 4245, 3931, 2019, 835, 410, 226, 135, 205, 253, 187, 147, 133, 68, -85, 110, 75, -73, 156, 101, 49, -46, -88, -52, 33, -21, 123, 89, 3, 70, 116, 6, -33, -200, -44, 52, 58, 66, 103, 167, 235, 356, 487, 502, 707, 1479, 2943, 5766, 5150, 2528, 941, 492, 271, 208, 98, 196, 151, -141, -46, -93, -11, -51, -68, -23, 104, -68, 98, -92, 85, 35, -29, 44, 14, 67, 34, -25, 6, 108, 96, 89, 100, 59, 160, 47, 129, 20, 104, 228, 226, 291, 613, 1059, 2447, 4594, 3816, 1789, 693, 492, 221, 103, 72, -26, 34, 134, 176, -12, 33, 55, -135, -51, -36, -41, 14, 16, 108, 131, 2, -27, 36, 13, -108, 28, 111, 60, 53, -106, -55, -114, 69, 56, 97, 90, 63, 170, 107, 102, 249, 416, 1032, 1933, 1263, 641, 190, 61, -27, -34, 38, 107, -160, -21, -100, 126, 92, -28, 31, 35, 17, -101, 121, 55, -41, -10, -54, 106, -145, -152, -132, -38, 58, 1, 23, -132, -53, 17, 74, -123, -124, -187, -17, 98, -13, 17, -10, -3, 43, 260, 242, 106, 68, 68, -98, 96, -66, 1, -122, 7, -53, -134, -34, -56, 6, 15, -122, -49, 83, 55, -95, -120, 8, -45, 56, -3, -4, -2, -31, -94, 58]
1656E8j56P6J2j7l4J26j21O0l0m4K3k2lJ33m7j7k3m2k9J61q0n4Q2N7Jj00o3o1K24k32R6N3
1652a3j11J22M2j12j3N4O0J27k2k02J23K2n0J81j59n3k2L0M6L7j34J5lK4o6K5j02J61m3l9
1647g5J29l7k9l0Q1k6J30j54p7N9J4N8O2j45L9N1j15J52k69J79n0Q6j98J65m3j21J60p4Q2
1643Dq0j4Q2k5j6j73P0K63O3j26J1j27Q5P3k95J71l3J4Q8j20J32j2q5R3l3R8J17j57j1j4l0
1639A3L3M3R8j43L5j23M1P9O7j20J87q6j70j01N8L8J9K5l1NJ47N8j34o0j0J44K5OP1j28k01
1635a15J24j2j0J55j00j16J53J08j98j6NQ9Q6j84R2k6k0K17k8J28r5m5p9l9k3o2J13K9r9m4
1630a2k1M8J69j80L4J2Jl9J4j2Km7J56o7m7kJ44K9Q8j05J07m2K9n0j01o4R6J12lk1j02K04
1626C30q3j23J20j2j85J01K50k6q5m3J0m5L8P2j65P9J40k28J86P4j82O1n2l2K5K17j2r6J00
$$ y = [58, -98, -22, -10, -27, -61, 65, -56, 4, -26, -70, -47, -69, -72, 61, 14, -3, -26, -68, -97, 64, -16, -70, 12, 69, 70, -30, -93, -154, 70, -162, -66, -13, -124, -2, 40, -72, -85, -31, 29, 156, 134, -68, 55, 77, 27, 208, 49, -4, -26, 4, 50, 87, -47, -32, -35, -11, -77, -52, -154, 7, -36, -75, 54, 17, -12, -42, 39, 13, 143, -11, -88, -29, -15, 43, 105, -40, -1, 50, -65, 87, -182, -3, -53, 33, -165, 0, -43, -164, -4, -78, 4, -76, -90, -8, -33, -49, -222, -152, 111, 174, 48, 59, -68, 17, 90, -205, -34, -67, -53, 35, -85, 47, 35, -50, 43, 10, 108, 225, 68, 57, 43, 13, 46, 89, 187, 44, 79, -44, -3, 76, 143, 23, 210, 124, -46, -147, -89, -51, -32, -7, -38, -33, 114, 172, 38, -22, -32, 112, 137, 143, 214, 86, -115, 9, -3, -13, 142, 42, -74, 79, 187, -11, -27, -22, 67, 153, -31, 61, 35, 15, 232, 204, 332, 237, 192, 113, 74, 51, -11, 102, 131, 32, -12, -33, 15, 184, 4, 38, 50, 51, 12, 26, 14, 16, -31, 125, 58, 11, 9, 153, 182, 270, 165, 272, 230, 259, 209, 108, 44, 140, 252, 249, 228, 126, 330, 247, 124, 244, 232, 47, 148, 398, 372, 287, 244, 254, 209, 247, 319, 154, 233, 373, 145, 331, 405, 223, 284, 232, 200, 225, 442, 430, 334, 434]
1622D34j04Q2r3Q2L2J0K9j02J8k6N2o0K11pO3ql3j46n3J52j9j00J8R5j64j57J64M3l9O9N0
1617D93o3J34M8R0n1m2Nl0k5p6K2J4j15M2J52k48R8PQ0kR9M5r0L6o2N6o9N1J0J06j4j8k01
1613D82K5R7j8k9M3J07k91l7k6J27q9o7O3o1P7m4J21n7o8l8R3R7q1j03j08L9J35Np6L06M3
1608F67j42m9R7l4n6n6m3Q1J5j54n7P7p0m5k2O3q3Q5J3J00m0J7q6k7J51mn5k78R5Kl3R1k01
1604A9P0M6J92j57j52L7k0J83o7r6Q0O8n0m5L2O6q2M8j5r4N6l8l1n2K21o3rj16o4J02p9J3
1599CR4j23pJ02o9p4J68p6n8K12n0j9n3P6j54J23j37M9p4J3P3K9L9JN3j37K4OPo5nj16J1Q5
1594d9q1R4NjR4j73j2M0L3m8m0N5P2%k7k9O2o4J02Q0j74J20m4o6lj2m7J3J00Pq5R7qj25P4
1589d0J7%j5m9Q5n2q3P3KP5k01J85q5M4J11j7p1M4k4L8l7j21O3m6l4P2m3J6J6J25l3K7K4j72
$$ y = [434, 330, 412, 319, 401, 433, 443, 472, 370, 388, 362, 414, 354, 565, 558, 621, 613, 580, 434, 381, 533, 514, 414, 432, 527, 363, 206, 370, 413, 374, 443, 493, 430, 564, 612, 702, 651, 609, 614, 584, 559, 483, 505, 519, 404, 446, 598, 350, 448, 455, 535, 533, 632, 677, 587, 623, 561, 617, 548, 599, 609, 715, 701, 683, 482, 507, 604, 586, 557, 600, 707, 416, 379, 353, 480, 391, 324, 387, 326, 403, 359, 480, 423, 355, 317, 410, 507, 426, 323, 215, 254, 389, 394, 318, 624, 667, 525, 476, 573, 539, 483, 427, 384, 465, 480, 326, 269, 346, 276, 231, 209, 272, 189, 274, 287, 387, 347, 364, 278, 251, 402, 398, 343, 65, 160, 162, 129, 220, 19, 89, 135, 327, 170, 18, 55, 35, 218, 151, 55, 135, 203, 153, 108, 140, 206, 124, 172, 157, 63, 119, 81, 50, -2, 219, 156, 147, 31, -33, 69, -10, 3, 97, -26, -33, 69, 0, -74, 94, 18, -40, 172, 122, 103, 50, 126, -28, 95, -42, 7, -67, -54, 19, 48, 87, 88, 141, 4, 28, 34, 41, -24, -29, -145, -134, -49, -130, -36, -31, -32, 62, -111, -123, -83, -50, -98, -138, -83, -11, -11, -38, -67, -5, -69, 33, 113, -61, 59, 15, -51, -54, -66, -113, -100, 0, 7, -78, 19, 11, -114, -40, -23, -23, -38, -87, -2, -54, -137, -64, -62, 13, -188, -3, -88, -44, 67, 50, -21, 23, -1, 37, 0, -121, -58, -104, -138, -66, -109, -93, -77, 48, 15, 42, 66, -106]
1585a06J49R2j30m2O4n2r4KLP5JK5p2J3R8J57j00L7j70j26J00P1R5j33p4J8k5J5J45q7J16
1580F5j30l3P3o9j3P2qo3l9l1R5k4j8o9K00M4m2n5q0qJ0K8O8q0K6N7R1r5K6j16J04j8j44J40
1575c6M4j20l4K6Q1R0M7p1j38m2R2O4m5O0j1j88O0J90j35M4k19Q9L6M3r4P1K9J38k13O3j6
1571i5j40J08n7O6N9K8j63J91Q1N1k68K2n4N9JQ9j32J61n3p7k7J1J13r9j2O7J06j94K6J8R8
1567a6O0j72Q1K2M6k6np5J24j63L4N0m9KlJ3jO4Q2j4p2oK4l1r9K7J68k09J31p8M8p1JJ80j43
1562g6L8J09j09j21p7K35n2k6n7rK7K20j09j9pk7L0ml1m1n9J3J05q8O9ok6r4NJ18J49j59q9
1557a68JP2j6P9J17K1r0j60J14N6p1k5P5k5j2j9l2J27j45LJ17j32Prl3O2r0J66j8l7Kpk5L2
1552f3P9j70k9L7q6J58j18R7R6l6J52l08L8J80N3j21K2Jj38L5o7L5k5lJ23Q0l7J7J7j43J94
$$ y = [-106, 43, 135, 5, -37, 27, -25, -119, -117, -114, -39, -38, -13, -85, -72, 26, 183, 83, 120, -50, -176, -76, -5, 90, -43, -117, -99, -124, -109, 36, -51, 65, -65, -98, -25, -94, -107, -35, -43, -106, -145, -176, -81, -105, -123, -192, 8, 52, 10, -45, -125, -133, -123, -95, -27, -107, -81, -24, 67, -28, -2, -118, -14, -32, -176, -36, 8, -112, -146, -120, -39, 51, 98, 27, -111, -153, -61, 3, -42, 18, 7, -181, -121, 69, -66, -22, -241, -152, -116, -73, -167, -96, -67, 71, -142, -79, -95, -235, -127, -184, -118, -59, -31, -194, -3, 78, 129, -139, -117, -171, -112, -111, -22, -154, 7, -46, -123, -150, -139, -26, -125, -137, -70, 36, -158, -132, -114, -16, 44, -128, -47, -25, 21, -5, -10, -85, 39, -124, -90, -40, -89, -87, -90, -77, -78, -14, 68, 54, -18, -24, 0, -31, -130, -103, 65, -144, -13, -91, -43, -114, -113, 67, -76, -38, 71, -38, -159, -236, -1, -53, -79, -136, -145, -118, 102, -7, -26, -33, -60, -30, -34, -65, -106, -165, -152, -47, -135, -66, -72, -98, -192, -187, -69, 80, -79, -168, -167, -95, -111, -32, 85, 106, 16, -144, -30, 26, -45, -70, 5, -20, -32, -51, -83, 44, -101, -98, 19, -113, -106, -115, -148, -86, -176, -10, -28, -65, -63, -70, -95, -63, 16, -154, -183, -146, -232, -74, -192, -95, 1, -35, 117, -191, -153, 27, 80, -41, -19, -18, -156, -121, -188, -153, -178, -181, -58, 22, -15, 2, 19, -124, 70]
1548G0k33O6K2Kn4K3pR5p9Q6k3N6K0j5j60M1J1L8lM1k7N5J09j27o5oj13J01j41J7j3J33J8
1543f2n9p2O3L7M3l2J0m9R7M7m7Ol4J0O0j9j16M0p5P8J13r2m7J15M6k13J39O0r6L1k56O8K29
1538B3j23Kl7J28Rm8j69J35m0Q7qJ08j2j64Jj22K14qM8Jl9K3j4Pm5m4N8m1R3p3Mp4M4m1K4
1534i3K5N9p3k06J16J52l7NR2l1kn7N0n8NP6j77P8q4Q3o5N6j0O0o1l1n9J35m8n4k7J19J15
1529E3j53r2J41j28Knk0q9J36J34J2kj0n5P7Kl7Qr0JK20K4j36P3r3Lk1Mr7K13ko7Q1j88J31
1524C0o5J12j72Q7k05R8K3J09O8n9j20LmK8o5P0j6R5n2N6k3m0j36J04j99J63O3J3P6m6j84
1520a88P1J5K7J04j55J20r8n7M9l0O5QKM4q3K02q3k9J01m4rq1j02O2J5J43l0pr3p5O1J3o1
1515a23n8k3J90j65J05J9q9j8J2J3LJ34n1m9M0n5K4M2J15m1r1n6N4o1J53k00J06K3n8L2J1
$$ y = [70, -163, -97, -75, -73, -127, -104, -111, -16, -95, -9, -32, 24, 44, 29, -131, -90, -79, -41, -44, -3, -30, 25, 134, 7, -58, -64, -177, -76, -217, -200, -213, -80, -62, -121, -193, -130, -93, -50, -82, -72, -121, -24, 23, -24, -18, -52, -42, 18, -1, -117, -77, -152, -74, 39, -53, -100, 15, 61, -152, -13, 47, -49, -18, -274, -206, 23, -100, -98, -135, -7, 2, -46, -215, -80, -120, -33, -41, 67, 55, -109, -108, -230, -16, -24, 24, 25, -14, 9, -5, 2, -43, -87, -29, -70, 23, -50, -46, -120, -76, -117, -93, -68, -9, -82, -288, -172, -20, -57, -52, 40, 9, 7, -50, 0, -58, -53, 23, -154, -76, -160, -77, -142, -86, -96, -36, -97, -128, -187, -52, -100, -154, -181, -62, 53, -100, -192, -51, -179, -177, -182, -202, -291, -155, -21, -9, -11, -21, -76, 1, 3, -34, -26, -116, -115, 105, 129, -7, 66, -27, -24, -45, -41, -138, 75, 73, 6, 87, -101, 30, -35, 77, -95, -8, -213, -115, -92, 17, 85, 26, -94, -91, -95, -67, -132, -62, -78, 17, -35, 21, -2, -42, -178, -74, -273, -110, -47, -34, 42, -4, -188, -117, -102, -75, 29, -126, -6, -104, -161, -112, -142, -77, -69, -67, -23, -106, 96, 13, -16, 85, 41, 32, -49, -151, -89, -74, 69, 39, 32, -61, -136, -75, -62, -123, -181, -204, -14, -179, -74, -55, -144, -162, -150, -137, -134, 0, -51, -100, -60, -115, -91, -49, 66, 25, -66, -122, -68, -129, 24, -176, -70, -47, -105, -73, -62]
1510f2J5l0J08j73L9K7J2J33j1q8NJ27j93r8J15L3j57J24l4J35j30p2Q3O3J13J8j24m4l8O
1506i8O6L5o8Ml6N4L4L4r9n5J57Q3q3j71J01J53j61o8RJ22rj8r0J19n5R2r1r9J78n9j41L3
1502a27J78K5o8r9p2J29Qo6J75r1J03k16k6Q5ll1J3j1J5O2j26J53p7L0k6m4R0p8j5k1o9o6
1497b66Q9N5P1K21k88M8K8l7J20K5J0r3J96k47M5J9J28j57N5L7j1L2j37j16mJ40o7j01J85
1493b0N7P0j5j28p7J7O9o4J47r5q7M9O%r9J07N%J29j5k01R4j29J6N4j25j20J70R7n8R9O5o4
1488d6M4O1n1l7K3o6L6o3P4n3N3k8J30K1j96J28k6o0J14n7n2J29k5j39J9J37j03N9J22k71
1484a23k0O7j3Nq4J15Q8Pk15J74J24K8j94J08k0j37n8N8l8J34K24l10P3q4J6L5q0K1K8%j39
1480b10J99j59n5M8J55j57R8N0j21R6lo4m0%J38q9K9Q8j62l9O0M7lJ3r2P2J30k3J08k79q2
$$ y = [-62, -47, -77, 31, -142, -103, -76, -64, 69, 58, -30, -25, 102, -91, -189, -74, -41, -198, -74, -108, 27, -103, -175, -92, -29, 84, 102, -22, -66, -104, -98, -32, 3, -65, -61, -97, -43, -9, 25, -74, -129, 28, 111, 28, -143, -42, 111, -50, -118, -109, 13, 4, -14, -104, 15, -40, 52, -39, -138, 40, -19, -160, -127, 51, 76, 8, -91, -163, -34, -26, -92, 83, -8, 95, -121, -147, -62, -65, -96, -83, -94, -79, -17, -143, 10, -67, -37, -63, -107, -17, -95, -110, -131, -200, -266, -177, -122, -51, 170, -118, -70, -42, -79, 41, 66, 76, -17, 179, -68, -23, -4, 124, -33, 22, 59, 48, 80, -57, -173, -177, -37, -104, -205, -20, 37, 107, 92, -36, -113, -96, -27, -91, 56, -39, -126, -77, -71, -71, -170, -63, -58, -58, 71, 56, -145, -51, -180, -164, -110, -235, -355, -185, -88, -146, -47, 18, -46, -2, 59, 8, -29, -6, -72, -36, -99, -25, -78, -25, -53, 77, 98, -98, 30, 4, -56, 58, 1, -51, 78, 53, -86, -67, 70, -33, 26, 148, -123, -143, -76, -89, -84, -168, -53, 35, 42, -173, 1, 125, 153, -41, 67, 47, -90, -148, -90, -128, 6, 230, -80, -7, -91, -75, -40, -120, -99, -71, -71, -210, -11, -170, -225, -177, -22, -179, -81, -31, -152, -56, -59, -123, -163, -163, -25, -114, -85, 3, -159, -198, -138, -91, -94, -81, -173, -101, 29, 6, 114, -165, -247]
1475b47J72J61j59n4j47J89k6l6N1l9J56j41r4K88j27oR8j21P0nO3M0p5k7N3j05MJ03q7L8
1471a0j4p4Q2J36j08R1j21J24j16J5o0M6m2J5Mn7J5M9N1k6j3j17K3P0l2J2l4L2k9J73p7o5
1467e7J11j16NO0p8M4l3lLO3q4O6m3P8Rr2R0L8r1L9R2n2j1j48J05P9R5j93K3OQ2j49q5PK6
1462a14J10N7j03j7P8j28j6m4J64m7M1N6r3R1L3m9o0n5l7N2Q9K6L4j00r2K5j0J48J5j54Q6
1457a4o2m4R2On4j4n5K8K7P8p3lj33j9J17K4N7m5k6J41O0j7p0k28J30n4J09j39N2OJ01L9m9
1453c2P3N3j97n8J16j05l8J09j19J26o5j4K39k7k19%Q8o1K8J89qj10P8j25J07m9j5l6p8K2
1448a28O0oP2m6N7Km6J8k9j38J10L9j7j28n1K23N8p4o0r7J76J3n6J62j33o1O6O5o7on1j09
1444a82J01nQ3r8J5k0N6p2J3k8k6j8l0J18o7jNJ82m8O3jn8K9Q3o5l1l5o1l4j3L9LK3R7p7M6
$$ y = [-247, -75, 86, -73, -127, -274, -85, -111, -147, -96, -135, 21, -120, -214, 74, -53, -59, 39, -82, -12, -17, 46, 86, 11, -16, 37, -68, -64, 39, -48, -10, -24, -98, -16, 120, 12, 103, -18, 106, -10, 5, -55, -9, -51, -36, -32, -89, -74, -25, 26, 0, -13, -130, -107, -37, -69, -57, -91, -59, -88, 85, 8, -57, 54, -62, -57, 3, -75, -31, -64, -67, -64, -1, -85, -19, -62, 16, 25, -67, 23, 61, -30, 9, 101, 49, 38, -110, -5, 74, 169, -24, -1, 5, 87, -62, -147, -140, -114, -4, 53, -50, -67, 11, -117, -133, -177, -13, -60, -19, 37, -56, 35, 68, 19, -41, -96, -133, -81, 8, 34, 68, -32, -124, -99, -109, 39, 54, -100, -14, -76, -120, -28, -22, -76, -90, -145, -117, -90, -12, -85, -88, -221, -240, -123, -99, -42, -87, -113, 28, 88, 71, 1, -227, -97, -151, -42, -181, -129, -123, -22, 17, -32, 41, 94, -103, -161, -45, -150, -188, -79, -198, -72, -137, -151, 88, 61, -158, -158, -70, -131, -103, 86, 78, -32, 46, -79, 28, -21, -36, -72, -150, -128, -68, -74, -2, -48, 9, 11, -35, -17, -46, -184, -74, -35, -52, -180, -231, -8, 50, -24, -84, -181, -5, 8, -48, 114, -19, -80, -14, 51, -16, -22, -73, -182, -81, -86, -3, -101, -86, -106, -50, -122, -109, -137, -163, -181, -211, -93, -160, -161, -156, 26, -22, 41, 40, -18, 11, 94, 29, -2, -37, -98, -132, -145, -106, -103, -80, 17, -60, -14]
1439a4j01j5M6l5R2k8m2J5Q0k2m2M8p0O0L9LK7q1M4k8l7R5j66n6j49K68K6n3K4k7J61r6j51
1434a85J3P3o9L3nL5Ll5k5N8J28k7j31O8K6j2l0M4j06n5M2o4J19j6n2oJ53j9o1l3L6Lq9J34
1429e2m9j76J32K3N9k23J41J03r4J79M9j29n6K35j65j6N4n7K5j34J25l0j35R8J17j81R5jJ12
1425D9m8j3o8J34l7l1M4q7Q0l5r9j69L1K46q8l7k1l5M2O8k1j12M6J00q5L3L0rK0m4M7j11R7
1421h3l1J3R5Q8K5k5k65qkJ87Jn4o3P7r8M5R7j21N6j71K20L1m0j06j2J19j34Q7L6P5r4l3m2
1416a30L0L3O7p0K1j31P6j02J03q4J4l5n2K84oj35O6K3j6p8p3Q0K4O8o3k6k1J51N6n9l0n2
1411f7r0P8K5L2q4L3N6q2N6j76J08J18m1q4K2J65j27O1j16O0j24P4O2M7J0k25R0R7j9r8KJ66
1407B9k32J10N8%r2L8r4M9J3J7M4lM6l4j07n7J36l1Jj15N2J10j40M2m7J07r1R7J1JR4m2m2
$$ y = [-14, -115, -130, -84, -119, -27, -55, -97, -82, -2, -24, -66, -18, -88, -28, 11, 14, 41, -40, 4, -24, -61, 34, -132, -188, -337, -69, -43, -96, -72, -99, 62, -34, -185, -172, -99, -168, -135, -140, -105, -102, -137, -162, -104, 24, -3, -134, -66, -40, -52, -82, -38, -144, -199, -157, -221, -102, -118, -170, -176, -23, -42, -103, -136, -100, -97, -186, -52, -101, -277, -145, -122, -63, -286, -145, -42, -136, 43, 92, -37, -93, 142, -23, -39, 15, -42, -17, -151, -26, -56, -191, -93, 24, -157, -62, -63, 49, 1, -12, -80, 54, 17, -14, 30, -57, 23, -12, -111, -280, -249, -3, -91, -128, -149, -184, -142, -74, -95, -207, -161, -61, -146, -113, -83, -92, -72, -116, -69, -180, -83, -114, -101, -6, 82, 107, 82, -183, -191, -193, -6, -5, -59, -122, -45, -143, -98, -1, -122, -66, -237, -17, 14, -26, -132, -144, -25, -159, -72, -36, 39, -55, -88, -130, -100, -67, 0, -70, -49, -180, -104, -206, -103, -187, -173, -208, -260, 24, 18, -117, -51, -28, -44, -122, -195, -115, -91, -23, -86, -112, -133, 18, 74, 15, -15, -67, -157, -79, -54, -22, -106, -73, -17, -99, -43, -219, -111, 7, -34, -118, -96, 69, -58, 3, -113, -53, -177, -103, -41, 6, 16, -209, -119, -22, -41, -139, -137, 29, -203, -93, -35, -35, -127, -89, -183, -134, -121, -104, -60, -63, -17, -51, -158, -215, -79, -110, -109, -224, -172, -62, -202, -160, -207, -100, -191, -94, -83, -82, 12, -30, -72]
1402g2R0j10l4N6k5j06P8j01J47p7J52o4m5K39j28n6j39J81J2q2J7R2j17P1r5L5J6O5j07k7
1398a34L8n1R1o3ON3k50K09n9j6J27R8j19Q3M7o3P2J5q9r5J1J1l4P0Kp6Pqj07J68N6j24P5
1393d9J16L8q1q4R4j69J34j21J69j14j5L5p2N8K5l1J58j59r8O4j25P9m3K00j0m2l4j28N5J48
1389bm2o4j10J08R2l4N0P5r7q0J28j23J3P9J8K1j75O7k4O2m8Qk5P9r4M4n4m0M3N7P9n7q1J3
1384a14Q7p6o4J22K4j25J18Jq7R5o6M4k2n8j9Q9N8Mq7P2m4k2K5j33R3Q3M2k4j55n9Q9Mj9J0
1379a14n3j00P7J21P8j75j1PQR9K5p0j13L9Q7J03j22J36n4j24J19j17J14J4Q2j62o9K3J1J24
1375a7j14O8M0o8p4P0J50j73n7O6M2K7j51RJ8K06K5j68M7m2m9Q3N0j00l5O1j35p6K97j52k3
1371a75J30j66O1J53N1Nk19J52j8j71J20Qo3k1N7N6K10j32n8j82N1J11L8M7j28m6J2Lm6O9
$$ y = [-72, 18, -92, -126, -70, -95, -201, -123, -224, -77, -154, -2, -66, -111, 128, 0, -56, -195, -14, -2, -84, -67, 25, -92, -21, -116, -81, -65, 0, -107, -134, -96, -147, -56, -119, -113, -60, -310, -101, -160, -176, -49, 49, -70, 13, 60, -3, 69, 84, -5, -100, -89, -78, -112, -42, -40, -116, -109, -117, -224, -56, 0, -124, -49, 67, 105, 24, -60, 34, -135, -1, -122, 47, -67, -82, -47, -119, -61, -36, -67, 91, -68, -166, -102, -227, -148, -191, 9, -1, -43, -77, -205, -150, -2, -44, -108, -218, -110, -18, -52, -2, 73, -24, -104, 24, -99, -86, -7, 11, 32, -143, -76, -100, -38, -86, -78, -103, -24, -118, -74, -128, -168, -125, -68, 11, -46, -127, -114, -27, -103, -167, -45, -21, -146, -28, -27, -114, -19, -85, -41, -63, -121, -140, -51, 7, 11, -76, -4, -48, -70, -45, -178, -85, -2, 40, 16, -139, -198, -109, -105, -124, -114, -167, -267, -190, -69, 9, -166, -177, -170, -162, -63, -38, -108, -221, -182, -95, 8, -114, 22, -32, -156, -37, -154, -40, -26, 56, -106, -175, -152, -141, -17, -131, -63, -23, -91, -165, -95, 55, -118, -175, -109, -67, -40, -191, -182, -164, 42, 67, -101, -54, -96, -145, -62, -12, -112, -147, -86, -221, -297, 0, -152, -175, -45, -211, -150, 3, 54, 59, -160, -8, -26, -197, -77, -69, -132, -153, -96, -40, 170, 38, -20, -202, -151, -40, -2, 45, -83, -129, -117, -114, -160, -91]
1367i1p6J39m4j9N3NP3j88O6J7J3J11n3p9m2%O7k9J08o3oq9J8M8n4NL0j2L5k3M5J18o4r3j54
1362b28N5J16K04k46p1j8N0n5O8j9qJ34J1k2Q9k50O2R4Kpj12J04M7j94Q1J74J7r8m5o5k1P
1357a44J33m9q6K3Q3M1j22m6J54r7k9Pr4RP0K8l4m9j61J77J57o5K1NQ7nKk8j3j54L3K5N5l7
1352a03o7k4J52o3m6R3j20J40J22n2m3Op0Lm3Q0j95J36o3J49J3j77L2o0N2J07l3O5j93J42
1348f0L7O3j03j18J44j05J21q9JP7nk5r5RO1qJ76j27NrM6j92n7O1q0J61Q9j36R1p9jR3n2r8
1343b04J11L7k6K5%N6j34N9%J0O5m8J2K8J1Lj2j91J12N7m7m7J32l2j5k6O2o1jO6k82K05kj5
1339i2jJ20n1j6Q5j61k1Q2J65j90mJ84j04o4L3q3L4K58k50J2m6j06O3J38k18J45j2j10J6J28
1334f6Q3j26O2kj2p4M3M7p6J60j97pr2K96Pr0P2j18K2L9O5j60m0L7P1j16N2R4M3l1j59J32
$$ y = [-91, -167, -28, -72, -91, -38, -33, 40, -148, -82, -65, -52, 59, 6, -73, -115, -115, -48, -77, 31, -32, -38, -127, -109, -61, -115, -110, -80, -92, -57, -80, -35, 83, 19, -74, -228, -173, -57, 147, -99, -170, -188, -138, -193, -125, -144, -152, -18, -7, -29, 60, -190, -128, -34, -32, -39, -151, -47, 0, -194, -113, 61, 78, -20, -65, -130, -151, -144, -11, -60, -146, -123, -40, 1, -121, -167, -13, -110, -139, -132, -226, -217, -147, -119, -153, -202, -363, -186, -29, -94, -73, -68, 19, 14, 16, -12, -25, -179, -146, -121, -66, -103, -170, -194, -42, -105, -151, -58, -178, -38, 84, 32, -11, -5, -75, -72, -115, -35, -230, -94, -157, -8, 5, -172, -140, -200, -148, -41, -74, -9, -202, -60, -23, 40, -63, -181, -37, -142, -21, -110, -109, -32, -37, -62, -157, -148, -87, -95, 81, -46, -41, -50, -4, -196, -253, -192, -272, -111, -22, -158, -67, -146, -147, -54, -106, -204, -93, -56, -82, -57, -57, -1, -135, -76, -76, -66, -1, -49, -37, -9, 2, 5, -7, -198, -86, -29, -76, -123, 9, -23, -38, -64, -2, -63, -64, 2, -280, -75, -77, -92, -93, 27, -24, -40, 45, -116, -137, -55, 110, -80, -84, 100, -4, -68, -35, -118, -84, 174, -76, -64, -110, -216, -153, -15, -233, -88, -100, -210, -194, -66, 17, -109, -47, -49, -61, -135, -92, -45, -121, 39, -158, -165, -257, 39, 46, -44, 28, -90, -68, -29, 36, -124, -164, -127, -56, -172, -120, -26, 17, -14, -173, -41]
1330d1%l5rr2M4j38PJ89o3m1O8P3k0l5MR8j18O2j19K22n8M5j51O4no2P8j2j26J78L0k24J88
1325Al4R2j26j03J02q3K00p3l4J8l4j1J11J1j37j5l7J07r8kl3K0M3J16n3J12n3q7q4J49m3
1321e8j6jj48J45j6k6p6P1J84j59jO6k0o1NJ13k53J02J2n0N9J20j11J57l1j86J23J4j04R2
1316e4j57J51j0Nm2q7J31q6O4J5RJ32j32j20P7K23k06K7q5J42J48j52lJ6j39k0k0J84L3k0
1312B4j97L5J7Nj19P8J09K5k1j26R2%Jj67k1J31%M0k9p8L7JJ23o4j4Q9Q0J9j35J5m3J3Mr5
1307a71O5N4q4J43j24J8n6J17K6k0r6j33N7J61N2N5j42p1N0P5J4j00N4J03q6o6j6R7mq7J04
1303a1j0LrN4m9p9j53J49k4M6O2j58J12p8J0J40n5Q0j4j58j8J71J14j20j8p3o4m8J46k1l6
1299a09L1RQj50J00j13R1J33r7N8M3Rj27l5O4J0r8J52J06j04Rn6m0J61n6j09kM1l7J53j00
$$ y = [-41, -41, -76, -85, -177, -133, -271, -264, -75, -138, -179, -111, -38, -58, -93, -89, 9, -109, -47, -166, 56, -2, 43, -108, -44, -49, -111, -33, -45, -171, 7, 37, -187, 1, -33, 59, -67, -170, -68, -151, 49, -24, -58, -40, -74, -85, 26, 37, -100, -115, -152, -45, -143, -145, -178, -158, -115, 1, -52, 60, 7, -80, -164, -15, -58, -74, -75, -223, -78, -94, -120, -196, -125, 59, -100, -101, -35, -55, -116, -111, 2, -251, -149, -137, -187, -128, -8, -119, 38, 7, -179, -56, -42, -146, -54, -211, -60, -70, -65, -107, -194, -63, -149, -85, -70, -61, 71, -61, -181, -104, 119, -87, -60, -145, -3, 145, -7, -10, 6, -133, -153, -173, 11, 44, 24, -173, -138, -121, -116, -235, -157, -48, -23, -44, -170, -78, -78, -77, -244, -265, -134, -134, -94, -123, -201, -164, -163, -40, -104, -118, -29, 51, 70, -65, -50, -93, -80, -76, -171, -106, -52, -136, 7, -117, -99, -155, -38, -12, -32, -128, -261, -204, -43, 9, 64, -78, -149, -99, -24, -10, -110, -56, 47, -39, -105, -121, -24, -28, -115, -11, -21, -18, -27, 27, -22, -101, -254, -105, -129, -83, -21, -179, -67, -145, -135, 5, -50, 30, 16, -142, -160, 11, 125, 5, -13, -86, -150, -198, -52, -73, -109, -78, -69, -61, -211, -111, -224, -133, 0, -97, -39, 4, 13, -114, -149, -85, -75, -173, -21, 85, -19, -10, -66, -106, 55, -1, -110, -112, -71, -108, 45, -55]
1294e5j8N7O7j22r4mo9J98J5P2p6n2n1J74o5K7M2o9r5K6M9j1M2n7m6O5N0j39R3m1O3K5L7j17
1289g9m8M0k8o0Q3k7l0M6K4J32j88pJ32N8j08j28M2l6k3L8o0R0J47k0j5j02k2K3Q4M2L5k8
1285Go0P7N6Qk29k9J77j57r3R6N6J46j5Qk03K2k0J50o3k9q6R4N5M8j43N3R8K7l8n6j2O5k0
1280a0l0m8N2m1J0j04P9p4R8K0l5J1j47J87p4J25Qj43L6l0j04O8p9J94J5M4p1n7N8J83j62
1276b1mKl3n6jr2R5L5k9j6j13J46M5j23M8k3l4m3J70J53j18P4k33J53J8P0j94J06m1j45J07
1272i7k5j01K05m6J1j2J53m0j47R1j28k8P6R0j29K6P4k0J03j64j6lJ3j15Q3J47j41J02m0M7
1267c1l7J32q8lL3j30j6L2j3K24r1j37j03J51%p0p4J2O8n9J0J05N0j2oJ10k42K5J05P4m6J6
1263a1m9J82j00K6j30P2L3J3J05k09K0r%K8j6l5j13R9J5J5n4Q2Nr3p1M2P4q8J38j7O0J6o0
$$ y = [-55, -73, -16, 51, -71, -165, -169, -238, -40, -25, 47, -29, -81, -132, 42, -23, 4, 46, -23, -118, -92, -43, -54, -12, -69, -115, -50, 0, -139, -46, -87, -24, 1, 38, -79, -127, -87, -115, -175, -92, -119, -149, -103, -79, 53, -135, -142, -10, 48, -60, -188, -146, -182, -205, -167, -227, -137, 10, -10, -25, -127, -149, -126, -42, 0, 35, 7, -53, 24, 80, 88, -141, -170, 7, -150, -243, -147, -91, 55, 40, 48, -155, -133, -153, -3, -66, -95, -181, -87, -32, 16, -127, -74, 24, 51, 13, -43, -55, 10, -10, -40, -88, -36, -77, -67, -171, -92, -166, -68, -48, -83, -72, -219, -32, -106, 19, 27, -116, -80, -110, -214, -146, -225, -31, -16, 28, -43, -100, -42, 141, -21, -25, -23, -56, -112, -113, -205, -110, -75, -104, -120, -233, -87, -42, -165, -117, -140, -174, -217, -47, 106, -12, 62, -171, -18, 0, 70, -124, -18, -59, -204, -97, -122, -223, -18, -64, -53, -65, 88, 48, -99, -8, -136, -164, -88, 2, -127, -101, -27, -47, 56, -108, -124, -127, -114, -229, -146, 1, -140, -38, -78, -31, -68, 64, -24, -27, 6, -124, -140, -108, -121, 103, 12, -125, -228, -77, -77, -147, -221, -209, -141, -200, -190, -85, -35, -47, -53, 57, -185, -160, -55, 19, -27, -11, -60, 122, 22, 48, -82, -10, 23, 36, 141, -68, -48, -57, -57, -29, -45, -80, -193, -94, -79, -64, -118, -36, -31, -124, -195, -153, -79, -167, -29, -46, 14, 30, -30]
1258c0j27J44N6l14J31P2j5m9M8j2n6J49J22k11P2j8K3l8ML7j9k5k0n8J10p1L2o8J49j50j31
1254b63J10N8p2J13l6j1K61j59p5K3k4J89o0l9p7Q5n2rl0o8K35k56R8J17j39R7l0j6j7q4n
1249a36R3r6J24j17j0J85kj32mJ17J2O5k48j22J15J42j45J35Q0j22m7J46j68J9Q7k1qPJ8Q6
1245E3O4j38Q0j73J97k35m5Q0O2j6q9P1n6J15l0Q7r7j02k4J14J9J66k53J03M7O4Mp6l2M0r8
1241i8p7J20l7k34J89J16o3N4q7M9Qn1j08Q4K7O1p8jJ53Q3j81N8o9l7l8NQ5J81j27L3Pj78
1236a51N8j8j31O5J22k6J58k30P5j30K31J0n3M3J6R6j56J7j75rJ21r9J14P9p3lQ8k4k88O6
1232b07J44j92K15p2N9l2j58J60j5R4j61P2nk0q5J8M8J3Q9P4O0j48n5m1O4o5r0QR5J26Km4
1227d9m7M0j54J69P5mk51J70m7P1R9p1K0j56K35j97j1q0P2P8p5p9R9J65q0k2n3j1L8L5k3N4
$$ y = [-30, -157, -13, 43, -271, -140, -68, -83, -132, -84, -96, -152, -3, 119, -92, -20, -38, -15, -53, -49, -12, -31, -56, -76, -134, -24, -95, -63, -131, 18, -132, -263, -153, -95, -167, -54, -90, -101, 160, 1, -74, -51, -75, 114, 54, 15, -62, 23, -29, -38, -68, -136, 99, -157, -59, 58, -81, 16, -14, -30, -47, -131, -136, -43, -139, -15, -132, -142, 43, 41, -91, -95, 22, 34, 99, -149, -271, -156, -14, -159, -24, 56, -66, -113, 33, -135, -116, -29, -50, -58, -51, -33, 53, 117, -21, 59, -114, 83, -152, -197, -117, -55, -71, -160, -89, -145, -30, -60, 27, -70, -172, -196, -82, -63, 103, -150, -47, 0, 64, 68, -8, -40, 0, -98, -175, -55, -92, -326, -137, -21, -84, -30, -117, -68, -60, -111, -219, -135, -108, -47, -125, -126, 27, 110, -71, -13, -82, -119, -157, -152, -67, 114, -13, 20, 27, -151, -93, -111, -242, -177, -55, -81, 77, -153, -78, -208, 23, 33, -20, 23, 39, 135, -21, -4, -179, -188, -67, -166, -52, 27, -46, -49, 39, 15, -273, -207, -63, -255, -40, -112, -53, -85, -243, -83, -98, -4, -165, -93, -98, -118, -203, -185, -137, -124, -35, 39, 99, -49, -104, -145, -81, -146, -236, -228, -133, -7, -5, -49, -96, -56, -210, -41, 34, 30, -221, -51, -98, -27, 72, 1, 21, -135, 100, -97, -108, -188, -116, -38, -113, -192, -93, 72, -8, -30, -83, -94, -56, -21, -44, 10]
1223A0o1o3L6M3L6k56O8O2P5m6L0Mj1J24j15o3j45J81n2PJ4P6rmJ59j30n2j02J26j3J78j35
1218b8J07o1rj35k7J5P3r6k3R8o7J29o1K6J3p4J42r9J04j79L2R1N0j15O9nK5l1N7p9j33Q0
1214a11L1P1p1rOQ3j59N5q3M1O8J52k68Ol4N5M4K9p3J33p1M5J4m5Lq4O2k0N0l4kl7O3j9J69
1209F0M1j45m3q8K22p9j17J40o4o8P3j17P9P2p6M4l6K5K1O5P4j1j28j03r7J11q3M9P0J01j0
1205a8n1Q6j03L5j9o5Jj9Pj04J80j38R8L5p2J02J09j41J6LP3j01O3k9o6k2Q2j4J2N0nj9%L3
1200aj0q3O7m5O7p0n0k0K06j07Q2j23q7LM6J18K1m5l7l3L0Q9n8m1J6k8pJ01k7nL1n8Q5k20
1195a93J38L0r6J40L3j40qJ82k10Q1R6j10j37J13n7M1J1P7l8k9r2N4L8K02J12j59j54PM9p3
1191i2k0N9O4j16k3rj2rK04j15J00p3j9k4k7J48N4l9j01k8J25j39L3P7%j30J12l6J16j39j4
$$ y = [10, -51, -114, -78, -35, 1, -255, -187, -125, -50, -96, -66, -62, -73, 51, -64, -127, -272, -91, -143, -136, -122, -46, -55, -59, 100, -30, -82, -184, -58, -71, 107, -28, 79, 18, 9, -126, -153, -138, -65, -161, -184, -86, -153, -24, -85, -59, -46, -120, 22, -77, 27, -152, -120, -29, 21, -94, -25, -30, -5, -36, 21, -58, -191, -111, -80, -9, -80, -89, -83, 0, -159, -104, -187, -146, -78, 74, -194, -188, -222, -167, -123, -94, -167, -34, -105, -60, -46, -91, -88, -172, -110, -130, -80, -114, -116, -153, -90, -109, 60, 101, -44, -87, -175, 47, -32, -149, -9, -73, -141, -68, -185, -106, -34, -110, -66, -102, -77, -56, 9, 83, 72, -56, -159, -256, -145, -228, -179, -109, -8, -18, -69, 17, -86, -51, -70, -135, -134, -153, -146, -250, -70, -208, -110, -75, -147, -45, 64, -77, -61, -58, 15, -86, -23, -52, -118, -140, -58, -72, -60, -10, -15, -34, -34, -1, -11, -94, -27, -72, -5, -75, -125, -145, 61, -46, 36, -87, -174, -171, -125, -7, 14, -31, -68, -101, -71, 18, -40, -81, -65, -93, -100, 1, -26, -31, 0, -58, 27, -193, -55, -25, -121, 19, 52, -88, -96, 86, -124, -43, 53, -57, -194, -81, -138, -97, -86, -9, -47, -76, -168, -114, -76, 126, 238, 79, -75, -68, -19, -92, -112, -53, 11, -105, -128, -137, -149, -158, 46, -69, 31, -42, -61, -85, -112, 36, 90, 51, -50, -78, 47, -92, -59, 18, 18, -112, 0, -36, 80, -59, -73]
1186g3q8R8Lr3K8J66nr6l0J82M2o8j45R6j61M4O4kr4L9J37j07N0m3N5o9k14K07p3j12K52m2
1182e2K0j10J06J6k9J27j14J0l9l0K3J13p2j76P1J1K3P0m9j7N3j46K05oJ12r8k7L5r3k2M9
1177c6j27l3J09j11L6N9lk4J12l1k9R3N1j24O5j75O0N5J27q5l6m8O1Q9p8Pj21Q0k8j3L6q0
1173a42J92p6j38P6p4J27j9m3m7m7J50j50l4K24j99K00j53l2J71j55q4m8K25J5J12pm6q2N0
1169c4L3J22j24k1n2N9j33J16O4j31J1N9k9j40l5J9K49p0r6J30q1R2m7o7J06%Q0l4k17J04
1165f7k9O1Qn4L8J09j12Q7J2l2j13M8r8j36O7K0Q2M7q8P0k5nn4J81j15K7K04q2o7K3J04j01
1160A0j33J29n8J2R0n0N5J2j25R5r0pL4L2K7P5k77R9J19O7j81j7j1j85J30J73j8j91J22J10
1156D8j79J34j33J86j53R2j44k4joJ8j1J60r1j0J4M8j02%P8J62j13o8lk8j2L7J59k02k4N5
$$ y = [-73, -161, -63, -60, -153, -125, 41, 36, -60, -90, 92, 134, 66, -79, 17, -144, -100, -36, -38, -132, -93, 44, -63, -13, -56, -1, -70, -284, -77, -150, -262, -10, -52, -32, -142, -36, -20, -49, 78, -36, -26, -65, -95, -72, 41, -31, -207, -136, -125, -102, -32, -81, -98, -45, -191, 14, 8, 120, 22, -5, 30, -63, -85, -36, -163, -196, -87, -198, -162, -103, -106, -130, -18, -49, -78, 15, 66, -58, 7, -168, -108, -53, 74, -11, -47, -95, -34, 55, -23, -16, -137, -57, -85, -98, -62, -142, 50, -26, -164, -88, -162, -35, -54, -97, -144, -191, -41, -191, -225, -1, -200, 0, -153, -185, -14, -169, -253, -301, -76, -61, 51, 44, -2, -84, -34, -1, 121, -3, -24, -76, -17, -150, -34, 30, -101, -90, -31, -60, -200, -235, -216, 33, -37, -133, -3, -84, 8, -39, -106, 0, 0, 80, 46, -171, -67, -96, -35, -27, -81, -43, 66, -46, 41, 53, 21, -92, -44, -142, -278, -211, -191, -109, -62, -150, -80, -105, -110, -164, 17, -98, -71, 133, 51, -16, 7, 111, 10, -123, 6, -52, -40, 50, 0, 55, 67, -58, 37, -53, -60, -26, 6, 33, 108, -169, -70, 49, 116, -65, -82, -93, -278, -148, 25, 7, -184, -62, 48, -131, 3, -130, 56, -97, -5, -149, -173, -174, -180, -162, -173, -13, -104, -114, -100, -52, -154, -154, -76, 86, -27, -95, -98, -126, -138, -101, 58, -144, -168, -113]
1151a13N0M2m3j42M3N4m4J22k4k37K85j9p1n2R2J0j86J11j41N7J09k8K0M0%J12m1q0j9o3k8
1147a84J72j43J8l4J41J55m5k25L8j4j41P7j4Lj16L08j43j0N8j3K05j42P4q9M4J1n2n6J42
1143B5k3R2r3K5Rr4k1O9k4J03n7L0k18M8J1J0M0Pk4j9J36o2K9o2Jo4OL0J9J6M1k3k3Q2j85
1138a63k3J09J50l5r7K3mJ2M9o9j6R5q9J0J16p7n0Qm9J36j62J78M2k05l2N5J81k03J65l0k07
1134a82J12n2J47j40J2R7Ojq2o8jq6J87R2l9j8k7j06K9p5J17p1L2Q6j07k6MP3J75j77rn7j0
1129a65J59n3j58N7J50K7j83M6P1o9J88k47J30O5J6m3O8j41O9J08k14J3M2Q4L2p4p3J07mM1
1125D9p7J09j48O8k61K04j69M0J84N8r0j9OP9r6n0M8J5j08L5J07j10J09j84J14mj9N7j35K31
1121D3L0l1j33J5k8l9J14k1L2j42P4O6O5k4n8M0N0j91qKM7l4J28L6p7jr5J47l8L5k9j01J29
$$ y = [-113, -63, -21, -64, -206, -163, -109, -153, -31, -55, -292, -7, -26, -97, -149, -57, -47, -233, -122, -263, -206, -97, -125, -105, -65, -65, 47, 6, -74, -93, -156, -184, -12, -155, -137, -171, -30, 125, 80, -145, -107, -121, -262, -185, -199, -196, -312, -4, -147, -157, -99, -112, 93, -49, 25, -64, -20, -9, -61, -117, 25, 2, 94, 1, 26, 35, -59, -80, -11, -35, 68, 11, 41, -177, -129, -118, -108, -68, -61, -85, -104, 32, -30, -1, -63, -62, -126, -120, -90, -71, -55, -14, -37, -60, 22, -163, -186, -77, 73, 38, -59, -36, -40, -28, 21, -48, -64, 31, -58, -48, 68, -9, -59, -51, -100, 36, -126, 52, 94, -111, -143, -88, 93, -110, 55, 25, -182, -70, -122, 25, -115, -103, -6, 0, -1, -83, -151, -152, -238, -51, 41, 2, -16, -43, -149, -120, -195, -78, -149, -117, -31, -138, -164, -160, -87, 88, -89, -98, -155, -165, -6, -59, -217, -160, -10, 17, -166, -120, -49, -118, 70, -177, -47, 18, 34, -9, 59, -82, -13, 95, -119, -106, -64, 20, 52, -22, -95, 12, 8, 49, -28, 81, -67, 1, -260, -56, -225, -185, -1, 57, -33, -52, -46, 33, -63, -113, -65, -50, -158, -123, -16, -126, -17, -201, -87, -91, -110, -53, -188, 43, 73, 42, -91, -76, -104, -143, -29, -50, -18, -160, -86, -20, 45, 21, -37, 3, 53, -138, -146, -144, -97, -131, -3, 33, -44, -45, -140, 7, -31, 4, -25, -126, 3]
1116Cn0O0o2n0J9qN4N6m6r8J7l2j0J81n0J06k3r9r3R5q4m3K31j74o3Q4O2JR5q2n3j1J12K4
1111F9p4j20R9j73L3J24L8l9L5k0j7K4q5Q0m4Q9J6Q6k61l2R3M4L1n5j03J04O5kp2K0J1m2L5
1106d3J86N5j90RJ56j34J4K3m5o9j05L0l2R9l7k6o6J28rj6l4N2R9k8j22J67o8m6k1L7J87j00
1102E1j98Q6P3nq8M4M0k09P8J10qmJ02o5R9j07k34K09j57K93q5j18l6P9r0M5J33K3L1N1q4
1097E9o7Nj44J19j6j9k7l6K5Mm3Q3L8j68J9J50j33Q8kJ2mn4p6J21J55j86P0l2O0j69M3POQ2
1093c0j95J73m4P7j47Q7p4J19L7K4j57J84j84J10p4P8j17R2j33J10O4J2o1p5L9J39j09q9J18
1089b6k2J28j9j65p2J19Oo2R4R0j28l3J2J11J48k61j39J57K75l58J02J26l2o0q0L8J29k08
1085a30l8K4L6J39M7m8o8k0J01j10N3J22k07j6M2J52M8lk7L0j56J77p5Pr8oqJ0J10j14O2l1
$$ y = [3, -47, 13, -49, -99, -80, -88, -34, 22, -24, -122, -105, -137, -147, 34, -16, 90, 67, -32, -125, -30, -114, -157, 74, -100, -163, -79, -17, -16, 79, -3, -56, -67, 45, 69, -5, -125, -26, -199, -166, -42, -4, -43, -8, -28, -45, -21, -106, -26, -70, 19, 35, 121, -140, -172, -79, -35, -4, -59, -162, -58, 7, 5, -67, -47, -36, -78, -43, 143, 198, 8, 17, 173, 39, 53, 76, 31, -38, -143, -113, -145, -46, -83, -109, -175, -47, -56, -72, -106, -54, 45, 17, -105, 62, -6, -52, -73, -36, 151, 51, -147, -61, 12, 7, -81, -37, 3, -206, -128, -18, -26, -30, 72, 7, 106, -1, -235, -26, -183, 110, 25, -93, -129, -50, -140, -95, 38, 61, 92, 143, 59, -8, -3, -147, -28, -44, -63, -90, -126, -101, -97, -140, -57, -19, -187, -168, -18, -151, -63, -65, -53, -57, -111, -187, -66, 89, -97, -27, -59, 1, -168, -125, -118, -112, -30, -225, -52, -96, -19, -166, -79, -153, -34, 3, 27, -130, 54, -130, -20, -94, -16, -133, -41, -174, -64, 0, 12, -49, -124, -85, 54, -55, -144, -26, -48, 80, 61, -104, -176, -57, -51, -113, -19, 71, -57, -90, -78, 33, 181, -80, -219, -62, 213, -145, -43, 83, 51, -9, -89, -51, 78, -130, -168, -144, -108, 31, 78, 30, -38, -58, 43, -67, -14, 108, -99, -115, -73, 79, 127, 124, 97, 127, -29, 148, 73, 80, -18, -24, -32, -22, 88, -26, 36, 5]
1080Ej13L5L0j38K58k23nR0l1J05l2J13k55nL09j44j19P9k5J43q3Jj79k5J09k1kk5J23L3r8
1076i0R4J5n7N4q0n4L1P2j11M0n1J32j37J72L4j14k0J5l9MN2L3%o2K2q6L6J51k13J86P7L6
1071A42j51k9m6K55j40j71Q3P9p8j34J35L1k2m4j4j4oJ42k7o0q1L01k5j40p8L2J0J9n6J76
1067H9l6l2r0P7J9M5m8P0q2L6k3L1L6j55NJ02po9J4M0j3k5O7p0Q1m6jJk6n3J02r7j6j3P8j63
1062a72K57nl1K3l8m2N1n2j13PR0l1J91j27R2R3k13k3M4q6K3On5j0J15O7j93Q1J25j7p0J37
1057A24k64QJ14oj90J02M6l8P4l9O4oJ21rj8j11N8k2N9K5N4j61O3l8NL4rPk5j06J52k13lp8
1053b26J41O6mp6R9L6rj07J87p6Q8p3l4m7kJ1j80N2loN2j66J00J36o9J0N6j8J4j79NJ44OJ53
1048H1j50Jj51P3N7Q0J11j00M1o7j6j89K16p2J45j20R4j64K66k38R0L5rj00J35k6O6p7N3m9
$$ y = [5, -108, -73, -43, -181, 77, -146, -151, -61, -92, 13, -19, 94, -161, -166, 143, -1, -120, -41, -66, 77, -6, -5, -184, -209, -100, -121, -123, -148, -25, 8, -90, 4, 19, -38, 16, -64, -118, -87, -15, -126, -86, -137, -5, -142, 30, 64, -50, -70, -55, -94, -90, -38, -5, -5, -67, -45, -131, -95, 56, -157, 29, 106, 142, -9, -38, -84, 171, 31, -140, -57, 22, -56, -190, -55, -24, -46, -90, -104, -118, -124, 18, -9, -69, -150, 151, 126, -14, -92, -60, -50, -31, -87, 89, 53, 21, -69, 8, 27, 72, 24, 94, 12, 48, 25, 56, 92, -63, -58, 44, 37, -32, -18, 22, 9, -16, 51, -19, 62, 16, 15, 16, -10, -63, 39, -58, -74, -87, -9, -172, 85, 80, 49, 72, 34, -8, 43, -9, -122, -115, -25, -56, 135, 8, 100, 193, -20, -43, 1, -85, -62, -56, -111, -121, -6, 61, -132, -51, 74, 57, -13, 124, -140, -132, -18, -24, -214, -112, -66, -104, -30, -69, -5, -11, 110, 101, 83, -28, 30, 8, 67, 92, 146, -15, 48, 10, 15, 49, 40, 47, 22, -84, 68, -145, -148, -226, -85, -19, -23, -99, 0, 36, 27, -80, 107, 31, 119, 46, 12, -35, -37, -26, -206, -154, -157, -163, -111, -277, -177, -41, -110, -100, -44, -62, -48, -227, -222, -78, -72, 81, -69, -68, -219, -146, -89, -9, 102, 2, 43, -24, -40, -229, -13, -85, 60, -60, 34, -130, 136, -102, -12, 23, 14, -86, 49, 23, 89, 12, 65, 16]
1044A6L3K2P2Qj4j33J06m0k4L1L0m0j24Q2k5NK8J33j26j15o1J75m6j0O0R1o2r8L4N0j95J06
1039c1r9J25K6n0k8K9KM1p5r8J6J39r7j5K7jR3j03J4Pk9j4N4r2n7J38L8O5J46m5q7OM8O5j67
1034ij7m3%j4jk1L7J24r3K1Q4P0o0k24J73l3p8L2j22j1J22j03N1J1q6J45j6q2L4j17J13R5
1030a8K1K0p4j1L2o4j3J33R0j23L6L1j12k3L8J06o3ojJ67j58J06r5j16m1N2m0K04q8p3Q0k36
1025b39J9J94L3N5M1O2m1n3j32P1J73k38M1J14j22K7m8j49mJ19O3k1L5J1q9R1K3o6K3J21o3
1021E1J03p9j79R0q0J17nq6J34o0Q6j11J05o6J32j05o4l2P2q9m1M5L0k7M7K6J79j16j4q3O0
1016D0P5j03P0K4p3J58j44K8Q6q6O9j40K5j9j17R3R7j78P8J44j29k11L5P0J35o5K3j22O7K3
1012d7J3j4Q1m6r4l7J26Q9j26J6q3n4l6K6K04K12j57j67j01J8J33J72k9l7n6K6q6k4r3P6R7
$$ y = [16, 49, 71, 143, 151, 137, 4, 110, 70, 46, 77, 107, 67, -57, 25, 0, 5, 33, 166, 40, -75, -136, 39, -7, -17, 43, 134, 72, -26, 8, 58, -137, -31, -130, -5, 21, -29, -57, -28, -26, 15, -60, -158, -142, -3, -100, -115, -88, -89, 4, -99, -85, -78, -107, -121, -67, -159, -216, -78, -40, 25, 171, 126, 39, 45, 93, 158, -9, -26, -69, -69, -83, -84, -105, -68, 56, -37, -16, 68, 138, 78, -146, 27, -6, -84, -52, -174, -185, -63, -166, -115, -104, -190, -45, -61, -143, -109, -226, -113, -18, 3, 23, -51, -62, -30, -94, -107, 26, 116, -7, 29, 60, -52, -75, -37, 69, 6, 0, -1, 166, 8, 114, 19, -97, -138, -86, -126, 78, -10, -83, -3, -239, -220, -26, 7, 62, 103, 165, 124, 71, -61, 10, 183, -55, -14, 100, -22, 5, -43, -192, -196, -77, -14, -35, 0, 11, -78, 13, 36, -30, -7, 114, 51, 154, 75, -104, -14, -94, 23, 18, -68, 66, 6, 92, -19, 86, 20, 152, 47, -17, -49, 23, -66, -107, -62, -32, -59, -12, 14, 193, 77, 63, -20, 40, 115, 12, 82, 106, 33, 191, 47, 75, 161, 75, 144, 4, 29, 10, -107, -14, 83, -95, -17, 127, -2, -213, -178, -108, 27, -38, -15, -137, -70, -47, -34, -48, 33, -13, -107, -144, -18, 71, -55, -39, -122, -176, -212, -186, 18, 230, 73, -94, -195, -177, -44, 128, 99, 62, 6, 32, -54, -78, -171, -95, 2]
1008Bn8%q3J08j4Q3Q4l1l0j5Nk16J80r3P6l5o2r4P1m1K00l2PL0l1p9J02j65M6M0J54m4l6o1
1003c2J25M4q6p4j8K09o1K17j31n8L8j2r9j39J03nm1K25j07n2m5K10j43k92Q6o4K84l2k0J02
999A32j36O0j5M0nN0j11l5l0J60N1n9Q2j38R1Mj5j18O3j06K7L2P3K4L2j32J8o8r2Q3JJ6km7
994g0J12k3L7l7q2K20L5p5p9O3n4m1m5J04M8j62L1O2J04j40L2J0K6n3P8r4mJ60jo6Qj61Q3
989B6oP0k3n4n1o5l4j7O3Pl0J60o0jj6j3R2n4mJ0J5o4j7Q1j11J2O3j22o9K11Q0p1Q3M4Q8k47
984b4K3J94k0r7j09J05J73j30o3Q2K9j68P0m5R6l4k9jQ5j64J31j29J1j05K24j12J55j0q0j48
980i0J19J89j80KJ33n0j14n4m5P4J34r3J64J09k20N1j09k2K29j78L7m6R7l1j40m6m9P8Pl2
976g6L0J9J1P5q2j00M3R9j4l6J97j61L2J94l01J16p4M4K64J3k00k1q0l8L2%n7m6K27k13Q9
$$ y = [2, -56, -56, -139, -31, -45, 38, 122, 91, 61, 46, 51, -165, 15, -78, -2, -37, -99, -193, -122, -163, 37, 5, 12, 42, 11, -68, 34, -131, -85, -45, 109, 65, 29, -32, 93, 137, 51, -23, -41, 168, 107, 324, 193, 135, 173, 161, 62, -77, 26, 21, -20, 205, 98, 46, 1, 211, 68, -224, -138, -202, 82, 50, 30, 132, -4, 56, 41, 81, 76, 126, 15, -20, -50, 110, 161, 102, 184, 46, 137, 141, 126, 8, 71, -35, -8, 24, 97, 121, 153, 21, 39, -29, -121, -38, -37, -21, -23, -70, 42, 19, 56, 19, -63, 157, 192, 117, 38, 101, 47, 6, -39, 65, 113, -49, -18, 44, 148, 8, 40, 50, 76, 23, 101, 7, 3, 163, 162, 96, 104, -57, 26, 20, 90, 67, 13, -38, -103, -137, -154, -91, -84, -114, 46, -14, -15, -31, -44, 48, -6, -10, 0, 15, -49, -66, 15, -96, -84, -21, -143, -212, -1, 79, 8, 91, 135, 223, -24, -1, 193, 173, 76, -33, 72, 245, 115, 52, 134, 163, -5, 65, 20, 116, 82, 53, 52, 137, -27, 104, -25, -14, -119, 105, -7, 148, 138, 58, -90, 29, 218, 38, 40, 173, 123, 9, -45, -90, -16, 118, 25, 189, 298, 78, 129, 20, -2, 227, 49, 86, 40, 137, 106, -34, -80, -129, -51, -44, -76, -46, -27, -16, 59, -23, -123, -80, 19, 5, -31, 166, 5, 37, 231, -70, 46, -28, 16, 280, 293, 93, 72, -8, -46, -14, -14, -71, -117, 110, -103, -14]
971a4R8l2LN5l8lj26L3K5Q0j67L4J68j15K0k8m4K8Q2j71P5n6J12j30P7J34ll6l0K4j29J9Q0
967B5j76Q6n1K8n5Q8n8L2L5r3%Q8J39j0j03O4q6J36L5p6o7J7P3L3M1jj46l2M2J15k1J3ol3
962G6r9O3p5j4M8p2J93j25J9R0j32j9j05J82L1r2M9L9J61j48m4o2N3K1J10k7j90P3L7m2j13
957a14J68O1j31pK3Q9j0o8J01q2k0K8L5qo4P6j60K09j26K9L8J5j12J5j8J05j81R2q4J27J6
953D2o7J01n4L3j30r9K15Q2M2L1o4o1j65P1J2N3l9m7q4j16J35L0Q6N2n9J69M7q9L3M0n9j89
948d8q8Q3J03P1p9L5p1J9O8j53J63j02M9k5N1J03j2o0m5n9k2mPk6M1J25j05k2j9q7J85m7J08
944A37J2P7j27K1J38j76K6j36J66j91R0n0J60q2m8l4J49j54j9J2j73N4J03O9J9Q0j30N5m8
940@J30m2r1M7n9m5K11n3rm8k7j19J05k4n0J89K4J19n8p0k5QK4q2J44l8J2p7k4Kp9j78J21
$$ y = [-14, 84, 52, 55, 110, 72, 69, -57, -24, 1, 81, -86, -52, 116, 1, 21, -7, -51, -23, 59, -112, -37, -93, 19, -111, -34, 100, 97, 61, 31, 55, -74, -55, 25, -151, -65, -116, -88, -143, -55, -113, -81, -46, -139, -139, -51, 88, 78, -25, 39, -47, 89, 124, 48, -19, -2, 71, 104, 145, 144, -2, -34, 8, 123, 102, 115, 109, 76, -23, 40, -35, -49, -1, -73, 120, -5, 14, 104, -28, -47, -152, 30, 61, -31, 18, 57, 218, 70, 26, -36, 17, 38, 148, 121, -69, 4, 41, -1, -114, 54, 115, -16, -23, 0, 89, 79, 11, 112, 30, 10, 38, 73, 65, 1, 77, -83, 126, 0, 29, 67, 82, -30, -15, -33, 72, -109, -17, -101, 26, 42, -25, 76, 22, 55, -75, -174, 41, 123, 165, 196, 132, 71, -94, -23, -11, 42, 3, -44, -128, -244, -109, -79, 7, 59, 0, 169, 216, 127, 160, 200, 141, -48, -136, -53, 50, 121, 42, 77, 6, 25, 93, -60, 103, 1, 50, 25, 76, 179, 167, 107, 62, 3, -19, -23, -16, -42, -1, 124, 19, -3, -22, -109, 76, 29, 137, 149, 226, 99, 120, 258, 82, 108, -28, 138, -53, 37, -13, 147, 65, 17, -17, 132, -22, -41, -29, -202, -148, -45, 24, 43, 123, -7, 48, 0, 130, 88, -3, 44, -15, -60, 151, 98, 89, 41, 14, -105, 0, -24, -74, 115, 139, 258, 200, 130, 105, 113, 137, 55, 199, 161, 173, 96, 72, 74, -5, -183, -62]
935f2J27j29R1P8j15J78M0p6L2N4j08k8p2p0R9l9O8L1m8R0o2J02K35l40j10l0PJ86N3q7p0
931B5P0j34K17Ql3j46J14K4O7rj56l1J50j01R5j4j25J48j43n3O6l6m5K5QQ7j23O0R4p5jr8
926f5M8j9J33p3R5j47n4J3O0l0J07J00j37Q0Q8lk06P8J4J38o5j01qN4m8n0J96j26K9j27j4
922d0P4k1K7j07J05l4J19k6k3l2q5K05j35J12j49K40K3n6L1j12p5R9oMQ3J00k7n8j55L1O8
917A80J16j04Km1L7j17p8j77L62j10m3K36j16j07J2L4R9k8P8j05j25O5m4J28j72J71J19j00
913A72j21J09J26j01R3k44Q2l6M6q2M2Q5j10N0j03K31rj16l6J31j39L8N1j78J83l8q4J09j9
909A32J94oN4l18R5j55J71n6p8M9K1r0n1Q9pOR1J02j48J62j40j17M2O5N2j17J9l3R5p9L9R
905I2K0K2q8j28j1K27m2M9l32K83J54l9p1r7O2j39J03Oq8ql9l3J50l7o4J28M1k5L2J74j59
$$ y = [-62, 65, -64, 27, 105, -10, 168, 208, 132, 164, 218, 110, 82, 10, -60, 39, 0, 68, 99, 51, 141, 79, 181, 416, 76, -34, -64, -57, 129, 182, 95, 25, 95, -39, 178, 186, 153, 7, 121, 145, 212, 203, 47, 16, 166, 65, 160, 146, 21, 169, 26, -27, 39, 3, -42, -17, -9, 78, -45, 15, 109, 34, 33, -65, -17, -36, 97, 24, 119, -28, -82, -69, -9, -39, 68, 168, 31, 111, 199, 196, -10, 68, 82, 220, 155, 54, 46, 100, 52, 2, 198, 72, 101, -26, -40, 34, 13, 40, -67, 38, 4, 123, 97, 74, 42, -43, 162, 27, 139, -10, 230, 253, 197, 228, 116, 41, 140, 134, 138, 221, 321, 294, 236, 81, 112, 180, 296, 192, 194, 153, 190, 73, -5, -182, 180, 70, 27, 263, 147, 40, 52, 86, 185, 157, 235, 130, 5, 70, 26, 154, -18, 153, 272, 172, 51, 160, 286, 185, 278, 34, 116, 80, 126, 44, 86, 171, 61, 111, 8, 239, 230, 114, 78, 209, 70, 108, 159, -19, 164, 126, 42, 151, 132, 326, 320, 374, 56, 151, -4, 167, 111, 33, 82, 103, 13, -38, 51, 44, 50, 141, 243, 95, 257, 117, 0, 42, 107, 159, 42, 61, 28, 123, 44, 83, 92, 112, 134, 46, -82, -93, 134, 92, 141, -191, 92, 246, 207, 136, 39, 101, -38, 65, 71, -17, -25, -64, -97, 53, 16, -48, 80, 121, 96, 128, 302, 143]
900A43j7KP8P8k5j26L4l1J6l4o3M8K8j50J14l8j17P5m5J2J48Q3j59n5Q5l3M3m0J28q5O1k3
896A35P1n0l4J9j24Q1O5K1j09J14l5m4m5J15k0j75j1M8R3k14J89o0k9L2l3q0J27L7J56q4j13
891D3k6J02j2n0O2J19k37J27P9q7m2M8j31L5j2J18j60L5j17J53r8M8o9j58K16l1Q5j79J48
887IL6N3ok68L0J69R8j9o2l3O3j32j34J89J97j37R1q7m7L1K55j12q8o7J17j58j23J29N5N1
883A00K6j7j08j6r6l5O0J03J37m5Q0R1j81j46o9R7J39o4j44K5j0P5q1m8J27J20j90K00l3L
879A00N9p9k8l9m0o2P3J12q5m3J67m9p4J04N6j22M1J26j21rJ80q6n7P3l5K4n5P3rj26J31k27
874b7oJ49r4J54L3q8l8O8k3j28o9M2q0J09n2%J52j70q0K76pJ7Po1oJ47P0j23m1K1j51Rj41
870a31J66K47k59O3j14P5L3O4J25k4L4k2k31J34K37k6O09k71j25o0r4j44M4j7l4j31N5j9q8
$$ y = [143, 126, 128, 206, 284, 259, 133, 167, 136, 152, 118, 55, 103, 131, -19, 95, 57, -60, 15, -30, -18, 130, 213, 54, -1, 84, 51, 94, 54, 182, 97, 158, 135, 206, 156, 122, 141, 17, 98, 163, 184, 75, 189, 154, 110, 65, 180, 160, -15, -26, 22, 115, -99, 90, 30, 1, 33, 0, -80, 47, 84, 240, 156, 43, 17, 119, 107, 57, 119, 238, 1, 128, 207, 120, 78, 126, -5, 30, 18, 136, -24, 11, -106, 47, -51, -3, -72, -230, -14, -45, 40, -139, 9, 45, 98, 92, -176, -146, 23, 121, 102, 40, 7, 70, -62, -196, -7, 190, 53, 144, 57, 10, 41, 296, 184, 96, 29, 146, -12, -135, -6, 49, 100, 126, 109, 1, -15, -111, -146, -86, 17, 154, 109, 189, 280, 99, -47, -116, -19, 120, 56, -88, -63, -73, 2, -79, -127, 0, 120, -70, 130, 97, 100, 159, 80, 52, 13, -27, -89, -16, 96, 11, -32, 135, 86, 12, 116, 172, 50, 91, 217, 96, 87, 267, 181, 124, 197, 162, 186, 131, 204, 195, 69, 200, -27, -33, 116, 22, 176, 209, 121, 83, 151, 128, 0, -69, -27, -107, 2, -50, -50, 102, -68, -148, 128, 121, 138, 145, 84, 78, 225, 295, 172, 131, 152, 1, 10, -131, 35, 282, 23, 86, -28, 47, 80, 144, 269, 245, 279, 257, 26, 160, 397, 371, 980, 709, 584, 524, 430, 286, 330, 313, 279, 148, 203, 184, 96]
866I6m4O9Jl1L2K1K5j46J14j39k2p7J3Lj6P7Lj8p3J75J6L8L8p0j01q0Q1R9L5J37p1j0Qj55
861B8M8j46Q4j4O8Q8k4k61J73L2n9l2r8J24o4J35J09j7j39m3M8km5j27J15q4J38O3r8%N8r
856D9P1J96O5j24q0N2j48m0p8n9J68j39p1P6p7K25L0N3%p3Q0l8m5J91N1p0j99J17n6l5r0Q7
852H9J04p8K5O7M2j1l3j3k28J31m6K3J33J4j20J62q0j34p5r2J00O5J7j56k2P0m6P1R1P6n0
847I6J23j4J79M0j30l3l1k92O3J60K5o9j12N3l9K29j79J26k18j19J23M2j6J11MJ4l4M9Q4j36
843I9L2N2%k3N1k50K4J46l13N7m9K33j46N6Q3j45O5O3j96R3K2P9k06J75J78k60j42oj0J19
839a19lp6J57q0RJ8J3L6J1J36J86q4q2l1J00k28O0j83K12n8mK46j60L9kP6Q1j53J01q3KL9
834A76j50k4k3O4L8o8l5l9K55J80q2RM2k8on6K6k8l4j57k7qR2J09l10P0r6m2J92M8O3M6K7
$$ y = [96, 52, 121, 122, 91, 123, 144, 169, 23, 137, -2, -24, -101, -88, -85, -101, -24, -21, -39, -112, 63, 79, 117, 155, 85, -16, -96, -15, 84, 119, 256, 185, 175, 183, 28, 76, -70, 14, 0, 68, 156, 132, -129, 44, 76, 17, -15, -113, 11, -53, 82, 191, 174, 35, -8, 40, 38, -7, -134, -19, -103, 35, 98, 0, 0, 58, 49, 120, 316, 381, 257, 177, 229, 81, 41, -37, -96, 72, -67, -138, -62, -139, 86, 116, 169, 169, 96, 176, 138, 93, 284, 335, 265, 66, 183, 127, 92, 2, 89, 193, 115, 140, 207, 249, 238, 205, 192, -36, 95, 49, 72, 205, 219, 99, 261, 181, 47, -28, -120, -20, 45, 62, -94, -116, -46, -92, -21, 70, 146, 96, 219, 205, 384, 424, 294, 261, 230, -62, 1, 161, 186, 117, 5, 58, 19, 248, 69, 195, -23, -142, -19, 23, 7, 118, 122, 136, 102, 151, 235, 99, 131, 183, 183, 160, 211, -39, -15, 131, -182, -125, -174, 59, -87, -31, 52, -93, -28, 35, -161, -68, -46, 33, -173, 2, 180, -80, -222, -228, -238, -119, -122, -198, -41, -121, -112, -94, -81, -45, -34, 102, 288, 204, 122, 91, 191, -37, 23, -160, 52, -6, -10, 236, 76, 115, 113, 189, 270, 117, 218, 135, 137, 176, 26, 2, -21, 43, 81, 13, -22, -61, 194, 374, 292, 301, 343, 315, 309, 253, 279, 251, 217, 60, 33, 25, 117, 226, -84, -14, -110, -152, 40, 88, 151, 197, 224]
830B24j32l7J41o6k4R1R1j42j45J65M1kL5K71L00Q34J259j248q00k98o4qK7m4j96Q6l7n9K4
826B87j96O9k1k4k12k18Q0K61L7k68K26q0k6J87p7Q6l2J26J19j33l4o3j11J71j27j83O3l1
822a24R4j19k1M4J49P7j00Mlj34N5J24N1rj84J12L1p2P9O9R9k32Rl04Q7NN6J39Q4l4j13J08
817B7J7r3J12J37p5j04j30m5%K6n5Q4J72J59j7j6r1P2Qo5J90n9M8j2k09J03q0Pj6J35o7J0
813A73L3k32q4J34J52pl1r0J75J8j44j72J10k5p6J01P5n1L9m3O5k9J70o4k93J02K99pJ2k6
808B84j45J86j52q9K05KN1q3L3p8j39K21K56l43m5M9M8q1j29m9r7o1J4J03J52mj6J4m0k4n1
804hm0L5K20m2R4o0l8QR5k23J84j9l0j08j07J52mk45L1P7n2J50r9K53q9m9L1Lp1r3N9j35J0
799a10P3J35p5m7P9j27Q9j12N8K11R7l2j2j63m7K1J3j88q3J95J43k5om5l7Q3k05R5j08K26
$$ y = [224, 92, 55, 196, 130, 106, 197, 288, 146, 1, 166, 207, 205, 240, 511, 811, 1645, 2904, 1656, 856, 558, 494, 486, 513, 469, 273, 359, 322, 263, 287, 91, 160, 139, 115, -97, -315, -235, 26, 63, -205, 21, -59, -85, 102, 25, 111, 79, 205, 324, 191, 157, 94, -17, 154, 27, -156, -93, -124, -30, -149, -170, -126, 23, 100, 0, 4, 1, -133, -78, 46, 97, 88, -96, 16, 47, -25, 54, 123, 222, -10, -1, -305, -218, -213, -157, -18, 66, 32, -81, 27, 44, -49, 63, 200, 125, 21, -109, -154, -154, -128, -183, -99, 73, 232, 215, 199, 108, 180, 188, 123, 313, 254, 302, 290, 81, 184, 104, 111, 95, 230, 163, 173, 206, -26, -110, 24, 176, 169, 138, 48, 223, 241, 97, -75, 35, 10, -66, 35, 110, 59, 98, 55, 120, 91, 261, 197, -96, 6, 305, 298, 310, 284, 139, 325, 173, 84, 289, 291, 342, 259, 292, 214, 75, 296, 552, 209, 164, 213, 261, 180, 51, 2, -95, -156, -142, -39, 113, 109, 93, 107, 67, 43, -8, -48, -13, 207, 165, 259, 199, 161, 169, 264, 41, 225, 206, 176, 68, -39, 113, 109, -136, -105, -28, -80, 70, -29, 224, 135, 86, 117, 120, 49, -44, 15, -120, -110, -37, 98, 23, -24, 55, -72, 17, -95, -37, 174, 271, 239, 227, 64, 17, 38, 51, -137, -220, -25, 118, 93, 87, 42, 5, 88, -117, -22, -130, 96]
795I6j08K04O5m8L9J25o6j24j14j90j01J51L06K19k25j57o2J9l6p6J1J43K64k5Q3l13J7r7
791@k06l7J5j0J19J27K4n9P5L6rN3j42j11n5J77J64J44j51N2oj64M1j25R3J79N6k64o6O7N2
787F9n2j53M2L15J26p3k51j31J79kmK47J26Q0j54p0j78j05J01l7j8p5j17k6OO1J06l42N3J88
783h9l8k04l7K50P4J73j00K1N3L9j03o8l6Q4K98j55p6J16r9K5L4O9K0J66k40j52q1N5M7j59
778a13N9j63l9jM0K83Q2Jr6P5N3m5N6m1p5Q4j54J08n9J6n4p9K2Q7n5L8jrk5O9q4P7k59n3J
773b54J70J12j50O7l4j65j45N3j53L8p1L38Q2k4Q8P2K14r0j1m9q9J17M7k12J13l9R5j82j10
769a72j8j28K72J18k07J76K20j7j31j47k62K44N8P0q5J7o5k65j9J15J46R8o5k6J10k39J07
765i5r6k0j19q6n2K1J11K81K2p1O9J87j45k23L14K70J0n0O4K3J03l2j93k33l5j45n7k37l7
$$ y = [96, -12, 192, 257, 209, 248, 373, 307, 183, 69, -121, -222, -71, 235, 454, 229, 72, 10, 29, -7, -83, -72, 71, 335, 310, 393, 80, 97, 0, -206, -243, -228, -238, -119, 8, 32, -27, 48, 84, 75, 128, -14, -125, -180, -3, 161, 305, 154, 206, 200, 36, 77, -48, 45, 224, 280, 16, -50, 17, 69, 17, -136, -94, 221, 347, 274, 23, -108, 71, 69, 65, 312, 438, 518, 364, 294, 116, 11, 112, 75, 57, -18, -135, -161, -155, -94, 12, -330, -277, -89, -127, -331, -368, -118, -44, 129, 29, 50, 103, 142, 39, -29, -65, 19, 317, 162, 86, 202, 103, 128, 162, 231, 251, 417, 177, 25, -56, -1, 46, -113, -54, -217, -256, -257, -217, 66, 148, 149, 53, 128, 181, 136, 192, 151, 76, 160, 6, 114, 55, 71, 17, -62, -40, 47, -8, 30, 29, 20, -5, 64, -20, 57, -202, -255, -254, -84, 28, -122, -55, -89, -254, -399, -346, -499, -461, -532, -194, -112, -136, -48, 24, 238, 148, 137, 88, -1, 116, 163, -49, 64, 25, 120, -62, -172, -190, -318, -46, 72, -135, 41, 261, 244, 113, -34, -296, -52, 6, 76, -9, 8, -57, -322, -341, -226, -80, 18, -47, -73, 37, -202, -95, -191, -211, -330, -416, -468, -447, -336, -55, -33, -104, -35, 152, 7, -216, 98, 368, 378, 328, 392, 415, 518, 486, 293, 60, 25, -120, -177, -414, -451]
761d51P3J69j49m6m4L90K58J4o9j02j50J47k7o5j66L9k2j18J68J04Q1l7l2J25j75J60K44l7
757B82J54NN9j14J45J83j54k1k20j8l66j69N1J08q9j17J1q5%K04NL4m1J14J26K6J38K95j89
753C57k09j92K95q0M4q1P6l26j00J71k7k30R3L8J31J23K22P5L2j10K0j56R6O1j37J24j31m7
749A32j18j85j16J74R6j26m1m8k05J71j7j1R7m6J13K15qj72R5n8o5r9J76P4O6J46l9j4J08
745B95j62J02n3L3p0j24qR0P4J08n4o0K8oJ84j00m69K01J72j46p4k00j40K77M9r9K5j30j07
741c64r2K49QJ87J24M9J63K5nj22J57q1J8q3k39j4l0R0j80J60j2J59q0K8J8P3K47k58J39j03
737B31J26k22N2K7J72j62K04o0j30lj31j31q7J27K58q2j38J32J08K51m8j58j9Jj15j36J28
733A95j27k1j52l7l1K17j3p9J58L23j49n3J96J24q2j21k41r5j2L78N2J2LR0k81j52o4R8K11
$$ y = [-451, -378, -209, -358, -404, -448, -58, 200, 214, 145, 43, -107, 40, 13, -52, -218, -179, -201, -319, -151, -47, 34, -3, -35, 90, -85, 75, 319, 282, 436, 441, 500, 386, 531, 714, 560, 539, 319, 301, -65, -234, -183, -75, -164, -281, -270, -355, -355, -151, -146, -112, -153, -39, 87, 113, 251, 546, 357, 148, -44, 251, 171, 215, 134, 210, -116, -216, -45, -72, -302, -209, -171, -40, 83, 305, 380, 412, 302, 322, 166, 262, 323, 186, 310, 179, 132, 14, -171, -287, -113, -17, -143, -184, -232, -437, -266, -283, -294, -197, -243, -130, 85, 77, -95, 0, -58, -123, -222, -46, 28, 94, 240, 201, 187, 295, 133, 235, 182, 215, 145, 21, 13, 103, 177, 285, 231, 171, 199, 193, 377, 277, -192, 9, 181, 35, -39, -239, -379, -102, -53, -152, -127, -257, -364, -456, -207, -199, -12, 112, 161, 324, 349, 344, 222, 379, 298, 316, 233, -6, -20, -50, 40, -140, 20, 8, 167, 87, 115, 133, 206, 453, 195, 334, 231, 357, 135, 187, 214, 386, 224, 428, 368, 238, 235, 104, -27, -114, 13, 271, 189, 51, 183, 291, 542, 494, 336, 317, 318, 203, 67, 195, 68, 47, -105, -142, -173, 44, 31, -48, 110, 433, 284, 231, 427, 551, 469, 348, 107, 12, 0, 378, 430, 442, 445, 535, 254, 102, 38, 136, 347]
729C47j74o9j56Q3P6%K6L6L13Q8J26J40Jj53j01L2lK62L13K27M55J336K088m16k050r85n07
725A335m16j59r4RJ46K07j77l2j2j55j72K1Q6M8l09J1j52j32kJ72N3J18J97o1j5R8K11Q2Q2
721I88K06K91k3j2L86N52J646J483j774j754n56m41l91k8k10J69J90QN8o4j26j03j03J7J30
718E39J85k86j07l3K02J43K3j4j02K0k53k32N0J39P4M80l6Qj21j29j09j1m2K94K5k53p2p5
714C07j82L4j58L81K69J30j20k25J42k40j80L1J42Q9o9j18J73LM1j68j12N5K0q1K52k60K22
710C78m7R2K5J7K10oj39K05J61l40j48L8K87M9K66L69N03J291K043J16k042q49n87m96k00
706A196O1J58l42l10l07k32M2j58K7j48J66j8j28J22k37J8J9K26J55J52J40r7k25K77r3j31
703C33K77J38K23J19N04K92O42J366J655j380j700j051o10l51J73L1K15j77L0j89n1L0j12
$$ y = [347, 173, 104, -52, 31, 107, 107, 133, 169, 482, 570, 696, 836, 837, 684, 583, 615, 612, 874, 1187, 1414, 1869, 3205, 5293, 4877, 2827, 1842, 1335, 919, 760, 666, 675, 821, 1028, 851, 819, 807, 652, 480, 501, 587, 635, 326, 337, 185, 53, 51, 223, 276, 394, 591, 530, 515, 613, 824, 906, 988, 1194, 1485, 1462, 1450, 1836, 2388, 4034, 5517, 3743, 1989, 1433, 992, 601, 573, 363, 532, 722, 730, 788, 724, 598, 495, 392, 409, 539, 724, 438, 331, 298, 500, 643, 666, 652, 550, 570, 317, 85, 135, 274, 348, 828, 792, 800, 679, 550, 441, 430, 388, 682, 707, 454, 382, 307, 125, 159, 1, 382, 651, 781, 661, 436, 578, 338, 158, 189, 331, 420, 351, 233, 406, 409, 450, 282, 170, 225, 245, 164, 416, 156, 378, 331, 423, 448, 465, 675, 669, 530, 735, 896, 556, 408, 446, 733, 782, 1048, 1417, 1920, 3211, 5254, 5370, 3328, 2479, 1892, 1396, 1196, 1257, 1415, 1073, 763, 456, 224, 266, 108, 135, -13, 153, 135, 7, 129, -108, -90, -71, 155, 310, 462, 602, 505, 280, 557, 464, 333, 610, 748, 971, 1090, 1594, 1886, 2528, 3894, 5549, 4169, 2469, 1418, 808, 457, 630, 661, 876, 699, 729, 540, 489, 519, 407]
699D07lJ27JJ53j75k0j38J05Q2J71j04R2m6k77R1j15K03m4J48k2R3J13r4l1r7o2RJ30J50k13
695F34k31j03K06n7N9J73M10K21k2k5K75L81K76P98L05M34L06K73J28J20j24l59n14o24j81
692B759k44l22m13j58j33j14j78j70j24q9P2j16J4n9j24j1j04K22J4j29J40K67K22k69k34
688G19l06N0J51M11M71J84L7p8k25r0l0j4R1J12K4K29J56R7K23L44J09O44J044L097K138k885
684F703k344j411q28l62l45QP6J69j15R4j03j38j18K7j11J9o4J96K66J79J22j27k51j03k14
681A225J43q6N1J91J0M9K35r2J65J97N24J155J722L666m03k457k412j259m35m23l08K37M28
678B123nm4j0m1J5J99J08M4P2J97J42l11q3m5M19M41L75k56j10M00J32L65K63L45M49J38R5
674E417j74Oj15k47m53k26l05n27j59m7Pj92N7j55j36p8k09O3J85J4L01L3n9K72M6l58j47
$$ y = [407, 404, 531, 532, 685, 510, 490, 352, 457, 539, 710, 606, 698, 652, 375, 466, 351, 554, 510, 658, 636, 729, 842, 748, 717, 620, 558, 567, 697, 847, 634, 403, 300, 506, 449, 508, 681, 1091, 1312, 1290, 1265, 1540, 1921, 2197, 2995, 3300, 3734, 4040, 4313, 4441, 4561, 4437, 4078, 3564, 2940, 2759, 2515, 2193, 1780, 1622, 1489, 1375, 1197, 1027, 903, 814, 886, 770, 784, 725, 601, 590, 486, 708, 722, 593, 733, 1000, 1222, 953, 719, 413, 463, 614, 1025, 1496, 1680, 1717, 1639, 1414, 1324, 1294, 1280, 1371, 1483, 1507, 1736, 1892, 1989, 2212, 2556, 2665, 3309, 4353, 7450, 9588, 6703, 4359, 2948, 2120, 1758, 1413, 1421, 1497, 1666, 1551, 1645, 1542, 1404, 1286, 1313, 1202, 1221, 1157, 1353, 1619, 1798, 1920, 1793, 1542, 1439, 1225, 1368, 1282, 1333, 1524, 1534, 1583, 1818, 1726, 1891, 2088, 2612, 3767, 5489, 9155, 8752, 6295, 3883, 2624, 2189, 1766, 1458, 1695, 2123, 2118, 2074, 2064, 2023, 2038, 2237, 2345, 2389, 2461, 2658, 2800, 2489, 2406, 2361, 2780, 3221, 3596, 3340, 3230, 3630, 3762, 4127, 4390, 4735, 5184, 5322, 5417, 5243, 5249, 5134, 4887, 4434, 4208, 3903, 3376, 3217, 3170, 3177, 2985, 3042, 2887, 2751, 2673, 2464, 2527, 2712, 2726, 3027, 3060, 3001, 3273, 3319, 2961, 2814]
670B814J68L03K85j66k71J68L19M32K22J48J37M1J36k91k59j95K62O11J55K05J9K11K95N37
667F286L00O37R76K457L069k298k349j406k85o1J16M32M02N86N28M46O34J048J011J114J239
664A4882J980K560K853L992M867O548R401J3185K1086L6388O7921J48413L59566L53993l83457
661F64178l47368j46353o4111l2389j7925j0005n957l176K46q79l111k566j757j376j937k599
659B2915j938j532j337q94m13k14L75M86P96J614J565K209L158L823N163P398J0939J6277
657G0390K7553M8072R3351K17833M36350K9002m45540k41248j00863m7196k5229j4147q575
655C9753o365m679l032j816j092k10J1J39n50j144j603j679j617j411j358j614j193j114r46
652H480j069r94r73l89o26m29j07K68j83N0k16k20j95K54NJ7n6l80l66l27j84Q2L31L26K24
$$ y = [2814, 2982, 3285, 3570, 3404, 3133, 3301, 3620, 4052, 4274, 4422, 4559, 4600, 4736, 4445, 4186, 3991, 4253, 4864, 5019, 5224, 5243, 5454, 5749, 6286, 6586, 7223, 8199, 10656, 13725, 11427, 9078, 7672, 7387, 7326, 7442, 7874, 8276, 8862, 9390, 9836, 10470, 11518, 12529, 13643, 14882, 16862, 19422, 22275, 26267, 31134, 37682, 47083, 60268, 81354, 117742, 185663, 334076, 693642, 1047635, 664178, 316810, 170457, 106346, 73957, 56032, 46027, 40070, 36894, 37140, 36261, 33150, 30584, 28827, 27451, 25514, 22915, 20977, 19445, 18108, 17214, 16801, 16587, 16962, 17448, 18244, 19858, 21423, 23632, 26790, 30613, 35776, 43174, 54113, 70390, 97943, 146015, 239366, 457199, 893549, 922551, 477011, 235763, 134900, 87704, 62475, 48328, 39753, 33388, 28709, 25677, 23861, 22769, 22559, 22570, 22709, 22159, 21015, 19412, 17733, 16116, 14705, 13347, 11733, 10540, 9426, 8480, 7411, 6417, 5444, 5055, 4429, 4000, 3893, 4161, 3978, 4028, 3812, 3592, 3397, 3651, 3656, 3673, 3617, 3237, 2871, 2544, 2360, 2442, 2773, 3099, 3323]
649C323O62M11j35k71L83O81K79P3j40K8O0k04P5K27P39K18N64j10L28L01O16J109J287J201
645A1705J341J485J908K113K855L739M919O474R195J2444J9577L3038N9770J24027K91108
643E85698L95406k29630l78103j76280p7780l8549k0899j2457p916n754l787k170q63m7O2
641B6931j40r99j495j653j724j587j175n51J1J25K74J080K052L120M312M555J785K603O507
638D4031J0222J4940K4690M3197Q0856J79346L87018J85690m12527k84334j21430n5647k9232
636F6820j6693j0144p288n408l850k250j052k0M85M64K66J42n80j398j936j393j337j877j654
634A1297j232o40M3J103R14l02l522k540j006o39l67J24Lj97j5m3J78m8J80k03l76k73j49
631B290r0J45J15J28K19K68l36l72j43L98L09J66m4q6J44M94k00j86n1J10n5k61n01j75j08
$$ y = [3323, 3985, 4396, 4261, 3990, 4373, 5054, 5333, 5406, 5266, 5294, 5354, 5150, 5225, 5452, 6191, 6409, 6973, 6863, 7191, 7492, 8108, 9217, 10504, 11705, 13046, 14531, 16439, 18552, 21407, 25146, 30065, 36539, 45734, 58178, 77755, 110793, 170563, 294590, 585698, 981104, 751474, 373371, 197091, 119311, 80762, 59863, 47406, 39490, 33736, 29949, 27779, 26916, 26869, 26931, 26791, 25792, 24297, 22644, 20920, 19333, 18158, 17607, 17618, 17743, 18017, 19097, 21149, 24269, 28581, 33136, 34921, 37524, 44031, 54253, 69193, 93883, 137080, 217936, 397282, 784300, 969990, 557463, 273129, 151699, 96052, 66820, 50127, 39983, 32695, 27287, 23437, 21187, 20135, 20115, 20600, 21064, 21330, 21472, 20892, 19494, 17558, 16165, 14828, 12951, 11297, 10065, 9425, 9468, 10571, 11485, 11183, 7661, 5121, 4115, 3476, 3109, 3233, 3236, 3039, 3024, 2981, 3159, 3111, 3291, 3088, 2712, 2439, 2290, 2200, 2345, 2460, 2588, 2807, 3075, 2739, 2367, 2224, 2622, 2931, 3097, 3053, 2967, 3111, 3605, 3405, 3219, 3168, 3278, 3223, 2962, 2461, 2286, 2178]
627B178j42P7j17J33J64J24j02J57L03N9K05o6o6j81j16k46K1p3q2m0R3J37k71r7N4K84K93
623B683J05m31j19L48k0J04J04K97K27N2j07L58J05J49N50M89M2M58N62J328J959J890o89
620A0444k408n83K78N59Q45O09L38k17m56o58r19q66m75l11k15k37j94J83K76O30N55R53J025
617I156N69O00P49N04M25L42j13j55K96J31q4K54O12J162K340K534J214k216j516j74L06J022
614A7958R75J343J795K284K273K320J965J780K665M730J2274M1061J3601m5097j4260k688
611D4979K75J276J376J505J375J677J438J261O12l45q03j189j740k162k512k749k662k567
609C9045k351k221j993k056j874j759j494j136j343j038j132n51j135r58p80l67l84j35j32
606A6206M43J731L820J2172M1970M724m5450j5295n080k207j197o21n85m77j88m42o04k05
$$ y = [2178, 2036, 2113, 1996, 2129, 2293, 2417, 2315, 2472, 2775, 2834, 3039, 2973, 2907, 2726, 2610, 2364, 2385, 2312, 2230, 2190, 2283, 2420, 2149, 2052, 2106, 2390, 2683, 2788, 2357, 2238, 2586, 2566, 2670, 2774, 3071, 3298, 3350, 3243, 3601, 3706, 3855, 4405, 4894, 4936, 5394, 5956, 7284, 9243, 11133, 10444, 8036, 7453, 7731, 8290, 9135, 9744, 10082, 9865, 9409, 8751, 7832, 6966, 6491, 6180, 5965, 5728, 5534, 5717, 5993, 6623, 7178, 8131, 9156, 9725, 10325, 11074, 11578, 12003, 12345, 12232, 12077, 12373, 12504, 12420, 12674, 13286, 14448, 16788, 19322, 20536, 18320, 16804, 16630, 16936, 17958, 18933, 20276, 22071, 24355, 26628, 28948, 30913, 32693, 35358, 40088, 52362, 93423, 107024, 61927, 47667, 44979, 45254, 46530, 47906, 49411, 50786, 52463, 53901, 55162, 55774, 55429, 54626, 53437, 51697, 49535, 47023, 44274, 41612, 39045, 36694, 34473, 32480, 30424, 28550, 26791, 25297, 24161, 22818, 21780, 20648, 20097, 18962, 18004, 17224, 16857, 16473, 16338, 16206, 16649, 18380, 22200, 34372, 76342, 81066, 35616, 20321, 15241, 13034, 11837, 11216, 10631, 10154, 9966, 9524, 8920, 8715]
604H715J18j95l4n2O4l40j26l7L03K86N21R8K38J69Rl31j77k13k7J32j57J62M7j48k29K59
600I055O9J36J20J12P5J0K15L26L25N01M58L75M21N60L90N11L63J95K44K44M18N05P45R00
596A7273J660K790M85j332m38R2N03O76P74Q83O79P01Q73R17J034J336J524J352J617J647
594C5046J655J855J620J618J384J364J569J040M62K14J24m24j055r71j200j471j810j998k090
591C6932j903j390l98l87l023l517k357j900j272j793j138q70q09o47p23j035n04q61p40m89
588A1176n43o56l31l28k38j10k9k86n40k73n48n06p7j96k05j01J78J4j30l68j83k05k82j47
585E086J6J34j68j17O3k40l17K3K21K83K60J0L02O3r5m7M76l64q4K49K71k06J75O6M28O7K25
581F780j71K24J35L6L88L29N09Q65R10R95J573J372J347Q41k77j089j760j723j645j155n27
$$ y = [8715, 8833, 8638, 8604, 8552, 8616, 8276, 8150, 8113, 8416, 8702, 9223, 9321, 9559, 9728, 9737, 9406, 9229, 9016, 8989, 9121, 8964, 9126, 9173, 9025, 8796, 9055, 9124, 9260, 9380, 9492, 9567, 9577, 9792, 10118, 10443, 10944, 11402, 11777, 12198, 12758, 13148, 13659, 14022, 14217, 14461, 14705, 15123, 15628, 16373, 17273, 18933, 21723, 22208, 20876, 20438, 20530, 21033, 21709, 22483, 23366, 24045, 24746, 25619, 26536, 27570, 28906, 30430, 31782, 33399, 35046, 36701, 38556, 40176, 41794, 43178, 44542, 46111, 47151, 47613, 47827, 47951, 47527, 46472, 45501, 44301, 42830, 41020, 39022, 36932, 35029, 33639, 33241, 32854, 29831, 26314, 23957, 22057, 20785, 18992, 17854, 16984, 16175, 15528, 14805, 13770, 13266, 12405, 11665, 11176, 10633, 9977, 9646, 9318, 9080, 8970, 8941, 8655, 8115, 7842, 7294, 6788, 6711, 6515, 6310, 6209, 6387, 6401, 6271, 5903, 5720, 5515, 5233, 5086, 5102, 5236, 5068, 4951, 5014, 4774, 4457, 4480, 4701, 4984, 5244, 5254, 5556, 5619, 5524, 5477, 5953, 5589, 5505, 5754, 6025, 5819, 5994, 6060, 6488, 6555, 6780, 6609, 6833, 6968, 7004, 7392, 7721, 8230, 9095, 10005, 11000, 12573, 13945, 15292, 16133, 15856, 14767, 13007, 11284, 9639, 8484, 7957]
578G957M14R42J855N83j602p51k05M95J052Q59P79P99q5l87o00j345j419o38r54q24n49m55
575E921k10k98j60J08J09J56M30K3L77J026J348J507J410J181R74q7j044j342j045n19O27
572A0492J172j144j900r43l00M34N80M57N50Q64P59Q38Q02k43l61O8q68j098q09q43p14l49
569G444k74r4k4j40l84l46l79j09O1k3p6L8L99k12K17K28L14k12J16J36J4J71N9K8J23q2J62
565G155j04J57J6L1K0j90K05K75L21L52K00K45M85M07O08L07N24K76L37L45M54R01Q80om40
561A3761l07j69m98KN42N86Q50R30P99J103R81R15R59Q85J076R67J171J706K461K737K584
558C4041K446L081L607L939L930M858P154J0863J7898L1494N8937R5072J23616J77411J92328
556G70675J42625R0414j9103r6208j96523j81332j55671j21901o7329l2401j3294j146J0905
$$ y = [7957, 8371, 9313, 11168, 11751, 10149, 9398, 9193, 9688, 10740, 11599, 12378, 13177, 13092, 12705, 12105, 10760, 9341, 8703, 7749, 6925, 6376, 5921, 5711, 5413, 5253, 5361, 5470, 5626, 6056, 6079, 6456, 7482, 8830, 10337, 11747, 12928, 13902, 13815, 12771, 11429, 10384, 9865, 10492, 11664, 10520, 8620, 7677, 7377, 7811, 8391, 8848, 9398, 10262, 11021, 11859, 12661, 12418, 12057, 12125, 11257, 10159, 9350, 8507, 7793, 7444, 7170, 7076, 7052, 6912, 6528, 6182, 5803, 5694, 5755, 5732, 5656, 5694, 6093, 5881, 6098, 6326, 6640, 6428, 6544, 6680, 6694, 6865, 6924, 6952, 7075, 6993, 7155, 7051, 7208, 7224, 7255, 7275, 7085, 7290, 7565, 7886, 8238, 8438, 8683, 9168, 9575, 10183, 10490, 11014, 11290, 11627, 11972, 12426, 13327, 14207, 14201, 13761, 13454, 13285, 12787, 12789, 13331, 13917, 14767, 15697, 16496, 17599, 18580, 19495, 20454, 21339, 22415, 23382, 24553, 26259, 28720, 31457, 34041, 36487, 39568, 43175, 47114, 51044, 55902, 63056, 73919, 91817, 123311, 182248, 277320, 400936, 578347, 770675, 913300, 1003714, 984611, 888403, 691880, 510548, 354877, 232976, 165647, 133246, 119952, 118806, 129711]
555A29711L0287N5211O8078R3717J33103R1263Q8110J09795M733m2240j5319j06143j34803
553E05503q2631j07996r3530n4040m0762k5567j2528n103j87L195Q752J6865L0415N8235R3760
551B94381J23143J75797J86573J35145Q5302k6366j01375j96722j77426j53880j21165o4083
549A59324l0546j2278o27J2199L2769N9496O8840R4046J31050Q1335Q5038J05768p565m4655
547G34194j8067j13605j34119q3667j10118r2085n4473m1563k7548j5510q654n025l432k209
545B4119j407j544j628j268j323j528r83p98o19K44N52M84M24M8R5L5J50J29N00J239K682
542A9603L617K157l37j727j242L46J062J865K535L404L660M486O349Q843J1877J6285K3200
540A05983L2909M7018O4945P8307O5203R873n1320p4959o6600m9977l5654k5259j8176j3261
$$ y = [129711, 159998, 215209, 283287, 377004, 510107, 601370, 689480, 799275, 804008, 761768, 746449, 640306, 505503, 422872, 314876, 221346, 167306, 126544, 100977, 88449, 83346, 83159, 86354, 95106, 111971, 142386, 200621, 294381, 417524, 593321, 779894, 915039, 1000341, 973975, 872600, 675878, 498452, 344572, 223407, 159324, 128778, 116500, 115873, 128072, 160841, 220337, 289177, 383223, 514273, 595608, 680646, 786414, 778849, 734194, 716127, 602522, 468403, 384736, 274618, 182533, 128060, 86497, 58949, 43439, 34785, 29760, 26328, 24119, 22712, 21168, 19540, 18272, 16949, 15421, 14438, 13640, 13021, 13265, 13817, 14301, 14725, 14773, 14868, 14903, 15053, 15182, 15682, 16921, 19603, 23220, 25377, 25040, 23313, 22071, 22417, 23479, 25344, 27879, 31283, 34943, 39429, 45778, 54621, 66498, 82783, 105983, 138892, 185910, 250855, 329162, 394365, 404238, 352918, 277959, 211359, 161382, 125728, 100469, 82293, 69032]
538F9032r802p792n794m545l129k529j498j381r05p94p42n99l14L74P77J186J709J850K686
535C7790K936L369M193N139N822P759J0031J2953J7337K3218L0909M1960N6874P3077P8177
533D11544M8597j6794o9571q1601o9211n2412l8385k7475k0378j4527j0740p978o010m520
531D0539l157k231k403k122k075k789k927k431k225j796j116q80l91l26j76J66N77O01R99
528A5837J311K207K565K810M072M665M963N680N930O360O026M261O80m283p981r193q912p048
526B9950n525m070l147j951r51q49q49o51l02n96j050r51j407j355j176j100r07o13o12o08
523A280l66r7o0n3kJ76j96j15J92Q7kJ5r5j79k26K27r7O3j13O7k93o6j7P7k60J38J66L37j5
519E73k03j48J66j29j15l8O0J04QJ96K59P50L48L8K63Q40j21P9L88j0n15n21m30l04j87k64
$$ y = [69032, 59230, 51438, 45644, 41099, 37970, 35441, 33943, 32562, 31657, 30863, 30121, 29522, 29208, 29582, 30359, 31545, 33254, 35104, 37790, 40726, 44095, 48288, 53427, 59249, 67008, 77039, 89992, 107329, 130547, 161456, 203416, 260290, 333367, 411544, 460141, 443347, 373776, 292175, 222964, 170552, 132167, 104692, 84314, 69787, 59047, 51069, 45059, 40539, 37382, 35151, 32748, 30626, 28551, 25762, 22835, 20404, 18179, 16383, 15267, 14387, 13996, 13670, 13494, 13660, 14237, 14838, 15837, 17148, 19355, 21920, 24730, 28802, 33467, 38430, 44110, 50040, 56400, 62426, 66687, 67367, 63084, 55103, 45910, 36998, 29950, 24425, 20355, 17208, 15257, 14306, 13457, 12608, 11957, 11655, 11059, 10009, 9058, 7651, 6296, 5120, 4020, 3113, 2500, 1888, 1280, 914, 817, 757, 704, 702, 878, 682, 567, 759, 846, 844, 859, 764, 585, 359, 586, 489, 552, 439, 506, 213, 147, 130, 207, -53, 85, 251, 588, 573, 370, 222, 388, 259, 144, 106, 166, 270, 278, 474, 733, 1483, 1831, 1869, 2132, 2972, 2851, 2930, 3318, 3308, 2793, 2272, 1842, 1538, 1351, 1087]
515A087J29j72j34p1p4j65r5J43O7R4q9o7k29m4n7j33LL31J0m6P6O7k5Q0J35K24N61J56J87
511A949N93N65o5J33Q13N44J3j48m83p17p56n08m35o8k30k84j6J0O8J6L18l5k10l7M3j87J19
507A005p8l7J92j41j62j38jj75k40J02K55M16J18J5K81N3J88J08K8K74k7J29J16j20q0p9K00
503B202l77l45M7R2%m4l8j56j8k19o3k41Jk02J0j91m9L0o8j73j37l7Q7l6P5N8J22j83j5j17
499A5Pp9o9J7N5o9J36O3m5j22L4k20k65m3lK20Q9J14K20M19j12p5j01j08j65k61jJ76j2K9
495a56j62j21J98R7O7L43Q5L25J58p5J1J09J08J86R2O31R12P82J244L94K62m65n51j089o88
491B697l88l27l58L43K43K81L24O25J087J305R99J369J498K108K675K594L241L094J713n58
488B4565k444m070l804k848k435j832j200m92p90o86m18q8j55L39L21O00P21P20P31P0l23
$$ y = [1087, 1216, 1044, 910, 839, 765, 600, 505, 648, 715, 809, 720, 653, 424, 380, 323, 190, 193, 524, 534, 488, 564, 631, 606, 686, 821, 1045, 1606, 1762, 1949, 2542, 3107, 3042, 3175, 3988, 4532, 4545, 4397, 3914, 3197, 2441, 1933, 1498, 1430, 1200, 916, 900, 910, 978, 994, 1312, 1277, 1067, 1030, 1073, 886, 1005, 927, 890, 1082, 941, 779, 641, 640, 465, 225, 327, 582, 998, 1116, 1131, 1412, 1465, 1653, 1761, 1789, 2063, 2036, 2165, 2281, 2161, 2081, 2002, 2202, 1825, 1480, 1527, 1619, 1619, 1575, 1537, 1381, 1363, 1144, 1081, 840, 841, 639, 649, 458, 409, 439, 371, 198, 61, 24, 111, 75, 150, 208, 330, 147, 132, 15, 22, -57, -126, -109, -54, -123, 13, 76, 31, -91, -57, -277, -542, -585, -588, -368, -279, -165, 55, 474, 362, 287, 186, 78, -87, -348, -349, -173, -185, -156, -318, -439, -241, -144, -77, 266, 351, 676, 834, 759, 770, 879, 987, 1173, 1265, 1896, 2808, 3590, 4834, 5228, 5490, 5025, 4474, 3385, 2697, 2309, 1982, 1624, 1967, 2210, 2491, 2815, 3440, 4527, 5832, 6831, 8200, 9698, 11806, 14481, 17075, 20316, 23410, 25123, 24565, 22121, 18051, 14247, 11399, 8964, 7132, 5932, 5440, 4650, 3964, 3546, 3458, 3303, 3642, 3963, 4563, 5284, 6004, 6735, 6805, 6482]
485F482j055r91q86m89m63j28O2N1J93M62N42R54R96J386K019J634K516K871K956L183K526
482B4821N10k342l482m173l698k699j967j402j172p51o53m60n09p0l88k09j58j11q7J17j95
479I22k04j46O9j2j16r6j25k43k44j12j41K0k4R7n5K29L05J59J01j00Q5R2J10k86k77k68K21
476c9J35J38p9L82K16K95J65q9j76p0J38k00k87l5k1j1j36k4j64j52j24j22M1n4q2j80K7R1
472d17J66J50L85P7K09m4J87K17j94qP1Jk71J75j15k9M4k9K66K5K85M47N8K11k14j08k77k75
468I93k03j24l23M8j09R0m6j02k44M1J79o2j59Q7j87N4J43J24j5J20j0K21M2j42J13k36K31
464E24k19N9n5o4r8M1o9R2n2R6R7K5N6oO6k29J4o4j59K64P6k21R5J81J15j16lk0j14k5M0k85
459D2m6j63r9l9q1o6O0J75J67J06MQ7J73O5o1k7N9r2o8o6K00k35J29j49J77N15Q17q26p20
$$ y = [6482, 5427, 4436, 3550, 3061, 2598, 2470, 2532, 2583, 2776, 3238, 3780, 4734, 5730, 7116, 9135, 10769, 13285, 16156, 19112, 22295, 24821, 25331, 22989, 19507, 15334, 11636, 8937, 6970, 5568, 4396, 3645, 2992, 2532, 2023, 1953, 1565, 1356, 1198, 1087, 1000, 1117, 922, 718, 572, 641, 629, 513, 417, 292, 49, -195, -307, -448, -428, -452, -355, -410, -181, 124, 283, 384, 284, 369, 461, 571, 285, 8, -260, -39, 96, 234, 155, 537, 753, 1048, 1213, 1124, 948, 878, 1016, 816, 529, 494, 473, 462, 326, 302, 138, -14, -138, -260, -219, -273, -355, -535, -508, -417, -251, -101, 284, 361, 570, 526, 713, 930, 736, 728, 799, 800, 529, 704, 589, 560, 604, 575, 841, 866, 1151, 1598, 1656, 1867, 1653, 1545, 1268, 993, 790, 666, 343, 391, 282, 372, 326, 224, -20, 21, 200, 138, -21, 66, -121, -67, 76, 200, 185, 305, 295, 516, 558, 416, 529, 293, 524, 305, 364, 309, 245, 147, 188, 119, 211, 159, 255, 352, 377, 433, 427, 493, 264, 278, 214, 55, 319, 395, 174, 269, 450, 565, 449, 446, 426, 312, 287, 327, 42, -4, -167, -266, -305, -386, -452, -392, -217, -50, 56, 60, 147, 320, 385, 324, 297, 356, 264, 196, 130, 330, 95, 224, 75, 252, 767, 1584, 758, 38]
455C8j54NP0N7j04Q4J98Q1N3Q2M4MoJ10k24j11j8J33j04j03j57k06Q4Q5J58P2J02P4N1J41
451E39m5K52M5m8J29m6L5N4K4J01Q09l44r43o04r1K76m9p7k9K11k7k30M69J45l5K02J9j10
447F32J36R1q9j12o1j15j00mk85o9K31L1j22j11K62Q1M2M8R0P4n4j2O4p5k06J02q0p2k1j79
443A17Q7N2O7k38Q4j4j57m3P8j38J0Q9n6K16K29o6m9J26p1J41r1n2M9J28k04M3K0k29k4%O7
439A71K7p7RlJ00O9M4O0k66J00R4R6j08L5o2l8j26mJ24R8N2j17j30j4LK9p8l2L6J4j0p2Q4
434A08lj75k3j5l1J17p4J83j69l34J56Q1R9j1O1K87n5q0o5L49j82j33o1k09N0J12Q6J6j12
430b7K39K00J4M6P0Q9N6l8k28j55J2n1k37j32J38q2j01J03m9q5M3O9M7l6M8o1J65PJ15j28
426E1l8K19p7p2k04j71J80L1J5J13j07J6Q3n6N9Lj10K08J57p5L05p0J0j47J40O0k93M6Q4N6
$$ y = [38, -116, -111, -41, 16, -88, -4, 194, 275, 328, 410, 454, 458, 452, 562, 338, 227, 209, 342, 238, 135, -22, -228, -144, -59, 99, 171, 273, 347, 398, 539, 494, 746, 791, 743, 872, 826, 861, 915, 939, 1040, 1849, 1505, 562, -42, -133, 143, 94, 17, -12, 199, 172, -58, 411, 556, 521, 723, 742, 632, 768, 859, 770, 658, 597, 482, 382, 378, 93, 24, 255, 286, 164, 53, 315, 396, 438, 486, 576, 650, 596, 584, 648, 573, 367, 469, 389, 317, 296, 117, 204, 256, 323, 85, 169, 155, -2, -45, 33, -105, -95, -6, -62, 154, 383, 317, 268, 394, 323, 464, 373, 321, 370, 498, 294, 337, 357, 128, 104, 104, 171, 198, 121, 130, 127, 227, 296, 340, 400, 134, 234, 328, 424, 316, 351, 289, 251, 125, 121, 245, 343, 395, 278, 148, 134, 137, 166, 88, 56, 92, 106, 96, 24, 108, 105, -70, -93, -108, -139, -22, -96, 87, -82, -416, -260, -179, -80, -91, -30, 257, 202, 122, 57, 406, 224, 91, 30, -179, -129, -17, 69, 85, -27, 212, 412, 426, 472, 542, 631, 687, 649, 421, 266, 278, 227, -10, -142, -4, -86, -187, -84, -133, -218, -175, -106, -59, -95, -47, -108, 57, 64, 179, 51, 13, 232, 155, 83, -121, -292, -112, -81, -66, 47, -60, -44, 39, -17, 42, 45, -65, 143, 300, 225, 530, 460, 470, 323, 463, 523, 230, 276, 360, 416]
421D16O3J5R3k20k04R3o0J25j58k06j7j07N8K2N8J23p0kR5j8j19K15R5j81q2L2j38L9j9K09
417A50j12%l1J64r9j14N7J07k42K78k1PJK15L8lp9n2j90o1J8L9q1k9J79O7j25j35n2n2r3K84
413C3Q3K93j20Rj12k02l5J81j7N9q1ll7j18J0j88k0J57j00O6j7M8p7K09J90k9j09J71k01N
408D8Q2p4J67m4%j98k7J58O8J0R0l6m1Kj91K63J3p2pL4Q4j02k19n5K17k52j09J06N5J42r8
404A4K09j15j58K14M7k69Q0N7oJ86n6K7N4j39j63R6M6oONk5J86N7M2j36K4k42J35J47l6j02
400A79q2k8P9J59j84J36j16k5q4J13K32L9n3o1r3m9P0k34ll0k3m5Q8Q1n7J57j15M9q6p2J74
395A16L2J00o3l8L0K5j08J83k8m4j61O8O5j71O6J15j2J25k06k3m0K85K16k13r2O9j37K23k29
391A53o0J10O7m5J96m3j9o8p7j00n5rkqj17J96K6p9J21L3j40R1J3j97JJ88o9j79L8j8L5j00
$$ y = [416, 479, 494, 587, 367, 163, 256, 196, 321, 163, -43, -60, -167, -109, -87, -29, 94, 24, 22, 117, 99, -20, 195, 290, 109, 27, 59, -79, -40, -59, 150, 38, 38, 7, 171, 72, -42, 15, 122, -120, 158, 137, 144, 145, 360, 398, 395, 316, 264, 74, 13, 31, 70, -11, -40, 139, 206, 81, -54, -106, -158, -251, 33, 116, 409, 289, 298, 186, -16, -51, 130, 113, 172, 91, 88, 51, -67, -57, -245, -265, -108, -208, -142, -159, -111, -188, 21, 211, 182, 73, 244, 43, 48, 130, 56, 223, 179, 179, -19, -46, 112, 180, 190, 280, 244, 203, 205, 14, 277, 290, 218, 211, 245, 329, 227, 8, -47, 170, -82, -191, -85, -30, 112, 14, 223, 108, -50, 164, 211, -58, 22, 79, 73, 259, 203, 230, 284, 145, -18, 78, 124, 118, 124, 129, 104, 290, 347, 389, 253, 277, 35, 170, 317, 281, 179, 97, 69, 148, 307, 123, 259, 143, 118, 34, 147, 379, 418, 365, 304, 211, 162, 232, -2, -5, -35, -58, -103, -15, 66, 9, 166, 51, 100, 14, -58, 116, 148, 248, 185, 147, 177, 202, 94, 277, 249, 205, 44, 112, 177, 6, 72, 187, 175, 300, 94, 71, 31, 316, 532, 319, 227, 296, 159, 382, 153, 93, 203, 270, 225, 421, 378, 359, 291, 214, 114, 59, 50, 48, 40, -77, 119, 145, 66, 187, 220, 80, 171, 184, -13, -12, 176, 107, -72, -34, -52, -17, -117]
387a17j3l2k0J8m2j40J85J87j46J9k1P8L14o2j20N3r9j44Q8K85q2n1k5p2J8K9r4l4k59M0J27
382a32j63J14N8M6p1L3L7K16j98j7n3p8Kp9M1o9J24jj8L0j00p6J46J27K39K2m5j2LJ51k04
378G3r2J32j13j33k4P3KJ08j43K27j08j03j88o7J61K00O5K9K4n1j14Q0j08j10O0J20k1m9O2
374hj05J09J15j90K43P9q7Lk43J3K41O4%P8K9n8j67o6o9R5kM8p6rm8N4p7J8P8k6K7j27L0J56
369A22Q1l58K0L9j01n9J51l0K5L0o9m8j6K1mQj91L6J60L6J03j00j7J13k6oj4J40L8r5K1M2
364E2n1M6k57J23j34J11q1N1J40j07J06n9n0J1j8n7J67j52J75o2J13J6jj75k0MJ32n1j9J93
360A46m7p8M6n2NJ23n9m0J4jj01R2p9j47J93j61O1J22n4p7J07k5o9l1k4k02L1R7O1j74J89
356a34k5N8J33n6J69k2K16o4n9k1k0O5j98N2J09k53J36j52nJ9J4P7Q7o3Q7N0j9L7j44J70n3
$$ y = [-117, -130, -162, -182, -164, -206, -346, -161, 26, -120, -101, -122, -44, 270, 208, 88, 141, 42, -102, -14, 271, 189, 138, 113, 41, 59, 88, -6, -40, -299, -259, -132, -295, -181, -123, -77, -148, -115, -78, 138, -60, -77, -130, -208, -206, -285, -244, -313, -189, -190, -208, -178, -278, -354, -208, -81, 158, 180, 135, 123, 126, 277, 73, -19, 113, 0, -133, -157, -84, -82, 26, -117, 110, 2, -101, -289, -356, -195, 5, 70, 99, 123, 72, -42, 38, -70, -180, -120, 0, -21, -70, -8, -113, -4, 111, -79, 164, 243, 156, 159, -84, -71, 170, 234, 234, 312, 341, 283, 116, 50, -19, 76, 74, 122, 46, 37, -11, 43, -34, -16, 62, 36, 63, -64, -34, 122, 203, -155, -135, -96, -197, -256, -105, -135, -110, -80, -149, -197, -213, -192, -196, -188, -379, -343, -183, -147, -44, -144, -161, -48, -74, -80, -94, 46, 84, -11, 10, 52, 1, 47, -210, -87, -221, -110, -191, -140, 0, -107, -1, -60, -110, -99, -117, -174, -7, -159, 16, -46, 67, 83, 82, -93, -113, -109, 23, -28, -47, 146, 99, 21, 67, 15, 20, 143, 84, 44, 58, 57, -44, 48, -31, -178, 15, -146, -85, 37, -17, -94, 13, -12, -81, -112, -136, -338, -307, -210, -149, -323, -134, -159, -101, 32, -24, 145, 123, 339, 275, 216, 195, 175, 240, 42, 94, 203, -50, 86, -66, -71, -52, -38, 39, 126, 63, 150, 200, 181, 218, 74, 244, 191]
351A91k0l4m6%j3p8n2j38P0mk00nj64Q7J33k1N2J75J22pj07J8J39q2k7K1O0k04P5Q1M2j51
347h7L7j65k5j7J50m2RJ5J86R2j9l6J61j7Q3p9j68j09J0j31n4N7Oj25M3J95q7R3j13j48K27
342e8J3Q7n3j12L1N5j4k8K62j02m5j52L0L31k57j05j09O1J92j17J13k3k4j69l5L7J51lk1K19
338A55J7j47P8l7j22J82j89J04j75J85J03r1q3K4oM5j54l7J2q9O6O2J35l4J3j45O6J42m3M1
334G8J26j27j77R5j75L2k8n2l2j72K75lL4k6J47J43r6L1O9O8J1j09j61n6K33j35K3P7k9Jj40
330g5Jj52P5J14Q9j28J76J9K7r1m5P6Q7k55M9KM8j79R9O1j29N9J24k47j86K71j43J30k1n3
325a97P9P6J6j8L9N1m9o0jNpL2k1Q5nr0M4j72N3J5l9J48J20m1k59J39k0jRO7j22J37q9K6N1
320An0k02P1K46j75N6j07n8J21nO2J6r8j63R9P6j55r8P2Q6r1Q0k8J47o6l1j20J07lJ74j40
$$ y = [191, 171, 137, 91, 91, 78, 0, -52, -190, -120, -124, -324, -329, -493, -406, -273, -294, -242, -67, 55, 48, -59, -41, 98, 16, -11, 10, 70, -134, -59, 22, 64, -87, -50, -215, -240, -257, -107, -149, -140, -125, 61, 153, 134, 98, 259, 242, 325, 246, 78, -31, -21, -152, -206, -149, -143, -268, -225, -30, -117, -24, -137, -285, -58, -45, 42, -11, -123, -92, -37, -51, -79, 183, 81, 36, -116, -86, 245, -12, -117, -226, -165, 27, -90, 23, 0, -24, -193, -228, -191, -40, -43, -64, 155, 172, 25, 103, 66, -56, 126, -63, 41, -134, 51, 154, 63, -20, 4, -2, 43, -111, -148, -136, -225, -159, -97, 38, 4, 17, -128, -62, 80, 37, 78, 204, 77, -100, -5, -180, -148, -176, -228, -260, -432, -157, -160, -126, -152, -5, 138, 42, 73, 142, 210, 221, 112, -49, -105, 128, -7, 16, 93, 64, 65, -75, -74, -226, -151, -37, 52, -76, 100, 119, 146, 55, 10, 86, 173, -82, -33, -31, 17, -162, -63, -2, -131, -72, 52, -195, -381, -110, -253, -123, -144, -197, -118, -42, -26, -44, -5, 46, -3, -63, -64, -59, -66, -34, -55, 30, 25, -65, -21, -193, -140, -125, -164, -16, 104, 63, -196, -57, -77, -78, -69, -2, -124, 13, -76, -50, 1, -49, -251, -180, 66, -109, -53, -160, -218, -97, -102, -40, -24, -122, -285, -186, -110, -265, -363, -291, -205, -296, -216, -244, -97, -163, -194, -314, -207, -210, -36, -176]
316a76P0r0l9q3J15q7op8R5l6J01l5n8J13J48k00P0M8O9l2n4O4K5J6k9O3m3k03l6N4k07J04
311c37nl5K30n1O3k3J15M3p6j21j02J17k17K17n6j7l1k85J39j21l1J60J11P9K22L6J09j23
308A0J3l51P6LN1J17P9J10j25K6k2m8m7j09M6j4K0J84j21L2L9N5j78p1Q7J47j32j15r6P0L6
303b28O5l25L7Q8J53po8J4k8J8J84J06k2j46l0l9O3k0j53J6L3J42j18L7j91J25J02n0Kk2L0
299b32m0m7J0J03K16o8j2o7K3m9j10m0R2n2r9K28J6%j15r0J76J02j69o5J35O1j43k19R6J39
295b20k05o5J9J00L8k8l5K07Q1l7M6j79J3o4K8K2p4Q0n7j13J88j29nO8p3J11n8J51j20R9K4
290a87m9Np0K12j35L1j21N0J05j50P2m1r1j8J73O7j41O9J63j58K0M3J48p8j24JN6j66L2J38
286a44j88Q5M7%q7K64qn1j54P6P0pk04l1n3P8Q3N6m0K4O7j29J08j13Q6M1J20j53K18k10O5
$$ y = [-176, -106, -196, -235, -318, -203, -290, -296, -374, -279, -315, -214, -249, -307, -194, -46, -246, -176, -128, -59, -91, -145, -81, -56, -40, -69, -6, -49, -252, -288, -234, -441, -337, -342, -377, -147, -198, -135, -158, -43, 0, -76, -197, -299, -182, -399, -182, -238, -255, -286, -571, -432, -553, -584, -424, -313, -234, -12, 24, 133, 10, 23, -328, -252, -249, -198, -81, -2, 108, -17, 9, -13, -61, -108, -217, -171, -185, -165, 19, -102, -70, -31, 24, -154, -225, -138, 9, -123, -238, -334, -264, -228, -163, -488, -451, -363, -210, -217, -285, -271, -299, -281, -97, 9, -13, -159, -189, -228, -165, -185, -338, -322, -289, -147, -265, -228, -419, -294, -192, -242, -240, -262, -232, -272, -319, -309, -206, 10, -58, -70, -137, -114, -163, -273, -313, -221, -273, -372, -144, -128, -128, -243, -333, -157, -55, -224, -289, -154, -93, -236, -455, -359, -220, -425, -490, -471, -371, -333, -361, -396, -189, -108, -145, -99, -278, -265, -329, -301, -279, -353, -273, -330, -443, -255, -384, -389, -321, -394, -283, -341, -190, -310, -211, -187, -236, -231, -301, -89, -224, -193, -314, -264, -159, -309, -237, -278, -369, -387, -214, -147, -288, -219, -56, -214, -194, -151, -3, -81, -205, -204, -148, -314, -282, -144, -332, -247, -200, -200, -287, -23, -31, -82, -236, -160, -90, -97, -301, -332, -385, -307, -224, -168, -208, -184, -117, -246, -138, -251, -165, -124, -4, -157, 61, -149, -84]
282h4q1o3j65P2l6j1P2k1K16k67J32J05o1L0O5J2k03K29R0k66J31m0J00p2p5M9M1j2r2j38
277c43K58K7p8p5PJ76n6n9n0k8J61m5j54J69k59l2K49l02L0J11J71o2J3j8L6k46L0j01Q8q
273c90J08k5Q8K22j82j0K8j03J02j21j47J80Ro3m7J34j03K57o5k26K18n4M4O3P8l85K35J5
269a40Rn0J13j10J08k8l2P4o4J38mr8k7L2P8j18J7k1P4j29o4P1n1N4J13k01J89q8o1J62j71
265b25J54j9N0q8j88J11lm4L6N7j1N4L9r2J21j9J05l5l8k26J71R0m0R2K0R2k65J6L2j2%r9
260a64m7J50k09O4J25q6M4M7K2J05j12j26J53n7J28j43J38j62J18P2j19J3j88R5j49K28j14
256a74O3j95J10J43k38K41j19J56l0j49j54J59L4j9k9J84qL0l7j08J1j23J8R8K1J18k31N1
252a77l9P3n5j38J25J12p8o2m6Q2o1J8L6N4j2J5j8J11K1j27p8L0N8n9P5M5J0j9Or2M6j35M7
$$ y = [-84, -165, -228, -393, -321, -357, -368, -296, -317, -101, -368, -236, -131, -192, -162, -97, -85, -288, -59, 31, -235, -104, -144, -44, -116, -191, -142, -101, -113, -205, -343, -85, -58, -136, -211, -204, -28, -84, -143, -193, -221, -60, -105, -259, -90, -349, -381, -132, -434, -404, -293, -122, -184, -171, -189, -153, -399, -369, -470, -382, -390, -282, -307, -219, 3, -179, -189, -161, -264, -162, -283, -430, -250, -241, -304, -351, -217, -320, -63, -128, -354, -136, -190, -146, -83, -5, -390, -155, -140, -131, -181, -68, -178, -70, -98, -130, -56, -120, 18, 14, -84, -111, -79, -1, -119, -102, -123, -49, -178, -242, -171, -222, -168, -55, -256, -67, -155, -216, -54, -225, -71, -90, -40, -128, -316, -205, -208, -252, -216, -159, -170, -116, -77, -169, -48, -67, 38, 3, -35, -261, -90, 0, -40, 52, 72, 164, -101, -85, -53, -65, -65, -164, -211, -61, -270, -206, -81, -167, -123, -76, -54, 51, -61, -187, -34, -91, 37, -106, 32, -130, -12, 60, -59, -46, -234, -139, -288, -60, -174, -111, -306, -196, -53, -291, -50, -169, -13, -43, -192, -346, -187, -153, -172, -201, -17, -25, 5, -32, -140, -129, -252, -234, -136, -115, 3, -228, -177, -216, -143, -198, -336, -211, -99, -177, -239, -285, -203, -264, -246, -210, -156, -168, -153, -171, -60, -39, -166, -244, -214, -156, -215, -140, -95, -85, -104, -98, -190, -144, -279, -232]
248b32P7j8R5k01j07J51N6J33q0lJ00n4l8J20j02k7j88J93m9M5O4Nj03j00K43p6j38L7j61
244c58mL9J7K4R4R3j68J14P7l9J2k52J42J2m7p5J03j43P6k8J65J72j93J29N0m9k60N6j4J1
239b44J2q8j7J6N9K8O8O5p1k7lm7J04J1j61L7J83k04k7L3k7J54j10O9j77J50Q6J5Lj38K1q5
235c12R6p7R9j28K37j2n1l9J02L6k37J5n1J85m4k49J51o9J92k18L3j46J56JK43J6p8j8P7q3
231a73p5l0J20K1K5j29j07K7O1O0km8j60K18r0J77l64K67j1j67J75K7r6J90L7j24j19j75J47
227c18R3Nq8L5rJ94K5j04K9QJ16j10L7J68l46J41N5j05j04J67J08J3K6j66M9q2O1J65l29P5
222a91r1K5o2R0J84j8j02J6j34J9J04j12M9pj25M4j10K02j24N4P7R5mK0j76k42J13m3J50M7
218b52MQ6j9nj4m6k3J65J42j80r3MJ03J76j92r1J0O6l3J9%j41J13R5Kl6J86j55K5K3p0L10
$$ y = [-232, -155, -173, -78, -279, -386, -235, -179, -46, -126, -129, -29, -83, -121, -1, -103, -130, -318, -125, -174, -129, -65, -60, -163, -263, -20, -96, -234, -197, -358, -362, -323, -306, -282, -188, -95, -263, -149, -72, -111, -99, -351, -209, -197, -244, -319, -216, -359, -283, -311, -146, 26, -167, -38, 12, -37, -297, -241, -255, -244, -232, -320, -337, -321, -262, -234, -166, -101, -172, -199, -202, -249, -145, -134, -295, -258, -75, -279, -306, -273, -300, -146, -256, -187, -364, -214, -128, -113, -110, -248, -227, -312, -216, -293, -194, -322, -85, -97, -148, -187, -85, -49, -286, -271, -322, -137, -181, -430, -279, -348, -156, -374, -341, -487, -331, -330, -87, -71, -149, -167, -90, -173, -248, -278, -158, -137, -112, -241, -348, -321, -260, -200, -202, -250, -410, -192, -282, -105, -469, -202, -213, -380, -205, -178, -274, -84, -47, -171, -290, -465, -318, -225, -220, -308, -273, -282, -88, -63, -167, -138, -130, -14, -124, -87, 81, -265, -124, -69, -174, -278, -111, -3, 10, 36, -130, -81, -163, -102, 63, -266, -191, -282, -257, -319, -229, -45, -63, -165, -149, -283, -264, -160, -272, -223, -230, -355, -311, -421, -219, -343, -289, -212, -117, -121, -101, -277, -519, -406, -449, -299, -252, -248, -162, -181, -186, -200, -246, -269, -104, 38, -142, -235, -231, -128, 48, -144, -235, -225, -159, -192, -173, -173, -314, -201, -106, -104, -140, 46, -109, -84, -61, -131, 179]
214A79j41k21K9M5k41R2%J29J21j94K74o9M1j67k11j1n3Q4L1J66l8J38q3J03j94K67k19J66
210B3k58J12j08J5L1m3J60j86L7J16mp8j50P3N2J6j42J00K2O4Q1Mk6K3l14J68o7J69J13q8
205h5j29r1j12K14K9J2l2J76j50J84O5j56q0Jp2J3O3o6j55J61J50K4M0J8j40R2j16m4j2P6
201a22kK4J01q4j28o0J08Q9m0O0O2j9j35m4MR0J03j69M2m9n1J5LJ42l0J67j51k12K6P4Q6q8
197a88k5K1p1L8k54J80Q5J60Ko2j50l4j2q8R5J53Qj48L2J69n2k38N7O5J03l0M4j7L4n5o0n9
192b97J6J61lm5JQ2j72l6J01K7j06Q7j9L2J51k22j3RJ23N7j98M3J89L0r1l75K2J19L47k15
188a95J8p5K6l5K46l1J68k05J35j35Q3j42K4Lk4L5r8L4n7Q2j42Q3m4k4j4K4QJ17m1M5j12j01
183c44o9J66J69J10k17J17L5j7k32J78m7K0K23j36j34Q1lk4J19m7N5o1q0J06q9J0KP2p9o9
$$ y = [179, 38, -183, -154, -109, -350, -258, -258, -129, -8, -202, 72, 3, 44, -123, -334, -345, -398, -314, -283, -117, -155, -17, -100, 3, -191, 76, -143, 23, -235, -123, -231, -216, -185, -228, -68, -254, -217, -101, -105, -183, -333, -260, -208, -192, -334, -234, -212, -148, -67, -63, -89, -66, -380, -212, -279, -110, 3, -85, -214, -305, -417, -203, -174, -162, -194, -18, -168, 16, 81, -75, -155, -154, -226, -213, -150, -216, -371, -210, -60, -36, 4, 22, -118, -26, -142, -186, -198, -122, -124, -100, 1, -83, -211, -271, -163, -74, -114, -54, 8, -11, -146, -190, -186, -96, 7, -162, -120, -169, -220, -205, -202, -60, -90, 77, -74, -286, -260, -186, -100, -188, -213, -192, -263, -225, -479, -299, -214, -54, -52, -114, -264, -298, -310, -398, -303, -150, -142, -290, -258, -89, -141, -379, -322, -257, -154, -184, -140, -157, -123, -178, -238, -297, -281, -120, -123, -168, -167, -85, -257, -293, -192, -165, -271, -184, -203, -171, -20, -242, -255, -246, -123, -66, -264, -221, -32, -2, -93, -468, -446, -327, 20, -195, -177, -252, -226, -261, -15, -46, 122, -83, 52, -83, 0, -142, -118, -115, -139, -104, -202, -168, -225, -143, -285, -202, -246, -270, -284, -260, -252, -135, -176, -131, -243, -344, -413, -247, -78, 32, -185, -68, -33, -50, -282, -104, -151, -131, 92, -44, -178, -97, -100, -124, -5, -52, 3, -58, -138, -32, -121, -111, -109, -37, -116, -185]
179a85r0M2QQ1M2L8j68J02O6n4L7r4M6j81j8o0J55k0N1o6n3J26K2N6J22oj02J2j04K7J13j5
175g0n0j65K3K61k8j06j0Q3l3N3J83ok82q2K01n0j33R8j39Oj47J38P5n3j23J07Q0J51lR5j98
170a24l1o4l5m1m9K11O0r4K0M9j56K70J3QK07l02n1j1j8K3R6n8l5R4j77r4J52K26j25j00j31
166b67J48r0KJ8J07MM4m4K29j95r5M6q0%J1k2N7J01r2L4j10R2K2j1k0Kl0P6J11K5r5m6l7Q8
161a7j26j1l8J65J4j07M6RR1q1K1k47q3J32n8K12j68JJ55o2j14J50J67j35k2p3j80L45L8K2
157D6j43j05L5pr4J52o4m7J14P2j71N7q7K10O8Lj20j02n2J8J26N1J71j71o4K6N7o3p8O4j90
152b88P5oj20O9mm5K53L9j99J32R1m0n1O6j06J91j18j79L06r4r3qk9J92l7m4p2j8N4p6k88
148d47O8J73qn4l3J60j55l8J25J91j70OL21j50O9j66J56k68j57P2J05J19J11m7j95MMK50k84
$$ y = [-185, -275, -233, -225, -144, -102, -64, -232, -130, -64, -118, -81, -175, -129, -310, -328, -388, -233, -253, -202, -268, -321, -195, -173, -117, 5, -1, -103, -91, -195, -168, -55, -70, -120, -285, -262, -1, -29, -135, -145, -62, -95, -42, 141, 135, -147, -229, -28, -78, -211, -113, -252, -246, -393, -255, -180, -233, -356, -249, -169, -18, -21, 74, -124, -155, -219, -254, -295, -344, -133, -73, -167, -147, -98, -254, 16, 29, 37, 244, -58, -109, -120, -138, -115, -19, -77, -112, -18, -195, -289, -137, 89, -36, -136, -267, -119, -209, -207, -189, -82, -78, -34, -78, 151, -44, -139, -93, -173, -173, -162, -184, -127, -26, -118, -84, -194, -102, -80, -91, -111, -109, -139, -63, 48, 73, -22, -68, -105, -17, -143, -154, -192, -27, -13, -120, -74, -65, 26, -55, -34, -281, -364, -232, -290, -78, -246, -245, -90, -152, -266, -116, 51, -84, -106, -179, -359, -14, 24, 46, -97, -202, -167, -174, -268, -116, -180, -227, -113, -41, -212, -155, -242, -32, 36, 39, -81, -183, -235, -217, -91, -40, 131, -40, -104, -78, -21, -84, -162, -98, -288, -213, -219, -339, -270, -274, -319, -66, -27, -226, -94, -3, -43, -94, -28, -134, 57, -61, -240, 66, -28, -121, -129, -158, 34, -3, -47, -119, -137, -83, -159, -447, -379, -206, -214, -268, -301, -141, -296, -334, -209, -18, -188, -182, 139, -11, 58, -108, 48, -220, -377, -305, -200, -81, 30, -17, -212, -208, -204, 46, -238]
144b38O6j0K4N5J9r5J15k1p2l1J3j3K32o2j32nJ31n0N2p9J2j7J72j3q4J23K32M06k8o01j82
140h1O1J14l2k7j60k8N4K3j56N2J22j08J1%J7m7P3k8J13kl8l9J21q2N3j14NK01J15l03l7j38
135b85J44n1J16k9j15K92%k53L62J73j59k78L3K0rmm7J7j27P1J17n4j85J51J52K0j31o0o0
131a79QO7k6j13J37j8K40k44l6k11J91P6N2j59J99q5R0j14k1m4P8J29l5k2j43Q2Pj10N6k9
127a77J06j33O0j07j00P6R6PM3j6k8j09J71M7k05k3J09r7J05%O1j46K18J00k5O3Nj35K2k0
122c2R4o2j62j29J17L6R7m2l2j83K6Q7P2k0P5j12o5Nl6K46j70M6K61k17N3jn6q9pK36k07m7
118b18j00R2R3PM5j5O0j47J59q0j07j0o9J12J8L9O7M3Q6j63j28K68j21L1J15j42o6k8R3K7
114c9l8Kj46J24JP3p8Q5j28K5K06J9j33M3R0j50qj69J85Kk19K58q8k51J2l3J38L9o9R1Lp4
$$ y = [-238, -172, -182, -158, -103, -84, -179, -64, -85, -157, -188, -175, -188, 44, -18, -150, -155, -24, -74, -22, -101, -89, -106, 66, 53, -31, 92, 324, 730, 702, 101, -81, -20, 94, 62, 35, -125, -153, -99, -76, -232, -180, -58, -166, -155, -155, -138, -185, -112, -140, -27, -29, -67, -106, 15, -67, -14, -128, -123, 78, 193, -110, -147, -285, -141, -192, -76, -105, -220, 72, 72, -181, 181, 354, 195, -83, -50, -30, -39, -43, -90, -73, -200, -129, -12, -66, -251, -100, 52, 72, -59, -119, -179, -171, -104, -130, -243, -106, -124, 116, -128, -164, -375, -184, -108, -56, -215, -16, -101, -11, -125, -146, -190, -112, 17, -18, -40, -183, -101, -94, -204, -148, -177, -71, -204, -144, -251, -351, -275, -179, -172, -129, -145, -173, -282, -111, -64, -269, -292, -183, -280, -175, -175, -114, -260, -42, 58, 33, 96, 101, -34, -12, -32, 62, 0, -162, -291, -174, -138, -41, -83, -115, -298, -272, -185, -113, -133, -58, -170, -235, -230, -266, -20, -190, -144, 117, -100, -47, -48, -104, -193, -200, 36, -171, -218, -318, -226, -133, -126, -81, -96, -36, -183, -24, -104, -211, -221, -290, -178, -160, -121, -54, -11, 75, -88, -216, 52, -69, -38, 77, -65, -131, -159, -66, -39, -77, -75, -221, -97, -96, -23, -101, -16, -144, -119, 87, 106, -27, 16, 106, -44, -52, -221, -36, -34, -253, 5, -83, -334, -322, -355, -217, -178, -247, -156, -153, -227]
109b27J03o7m2M8n6L19j17j3qk2q7l0J12J27r0M5pp2o9j13lP1J24r9j13k2L50n4Mj35r2P0
105a65Q2j11m9J43k09j9l3Q8J24j58M7j35J28J19j03J70J52k41K0%j5J18M7OK58k55j84J70
101eJ07L6p0P8l08j36Q8Q7J21j04j05j19K9J39R8r5j34J76O9K6OL4K20j01J87M45k36k92l65
97a24J79j73p7j20J76J2M8k50J38l0J48j72K03O6j86O7L3K40j16j13Qq1r0P9J0L6J38j03k2
92g6j11J87pjj4L6j00Q6O9j38Q2mN5J19j87lJ57Q3K6L7K00l68p3o5O2j27L2P6j1j18J9J01
88B4m1Q8j97o8l8K27o9R6j23k24O8M1J81O3Kk26m0j33R5L2K8J52J78j54J43j66o2J34p1o8
84a28R2m0j77J97p2m0J09o0k44J66J38j77n1K89k7j8k4j9J66N7P4k44m4N8J65n5j31OJ53j46
79b7j6k5l2J92r8l1Q9M1j02J08j68K8O1j28l2J9p5J6J11j24Q9M7n1l4r7K47p7m6o0O8Q8l9
$$ y = [-227, -124, -191, -233, -185, -241, 78, -39, -52, -60, -82, -169, -199, -87, 40, -50, -5, -12, -84, -153, -266, -269, -198, -74, -173, -286, -308, 42, -12, -8, -143, -235, -165, -83, -194, -243, -100, -309, -328, -361, -273, -149, -307, -260, -395, -267, -148, -251, -81, 71, -170, -150, -150, -165, -47, 0, 6, 264, 9, -175, -5, 102, 138, 68, 146, -162, -298, -210, -123, -2, -106, -211, -330, -301, -162, -64, -159, -293, -117, -48, -22, -16, 18, 238, 137, 324, 769, 533, 241, -124, 55, -118, -195, -315, -139, -127, -79, -329, -191, -221, -73, -245, -42, 24, -162, -95, -62, 178, 62, -51, -43, -124, -214, -135, -125, -89, 49, -54, -76, -187, 0, -7, -8, -22, 14, -86, 0, 69, -69, 13, 9, 64, 183, -4, -7, 150, 233, 259, 296, 496, 128, 55, -10, 52, -75, -43, 33, 22, -96, -77, 24, -17, 71, -126, -194, -232, -5, -74, 22, -101, -325, -257, -216, -35, 28, 30, -196, -236, -369, -274, -242, -214, -62, 116, -38, 105, -61, -123, 11, -60, -128, -36, -76, -253, -56, -128, -168, -59, -119, -363, -197, -59, -236, -287, 2, -25, -43, -67, -86, 80, 137, 211, -33, -77, -19, 146, 91, -40, -34, 119, -27, -43, -68, -100, 92, -6, -37, 52, 93, -9, 99, -69, -41, 20, -108, -140, -121, -196, -180, -69, -193, -104, -57, -108, -142, -239, 8, -69, -115, -175, -107, -19, -58]
75e8J9M7J6r9Q4j22L2j5j5o1l1R9lm4J49p4np4K24P1l05K35l7j97Km3P1P7n5pP4J22r2q1o9
70a65N4m6j90M73m2j58Q2j89K4k36J87J32P4j66J2J60M0J8k9o8o6l5l9N6K4J9JO1k01J9l5
66b29N8J77j3j80J50L1M5r9n8J52j29j63K49l2N9o5m3l0J23p6Q5o0l7o8l3K44m5r5N2O8j22
61h4j86J71M8J54j83L0O7mrq7O2J60Q0K16J30j21L56L42J68O9k54q2j40l72j81l49j09Q2j50
57a76O2L7J49q4j39R6K3J19o7o8M1o1N2J21O4k8J9p9j80j03J09R2k7j9J78j61rj69J22K0P6
53A0o2j32R2O0j3J00n7k17L17j41M3J6j62P9n7o6L3J11p1J50j07J5o3j8p3J06j14J04L3J33
49D9j58nM2j1R1l1J9j62l6J01k1Q9k14J55k95M29J4P8L0m8pr3j79J06N3l18J04MJ71L4n0J56
44I7j25J62J01l05j9j8N9O3j69lJ46l2k96J72n8R6J2p8J29J69j11p5J45j81q7J98L9M5P8n2
$$ y = [-58, -39, 8, 24, -75, 9, -113, -81, -96, -111, -172, -203, -104, -107, -151, -2, -76, -81, -155, 69, 140, -165, 70, 33, -164, -162, -205, -134, -57, -112, -119, -45, 77, -15, -96, -165, -111, -157, -347, 126, 84, -74, 8, -181, -157, -393, -206, -74, 0, -166, -154, 6, 46, 64, 35, -33, -99, -134, -173, -117, -93, -74, -73, -12, -213, -194, -229, -171, 6, -7, -187, -37, -6, 39, -60, -118, 34, -95, -258, -9, -41, 18, -47, -90, -120, 3, -73, 12, -48, -85, -153, -186, 58, 13, -82, -30, 38, -84, -270, -99, -51, 103, -80, -50, 17, 13, 4, -83, -21, 139, 219, 435, 565, 444, 800, 1142, 1310, 1379, 1125, 1043, 903, 531, 350, 1, -108, -26, -176, -114, -77, 72, -12, -151, -55, -32, 87, 20, -48, -7, -68, -16, 105, 169, 141, 160, 81, -99, -202, -93, -1, -28, -47, 131, -30, -39, -208, -86, -66, 10, -52, -184, -92, -32, -45, 55, -2, -219, 98, -43, 0, 16, -146, -67, -124, -190, -157, -46, -117, 33, -74, -59, -122, -140, -213, -107, -221, -117, -84, 49, -109, -114, -72, -83, 8, -23, -4, -166, -202, -101, -122, -33, -247, -92, -387, 42, 56, 134, 164, 116, 109, 16, -163, -57, -4, -322, -218, -214, -43, -9, -59, 97, -28, 134, 235, -70, -89, -107, -48, 15, -154, -157, -11, -43, -339, -167, -225, -129, -117, -195, -66, 103, -8, -83, 62, -119, -206, -8, 31, 76, 154, 102]
40A02j16j00J74Rj06J39j7L4p7Rm1J2r7J24n3nJ21j09O9j19j9mk8q1J47j53Q8l6K4J48r7R4
35C6k3j01j45K02k40J23O3K11o1j33j42N1J7l0J94L8j02k29J84J45r1J23Om02J37J14j63J93
31b5O5j15Ln1Q5J90K8n1o1j4J21j52P5O1M5j32j44r0J29k26O8L4K2J00j9J4K0r5K4J10k3l4
27c8J11O5m7Q5%J39k00K7m3J26j0J38k81j13J1J13O1q6J77l6oJ18o3J08L66M29J361K796k688
23B620j291p91l28m6M6n8M4P2r2nNK4l2k3K42k01r4J72j19Q8n2J85j60n7j10M2R1m2J82k33
18G9o2J61p2j9P5k03m1QJ50J58j16R3k11R1j30J04j24K13R7L5k5k2O1k43L1R2O0j38P6q7j09
14a8p0Q0J24J97m2k46K41L9j26K3P6j03o4J26o2K2K06k5o5j86J17j14j14M4Q0K71r3J43J49
10F10o1m08K7K68j25K43j61k3j6M4l4j35L50j09n7j13n2J70r7Q0J30n9P4n3J69M5Pk07j82
$$ y = [102, -14, -114, 60, 69, -37, 102, 85, 119, 42, 51, 10, 22, -75, 49, -4, -9, 112, 3, 72, -47, -66, -70, -98, -179, -32, -185, -97, -133, -109, 39, -58, 36, 13, -88, -233, -31, -271, -148, -85, 126, 65, -68, -210, -159, -142, -172, 22, 60, -42, -271, -87, 58, -33, 90, 96, -306, -169, -55, -218, -25, 40, -75, -72, -123, -38, 152, 180, 129, 68, 54, 175, 23, 98, 159, 204, 72, -72, -162, -33, -259, -191, -157, -135, -35, -54, -40, -20, -115, -91, 19, -4, -38, 73, 138, 91, 176, 176, 315, 115, 142, 99, 225, 215, 353, 72, -41, -30, 83, 144, 58, 235, 199, 193, 311, 248, 356, 722, 1151, 2512, 5308, 2620, 1329, 538, 210, 164, 210, 152, 196, 268, 176, 171, 176, 200, 168, 145, 387, 186, 92, 264, 145, 233, 181, 366, 206, 149, 39, 81, 172, 130, 312, 79, 17, 178, 106, 87, 162, -41, -82, -74, 76, 234, 118, 211, 0, 91, -39, 65, -59, 154, 251, 286, 261, 239, 300, 57, 88, 180, 240, 102, 178, 91, -18, -88, -8, 116, 313, 271, 25, 266, 305, 179, 202, 278, 175, 111, 237, 175, 197, 403, 378, 313, 127, 244, 130, 16, 60, 140, 411, 318, 461, 610, 549, 141, 168, 436, 311, 554, 393, 370, 354, 398, 364, 229, 579, 470, 413, 300, 248, 418, 321, 401, 531, 472, 546, 493, 662, 707, 714, 507, 325]
6C25Q2L53j1k2LJ35k8K69K6o7R9J39M9K05L85N64J685O050P056j0095l446q30m19j97K80J01
2B691M30O28M92P98R12J782L054L779L078L224L961R827K0586M8578J87439L90324l87652
0B93931j91245n3447j9987q983m018q03j863k915l270k920j108o56n44k08j67k95j96%K11
-3A517P00J828Q039J832r155k761q19n30k82L6J2q5k13J36l16QN3k7P1r3M8m3K83k16j54p8
-7b09O6l02J1Q5P1P7m8J84l3o4M4p6Q0J14k96J17L3j4n1O1K00r2K9k12O9j17j32MJ33LJ76
-11h9m7K3J4N9j5M8n5o7N7Jk24jK08k2j33J50L7O4j82J51J36O6mk36K01k22r8n1m2J16P9k2
-15a00L6N7j29K4J04q9J10p9J30J09k44N1k07N7L14om2Kq6n5J82j31q8j5K6m2J24o5M6k8N0
-20A6k25joJ17o1j00J19J18j76K00m3K23j43J09pK33j78K07J71P22J454J484j736j687m79
$$ y = [325, 407, 760, 749, 727, 730, 865, 837, 1106, 1132, 1065, 1164, 1303, 1352, 1557, 1942, 2506, 4191, 10241, 17297, 7202, 3756, 2926, 2507, 2310, 2590, 2691, 3121, 3749, 4241, 5039, 5951, 7733, 10787, 14566, 17644, 20868, 24829, 34656, 55242, 103820, 291259, 681583, 293931, 102686, 49239, 29252, 20269, 16251, 15448, 13585, 10670, 7400, 4480, 3372, 2716, 2172, 1964, 1797, 1502, 1306, 1306, 1517, 2217, 4045, 12084, 13916, 4761, 2000, 1181, 651, 369, 405, 417, 332, 119, 255, -61, -53, 0, -27, 44, -49, -1, -44, 239, 23, -131, -209, -143, -445, -434, -349, -278, -201, -249, -65, -98, -162, -118, -194, -114, 0, -296, -179, -146, -160, -211, -150, 50, -42, -13, -225, -156, -273, -405, -401, -268, -265, -89, -136, -113, -99, -40, -55, -7, -62, -129, -72, -71, -295, -296, -88, -110, -243, -93, -56, 8, -174, -23, 113, 179, 175, -61, 140, -82, -180, -231, -273, -157, -78, -100, -64, -7, -136, -112, -8, -97, 13, -66, 64, 173, -71, -20, -227, -170, 144, 138, 96, 98, 12, -43, 139, 8, -80, -95, -69, -111, 13, -52, -6, -34, 16, -209, -210, -216, -99, -160, -260, -141, -23, -199, 1, -42, 181, 38, 147, 140, 373, 195, 402, 573, 1295, 2749, 4233, 2497, 810, 331]
-23C31l02j14J55P2r5q5K6j62J4J18n9l6l1k18M0L12K8k49J43O2O6r8p2m6N4J54J1r9J21j30
-28h9P3l4N2J66J05r4mj16j63J44j40o3J9J84j95K20k5R1k29p3K21K15k03j12J24j16Q5k95
-32b52K31J26P1j67P5q1k2q1N4J51j92P0P9j13O7Q7J4N9j50J17j63J26l7K5k94J40k7M8k1
-36f0L0J04Kk1k7o2J58Qk29O1O2j94K38j4j29P2j44O5J09n1m1M6k6N7J15l5J67j24j24q6l0
-40a03K17k60J60J11j90J30N2j49N4M1o2j2n9O4L6J23k07pK6OR6J03j1j07J0n9J65o9j03j62
-44a66L0K64j61k2J01J1p8m9L05k0J1j90R8j34R1K6q1R3k09J33J66P5j83o7L8Qo5O7J30l0
-49A92q5QN7J0n4J6m5J30j20k39Q8J11J6P8l7n0Pq9nk2K3J24J02o1j03j31k3QL3Q5r5l1j38
-53b40N6P3K74k45K03m8m6j35K61k15j33O9l1L7J22K6j7J72j13k5Q0J2l7J3m8j10O6K6L8j6
$$ y = [331, 29, -85, 70, 142, 47, -38, -12, -174, -160, -42, -101, -137, -168, -386, -346, -34, -6, -255, -112, -50, 16, -82, -154, -200, -146, 8, 19, -80, 41, -89, -16, -50, 2, 168, 273, 179, 175, 59, -104, 40, -100, -163, -144, 40, -155, 65, 40, 131, -98, -171, 50, 265, 62, -50, 74, -42, 43, -252, -21, 105, 176, 9, 84, 3, -19, -100, -46, 105, -87, -17, 62, -51, 16, 103, 117, 176, 26, 143, -20, 106, 69, 94, -200, -60, -87, -39, -60, -30, 74, 76, 55, 28, -34, 124, 132, -97, -36, 26, -168, 70, 56, -73, -1, -145, -80, 29, -22, -63, -17, -43, 14, 129, 94, 261, 137, 13, -73, -103, 114, -146, 14, 125, -65, 65, 117, -32, 22, 63, 1, -11, -70, -6, 30, 153, -54, -61, -35, -29, 67, 170, 159, 52, 62, 3, 168, 99, -4, -166, -136, 128, -33, -55, 46, 57, -21, -70, 235, 215, 226, 36, 134, 0, 91, 117, 36, 129, -80, 53, 219, 294, 111, 44, 82, 90, 25, 92, 222, 192, 107, 115, 172, 182, 128, 144, 99, 229, 109, -130, -42, 69, 85, 163, 126, 76, 83, -6, -11, -33, -10, 114, 216, 155, 52, -79, -102, -94, -61, 24, -71, -102, -240, -184, -111, 163, -82, 121, 73, 27, -108, 153, -62, -195, -126, -157, -120, 2, 28, 11, 183, 70, 45, 125, 137, 100, 113, 65, -45, 21, 47, 85, 69]
-57F9J37J19j04k02p3J33j53J72J46q4j00J97J26J15M86L75N0j28j57m17l24j90j16J09pJ50
-61C29j0R7k86k61q0K71m9J84k5l5r8j07O6M2M1l3j38m6Q0K39j35L9l1j31N3J38l1j68Q3j03
-65a05N0k03J48n3JrJ64J03K38j63o8k40J10K35k11o9R3l0K1lN7K31j59j6o2J52J9k15J7J7
-70E0J5oK4j9j36oJ91k08P0R3k25J15J1P1L2o3QN6q4j4RJ60p2K1j33K41q7J80j56k74j0L5
-74a11K45j9j71Q8K7J31j26Rj07L5q8L3J99O7o4O5j60J65j64K8J59J14M2l05k51j50R4K59
-78D4m4q2J01J38q7J32j51k03J90J08j51J64l3l1J19q9j36j60K53l4j65j29J65m4O5J09n2
-82cn3K19j31l3K10j76L3p0R0R1q9N1Ko7R8p0o0l6M9M8J0J52O2L0j58J05j24rj34j37K01o6
-86C5K5p8m7J28L7k05J43J97m9q5j48l2N8m0O8q4NN2O9k7O4j12K32l6j4m3p6M8r7J28n7R2
$$ y = [69, 206, 325, 221, 19, -54, 79, -74, 98, 244, 160, 60, 257, 383, 498, 984, 1359, 1409, 1281, 1124, 707, 383, 193, 77, 186, 179, 329, 319, 416, 130, -131, -211, 60, 11, 195, 170, 135, 37, -70, -4, 38, 79, 46, -92, -138, -58, 181, 46, 85, 54, -77, -24, 114, 83, -85, -2, -105, -55, -258, -110, -163, -162, -171, -7, 96, 334, 171, 103, -137, -27, 208, -3, -72, 21, -9, 12, 9, 66, 297, 138, 122, 60, 212, 231, 16, 33, 50, 65, 59, 83, 64, -72, -78, 113, -95, -25, 68, -157, -42, -31, 40, 72, 9, 17, 73, -11, -25, -16, 144, 72, 93, -40, 201, 114, 294, 138, -136, -146, -111, 134, 115, -56, 32, 59, 190, 64, 73, -34, 1, -87, -54, 145, 212, 148, 213, 53, 218, 54, 82, 241, 355, 397, 92, -159, -309, -215, 44, 0, -82, 19, 157, 70, 202, 51, -152, 38, 146, -5, 159, 126, 95, 214, 125, -11, -171, 82, 48, -117, -246, -81, -125, -60, 49, -3, -56, 163, 32, -1, 209, 33, 66, -4, 86, 177, 88, 139, 141, 74, 172, 102, 42, 6, 55, 103, 113, 265, 327, 357, 199, 304, 180, 171, 37, -100, 101, 35, 60, -18, -65, 63, 100, -105, 38, 235, 186, 101, -47, -79, -21, -61, 7, -77, -72, -20, 49, 22, 86, -26, 206, 170, 156, 113, 37, 85, -12, 116, 59, 151]
-91A51P4j87o9J08J13j95J48J74j27L1m9mj48k8K2O1J29j86J71j56K8K24p2j69p9J39qK08
-95C04k85p1O4K28K4n0l5k3j02k7nn4R4k74J08N5R1J87j74J0r3J19j33Q0n1OJ39P4q0J8j03
-99D1J31j9M6J36m5k24n0J8Jo4j4j16J09Q0O8j7K38j37k08L1PN8j2P4j11J39p3o5M0M5n8j87
-104a38K10K30j41nr2n6J36r1J2J93r2j62K00j74J99m1ko8k25K0J99j05k0m9j58K05R9j23
-108c9lJ58l3K69j82k36L0K81N0K6q6jj99M1J40p9M5k0j07j07p2J56P8l02J07R6Q4M6j07N8
-112I2j01N1p9Q3J0N0j95K20k7j05K22mJ7K16l18J2o4l20K04M8K3j3q1K6P5K52k00P2K05k10
-116A61k8N4O1j01n0L2r9R9L9k4J8j04j01R2j4Q3mK33p1k55J7PJ18j56j1M8M4k1Q8k8J14k32
-121Ir3K30n8J49j50LL5j2M2j10j49K90j08NQ5p2j54J6M1JJ40P1M2r4N0k2p5J4N6p9k73K01
$$ y = [151, 225, 38, -31, 77, 190, -5, 143, 317, 190, 221, 172, 168, 20, -8, 14, 75, 204, 18, 189, 33, 61, 285, 213, 44, -35, 104, 96, 304, 19, -52, 12, 240, 264, 214, 179, 156, 54, 27, 22, -32, 62, -212, -104, -49, 42, 229, 55, 65, -28, 91, -42, 38, -13, -7, 132, 206, 126, 144, 41, 172, 153, 199, 335, 290, 66, 16, 34, 35, -29, -43, -159, -50, 30, 98, 81, 319, 182, -26, 5, 12, 70, 58, 132, 21, 160, 87, 22, 62, 107, 49, -138, 72, 302, 161, 156, 64, 8, 144, 53, 65, 258, 166, 4, 204, 30, 229, 188, 186, 118, -107, -87, 112, 7, -13, -62, -220, -15, 84, -39, -42, 116, 83, 352, 170, -66, -36, 245, 295, 321, 235, 234, 35, 76, 216, 137, 182, 162, 55, -52, -124, 32, 110, -192, -85, 11, 95, 141, 34, 92, -9, 42, -37, 46, 56, 106, -89, 131, 104, -1, 221, 217, 234, 450, 132, 144, 80, -240, -36, 12, 35, 22, -59, -33, 42, 294, 94, 166, 371, 161, 133, 187, 248, 147, 97, 129, 30, 129, 168, 144, 162, 58, -43, 49, 35, 118, 114, 347, 276, 21, 38, 45, 163, 7, -4, 44, 88, 67, 155, 127, 241, 9, -84, 146, 88, 237, 87, 90, 125, 113, 155, 45, -104, 186, 78, 83, 168, 96, -58, -42, -1, 0, 140, 211, 253, 159, 209, 187, 112, 126, 182, 103, -170, 31]
-125C1J54j52J6J04j29L2OJ7Kp8P7K42j49j07P4j47N3l9r7mR7P5r8N3j4j30R9J00J06R7r8
-130A93m5m9r4P8j08O9M5J40P3O6k02j80J33p4n6K72j92Q9N5k53L4M5N5L4M5J03k22Q7o8Q5
-134A58pj10J1m8J39J93Jp6rj13j16K0J64J05M4k34n2J7l5j26P5o4K13l9o0jJ06J80j09m4
-138A83k6p9j94K54m6J41j27M8K8q2L6J59j77j69J06R9j11R3Q5j03N0jn7p2J34R7O9k32k1
-142H5Q1j8k04K5M7l1j67K84M0n0P0oL7P0j24l5L1j79n7Q4J78M1Q4j8l7j69J30P8o1J7n4n0
-147A22k13J4N8j00J23L2r1j46O9J51K01r3K4J6JM3m8j1j34q7J75qm1Q9j72J41ql0k8P7k2
-151A04p7J59k8l5J04j7Q5m8n4k54J43j7N7R8n1j96m1J42j22K88L4m1n2p2J7K9J23n6R3o8
-155B47q6P0n2J12j58Q6r8j21Q0J0L2L9P0Lm7o2j43J87J2k28K96j9j04K52k30Lk6j06J29M9
$$ y = [31, 185, 33, 49, 153, 24, 56, 62, 79, 81, 3, 80, 322, 173, 66, 140, -7, 46, 7, -90, -94, 3, 78, -20, 33, 19, -111, -12, 88, 194, 291, 193, 148, 99, 5, 83, -25, 44, 89, 229, 302, 368, 166, -14, 119, 45, -11, 261, 69, 158, 213, -40, -6, 39, 94, 128, 173, 276, 54, 141, 73, 158, 151, 41, 52, 4, 143, 336, 337, 261, 252, 139, 23, 43, 207, 312, 356, 122, 70, 87, 52, -74, 1, -63, 150, 111, 51, 50, 156, 336, 227, 183, 157, 78, -116, 138, 92, 233, 106, 154, 182, 100, 136, 295, 118, -51, 55, 154, 43, 136, 221, 118, 168, 167, 110, 38, 172, 269, 338, 106, 85, 166, 148, -56, -31, 16, -15, -182, 102, 142, 92, 162, 156, 193, 263, 139, 104, 135, -44, -101, -17, 161, 202, 286, 268, 231, 62, 192, 270, 209, 226, 172, 122, -91, -77, -19, -119, 4, 36, -55, -201, -132, 19, 220, 127, 151, 167, 168, 211, 163, 152, 18, -69, 106, 98, 57, 146, -26, 115, 107, 77, 49, 126, 104, 27, 186, 158, 123, 227, 210, 295, 247, 193, -61, 82, 65, 122, 220, 169, -27, -68, 74, -48, 240, 274, 233, 181, 109, 126, 155, 278, 222, 315, 247, 161, 231, 179, 291, 133, 219, 121, 0, 80, 90, 122, 161, 231, 234, 187, 125, -18, 169, 181, -47, 249, 230, 126, 378, 148, 151, 125, 19, 148, 197]
-160A97o1j73Q8j33K5n0J33m3O0j1M5R2K6m6jK7R1k19J42j30J21P2J9n0n8pm2J95j47k7Nk60
-164a20J64K42k45q0L5P4M4M6n9P8J49j31Nj84j9LJ24L10j03j76o6O7k08N1K37p6j25K10P7
-168C24k40M4j87J17K75l45q6K6J77j37MO9J26j1j37O7J34P1m27N2Q7L66j23r7j10K46j84
-172A01R5K7j37J43k16qJ8R3m9J00pj71k9J67K6K7r3J7j30J37J2JK05j57K33k24n6j80N6K18
-176B19p9J21j82P2N3l2J01j32p4l0j3K37N6L0j52j42J25k0J40j96j1k9K25p1j39N3j02K8
-180E6K7l9J11J58j95K6P3k9q0j01J11J55j02k2J26l3J3Oj77K4J6r5J37J6J1M7j08k12J64
-184H4J96j20j02P9Q7j63n3J3RJ76j10k1l4J26P5r3p4Q3ql0K96l25j54P6O8K21lm5R9l10q0
-189c7l5J23J30j44j06P0L99k49l0l1R3j32J17kj3R9p6j4J06o3K18k88m4j84K30M4j37L09
$$ y = [197, 136, -37, 51, -82, -57, -107, 26, -17, 43, 32, 77, 169, 195, 149, 148, 175, 266, 47, 189, 59, 180, 252, 271, 221, 163, 156, 114, 309, 162, 135, 140, -120, 44, 286, 41, -39, -4, 70, 114, 160, 101, 179, 328, 197, 202, 18, -1, 2, 126, 436, 333, 157, 91, 158, -50, 1, 238, 162, 37, 247, 324, 84, 128, -59, 58, 333, -12, -98, -72, 105, -32, -28, 41, 167, 156, 19, 86, 220, 291, -136, -84, 3, 369, 246, 149, 39, 285, 101, 196, 223, 86, 229, 13, 5, 23, 116, 67, 167, 160, -11, -40, 127, 153, 180, 87, 104, -26, 111, 123, 124, 329, 172, 405, 181, 125, -55, 1, 219, 140, 261, 79, 151, 204, 172, 273, 141, 67, 37, 24, 261, 317, 347, 195, 53, 178, 158, 298, 102, 91, 62, 287, 216, 77, 130, 28, 56, 83, 44, 155, 313, 118, 144, 217, 188, 108, 7, 118, 273, 171, 149, 275, 242, 255, 261, 84, 108, 124, 29, 166, 182, 193, 240, 132, -80, 84, 280, 160, 58, 137, 224, 61, 8, 21, 30, 206, 96, 75, 41, 167, 242, 149, 75, 158, 150, 120, 416, 91, -63, 13, 81, 302, 299, 254, 353, 43, -37, -72, 51, 181, 37, -69, 1, 400, 151, 121, 90, 183, 51, 168, 166, 153, 252, 176, 162, 268, 205, 423, 135, 91, -93, 137, 181, 44, 353]
-193C53J5p2j54l5N4J6j30Q8n7jm8Q6J29nq7n9j7MK9K7j8m2N9J28p0K24r5k12M9Mm5MJ13J67
-197D02j66j82M0J89j11N2Jl4j5k00P2m6P6Q9Lo2j11K6J98k62J85m2Q2j8O9m6o2n3Q5r0K0
-202H9q6K28j36j9o6J73N3l2q6J12KJ00j38J02l00RP6R0j29R8j58J26J12j66K4j8J62J7k05
-206C4P6P0j32J71q3n8k6R4j2L8K9J04l0O1l6J45j97o1l1n5K08o6j9j41J08j02Q5r9J24P8
-210B77j48J17J04j26n1m7Nj55K91k9j08k6J06j15J9RR4N1j28N1k27O0J27K51j6Kl18R8j48
-214B0J09M5j86R0K68k4jj81n
$$ y = [353, 368, 296, 142, 107, 161, 177, 47, 135, 78, 77, 29, 115, 244, 239, 152, 93, 76, 80, 109, 136, 118, 76, 135, 263, 193, 417, 322, 110, 159, 163, 118, 122, 235, 402, 236, 54, 94, 283, 172, 224, 225, 191, 176, -24, 48, 2, 78, 167, 170, 108, -3, 23, 221, -41, 144, 102, 184, 166, 235, 189, 127, 74, 159, 69, 89, 3, 231, 95, 76, 10, 183, 236, 204, 118, 230, 232, 332, 194, 296, -4, 5, 81, 171, 42, 140, -18, 108, 220, 54, 78, 60, 222, 239, 34, 110, 180, 48, 219, 136, 78, 52, 146, 134, 172, 201, 305, 275, 336, 300, 445, 248, 187, 156, 101, 309, 243, 224, 83, 191, 89, 174, 75, 199, 277, 129, 246, 350, 224, 173, 126, 131, -24, 267, 238, 130, 104, 210, 95, 114, 123, 217, 268, 140, 191, -36, 24, 151, 402, 386, 388, 70, 168, 20, 129, 174, -12, 78, 346, 322, 321, 140, 135]
-216A35
##END=	
##END=	
