##TITLE=	Document 1
##JCAMP-DX=	6.0	$$ MestReNova 15.0.0-34764
##DATA TYPE=	LINK
##BLOCKS=	3    
##ORIGIN=	Mestrelab Research S.L.
##OWNER=	17159
##$MNOVA/METADATA=	(DOCUMENT,BASE64)
ewogICAgIm5hbWUiOiAiRG9jdW1lbnQgMSIsCiAgICAicGFnZXMiOiBbCiAgICAgICAgewogICAgICA
gICAgICAiaXRlbXMiOiBbCiAgICAgICAgICAgICAgICAiMiIsICAgICAgICAgICAgICAgICAgICAgIC
AgICAgICAgICAgICAgIAogICAgICAgICAgICAgICAgIjEiICAgICAgICAgICAgICAgICAgICAgICAgI
CAgICAgICAgICAgIAogICAgICAgICAgICBdCiAgICAgICAgfQogICAgXQp9Cg==
##TITLE=	H NMR calculated spectrum
##JCAMP-CS=	3.7	$$ MestReNova 15.0.0-34764
##BLOCK_ID=	1
##ORIGIN=	Mestrelab Research S.L.
##OWNER=	17159
##$MNOVA/METADATA=	(ITEM,BASE64)
ewogICAgImFuZ2xlIjogMCwKICAgICJwb2ludHMiOiBbCiAgICAgICAgewogICAgICAgICAgICAieCI
6IDU1NTcsCiAgICAgICAgICAgICJ5IjogNjA3MQogICAgICAgIH0sCiAgICAgICAgewogICAgICAgIC
AgICAieCI6IDc1NTMuNTU1NjYwNjUzNjA1LAogICAgICAgICAgICAieSI6IDYwNzEKICAgICAgICB9L
AogICAgICAgIHsKICAgICAgICAgICAgIngiOiA3NTUzLjU1NTY2MDY1MzYwNSwKICAgICAgICAgICAg
InkiOiA3NDE5LjM0NjQ0OTU2Nzc0CiAgICAgICAgfSwKICAgICAgICB7CiAgICAgICAgICAgICJ4Ijo
gNTU1NywKICAgICAgICAgICAgInkiOiA3NDE5LjM0NjQ0OTU2Nzc0CiAgICAgICAgfSwKICAgICAgIC
B7CiAgICAgICAgICAgICJ4IjogNTU1NywKICAgICAgICAgICAgInkiOiA2MDcxCiAgICAgICAgfQogI
CAgXSwKICAgICJ6IjogMQp9Cg==
##NAMES=	H NMR calculated spectrum
##ATOMLIST=	
$$ AN	AS	NH
	1	C	3
	2	C	1
	3	C	3
	4	O	 
	5	P	 
	6	S	 
	7	C	3
	8	O	 
	9	C	1
	10	C	2
	11	C	2
	12	C	2
	13	C	2
	14	C	2
##BONDLIST=	
$$ AN1	AN2	BT
	1	2	S
	2	3	S
	2	4	S
	4	5	S
	5	6	D
	5	7	S
	5	8	S
	8	9	S
	9	10	S
	9	14	S
	10	11	S
	11	12	S
	12	13	S
	13	14	S
##MAXRASTER=	32768
##XY_RASTER=	
$$ AN	X	Y	Z
	1	32768	22941	0
	2	29900	22941	0
	3	28396	25424	0
	4	28396	20353	0
	5	25493	20353	0
	6	25493	17485	0
	7	25493	23325	0
	8	22626	20353	0
	9	21192	22941	0
	10	22626	25424	0
	11	21192	27941	0
	12	18254	27941	0
	13	16786	25424	0
	14	18254	22941	0
##END=		$$ JCAMP-CS
##TITLE=	
##JCAMP-DX=	6.0	$$ MestReNova 15.0.0-34764
##DATA TYPE=	NMR SPECTRUM
##DATA CLASS=	XYDATA
##BLOCK_ID=	2
##ORIGIN=	Mnova: Peaks
##OWNER=	17159
##NUMDIM=	1
##$MNOVA/METADATA=	(ITEM,BASE64)
ewogICAgImFuZ2xlIjogMCwKICAgICJheGVzIjogewogICAgICAgICJ4IjogewogICAgICAgICAgICA
ibWF4IjogMjAuMDAwMTUwMDAxMTI1MDEsCiAgICAgICAgICAgICJtaW4iOiAtNC45OTk2NTYwMjc2OT
M2NDU1CiAgICAgICAgfSwKICAgICAgICAieSI6IHsKICAgICAgICAgICAgIm1heCI6IDAuMTMwNzc4N
TM1MjY5MjAwOCwKICAgICAgICAgICAgIm1pbiI6IC0wLjAxMTg4ODk1NzU4MjQxNDE1CiAgICAgICAg
fQogICAgfSwKICAgICJwb2ludHMiOiBbCiAgICAgICAgewogICAgICAgICAgICAieCI6IDUzMjEsCiA
gICAgICAgICAgICJ5IjogNTgzNQogICAgICAgIH0sCiAgICAgICAgewogICAgICAgICAgICAieCI6ID
g3MjIsCiAgICAgICAgICAgICJ5IjogNTgzNQogICAgICAgIH0sCiAgICAgICAgewogICAgICAgICAgI
CAieCI6IDg3MjIsCiAgICAgICAgICAgICJ5IjogODIwOAogICAgICAgIH0sCiAgICAgICAgewogICAg
ICAgICAgICAieCI6IDUzMjEsCiAgICAgICAgICAgICJ5IjogODIwOAogICAgICAgIH0sCiAgICAgICA
gewogICAgICAgICAgICAieCI6IDUzMjEsCiAgICAgICAgICAgICJ5IjogNTgzNQogICAgICAgIH0KIC
AgIF0sCiAgICAieiI6IDAKfQo=
##.OBSERVE FREQUENCY=	250.1281240250000053
##.OBSERVE NUCLEUS=	^1H
##.SOLVENT NAME=	
##.PULSE SEQUENCE=	
##LONGDATE=	2025/08/26 11:55:54.000
##.ACQUISITIONMODE=	SIMULTANEOUS
##$ORIGINAL FORMAT=	MNova
##$MNOVA/SCALES_VERSION=	9
##$PARAMETER FILE=	(datafile, ASCII, c:/Users/17159/Desktop/%E6%96%87%E4%BB%B6/%E5%B7%A5%E4%BD%9C/H_jdx/H-%E6%94%B9/14-3-0010.jdx, 0)
$$ 
##$PARAMETER FILE=	(originalData.xml, ASCII, , 0)
$$ <?xml version="1.0" encoding="UTF-8"?>
$$ <MnovaSpectrumParams>
$$     <itemId>{a0c1a8b6-402e-4254-92d4-3de1f6d68341}</itemId>
$$     <spectrumIndex>0</spectrumIndex>
$$     <DataFileName/>
$$     <Title>
$$         <dim0>Predicted 1H NMR Spectrum</dim0>
$$     </Title>
$$     <Comment/>
$$     <Origin>
$$         <dim0>Mestrelab Predictor, Modgraph NMRPredict Desktop</dim0>
$$     </Origin>
$$     <Owner/>
$$     <Site/>
$$     <Instrument/>
$$     <Author/>
$$     <Solvent>
$$         <dim0>Chloroform-d</dim0>
$$     </Solvent>
$$     <Temperature/>
$$     <PulseSequence/>
$$     <Experiment>
$$         <dim0>1D</dim0>
$$     </Experiment>
$$     <Probe/>
$$     <NumberofScans/>
$$     <ReceiverGain/>
$$     <RelaxationDelay/>
$$     <PulseWidth/>
$$     <PresaturationFrequency/>
$$     <AcquisitionTime/>
$$     <AcquisitionDate/>
$$     <ModificationDate/>
$$     <Class/>
$$     <Purity>
$$         <dim0>100</dim0>
$$     </Purity>
$$     <SpectrumQuality>
$$         <dim0>0</dim0>
$$     </SpectrumQuality>
$$     <Version>
$$         <dim0>1.4, 1.19 (5.076)</dim0>
$$     </Version>
$$     <Algorithm/>
$$     <UseDB/>
$$     <GMMXCycles/>
$$     <LineWidth>
$$         <dim0>0.75</dim0>
$$     </LineWidth>
$$     <SpectrometerFrequency>
$$         <dim0>250.13</dim0>
$$     </SpectrometerFrequency>
$$     <SpectralWidth>
$$         <dim0>6253.25</dim0>
$$     </SpectralWidth>
$$     <LowestFrequency>
$$         <dim0>-1250.65</dim0>
$$     </LowestFrequency>
$$     <Nucleus>
$$         <dim0>1H</dim0>
$$     </Nucleus>
$$     <AcquiredSize/>
$$     <SpectralSize>
$$         <dim0>65536</dim0>
$$     </SpectralSize>
$$     <DigitalResolution>
$$         <dim0>0.0954170227050781</dim0>
$$     </DigitalResolution>
$$     <AbsoluteReference/>
$$ </MnovaSpectrumParams>
##$PARAMETER FILE=	(parameters, ASCII, , 0)
$$ <MnovaSpectrumParams>
$$ <SpecCount>1</SpecCount>
$$ <Dimensions>1</Dimensions>
$$ <Origin>Mnova: Peaks</Origin>
$$ <Window Dim="f1">
$$ <Nucleus>1H</Nucleus>
$$ <Points>65536</Points>
$$ <Width>6253.25</Width>
$$ <MHz>250.128124025000005</MHz>
$$ <Hz>-1250.65000000000009</Hz>
$$ </Window>
$$ <Window Dim="f0">
$$ <Points>1</Points>
$$ </Window>
$$ </MnovaSpectrumParams>
##$PARAMETER FILE=	(title, ASCII, , 0)
$$ 
##XUNITS=	HZ
##YUNITS=	ARBITRARY UNITS
##FIRSTX=	5002.6000000000003638
##LASTX=	-1250.5545829772950128
##DELTAX=	-0.095417022705078125
##XFACTOR=	1
##YFACTOR=	5.536227381888261155E-11
##FIRSTY=	5.9237632576980558952E-09
##MINY=	0
##MAXY=	0.11888957768678665161
##NPOINTS=	65536
##XYDATA=	(X++(Y..Y))
$$ [...]
855A0653KKJKKKKKKJKKKKKKKJKKKKKKKKKKJKKKKKKKKKKKKKKKKKKKKKKKKKKKKKKKKKKKKKKK
848A0785LKKKKKKKKKKKLKKKKKKKLKKKKKKLKKKKKLKKKKLKKKKLKKKLKKKKLKKKLKKLKKKLKKKL
842A0934KKLKKLKKLKKLKKLKKLKKLKLKKLKKLKLKLKKLKLKKLKLKLKLKLKKLKLKLKLKLKLKLKLLK
835A1098LKLKLKLKLLKLKLKLLKLKLLKLKLLKLLKLLKLKLLKLLKLLLKLLKLLKLLLKLLLKLLLKLLLK
829A1278LLLKLLLLKLLLLKLLLLLKLLLLLLKLLLLLLLKLLLLLLLLLLLKLLLLLLLLLLLLLLLLLLLLL
822A1475LLLLLLLLLLLLLLMLLLLLLLLLLLMLLLLLLLMLLLLLMLLLLLMLLLLLMLLLMLLLLMLLLMLL
816A1688LMLLMLLLMLLMLLMLLLMLLMLMLLMLLMLLMLMLLMLMLLMLMLMLLMLMLMLMLMLMLMLLMMLM
809A1919LMLMLMLMLMLMMLMLMLMMLMLMMLMLMMLMMLMMLMMLMMLMMLMMLMMMLMMLMMMLMMMLMMML
$$ plain form
855 10653 10655 10657 10658 10660 10662 10664 10666 10668 10670 10671 10673 10675 10677 10679 10681 10683 10685 10686 10688 10690 10692 10694 10696 10698 10700 10702 10704 10706 10707 10709 10711 10713 10715 10717 10719 10721 10723 10725 10727 10729 10731 10733 10735 10737 10739 10741 10743 10745 10747 10749 10751 10753 10755 10757 10759 10761 10763 10765 10767 10769 10771 10773 10775 10777 10779 10781 10783 10785
848 10785 10788 10790 10792 10794 10796 10798 10800 10802 10804 10806 10808 10810 10813 10815 10817 10819 10821 10823 10825 10827 10830 10832 10834 10836 10838 10840 10842 10845 10847 10849 10851 10853 10855 10858 10860 10862 10864 10866 10869 10871 10873 10875 10877 10880 10882 10884 10886 10889 10891 10893 10895 10897 10900 10902 10904 10906 10909 10911 10913 10916 10918 10920 10922 10925 10927 10929 10931 10934
842 10934 10936 10938 10941 10943 10945 10948 10950 10952 10955 10957 10959 10962 10964 10966 10969 10971 10973 10976 10978 10980 10983 10985 10988 10990 10992 10995 10997 10999 11002 11004 11007 11009 11012 11014 11016 11019 11021 11024 11026 11028 11031 11033 11036 11038 11041 11043 11046 11048 11051 11053 11055 11058 11060 11063 11065 11068 11070 11073 11075 11078 11080 11083 11085 11088 11090 11093 11096 11098
835 11098 11101 11103 11106 11108 11111 11113 11116 11118 11121 11124 11126 11129 11131 11134 11136 11139 11142 11144 11147 11149 11152 11155 11157 11160 11162 11165 11168 11170 11173 11176 11178 11181 11184 11186 11189 11191 11194 11197 11199 11202 11205 11207 11210 11213 11216 11218 11221 11224 11226 11229 11232 11234 11237 11240 11243 11245 11248 11251 11254 11256 11259 11262 11265 11267 11270 11273 11276 11278
829 11278 11281 11284 11287 11289 11292 11295 11298 11301 11303 11306 11309 11312 11315 11317 11320 11323 11326 11329 11332 11334 11337 11340 11343 11346 11349 11352 11354 11357 11360 11363 11366 11369 11372 11375 11377 11380 11383 11386 11389 11392 11395 11398 11401 11404 11407 11410 11412 11415 11418 11421 11424 11427 11430 11433 11436 11439 11442 11445 11448 11451 11454 11457 11460 11463 11466 11469 11472 11475
822 11475 11478 11481 11484 11487 11490 11493 11496 11499 11502 11505 11508 11511 11514 11517 11521 11524 11527 11530 11533 11536 11539 11542 11545 11548 11551 11554 11558 11561 11564 11567 11570 11573 11576 11579 11583 11586 11589 11592 11595 11598 11602 11605 11608 11611 11614 11617 11621 11624 11627 11630 11633 11636 11640 11643 11646 11649 11653 11656 11659 11662 11665 11669 11672 11675 11678 11682 11685 11688
816 11688 11691 11695 11698 11701 11705 11708 11711 11714 11718 11721 11724 11728 11731 11734 11738 11741 11744 11747 11751 11754 11757 11761 11764 11768 11771 11774 11778 11781 11784 11788 11791 11794 11798 11801 11805 11808 11811 11815 11818 11822 11825 11828 11832 11835 11839 11842 11846 11849 11852 11856 11859 11863 11866 11870 11873 11877 11880 11884 11887 11891 11894 11898 11901 11904 11908 11912 11915 11919
809 11919 11922 11926 11929 11933 11936 11940 11943 11947 11950 11954 11957 11961 11965 11968 11972 11975 11979 11982 11986 11990 11993 11997 12000 12004 12008 12011 12015 12018 12022 12026 12029 12033 12037 12040 12044 12048 12051 12055 12059 12062 12066 12070 12073 12077 12081 12084 12088 12092 12095 12099 12103 12107 12110 12114 12118 12121 12125 12129 12133 12136 12140 12144 12148 12151 12155 12159 12163 12166
803A2166MMMMLMMMMLMMMMMLMMMMMMLMMMMMMMLMMMMMMMMMMMMMMLMMMMMMMMMMMMMMMMMMMNMM
796A2433MMMMMMMMMMMNMMMMMMMMNMMMMMNMMMMMNMMMMNMMMMNMMMNMMMNMMMNMMNMMMNMMNMMN
790A2718MMNMMNMNMMNMMNMNMMNMNMNMMNMNMNMNMNMNMNMNMNMNMNMNMNMNNMNMNMNNMNMNNMNN
783A3023MNMNNMNNMNNMNNNMNNMNNNMNNNMNNNMNNNMNNNNMNNNNNMNNNNNNMNNNNNNNNNMNNNNN
777A3348NNNNNNNNNNNNNNNNNNNNNNNNNNNNNONNNNNNNNONNNNNNONNNNNONNNNONNNONNNONNN
770A3695ONNONNNONNONNONNONNONONNONONNONONONNONONONONONONONONONOONONONOONONOO
764A4066NONOONOONOONOONOOONOONOOONOOONOOOONOOOOONOOOOONOOOOOOOOONOOOOOOOOOOO
757A4460OOOOOOOOOOOOOOOOPOOOOOOOOOPOOOOOPOOOOOPOOOPOOOOPOOPOOOPOOPOOPOOPOOPO
$$ plain form
803 12166 12170 12174 12178 12182 12185 12189 12193 12197 12201 12204 12208 12212 12216 12220 12224 12227 12231 12235 12239 12243 12247 12251 12254 12258 12262 12266 12270 12274 12278 12282 12285 12289 12293 12297 12301 12305 12309 12313 12317 12321 12325 12329 12333 12337 12341 12344 12348 12352 12356 12360 12364 12368 12372 12376 12380 12384 12388 12392 12396 12400 12404 12408 12412 12416 12420 12425 12429 12433
796 12433 12437 12441 12445 12449 12453 12457 12461 12465 12469 12473 12477 12482 12486 12490 12494 12498 12502 12506 12510 12514 12519 12523 12527 12531 12535 12539 12544 12548 12552 12556 12560 12564 12569 12573 12577 12581 12585 12590 12594 12598 12602 12606 12611 12615 12619 12623 12628 12632 12636 12640 12645 12649 12653 12657 12662 12666 12670 12675 12679 12683 12687 12692 12696 12700 12705 12709 12713 12718
790 12718 12722 12726 12731 12735 12739 12744 12748 12753 12757 12761 12766 12770 12774 12779 12783 12788 12792 12796 12801 12805 12810 12814 12819 12823 12827 12832 12836 12841 12845 12850 12854 12859 12863 12868 12872 12877 12881 12886 12890 12895 12899 12904 12908 12913 12917 12922 12926 12931 12935 12940 12944 12949 12954 12958 12963 12967 12972 12976 12981 12986 12990 12995 12999 13004 13009 13013 13018 13023
783 13023 13027 13032 13036 13041 13046 13050 13055 13060 13064 13069 13074 13078 13083 13088 13093 13097 13102 13107 13111 13116 13121 13126 13130 13135 13140 13145 13149 13154 13159 13164 13168 13173 13178 13183 13187 13192 13197 13202 13207 13211 13216 13221 13226 13231 13236 13240 13245 13250 13255 13260 13265 13270 13274 13279 13284 13289 13294 13299 13304 13309 13314 13319 13323 13328 13333 13338 13343 13348
777 13348 13353 13358 13363 13368 13373 13378 13383 13388 13393 13398 13403 13408 13413 13418 13423 13428 13433 13438 13443 13448 13453 13458 13463 13468 13473 13478 13483 13488 13493 13499 13504 13509 13514 13519 13524 13529 13534 13539 13545 13550 13555 13560 13565 13570 13575 13581 13586 13591 13596 13601 13606 13612 13617 13622 13627 13632 13638 13643 13648 13653 13659 13664 13669 13674 13680 13685 13690 13695
770 13695 13701 13706 13711 13717 13722 13727 13732 13738 13743 13748 13754 13759 13764 13770 13775 13780 13786 13791 13796 13802 13807 13813 13818 13823 13829 13834 13840 13845 13850 13856 13861 13867 13872 13878 13883 13888 13894 13899 13905 13910 13916 13921 13927 13932 13938 13943 13949 13954 13960 13965 13971 13976 13982 13987 13993 13999 14004 14010 14015 14021 14026 14032 14038 14043 14049 14054 14060 14066
764 14066 14071 14077 14082 14088 14094 14099 14105 14111 14116 14122 14128 14133 14139 14145 14150 14156 14162 14168 14173 14179 14185 14190 14196 14202 14208 14213 14219 14225 14231 14236 14242 14248 14254 14260 14265 14271 14277 14283 14289 14295 14300 14306 14312 14318 14324 14330 14335 14341 14347 14353 14359 14365 14371 14377 14383 14389 14394 14400 14406 14412 14418 14424 14430 14436 14442 14448 14454 14460
757 14460 14466 14472 14478 14484 14490 14496 14502 14508 14514 14520 14526 14532 14538 14544 14550 14556 14563 14569 14575 14581 14587 14593 14599 14605 14611 14617 14624 14630 14636 14642 14648 14654 14661 14667 14673 14679 14685 14691 14698 14704 14710 14716 14723 14729 14735 14741 14747 14754 14760 14766 14773 14779 14785 14791 14798 14804 14810 14817 14823 14829 14836 14842 14848 14855 14861 14867 14874 14880
751A4880OPOPOOPOPOPOOPOPOPOPOPOPOPOPOPOPPOPOPPOPOPPOPPOPPOPPOPPOPPPOPPPOPPPO
744A5327PPPPOPPPPPOPPPPPPPPOPPPPPPPPPPPPPPPPPPPPPPPPPPPQPPPPPPPQPPPPPQPPPPQP
738A5804PPQPPPQPPPQPPQPPQPPQPQPPQPQPPQPQPQPQPPQPQQPQPQPQPQPQQPQPQQPQQPQQPQQP
731A6311QQQPQQPQQQQPQQQQPQQQQQPQQQQQQQQQQPQQQQQQQQQQQQQRQQQQQQQQQQRQQQQQRQQQ
725A6852QRQQQRQQQRQQRQQRQQRQQRQRQQRQRQQRQRQRQRQRQRRQRQRQRRQRQRRQRRQRRQRRRQRR
718A7429RQRRRRQRRRRRQRRRRRRRRRQRRRRRRRRRRRRJ0RRRRRRRRRJ0RRRRRJ0RRRJ0RRRJ0RRR
712A7997J0RRJ0RRJ0RRJ0RJ0RRJ0RJ0RJ0RJ0RJ0RJ0RJ0RJ0RJ0J0RJ0RJ0J0RJ0J0RJ0J0RJ0
708A8425J0J0RJ0J0J0RJ0J0J0J0RJ0J0J0J0J0RJ0J0J0J0J0J0J0J0J0J0J0J0J0J0J0J0J0J0
$$ plain form
751 14880 14886 14893 14899 14906 14912 14918 14925 14931 14938 14944 14951 14957 14963 14970 14976 14983 14989 14996 15002 15009 15015 15022 15028 15035 15041 15048 15054 15061 15067 15074 15080 15087 15094 15100 15107 15113 15120 15127 15133 15140 15146 15153 15160 15166 15173 15180 15186 15193 15200 15206 15213 15220 15226 15233 15240 15246 15253 15260 15267 15273 15280 15287 15294 15300 15307 15314 15321 15327
744 15327 15334 15341 15348 15355 15361 15368 15375 15382 15389 15396 15402 15409 15416 15423 15430 15437 15444 15451 15458 15464 15471 15478 15485 15492 15499 15506 15513 15520 15527 15534 15541 15548 15555 15562 15569 15576 15583 15590 15597 15604 15611 15618 15625 15632 15639 15646 15653 15661 15668 15675 15682 15689 15696 15703 15710 15718 15725 15732 15739 15746 15753 15761 15768 15775 15782 15789 15797 15804
738 15804 15811 15818 15826 15833 15840 15847 15855 15862 15869 15876 15884 15891 15898 15906 15913 15920 15928 15935 15942 15950 15957 15965 15972 15979 15987 15994 16002 16009 16016 16024 16031 16039 16046 16054 16061 16069 16076 16083 16091 16098 16106 16114 16121 16129 16136 16144 16151 16159 16166 16174 16181 16189 16197 16204 16212 16219 16227 16235 16242 16250 16258 16265 16273 16281 16288 16296 16304 16311
731 16311 16319 16327 16335 16342 16350 16358 16365 16373 16381 16389 16397 16404 16412 16420 16428 16436 16443 16451 16459 16467 16475 16483 16490 16498 16506 16514 16522 16530 16538 16546 16554 16562 16570 16577 16585 16593 16601 16609 16617 16625 16633 16641 16649 16657 16665 16673 16681 16690 16698 16706 16714 16722 16730 16738 16746 16754 16762 16770 16779 16787 16795 16803 16811 16819 16828 16836 16844 16852
725 16852 16860 16869 16877 16885 16893 16902 16910 16918 16926 16935 16943 16951 16960 16968 16976 16985 16993 17001 17010 17018 17026 17035 17043 17052 17060 17068 17077 17085 17094 17102 17110 17119 17127 17136 17144 17153 17161 17170 17178 17187 17195 17204 17213 17221 17230 17238 17247 17255 17264 17273 17281 17290 17298 17307 17316 17324 17333 17342 17350 17359 17368 17376 17385 17394 17403 17411 17420 17429
718 17429 17438 17446 17455 17464 17473 17482 17490 17499 17508 17517 17526 17535 17543 17552 17561 17570 17579 17588 17597 17606 17615 17624 17632 17641 17650 17659 17668 17677 17686 17695 17704 17713 17722 17731 17740 17750 17759 17768 17777 17786 17795 17804 17813 17822 17831 17841 17850 17859 17868 17877 17886 17896 17905 17914 17923 17933 17942 17951 17960 17970 17979 17988 17997
712 17997 18007 18016 18025 18035 18044 18053 18063 18072 18081 18091 18100 18110 18119 18128 18138 18147 18157 18166 18176 18185 18195 18204 18214 18223 18233 18242 18252 18261 18271 18280 18290 18300 18309 18319 18328 18338 18348 18357 18367 18377 18386 18396 18406 18415 18425
708 18425 18435 18445 18454 18464 18474 18484 18493 18503 18513 18523 18533 18542 18552 18562 18572 18582 18592 18601 18611 18621 18631 18641 18651 18661 18671 18681 18691 18701 18711 18721 18731 18741 18751 18761 18771 18781
705A8781J0J0J0J0J0J0J1J0J0J0J0J0J1J0J0J0J0J1J0J0J0J1J0J0J0J1J0J0J1J0J1J0J0J1
701A9129J0J0J1J0J1J0J1J0J1J0J1J0J1J0J1J0J1J1J0J1J0J1J1J0J1J1J0J1J1J0J1J1J1J0
698A9488J1J1J1J0J1J1J1J1J0J1J1J1J1J1J1J1J1J1J1J0J1J1J1J1J1J2J1J1J1J1J1J1J1J1
695A9860J1J1J2J1J1J1J1J1J2J1J1J1J2J1J1J2J1J1J2J1J1J2J1J1J2J1J2J1J1J2J1J2J1J2
692B0245J1J2J1J2J2J1J2J1J2J2J1J2J2J1J2J2J1J2J2J1J2J2J2J2J1J2J2J2J2J1J2J2J2J2
688B0643J2J2J2J2J2J2J2J2J2J2J2J2J2J2J2J2J2J2J3J2J2J2J2J2J3J2J2J2J3J2J2J3J2J2
685B1055J3J2J2J3J2J2J3J2J3J2J3J2J3J2J3J2J3J2J3J2J3J3J2J3J3J2J3J3J2J3J3J2J3J3
682B1482J3J3J2J3J3J3J3J3J2J3J3J3J3J3J3J3J3J3J3J3J3J3J3J3J4J3J3J3J3J3J3J4J3J3
$$ plain form
705 18781 18791 18801 18811 18821 18831 18841 18852 18862 18872 18882 18892 18902 18913 18923 18933 18943 18953 18964 18974 18984 18994 19005 19015 19025 19035 19046 19056 19066 19077 19087 19098 19108 19118 19129
701 19129 19139 19149 19160 19170 19181 19191 19202 19212 19223 19233 19244 19254 19265 19275 19286 19296 19307 19318 19328 19339 19349 19360 19371 19381 19392 19403 19413 19424 19435 19445 19456 19467 19478 19488
698 19488 19499 19510 19521 19531 19542 19553 19564 19575 19585 19596 19607 19618 19629 19640 19651 19662 19673 19684 19695 19705 19716 19727 19738 19749 19760 19772 19783 19794 19805 19816 19827 19838 19849 19860
695 19860 19871 19882 19894 19905 19916 19927 19938 19949 19961 19972 19983 19994 20006 20017 20028 20040 20051 20062 20074 20085 20096 20108 20119 20130 20142 20153 20165 20176 20187 20199 20210 20222 20233 20245
692 20245 20256 20268 20279 20291 20303 20314 20326 20337 20349 20361 20372 20384 20396 20407 20419 20431 20442 20454 20466 20477 20489 20501 20513 20525 20536 20548 20560 20572 20584 20595 20607 20619 20631 20643
688 20643 20655 20667 20679 20691 20703 20715 20727 20739 20751 20763 20775 20787 20799 20811 20823 20835 20847 20859 20872 20884 20896 20908 20920 20932 20945 20957 20969 20981 20994 21006 21018 21031 21043 21055
685 21055 21068 21080 21092 21105 21117 21129 21142 21154 21167 21179 21192 21204 21217 21229 21242 21254 21267 21279 21292 21304 21317 21330 21342 21355 21368 21380 21393 21406 21418 21431 21444 21456 21469 21482
682 21482 21495 21508 21520 21533 21546 21559 21572 21585 21597 21610 21623 21636 21649 21662 21675 21688 21701 21714 21727 21740 21753 21766 21779 21792 21806 21819 21832 21845 21858 21871 21884 21898 21911 21924
679B1924J3J4J3J3J3J4J3J3J4J3J3J4J3J4J3J4J3J4J3J4J3J4J3J4J3J4J3J4J4J3J4J4J3J4
675B2382J4J4J3J4J4J4J4J3J4J4J4J4J4J4J4J3J4J4J4J4J4J4J4J5J4J4J4J4J4J4J4J5J4J4
672B2857J4J4J5J4J4J5J4J4J5J4J4J5J4J5J4J4J5J4J5J4J5J5J4J5J4J5J5J4J5J5J4J5J5J4
669B3349J5J5J5J5J4J5J5J5J5J5J5J5J4J5J5J5J5J5J6J5J5J5J5J5J5J5J5J6J5J5J5J6J5J5
666B3860J5J6J5J6J5J5J6J5J6J5J6J5J6J5J6J5J6J5J6J6J5J6J6J5J6J6J6J5J6J6J6J6J5J6
662B4390J6J6J6J6J6J6J6J6J6J6J6J6J6J6J7J6J6J6J6J7J6J6J6J7J6J6J7J6J6J7J6J7J6J7
659B4941J6J7J6J7J6J7J7J6J7J7J6J7J7J6J7J7J7J7J7J6J7J7J7J7J7J7J7J7J7J7J7J7J7J7
656B5512J8J7J7J7J7J8J7J7J7J8J7J8J7J7J8J7J8J7J8J7J8J7J8J7J8J8J7J8J8J7J8J8J8J8
$$ plain form
679 21924 21937 21951 21964 21977 21990 22004 22017 22030 22044 22057 22070 22084 22097 22111 22124 22138 22151 22165 22178 22192 22205 22219 22232 22246 22259 22273 22286 22300 22314 22327 22341 22355 22368 22382
675 22382 22396 22410 22423 22437 22451 22465 22479 22492 22506 22520 22534 22548 22562 22576 22590 22603 22617 22631 22645 22659 22673 22687 22701 22716 22730 22744 22758 22772 22786 22800 22814 22829 22843 22857
672 22857 22871 22885 22900 22914 22928 22943 22957 22971 22986 23000 23014 23029 23043 23058 23072 23086 23101 23115 23130 23144 23159 23174 23188 23203 23217 23232 23247 23261 23276 23291 23305 23320 23335 23349
669 23349 23364 23379 23394 23409 23423 23438 23453 23468 23483 23498 23513 23528 23542 23557 23572 23587 23602 23617 23633 23648 23663 23678 23693 23708 23723 23738 23753 23769 23784 23799 23814 23830 23845 23860
666 23860 23875 23891 23906 23922 23937 23952 23968 23983 23999 24014 24030 24045 24061 24076 24092 24107 24123 24138 24154 24170 24185 24201 24217 24232 24248 24264 24280 24295 24311 24327 24343 24359 24374 24390
662 24390 24406 24422 24438 24454 24470 24486 24502 24518 24534 24550 24566 24582 24598 24614 24631 24647 24663 24679 24695 24712 24728 24744 24760 24777 24793 24809 24826 24842 24858 24875 24891 24908 24924 24941
659 24941 24957 24974 24990 25007 25023 25040 25057 25073 25090 25107 25123 25140 25157 25173 25190 25207 25224 25241 25258 25274 25291 25308 25325 25342 25359 25376 25393 25410 25427 25444 25461 25478 25495 25512
656 25512 25530 25547 25564 25581 25598 25616 25633 25650 25667 25685 25702 25720 25737 25754 25772 25789 25807 25824 25842 25859 25877 25894 25912 25929 25947 25965 25982 26000 26018 26035 26053 26071 26089 26107
653B6107J7J8J8J8J8J8J8J8J8J8J8J8J8J8J8J8J8J9J8J8J8J9J8J8J8J9J8J9J8J8J9J8J9J8
649B6724J9J8J9J9J8J9J9J8J9J9J8J9J9J9J9J9J8J9J9J9J9J9J9J9J9J9K0J9J9J9J9J9K0J9
646B7367J9K0J9J9K0J9J9K0J9K0J9K0J9K0K0J9K0K0J9K0K0K0J9K0K0K0K0K0K0K0K0K0K0K0
643B8036K0K0K0K0K0K1K0K0K0K1K0K0K1K0K1K0K0K1K0K1K1K0K1K0K1K1K1K0K1K1K1K0K1K1
640B8732K1K1K1K1K1K1K1K1K1K2K1K1K1K1K2K1K1K2K1K2K1K1K2K1K2K2K1K2K1K2K2K1K2K2
637B9458K2K2K1K2K2K2K2K2K2K2K2K2K3K2K2K2K2K3K2K2K3K2K2K3K2K3K2K3K2K3K3K2K3K3
633C0215K2K3K3K3K3K3K2K3K3K3K3K3K4K3K3K3K3K3K4K3K3K4K3K3K4K3K4K3K4K3K4K4K3K4
630C1004K4K4K3K4K4K4K4K4K4K4K4K4K4K4K4K4K5K4K4K4K5K4K5K4K4K5K5K4K5K4K5K5K4K5
$$ plain form
653 26107 26124 26142 26160 26178 26196 26214 26232 26250 26268 26286 26304 26322 26340 26358 26376 26394 26412 26431 26449 26467 26485 26504 26522 26540 26558 26577 26595 26614 26632 26650 26669 26687 26706 26724
649 26724 26743 26761 26780 26799 26817 26836 26855 26873 26892 26911 26929 26948 26967 26986 27005 27024 27042 27061 27080 27099 27118 27137 27156 27175 27194 27213 27233 27252 27271 27290 27309 27328 27348 27367
646 27367 27386 27406 27425 27444 27464 27483 27502 27522 27541 27561 27580 27600 27619 27639 27659 27678 27698 27718 27737 27757 27777 27797 27816 27836 27856 27876 27896 27916 27936 27956 27976 27996 28016 28036
643 28036 28056 28076 28096 28116 28136 28157 28177 28197 28217 28238 28258 28278 28299 28319 28340 28360 28380 28401 28421 28442 28463 28483 28504 28524 28545 28566 28587 28607 28628 28649 28670 28690 28711 28732
640 28732 28753 28774 28795 28816 28837 28858 28879 28900 28921 28943 28964 28985 29006 29027 29049 29070 29091 29113 29134 29156 29177 29198 29220 29241 29263 29285 29306 29328 29349 29371 29393 29414 29436 29458
637 29458 29480 29502 29523 29545 29567 29589 29611 29633 29655 29677 29699 29721 29744 29766 29788 29810 29832 29855 29877 29899 29922 29944 29966 29989 30011 30034 30056 30079 30101 30124 30147 30169 30192 30215
633 30215 30237 30260 30283 30306 30329 30352 30374 30397 30420 30443 30466 30489 30513 30536 30559 30582 30605 30628 30652 30675 30698 30722 30745 30768 30792 30815 30839 30862 30886 30909 30933 30957 30980 31004
630 31004 31028 31052 31075 31099 31123 31147 31171 31195 31219 31243 31267 31291 31315 31339 31363 31387 31412 31436 31460 31484 31509 31533 31558 31582 31606 31631 31656 31680 31705 31729 31754 31779 31803 31828
627C1828K5K5K5K4K5K5K5K5K5K5K5K6K5K5K5K5K6K5K5K6K5K6K5K6K5K6K6K5K6K6K5K6K6K6
624C2689K6K6K6K6K6K6K6K6K6K6K7K6K6K7K6K6K7K6K7K6K7K7K6K7K7K6K7K7K7K7K7K7K7K7
620C3589K7K7K7K7K8K7K7K8K7K7K8K7K8K7K8K8K7K8K8K7K8K8K8K8K8K8K8K8K8K8K8K9K8K8
617C4530K9K8K8K9K8K9K8K9K9K8K9K9K9K9K8K9K9K9K9K9L0K9K9K9L0K9K9L0K9L0K9L0K9L0
614C5516L0K9L0L0L0L0L0L0L0L0L0L0L0L0L0L1L0L1L0L0L1L1L0L1L0L1L1L1L1L1L0L1L2L1
611C6549L1L1L1L1L2L1L1L2L1L2L1L2L2L1L2L2L2L1L2L2L2L2L2L3L2L2L2L3L2L2L3L2L3L3
607C7632L2L3L3L2L3L3L3L3L3L3L3L3L4L3L3L4L3L3L4L3L4L4L3L4L4L4L4L4L4L4L4L4L4L4
604C8768L4L5L4L5L4L5L4L5L5L4L5L5L5L5L5L5L5L5L5L5L6L5L5L6L5L6L6L5L6L6L6L5L6L6
$$ plain form
627 31828 31853 31878 31903 31927 31952 31977 32002 32027 32052 32077 32102 32128 32153 32178 32203 32228 32254 32279 32304 32330 32355 32381 32406 32432 32457 32483 32509 32534 32560 32586 32611 32637 32663 32689
624 32689 32715 32741 32767 32793 32819 32845 32871 32897 32923 32949 32976 33002 33028 33055 33081 33107 33134 33160 33187 33213 33240 33267 33293 33320 33347 33373 33400 33427 33454 33481 33508 33535 33562 33589
620 33589 33616 33643 33670 33697 33725 33752 33779 33807 33834 33861 33889 33916 33944 33971 33999 34027 34054 34082 34110 34137 34165 34193 34221 34249 34277 34305 34333 34361 34389 34417 34445 34474 34502 34530
617 34530 34559 34587 34615 34644 34672 34701 34729 34758 34787 34815 34844 34873 34902 34931 34959 34988 35017 35046 35075 35104 35134 35163 35192 35221 35251 35280 35309 35339 35368 35398 35427 35457 35486 35516
614 35516 35546 35575 35605 35635 35665 35695 35725 35755 35785 35815 35845 35875 35905 35935 35965 35996 36026 36057 36087 36117 36148 36179 36209 36240 36270 36301 36332 36363 36394 36425 36455 36486 36518 36549
611 36549 36580 36611 36642 36673 36705 36736 36767 36799 36830 36862 36893 36925 36957 36988 37020 37052 37084 37115 37147 37179 37211 37243 37275 37308 37340 37372 37404 37437 37469 37501 37534 37566 37599 37632
607 37632 37664 37697 37730 37762 37795 37828 37861 37894 37927 37960 37993 38026 38060 38093 38126 38160 38193 38226 38260 38293 38327 38361 38394 38428 38462 38496 38530 38564 38598 38632 38666 38700 38734 38768
604 38768 38802 38837 38871 38906 38940 38975 39009 39044 39079 39113 39148 39183 39218 39253 39288 39323 39358 39393 39428 39463 39499 39534 39569 39605 39640 39676 39712 39747 39783 39819 39855 39890 39926 39962
601C9962L6L6L7L6L6L6L7L6L7L6L7L6L7L7L6L7L7L7L7L7L7L7L8L7L7L8L7L8L7L8L8L7L8L8
598D1218L8L8L8L8L8L8L9L8L8L9L8L9L8L9L9L8L9L9L9L9L9L9M0L9L9M0L9L9M0M0L9M0M0M0
594D2540M0M0M0M0M0M0M0M1M0M1M0M1M1M0M1M1M1M1M1M1M1M1M2M1M2M1M2M1M2M2M2M1M2M2
591D3932M3M2M2M2M3M2M3M2M3M2M3M3M3M3M3M3M3M3M4M3M4M3M4M3M4M4M4M4M4M4M4M4M4M5
588D5402M4M5M4M5M5M4M5M5M5M5M5M6M5M5M6M5M6M5M6M6M6M6M6M6M6M7M6M6M7M6M7M7M7M6
585D6953M7M7M7M8M7M7M8M7M8M7M8M8M8M8M8M8M8M9M8M8M9M8M9M9M9M9M9M9M9M9N0M9N0M9
581D8594N0N0N0M9N0N1N0N0N0N1N0N1N1N0N1N1N1N1N2N1N1N2N1N2N2N2N2N2N2N2N2N3N2N3
578E0332N2N3N3N3N3N3N3N3N4N3N4N3N4N4N4N4N4N4N4N5N4N5N5N4N5N5N5N6N5N5N6N5N6N6
$$ plain form
601 39962 39998 40034 40071 40107 40143 40179 40216 40252 40289 40325 40362 40398 40435 40472 40508 40545 40582 40619 40656 40693 40730 40767 40805 40842 40879 40917 40954 40992 41029 41067 41105 41142 41180 41218
598 41218 41256 41294 41332 41370 41408 41446 41485 41523 41561 41600 41638 41677 41715 41754 41793 41831 41870 41909 41948 41987 42026 42065 42105 42144 42183 42223 42262 42301 42341 42381 42420 42460 42500 42540
594 42540 42580 42620 42660 42700 42740 42780 42820 42861 42901 42942 42982 43023 43064 43104 43145 43186 43227 43268 43309 43350 43391 43432 43474 43515 43557 43598 43640 43681 43723 43765 43807 43848 43890 43932
591 43932 43975 44017 44059 44101 44144 44186 44229 44271 44314 44356 44399 44442 44485 44528 44571 44614 44657 44700 44744 44787 44831 44874 44918 44961 45005 45049 45093 45137 45181 45225 45269 45313 45357 45402
588 45402 45446 45491 45535 45580 45625 45669 45714 45759 45804 45849 45894 45940 45985 46030 46076 46121 46167 46212 46258 46304 46350 46396 46442 46488 46534 46581 46627 46673 46720 46766 46813 46860 46907 46953
585 46953 47000 47047 47094 47142 47189 47236 47284 47331 47379 47426 47474 47522 47570 47618 47666 47714 47762 47811 47859 47907 47956 48004 48053 48102 48151 48200 48249 48298 48347 48396 48446 48495 48545 48594
581 48594 48644 48694 48744 48793 48843 48894 48944 48994 49044 49095 49145 49196 49247 49297 49348 49399 49450 49501 49553 49604 49655 49707 49758 49810 49862 49914 49966 50018 50070 50122 50174 50227 50279 50332
578 50332 50384 50437 50490 50543 50596 50649 50702 50755 50809 50862 50916 50969 51023 51077 51131 51185 51239 51293 51347 51402 51456 51511 51566 51620 51675 51730 51785 51841 51896 51951 52007 52062 52118 52174
575E2174N5N6N6N7N6N6N7N6N7N7N6N7N7N8N7N7N8N7N8N8N8N8N8N8N8N9N8N9N8N9N9N9N9N9
572E4129O0N9O0O0N9O0O0O0O1O0O0O1O1O0O1O1O1O1O2O1O2O1O2O2O2O2O3O2O2O3O3O2O3O3
568E6209O4O3O3O4O3O4O4O4O4O4O5O4O5O5O4O5O5O6O5O5O6O6O6O6O6O6O6O7O6O7O7O7O7O7
565E8425O7O8O7O8O8O8O8O8O9O8O9O9O9O9O9O9P0O9P0P0P0P0P0P0P1P1P0P1P1P2P1P2P1P2
562F0789P2P2P2P2P3P3P2P3P3P4P3P3P4P4P4P4P4P4P5P5P4P5P6P5P5P6P6P5P6P7P6P7P6P7
559F3316P7P7P7P8P7P8P8P8P8P9P8P9P9P9P9P9Q0P9Q0Q0Q0Q1Q0Q1Q1Q1Q1Q1Q2Q1Q2Q2Q2Q3
555F6023Q2Q3Q3Q3Q3Q3Q4Q4Q3Q5Q4Q4Q5Q5Q5Q5Q5Q6Q5Q6Q6Q6Q7Q7Q6Q7Q7Q8Q7Q8Q8Q8Q8Q9
552F8928Q8Q9Q9R0Q9R0Q9R0R1R0R1R0R1R2R1R2R1R2R3R2R3R2R3R4R3R4R3R4R5R4R5R5R5R5
$$ plain form
575 52174 52229 52285 52341 52398 52454 52510 52567 52623 52680 52737 52793 52850 52907 52965 53022 53079 53137 53194 53252 53310 53368 53426 53484 53542 53600 53659 53717 53776 53834 53893 53952 54011 54070 54129
572 54129 54189 54248 54308 54368 54427 54487 54547 54607 54668 54728 54788 54849 54910 54970 55031 55092 55153 55214 55276 55337 55399 55460 55522 55584 55646 55708 55771 55833 55895 55958 56021 56083 56146 56209
568 56209 56273 56336 56399 56463 56526 56590 56654 56718 56782 56846 56911 56975 57040 57105 57169 57234 57299 57365 57430 57495 57561 57627 57693 57759 57825 57891 57957 58024 58090 58157 58224 58291 58358 58425
565 58425 58492 58560 58627 58695 58763 58831 58899 58967 59036 59104 59173 59242 59311 59380 59449 59518 59588 59657 59727 59797 59867 59937 60007 60077 60148 60219 60289 60360 60431 60503 60574 60646 60717 60789
562 60789 60861 60933 61005 61077 61150 61223 61295 61368 61441 61515 61588 61661 61735 61809 61883 61957 62031 62105 62180 62255 62329 62404 62480 62555 62630 62706 62782 62857 62933 63010 63086 63163 63239 63316
559 63316 63393 63470 63547 63625 63702 63780 63858 63936 64014 64093 64171 64250 64329 64408 64487 64566 64646 64725 64805 64885 64965 65046 65126 65207 65288 65369 65450 65531 65613 65694 65776 65858 65940 66023
555 66023 66105 66188 66271 66354 66437 66520 66604 66688 66771 66856 66940 67024 67109 67194 67279 67364 67449 67535 67620 67706 67792 67878 67965 68052 68138 68225 68312 68400 68487 68575 68663 68751 68839 68928
552 68928 69016 69105 69194 69284 69373 69463 69552 69642 69733 69823 69914 70004 70095 70187 70278 70370 70461 70553 70646 70738 70831 70923 71016 71110 71203 71297 71390 71484 71579 71673 71768 71863 71958 72053
549G2053R5R6R6R6R7R6R7R7R7R8R7R8R8R8R9R9R9R9R9J00J00J00J00J01J01J01J01J01J02
546G4911J02J02J03J02J03J03J04J03J04J04J04J05J05J05J05J05J06J06J06J07J07J07J07
544G7316J07J08J08J08J09J09J09J09J10J09J10J11J10J11J11J12J11J12J12J13J12J13J14
542G9854J13J14J14J14J15J15J15J15J16J16J16J17J17J17J17J18J18J18J19J19J19J19J20
540H2535J20J20J21J21J21J22J21J22J23J23J23J23J24J23J25J24J25J25J26J26J26J26J27
537H5372J27J28J27J28J29J28J29J30J29J30J31J30J31J32J32J32J32J33J33J33J34J34J34
535H8378J35J35J36J35J37J36J37J37J38J38J38J39J39J39J40J40J41J41J41J42J42J42J43
533I1569J43J43J44J45J44J45J46J46J46J47J47J47J48J48J49J49J49J50J50J51J51J51J52
$$ plain form
549 72053 72148 72244 72340 72436 72533 72629 72726 72823 72920 73018 73115 73213 73311 73409 73508 73607 73706 73805 73904 74004 74104 74204 74304 74405 74506 74607 74708 74809 74911
546 74911 75013 75115 75218 75320 75423 75526 75630 75733 75837 75941 76045 76150 76255 76360 76465 76570 76676 76782 76888 76995 77102 77209 77316
544 77316 77423 77531 77639 77747 77856 77965 78074 78183 78293 78402 78512 78623 78733 78844 78955 79067 79178 79290 79402 79515 79627 79740 79854
542 79854 79967 80081 80195 80309 80424 80539 80654 80769 80885 81001 81117 81234 81351 81468 81585 81703 81821 81939 82058 82177 82296 82415 82535
540 82535 82655 82775 82896 83017 83138 83260 83381 83503 83626 83749 83872 83995 84119 84242 84367 84491 84616 84741 84867 84993 85119 85245 85372
537 85372 85499 85627 85754 85882 86011 86139 86268 86398 86527 86657 86788 86918 87049 87181 87313 87445 87577 87710 87843 87976 88110 88244 88378
535 88378 88513 88648 88784 88919 89056 89192 89329 89466 89604 89742 89880 90019 90158 90297 90437 90577 90718 90859 91000 91142 91284 91426 91569
533 91569 91712 91855 91999 92144 92288 92433 92579 92725 92871 93018 93165 93312 93460 93608 93757 93906 94055 94205 94355 94506 94657 94808 94960
531I4960J53J52J54J53J54J54J55J56J55J56J57J57J57J58J59J58J59J60J60J61J61J61J62
529I8572J62J63J63J64J64J65J65J66J66J66J67J68J68J68J69J69J70J71J71J71J72J72J73
526A02425J74J73J75J75J75J76J76J77J78J78J78J79J80J80J81J81J81J83J82J84J84J84J85
524A06544J86J86J86J87J88J89J88J90J90J91J91J92J92J93J93J95J94J96J96J96J97J98J98
522A10956J99K00K00K01K01K02K03K03K04K05K05K06K07K07K08K08K09K10K11K11K12K12K13
520A15693K14K15K15K16K17K17K18K19K19K20K21K22K22K23K24K25K25K26K26K28K28K29K30
518A20792K30K32K32K32K34K34K35K36K37K37K39K39K40K40K42K42K43K44K45K46K46K48K48
515A26293K49K50K51K51K53K53K54K55K57K56K58K59K60K60K61K63K63K64K65K66K67K68K69
$$ plain form
531 94960 95113 95265 95419 95572 95726 95880 96035 96191 96346 96502 96659 96816 96973 97131 97290 97448 97607 97767 97927 98088 98249 98410 98572
529 98572 98734 98897 99060 99224 99388 99553 99718 99884 100050 100216 100383 100551 100719 100887 101056 101225 101395 101566 101737 101908 102080 102252 102425
526 102425 102599 102772 102947 103122 103297 103473 103649 103826 104004 104182 104360 104539 104719 104899 105080 105261 105442 105625 105807 105991 106175 106359 106544
524 106544 106730 106916 107102 107289 107477 107666 107854 108044 108234 108425 108616 108808 109000 109193 109386 109581 109775 109971 110167 110363 110560 110758 110956
522 110956 111155 111355 111555 111756 111957 112159 112362 112565 112769 112974 113179 113385 113592 113799 114007 114215 114424 114634 114845 115056 115268 115480 115693
520 115693 115907 116122 116337 116553 116770 116987 117205 117424 117643 117863 118084 118306 118528 118751 118975 119200 119425 119651 119877 120105 120333 120562 120792
518 120792 121022 121254 121486 121718 121952 122186 122421 122657 122894 123131 123370 123609 123849 124089 124331 124573 124816 125060 125305 125551 125797 126045 126293
515 126293 126542 126792 127043 127294 127547 127800 128054 128309 128566 128822 129080 129339 129599 129859 130120 130383 130646 130910 131175 131441 131708 131976 132245
513A32245K70K71K72K73K73K75K76K77K77K79K80K81K81K83K84K85K86K87K88K89K90K91K92
511A38705K94K94K96K96K98K99L00L01L02L04L04L06L07L08L09L10L12L12L14L15L17L17L19
509A45739L20L21L23L23L25L26L28L29L30L31L33L34L35L37L38L39L41L42L43L45L46L47L49
507A53424L50L52L53L55L56L57L59L60L62L63L65L66L68L70L70L73L74L75L77L79L80L82L83
504A61853L85L87L88L90L91L94L94L97L98M00M02M03M05M07M09M10M12M14M16M18M19M21M24
502A71137M25M26M29M31M32M35M36M39M40M42M44M47M48M50M53M54M57M58M61M63M65M67M69
500A81408M71M74M75M78M81M82M85M87M89M91M94M97M98N01N03N06N08N11N13N15N18N21N23
498A92829N25N28N31N33N36N39N41N44N47N49N52N55N57N60N64N66N68N72N75N77N81N83N86
$$ plain form
513 132245 132515 132786 133058 133331 133604 133879 134155 134432 134709 134988 135268 135549 135830 136113 136397 136682 136968 137255 137543 137832 138122 138413 138705
511 138705 138999 139293 139589 139885 140183 140482 140782 141083 141385 141689 141993 142299 142606 142914 143223 143533 143845 144157 144471 144786 145103 145420 145739
509 145739 146059 146380 146703 147026 147351 147677 148005 148334 148664 148995 149328 149662 149997 150334 150672 151011 151352 151694 152037 152382 152728 153075 153424
507 153424 153774 154126 154479 154834 155190 155547 155906 156266 156628 156991 157356 157722 158090 158460 158830 159203 159577 159952 160329 160708 161088 161470 161853
504 161853 162238 162625 163013 163403 163794 164188 164582 164979 165377 165777 166179 166582 166987 167394 167803 168213 168625 169039 169455 169873 170292 170713 171137
502 171137 171562 171988 172417 172848 173280 173715 174151 174590 175030 175472 175916 176363 176811 177261 177714 178168 178625 179083 179544 180007 180472 180939 181408
500 181408 181879 182353 182828 183306 183787 184269 184754 185241 185730 186221 186715 187212 187710 188211 188714 189220 189728 190239 190752 191267 191785 192306 192829
498 192829 193354 193882 194413 194946 195482 196021 196562 197106 197653 198202 198754 199309 199866 200426 200990 201556 202124 202696 203271 203848 204429 205012 205598
496B05598N90N92N96N98O02O05O07O11O15O17O21O24O27O31O34O37O41O44O47O51O55O58O62
493B19963O65O69O72O76O80O84O87O91O95O99P03P06P11P15P18P23P26P31P35P39P44P47P52
491B36231P56P61P65P69P74P78P83P88P92P97Q01Q07Q11Q16Q20Q26Q31Q35Q41Q46Q50Q56Q62
489B54796Q66Q72Q77Q83Q88Q94Q99R05R10R16R22R28R34R39R46R51R58R64R70R76R83R89R96
487B76162J002J008J015J022J029J035J043J049J057J063J071J078J085J092J100J108J115
485B94134J123J130J139J146J155J162J170J179J187J196J204J213J221J230J239J248J256
484C14332J266J276J284J294J304J313J323J333J342J353J363J373J384J394J405J415J426
482C37180J437J449J459J471J483J494J505J518J530J541J554J567J579J592J604J618J631
$$ plain form
496 205598 206188 206780 207376 207974 208576 209181 209788 210399 211014 211631 212252 212876 213503 214134 214768 215405 216046 216690 217337 217988 218643 219301 219963
493 219963 220628 221297 221969 222645 223325 224009 224696 225387 226082 226781 227484 228190 228901 229616 230334 231057 231783 232514 233249 233988 234732 235479 236231
491 236231 236987 237748 238513 239282 240056 240834 241617 242405 243197 243994 244795 245602 246413 247229 248049 248875 249706 250541 251382 252228 253078 253934 254796
489 254796 255662 256534 257411 258294 259182 260076 260975 261880 262790 263706 264628 265556 266490 267429 268375 269326 270284 271248 272218 273194 274177 275166 276162
487 276162 277164 278172 279187 280209 281238 282273 283316 284365 285422 286485 287556 288634 289719 290811 291911 293019 294134
485 294134 295257 296387 297526 298672 299827 300989 302159 303338 304525 305721 306925 308138 309359 310589 311828 313076 314332
484 314332 315598 316874 318158 319452 320756 322069 323392 324725 326067 327420 328783 330156 331540 332934 334339 335754 337180
482 337180 338617 340066 341525 342996 344479 345973 347478 348996 350526 352067 353621 355188 356767 358359 359963 361581 363212
480C63212J644J657J671J685J699J713J728J742J756J772J786J802J817J832J848J865J880
479C93109J897J913J930J947J965J981K000K017K036K053K073K091K110K129K149K169K189
477D27758K210K230K251K272K293K316K337K360K383K405K429K452K477K501K525K551K575
476D68325K602K628K654K681K708K736K764K792K822K850K881K910K941K973L004L036L068
474E16375L102L135L169L204L239L275L311L348L386L423L462L502L541L582L623L665L708
472E74050L751L795L840L885L931L979M027M075M125M176M226M279M332M387M441M497M554
471F44350M613M671M732M792M856M919M983N050N117N185N256N326N399N473N548N625N703
469G31598N783N865N948O033O119O207O297O390O483O579O677O776O879O983P089P198P308
$$ plain form
480 363212 364856 366513 368184 369869 371568 373281 375009 376751 378507 380279 382065 383867 385684 387516 389364 391229 393109
479 393109 395006 396919 398849 400796 402761 404742 406742 408759 410795 412848 414921 417012 419122 421251 423400 425569 427758
477 427758 429968 432198 434449 436721 439014 441330 443667 446027 448410 450815 453244 455696 458173 460674 463199 465750 468325
476 468325 470927 473555 476209 478890 481598 484334 487098 489890 492712 495562 498443 501353 504294 507267 510271 513307 516375
474 516375 519477 522612 525781 528985 532224 535499 538810 542158 545544 548967 552429 555931 559472 563054 566677 570342 574050
472 574050 577801 581596 585436 589321 593252 597231 601258 605333 609458 613634 617860 622139 626471 630858 635299 639796 644350
471 644350 648963 653634 658366 663158 668014 672933 677916 682966 688083 693268 698524 703850 709249 714722 720270 725895 731598
469 731598 737381 743246 749194 755227 761346 767553 773850 780240 786723 793302 799979 806755 813634 820617 827706 834904 842212
467H42212P423P538P656P778P902Q028Q157Q291Q425Q565Q706Q851R000R152R307R467R631
466I86089R797R969J0145J0324J0509J0698J0892J1091J1294J1504J1718J1939J2165J2397
464A140531J2635J2880J3131J3390J3655J3928J4208J4497J4793J5099J5412J5736J6068J6410
463A342373J6763J7126J7500J7886J8283J8693J9116J9552K0002K0466K0946K1440K1953K2480
462A614579K3027K3591K4176K4779K5405K6051K6722K7415K8135K8880K9652L0455L1285L2149
460A996301L3045L3975L4943L5948L6994L8081L9214M0392M1619M2899M4233M5624M7076M8592
459B558936N0175N1829N3559N5369N7263N9247O1325O3505O5790O8190P0710P3359P6144P9075
458C444476Q2162Q5414Q8845R2463R6286J00326J04598J09122J13914J18996J24389J30117
$$ plain form
467 842212 849635 857173 864829 872607 880509 888537 896694 904985 913410 921975 930681 939532 948532 957684 966991 976458 986089
466 986089 995886 1005855 1016000 1026324 1036833 1047531 1058423 1069514 1080808 1092312 1104030 1115969 1128134 1140531
464 1140531 1153166 1166046 1179177 1192567 1206222 1220150 1234358 1248855 1263648 1278747 1294159 1309895 1325963 1342373
463 1342373 1359136 1376262 1393762 1411648 1429931 1448624 1467740 1487292 1507294 1527760 1548706 1570146 1592099 1614579
462 1614579 1637606 1661197 1685373 1710152 1735557 1761608 1788330 1815745 1843880 1872760 1902412 1932867 1964152 1996301
460 1996301 2029346 2063321 2098264 2134212 2171206 2209287 2248501 2288893 2330512 2373411 2417644 2463268 2510344 2558936
459 2558936 2609111 2660940 2714499 2769868 2827131 2886378 2947703 3011208 3076998 3145188 3215898 3289257 3365401 3444476
458 3444476 3526638 3612052 3700897 3793360 3889646 3989972 4094570 4203692 4317606 4436602 4560991 4691108
457D691108J36210J42692J49599J56966J64830J73234J82228J91861K02194K13290K25221
456F629433K38068K51920K66876K83052L00570L19575L40230L62713L87234M14027M43363
455A0237061M75550N10940N49944N93031O40750O93736P52737Q18627Q92435R75383J068923
453A8209117J174790J295073J432296J589517J770500J979858K223324K508060K843090L239870
453C8265495L713096M281789M970810N813066O852539Q148822R783633J1870578J4569612
452A08269440J8108745K2816188K9166156L7838002M9767844O6102329Q7748785J13773270
451E33590759J37832132J44814039J15210705M1715414n1325003j20599503j45482290j35691793
450E20064460j10853149q5131364o4069973m8267629l6743237k8362907k2219130j7657822
$$ plain form
457 4691108 4827318 4970010 5119609 5276575 5441405 5614639 5796867 5988728 6190922 6404212 6629433
456 6629433 6867501 7119421 7386297 7669349 7969919 8289494 8629724 8992437 9379671 9793698 10237061
455 10237061 10712611 11223551 11773495 12366526 13007276 13701012 14453749 15272376 16164811 17140194 18209117
453 18209117 19383907 20678980 22111276 23700793 25471293 27451151 29674475 32182535 35025625 38265495
453 38265495 41978591 46260380 51231190 57044256 63896795 72045617 81829250 93699828 108269440
452 108269440 126378185 149194373 178360529 216198531 265966375 332068704 419817489 533590759
451 533590759 671422891 816236930 931447635 973163049 921838046 801238543 655756253 520064460
450 520064460 409211311 324079947 260009974 211742345 174999108 146636201 124417071 106759249
449A06759249j4223198j1599848r568442p974942o709793n694074m870137m195392l637948
449C8285475l173642k783997k454717k174633j934956j728692j550247j395099j259585j140697
448A8689210j035968r43350q61139p87913p22472o63802o11045n63465n20439m81425m45957
447A1052235m13637l84112l57079l32271l09454k88426k69005k51028k34357k18866k04440
445G789560j90981j78399j66613j55550j45146j35341j26082j17319j09010j01113r3590q6409
444F184007p9538p2947o6612o0503n4602m8884m3331l7920l2636k7459k2375j7364j2415p507
443E599914k630K233P097J1976J6886K1840K6856L1947L7130M2422M7842N3405N9132O5045
442F021095P1162P7510Q4110R0990R8179J05709J13611J21922J30685J39938J49733J60121
$$ plain form
449 106759249 92536051 80936203 71367761 63392819 56683026 50988952 46118815 41923423 38285475
449 38285475 35111833 32327836 29873119 27698486 25763530 24034838 22484591 21089492 19829907 18689210
448 18689210 17653242 16709892 15848753 15060840 14338368 13674566 13063521 12500056 11979617 11498192 11052235
447 11052235 10638598 10254486 9897407 9565136 9255682 8967256 8698251 8447223 8212866 7994000 7789560
445 7789560 7598579 7420180 7253567 7098017 6952871 6817530 6691448 6574129 6465119 6364006 6270416 6184007
444 6184007 6104469 6031522 5964910 5904407 5849805 5800921 5757590 5719670 5687034 5659575 5637200 5619836 5607421 5599914
443 5599914 5597284 5599517 5606614 5618590 5635476 5657316 5684172 5716119 5753249 5795671 5843513 5896918 5956050 6021095
442 6021095 6092257 6169767 6253877 6344867 6443046 6548755 6662366 6784288 6914973 7054911 7204644 7364765
441G364765J71161J82916J95455K08861K23218K38624K55189K73037K92301L13138L35726
439A0054391L60257L86961M16091M47941M82845N21190N63417O10045O61667P18978P82798
438A6006581Q54077R33953J023761J125098J239882J370412J519484J690491J887612K115993
437B9767344K382047K693800L061414L497830M019734M648797N413540O351882P514880Q972208
437G8323476J0820234J3194142J6286356K0374368K5862687L3343159M3671851N8026550P7788888
436C77691711J03740363J33470001J56680378J54112752J08555655K2077763p3965575j39691706
435H42671342j60002587j45603041j16876283q8596765o6079098m9487651l7533635k8911366
434A49580916k2624472j7973544j4479410j1814333r752225q135205o851458n820641m984230
$$ plain form
441 7364765 7535926 7718842 7914297 8123158 8346376 8585000 8840189 9113226 9405527 9718665 10054391
439 10054391 10414648 10801609 11217700 11665641 12148486 12669676 13233093 13843138 14504805 15223783 16006581
438 16006581 16860658 17794611 18818372 19943470 21183352 22553764 24073248 25763739 27651351 29767344
437 29767344 32149391 34843191 37904605 41402435 45422169 50070966 55484506 61836388 69351268 78323476
437 78323476 89143710 102337852 118624208 138998576 164861263 198204422 241876273 299902823 377691711
436 377691711 481432074 614902075 771582453 925695205 1034250860 1056328623 982363048 842671342
435 842671342 682668755 537065714 420189431 331592666 265513568 216025917 178492282 149580916
434 149580916 126956444 108982900 94503490 82689157 72936932 64801727 57950269 52129628 47145398
433D7145398m299006l732661l260727k864498k529501k244429k000384j790283j608457j450331
432B1365121j312182j190964j084178r89738r05921q31277p64589p04825o51114o02707n58970
431A1768656n19352m83379m50642m20787l93501l68517l45593l24525l05126k87235k70707
430G599292k55417k41247k28099k15881k04513j93921j84040j74810j66180j58100j50529
429E426555j43423j36750j30478j24573j19012j13768j08819j04145r9726r5544r1586q7832
428D070899q4274q0896p7686p4636p1734o8971o6340o3831o1437n9152n6971n4885n2889n0981
427C146216m9152m7400m5721m4109m2562m1076l9648l8275l6954l5681l4456l3275l2135l1035
425B594737k9974k8948k7956k6997k6068k5169k4297k3453k2632k1836k1063k0311j9579j8867
$$ plain form
433 47145398 42846392 39113731 35853004 32988506 30459005 28214576 26214192 24423909 22815452 21365121
432 21365121 20052939 18861975 17777797 16788059 15882138 15050861 14286272 13581447 12930333 12327626 11768656
431 11768656 11249304 10765925 10315283 9894496 9500995 9132478 8786885 8462360 8157234 7869999 7599292
430 7599292 7343875 7102628 6874529 6658648 6454135 6260214 6076174 5901364 5735184 5577084 5426555
429 5426555 5283132 5146382 5015904 4891331 4772319 4658551 4549732 4445587 4345861 4250317 4158731 4070899
428 4070899 3986625 3905729 3828043 3753407 3681673 3612702 3546362 3482531 3421094 3361942 3304971 3250086 3197197 3146216
427 3146216 3097064 3049664 3003943 2959834 2917272 2876196 2836548 2798273 2761319 2725638 2691182 2657907 2625772 2594737
425 2594737 2564763 2535815 2507859 2480862 2454794 2429625 2405328 2381875 2359243 2337407 2316344 2296033 2276454 2257587
424B257587j8174j7497j6837j6194j5564j4949j4347j3759j3180j2614j2059j1512j0975j0446
423B059480r926r412q906q405p911p420o935o453n974n500n026m554m084l615l144k674k202
421A957339j730j253p75k92J94O87J183J688K199K719L247L785M335M897N470O059O663P284
419B003699P922Q580R260R962J0689J1443J2226J3039J3888J4771J5695J6662J7674J8737
418B184247J9855K1031K2273K3583K4970K6440K8003K9662L1433L3322L5343L7509L9835M2338
417B599844M5037M7955N1113N4544N8278O2351O6808P1697P7076Q3013Q9584R6883J05020
415C509203J14124J24349J35883J48951J63829J80852K00437K23103K49501K80458L17032
414E647722L60595M12949M76478N54403O51118P72733R27875J128958J394143J750431K238362
$$ plain form
424 2257587 2239413 2221916 2205079 2188885 2173321 2158372 2144025 2130266 2117086 2104472 2092413 2080901 2069926 2059480
423 2059480 2049554 2040142 2031236 2022831 2014920 2007500 2000565 1994112 1988138 1982638 1977612 1973058 1968974 1965359 1962215 1959541 1957339
421 1957339 1955609 1954356 1953581 1953289 1953483 1954170 1955353 1957041 1959240 1961959 1965206 1968991 1973326 1978223 1983693 1989752 1996415 2003699
419 2003699 2011621 2020201 2029461 2039423 2050112 2061555 2073781 2086820 2100708 2115479 2131174 2147836 2165510 2184247
418 2184247 2204102 2225133 2247406 2270989 2295959 2322399 2350402 2380064 2411497 2444819 2480162 2517671 2557506 2599844
417 2599844 2644881 2692836 2743949 2798493 2856771 2919122 2985930 3057627 3134703 3217716 3307300 3404183 3509203
415 3509203 3623327 3747676 3883559 4032510 4196339 4377191 4577628 4800731 5050232 5330690 5647722
414 5647722 6008317 6421266 6897744 7452147 8103265 8875998 9803873 10932831 12326974 14077405 16315767
413A6315767K918530L877933N224880P031979R133698J0760442J0596324P949389L459782
412G7268724j454147n156844o390367m873960j607193K181806N662229P792252O798914J532514
412H1753928n736676j0631113j1595999j0172608q101256o209943m713559l590311k760239
411A8242224k145946j686954j339323j071929q62789o96270n61046m48693l52707k67861j90114
410H618592j17753n5184j7750k2729n4788o7191m2130L393N2497R8897J42190J83704K24950
408H946698K67288L11934L60050M12834M71611N37903O13539P00762Q02383R21976J064151
407A5411129J234950J442374J697201K014119K413474K923852L585983M458631N627146P214955
406D8023814R394756J2383596J6365555K1200496K5775750K7500594K3367868J2554911j216255
$$ plain form
413 16315767 19234297 23112230 28337110 35369089 44502787 55263229 65859553 73808942 77268724
412 77268724 75814577 70657733 64267366 59393406 57786213 59968019 65630248 73422500 80221414 81753928
412 81753928 76017252 65386139 53790140 43617532 35516276 29306333 24592774 21002463 18242224
411 18242224 16096278 14409324 13070001 11998072 11135283 10439013 9877967 9429274 9076567 8808706 8618592
410 8618592 8500839 8445655 8427905 8405176 8350388 8283197 8241067 8244460 8296957 8395854 8538044 8721748 8946698
408 8946698 9213986 9525920 9885970 10298804 10770415 11308318 11921857 12622619 13425002 14346978 15411129
407 15411129 16646079 18088453 19785654 21799773 24213247 27137099 30723082 35181713 40808859 48023814
406 48023814 57418570 69802166 86167721 107368217 133143967 160644561 184012429 196567340 195351085
406A95351085j1255974j3694405r297350j420528O184596J0484317J0069293O106389Q77453
405A93404876m509075r844076j4072941j5002761j1908538p587595n880961p520079j0873106
404A06205744j3878147j4410700j1910825q213189m851295k107254K35883K433817M665548
403E8169582O948594Q706293Q008919K868637m805131j0022485j0882556r391984p513981
402D2085888n881159m567608l539460k744871k131802j655378j280072r78932p31881n23988
401A8050737l44004j83262l4874J06908K47157L90654N42247P07183Q91489J102429J349069
400B2825733J643052J999626K439026K988328L683758M573294N718765P195929R090587J1493993
399G3652091J4506133J8134062K1417277K0724155J2150686p13115q317853o993868n86797
$$ plain form
406 195351085 184095111 170400706 161103356 159682828 165867424 176351741 186421034 192527423 193404876
405 193404876 188895801 179051725 164978784 149976023 138067485 130479890 124598929 117078850 106205744
404 106205744 92327597 77916897 66006072 57792883 52941588 50834334 51070217 53504034 58169582
403 58169582 65118176 73824469 81833388 84702025 79896894 69874409 58991853 49599869 42085888
402 42085888 36204729 31637121 28097661 25352790 23220988 21565610 20285538 19306606 18574725 18050737
401 18050737 17706733 17523471 17488597 17595505 17842662 18233316 18775563 19482746 20374235 21476664 22825733
400 22825733 24468785 26468411 28907437 31895765 35579523 40152817 45871582 53067511 62158098 73652091
399 73652091 88158224 106292286 127709563 148433718 160584404 159871289 151553436 144559568 143972771
398A43972771O965859J3224860J4680294P759167m683472j2958277j2013551m900362K789446
397A54836735N933556K488191m102479o916149k807496M236284O719883K949241l245920p509405
396A52582441n620358K226890J0688405J5224598J3706248O329251m668736j5568328k2987600
396A51912811k5411613k3481722j9387149j5113474j1551845q837280o830511n352471m254839
395C1691907l428818k797812k308371j923060j615381j366337j162121r92542q49974p28631
394A4518860o24037n32689m51778l79003l12417k50303j91065j33115p4761j4072N1246J23846
393A1730712K06283K99103L95480M71438M83853M11411L17527L02107L90412N45433P34043
392A6287802R45893J185396J464210J798606K209737K725285L382017M228815N329647O764705
$$ plain form
398 143972771 150938630 164163490 178843784 186602951 181919479 168961202 156947651 152047289 154836735
397 154836735 160770291 163258482 159156003 152239854 149432358 153668642 160388525 163337766 160091846 152582441
396 152582441 146962083 149188973 159877378 175101976 188808224 195137475 190468739 174900411 151912811
396 151912811 126501198 103019476 83632327 68518853 56967008 48129728 41299217 35946746 31691907
395 31691907 28263089 25465277 23156906 21233846 19618465 18252128 17090007 16097465 15247491 14518860
394 14518860 13894823 13362134 12910356 12531353 12218936 11968633 11777568 11644453 11569692 11555620 11606866 11730712
393 11730712 11936995 12236098 12631578 13103016 13586869 13998280 14315807 14617914 15008326 15553759 16287802
392 16287802 17233695 18419091 19883301 21681907 23891644 26616929 29998946 34227761 39557408 46322113
391D6322113Q626757J1009435J3979930J7434985K0361541J9491271J1166218j942878j1124121
390A35325251j1985213p336623o79917O637436J3484681J5912211P091824j1112765k4032570
389A23304315k5239933k0740674j5716264j1665198q680143o541141n011913l907902l098755
388B2702392k495606k038297j685873j410119j191310j015437q72404p54817o57189n75394
387A0005946n06280m47430l96948l53353l15458k82317k53164k27371k04426j83902j65442
386F669855j48749j33564j19670j06876r5012q3926p3479o3534n3962m4625l5371k6034j6409
385E668644o240M808J7182L1504M8639O9801R6656J31356J76233K32475K95672L43077L16987
384G426794J63848n3422j87895j93025j27522m3955L9558J21235K03494K86156L50932L35880
$$ plain form
391 46322113 54948870 65958305 79938235 97373220 117734761 137226032 148392250 146449372 135325251
390 135325251 123340038 116003415 115323498 121960934 135445615 151357826 158449650 147336885 123304315
389 123304315 98064382 77323708 61607444 49942246 41262103 34720962 29709049 25801147 22702392
388 22702392 20206786 18168489 16482616 15072497 13881187 12865750 11993346 11238529 10581340 10005946
387 10005946 9499666 9052236 8655288 8301935 7986477 7704160 7450996 7223625 7019199 6835297 6669855
386 6669855 6521106 6387542 6267872 6160996 6065984 5982058 5908579 5845045 5791083 5746458 5711087 5685053 5668644
385 5668644 5662404 5667212 5684394 5715898 5764537 5834338 5930994 6062350 6238583 6471058 6766730 7109807 7426794
384 7426794 7590642 7537220 7349325 7156300 7028778 6984823 7024381 7145616 7349110 7635266 7986198 8322078
382H322078J76009o6910k29828k51372j97365j31096p2726k4584J4496M6284P2533R4742J14092
381G866353J31482J47580J62896J77811J92631K07598K22918K38772K55321K72724K91133
380A0167219L10703L31601L53997L78078M04056M32155M62630M95771N31899N71386O14653
379A5054148O62178P14524P72330Q36341R07428R86609J075077J174249J285801J411726J554423
378B6434834J716780J902301K115253K360886K645682K977737L367205L826942M373415N027863
377E6748898N818020O780477P964142R435243J1284689J3639219J6678275K0659977K5961586
376A74970526L3141577M3032687N6866195P6381027J03680510J40025798J81766917K13153015
375A023018252K06886024J45062875L6429770q5086550j77278853k15690092k03130270j64582837
$$ plain form
382 8322078 8498087 8431177 8201349 7949977 7752612 7621516 7548790 7524206 7538702 7584986 7657519 7752261 7866353
381 7866353 7997835 8145415 8308311 8486122 8678753 8886351 9109269 9348041 9603362 9876086 10167219
380 10167219 10477922 10809523 11163520 11541598 11945654 12377809 12840439 13336210 13868109 14439495 15054148
379 15054148 15716326 16430850 17203180 18039521 18946949 19933558 21008635 22182884 23468685 24880411 26434834
378 26434834 28151614 30053915 32169168 34530054 37175736 40153473 43520678 47347620 51721035 56748898
377 56748898 62566918 69347395 77311537 86746780 98031469 111670688 128348963 149008940 174970526
376 174970526 208112103 251144790 308010985 384392012 488072522 628098320 809865237 1023018252
375 1023018252 1229904276 1374967151 1411396921 1326310371 1149031518 933341426 730211156 565628319
375E65628319j24009356r1364477o7518281n0584300l8552799k9900283k3575691j8872579
374A21250553j5316347j2584854j0456274q775353p431787o345889n459305m728686m121446
373D6030612l612743l183496k818839k507116k239082k007360j806010j630213j476031j340233
372B3409489j220143j113539j018559r33635q57449p88875p26955o70866o19900n73439n30946
371A4355183m91952m56039m22832l91991l63207l36185l10639k86285k62823k39929k17219
370A0576082j94242j70400j44919j16710q4225m5217L616O7033J51412K63406M03103N42023
369A1250962N80922L63705r1578m59614n26166l89678k00420l5473P0549J02682P1684R041
368A0746616o0716j34220k15482k94515l44180l44597l02691k40979j78222j23250p7944m1177
$$ plain form
375 565628319 441618963 350254486 282736205 232151905 193599106 163698823 140123132 121250553
374 121250553 105934206 93349352 82893078 74117725 66685938 60340049 54880744 50152058 46030612
373 46030612 42417869 39234373 36415534 33908418 31669336 29661976 27855966 26225753 24749722 23409489
372 23409489 22189346 21075807 20057248 19123613 18266164 17477289 16750334 16079468 15459568 14886129 14355183
371 14355183 13863231 13407192 12984360 12592369 12229162 11892977 11582338 11296053 11033230 10793301 10576082
370 10576082 10381840 10211440 10066521 9949811 9865586 9820369 9823985 9891018 10042430 10305836 10708939 11250962
369 11250962 11831884 12195589 12104011 11644397 11118231 10728553 10528133 10492660 10563209 10665891 10737575 10746616
368 10746616 10685900 10551680 10336198 10041683 9697503 9352906 9050215 8809236 8631014 8507764 8429820 8388643
367H388643j1047J4235L6102N5646P3681R0822J07545J24233J41203J58742J77111J96566
365I553482K17377K39818K64200K90866L20213L52693L88845M29302M74820N26317N84903
364A3642836O51941P29111Q18513R22781J045258J190237J363261J571614J824931K136175
363B5896658K522974L009687L630432M433728N489497O899612Q813245J1447421J5108347
363H7251601K0195303K7135423L6100725M5711761M8423623K9743700o933021l1264238l0771141
362B25593736j8410563m115600R340247K0127197K4655366J8453022P42487k0810436l5244604
361B20330852l8766930l4747857k8000755k1524477j6330196j2434138r569064p460099n892081
360D5605255m710144l805779l103243k549370k106415j747245j452095j206346r99062q21920
$$ plain form
367 8388643 8377596 8391831 8427933 8483579 8557260 8648082 8755627 8879860 9021063 9179805 9356916 9553482
365 9553482 9770859 10010677 10274877 10565743 10885956 11238649 11627494 12056796 12531616 13057933 13642836
364 13642836 14294777 15023888 15842401 16765182 17810440 19000677 20363938 21935552 23760483 25896658
363 25896658 28419632 31429319 35059751 39493479 44982976 51882588 60695833 72143254 87251601
363 87251601 107446904 134582327 170683052 216394813 264818436 294562136 287629115 256364877 225593736
362 225593736 207183173 203067573 212407820 232535017 257190383 275643405 276385892 255575456 220330852
361 220330852 181563922 146816065 118815310 97290833 80960637 68526499 58957435 51497336 45605255
360 45605255 40895111 37089332 33986089 31436719 29330304 27583059 26130964 24924618 23925556 23103636
359B3103636o68513n33842m13931l05577k06156j13456k5591N9116J42186K25062L09140L95855
358B1967929M86720N83371O87672Q01752R28160J069955J230913J415753J630483J882855
357C2685563K183025K544519K985653L531621M217759N094509O235285P748686R797373J2624799
356H9648792J6583766K2128071K9620805L8593896M6252936M7278307L8412585K2062489L438586
355C54020233j1704912j8306600j4388915m110066N826112J1257068J1172922O446351j391947
354C38820246j0668723j9703964k7007868l1381170l2218535k9978641k5948515k1425259
354A40487571j7210525j3620664j0688270q328392o427292m878577l593722k502179j548184
353G1689766o87091J18008Q99179J685917K507487L394974M383706N516144O845604Q441489
$$ plain form
359 23103636 22435123 21901281 21487350 21181773 20975617 20862161 20836570 20895686 21037872 21262934 21572074 21967929
358 21967929 22454649 23038020 23725692 24527444 25455604 26525559 27756472 29172225 30802708 32685563
357 32685563 34868588 37413107 40398760 43930381 48148140 53242649 59477934 67226620 77023993 89648792
356 89648792 106232558 128360629 157981434 196575330 242828266 290106573 328519158 350581647 354020233
355 354020233 342315321 324008721 309619806 305509740 311335852 322592920 333765842 340212193 338820246
354 338820246 328151523 308447559 281439691 250058521 217839986 187861345 161912830 140487571
354 140487571 123277046 109656382 98968112 90639720 84212428 79333851 75740129 73237950 71689766
353 71689766 71002675 71120683 72019862 73705779 76213266 79608240 83991946 89508090 96353694 104795183
352A04795183J0396739J2838872J5946570J9975140K5295960L2457025M2273781N5952188
351C19931458P5202791J02132350J38159394J80204862K13513619K10878502J52249376M3978152
350A436250504q0118982j75568089k16290650k04798305j66162521j24880686r1364106o6637162
349C10430003m8800156l5768586k5914416j8050766j1294077m956532J450052P949292J3410292
349A88455106J4932831R086129l723354j6396139k1990691k0285344j4700734q032487j394092
348A25951225M865296R919676J1885322Q848598P29988r573236j7560766k0728755j9545120
347I4792228j6168423j2571262r610834p393053n776553m597186l725848l071163k570411
346B9307495k180683j872367j624750j423114j256839j118151j001257r01794q16438p42596
$$ plain form
352 104795183 115191922 128030794 143977364 163952504 189248464 221705489 263979270 319931458
351 319931458 395134249 497266599 635425993 815630855 1029144474 1240022976 1392272352 1436250504
350 1436250504 1356131522 1180563433 964272783 759474478 593311957 468431271 377067165 310430003
349 310430003 261629847 225861261 199946845 181896079 170602002 165645470 167095522 175044814 188455106
349 188455106 203387937 212474066 208750712 192354573 170363882 150078538 135377804 127345317 125951225
348 125951225 130816521 140736197 152621519 161470117 162200105 152626869 135066103 114337348 94792228
347 94792228 78623805 66052543 56441709 49048656 43272103 38674917 34949069 31877906 29307495
346 29307495 27126812 25254445 23629695 22206581 20949742 19831591 18830334 17928540 17112102 16369506
345A6369506o78262o21832n72038n27847m88425m53083m21255l92466l66318l42473l20643
344A1184864l00580k82069k64917k48954k34026k19988k06702j94024j81815j69911j58127
343H723751j46235j33945j20868j06476r0042p0588m6918j7967J5888M9671O9679N4712q637
342H172025j00416j71696j92191j68326j20200o2836m295M5436O4260K2558p9510j82903k29504
340F992402k20647j86934j50850j20838r7857q0593o7515n7404m9394m2882l7454l2823k8787
339E818424k5204k1969j9008j6263j3690j1256q937o710m560k472m36J556L516N447P358R252
338E715048J1136J3012J4885J6760J8639K0526K2423K4336K6265K8214L0187L2185L4213L6273
336F044102L8367M0501M2676M4895M7163M9481N1856N4289N6785N9348O1983O4692O7482P0358
$$ plain form
345 16369506 15691244 15069412 14497374 13969527 13481102 13028019 12606764 12214298 11847980 11505507 11184864
344 11184864 10884284 10602215 10337298 10088344 9854318 9634330 9427628 9233604 9051789 8881878 8723751
343 8723751 8577516 8443571 8322703 8216227 8126185 8055597 8008679 7990712 8006600 8056271 8125950 8180662 8172025
342 8172025 8071609 7899913 7707722 7539396 7419196 7356360 7352065 7397501 7461761 7484319 7404809 7221906 6992402
340 6992402 6771755 6584821 6433971 6313133 6215276 6134683 6067168 6009764 5960370 5917488 5880034 5847211 5818424
339 5818424 5793220 5771251 5752243 5735980 5722290 5711034 5702097 5695387 5690827 5688355 5687919 5689475 5692991 5698438 5705796 5715048
338 5715048 5726184 5739196 5754081 5770841 5789480 5810006 5832429 5856765 5883030 5911244 5941431 5973616 6007829 6044102
336 6044102 6082469 6122970 6165646 6210541 6257704 6307185 6359041 6413330 6470115 6529463 6591446 6656138 6723620 6793978
335F793978P3324P6386P9550Q2822Q6207Q9715R3351R7124J01040J05111J09343J13749J18339
334H020039J23123J28113J33325J38771J44465J50426J56670J63214J70083J77294J84874
333I690397J92848K01242K10088K19419K29267K39677K50687K62344K74697K87805L01725
332A2360196L16527L32280L49067L66977L86108M06569M28479M51975M77202N04332N33544
331A6913256N65053N99089O35916O75829P19167P66310Q17683Q73790R35183J002516J076524
330B5580316J158071J248141J347896J458673J582050J719885J874366K048085K244158K466293
329D2727934K718989L007678L339010L721150M164200M680755N286666O001998O852451P871237
328I0372068R101740J0601274J2446532J4741427J7628888K1308327K6062486L2298592M0612475
$$ plain form
335 6793978 6867302 6943688 7023238 7106060 7192267 7281982 7375333 7472457 7573497 7678608 7787951 7901700 8020039
334 8020039 8143162 8271275 8404600 8543371 8687836 8838262 8994932 9158146 9328229 9505523 9690397
333 9690397 9883245 10084487 10294575 10513994 10743261 10982938 11233625 11495969 11770666 12058471 12360196
332 12360196 12676723 13009003 13358070 13725047 14111155 14517724 14946203 15398178 15875380 16379712 16913256
331 16913256 17478309 18077398 18713314 19389143 20108310 20874620 21692303 22566093 23501276 24503792 25580316
330 25580316 26738387 27986528 29334424 30793097 32375147 34095032 35969398 38017483 40261641 42727934
329 42727934 45446923 48454601 51793611 55514761 59678961 64359716 69646382 75648380 82500831 90372068
328 90372068 99473808 110075082 122521614 137263041 154891929 176200256 202262742 234561334 275173809
327B75173809N1886651O7436559Q9201427J19895051J62704052K19172046K82454229L26451760
326A594375584L09324070K07022217L6761776j46551450k79432534l28737983l03435782k43214187
325H46111711j82473052j34321210r9306333p4445146n6751956m3996455l4646250k7671626
324A92499683k2379994j8300174j5107136j2572809j0534725q875219p507832o368119n407379
324H5446296m588300l881913l265467k720777k233143j790469j382577j000764o37357k85390
323F3660139O1653M10116P66396J137194J529794J952324K414173K926396L502309M158236
322H2518730M914519N796866O838202Q081272R582379J1416577J3685422J6528379K0139965
321A79502311K4795765L0892733L9011578N0012946O5180381Q6409189J16359636J58180796
$$ plain form
327 275173809 327060460 394497019 483698446 603593497 766297549 985469595 1267923824 1594375584
326 1594375584 1903699654 2110721871 2147483647 2000932197 1721499663 1392761680 1089325898 846111711
325 846111711 663638659 529317449 430011116 355565970 298814014 254817559 220171309 192499683
324 192499683 170119689 151819515 136712379 124139570 113604845 104729626 97221794 90853675 85446296
324 85446296 80857996 76976083 73710616 70989839 68756696 66966227 65583650 64582886 63945529 63660139
323 63660139 63721792 64131908 64898304 66035498 67565292 69517616 71931789 74858185 78360494 82518730
322 82518730 87433249 93230115 100068317 108149589 117731968 129148545 142833967 159362346 179502311
321 179502311 204298076 235190809 274202387 324215333 389395714 475804903 592164539 750345335
320G50345335K13487645K75820578L19889705L04554736K05821641M0119514j39834764k72190587
319A698013803l23245559l00097559k41263671j81236408j33485275r8743895p4094064n6572226
319B89275146m3958218l4726475k7852669k2648360j8646042j5523354j3054550j1079012
318A01786466r480595q174199p096509o199887n448043m812996m273007l810960l413323l069251
317D6007696k770025k508558k279082k076826j897864j738922j597266j470587j356955j254706
316B7056905j162446j078966j003235r34361q71574q14205p61664p13454o69115o28259n90542
315A7829084n55657n23329m93318m65413m39418m15163l92495l71274l51377l32690l15111
314A3173839k98550k82923k68150k54164k40903k28306k16319k04896j93988j83554j73556
$$ plain form
320 750345335 963832980 1239653558 1559543263 1864097999 2069919640 2110039154 1970204390 1698013803
319 1698013803 1374768244 1074670685 833407014 652170606 518685331 419941436 345847372 289275146
319 289275146 245316928 210590453 182737784 160089424 141443382 125920028 112865478 101786466
318 101786466 92305871 84131672 77035163 70835276 65387233 60574237 56301230 52490270 49076947 46007696
317 46007696 43237671 40729113 38450031 36373205 34475341 32736419 31139153 29668566 28311611 27056905
316 27056905 25894459 24815493 23812258 22877897 22006323 21192118 20430454 19717000 19047885 18419626 17829084
315 17829084 17273427 16750098 16256780 15791367 15351949 14936786 14544291 14173017 13821640 13488950 13173839
314 13173839 12875289 12592366 12324216 12070052 11829149 11600843 11384524 11179628 10985640 10802086 10628530
313A0628530j63953j54718j45815j37213j28885j20805j12948j05284r7798r0460q3252p6151
312I211248o9136o2184n5279m8393m1512l4607k7662k0652j3550o337J018Q540J6259K4207
310H881960L2417M0924M9771N8998O8653P8788Q9457J00726J12663J25347J38863J53311J68794
309A0100672J85441K03389K22795K43840K66729K91697L19014L48995L82001M18450M58838
308A3441861N03739N53833O09925O72968P44105Q24708R16436J021302J141772J280882J442401
307B3153932J631039J852730K115025K427614K803061L257845L813799M500273N357168O439619
306E7352105P824832R622731J1992162J5166014J9489177K5472552L3855785M5622502O1745682
305B88143542Q2028250J02155464J10791578R4451812M9216223j3780787p1583197j05008464
$$ plain form
313 10628530 10464577 10309859 10164044 10026831 9897946 9777141 9664193 9558909 9461111 9370651 9287399 9211248
312 9211248 9142112 9079928 9024649 8976256 8934744 8900137 8872475 8851823 8838273 8831936 8832954 8841494 8857753 8881960
310 8881960 8914377 8955301 9005072 9064070 9132723 9211511 9300968 9401694 9514357 9639704 9778567 9931878 10100672
309 10100672 10286113 10489502 10712297 10956137 11222866 11514563 11833577 12182572 12564573 12983023 13441861
308 13441861 13945600 14499433 15109358 15782326 16526431 17351139 18267575 19288877 20430649 21711531 23153932
307 23153932 24784971 26637701 28752726 31180340 33983401 37241246 41055045 45555318 50912486 57352105
306 57352105 65176937 74799668 86791830 101957844 121447021 146919573 180775358 226397860 288143542
305 288143542 370171792 472327256 583118834 677570646 726786869 713006082 641422885 536414421
304E36414421j09482162r4190191p3039522n4324375m0137900k9938319k2680238j7476662
304I5145052j3692033j0893470q789282p181786n935377m955586m175626l547519l036282
303C2938091k616066k267518j975964j730156j521380j342815j189078j055871r39750q37920
302A7461573p48106o68434n97355n33582m76025m23778l76057l32197k91621k53829k18377
301A2542212j84876j52969j22340r2691o3744l5236o911K1485N0206P9515J09681J40996J73771
299A2459099K08349K45105K84469L26920L73010M23379M78769N40052O08260O84622P70611
298A7402645Q68004R78963J106140J252799J423007J621860J855811K133084K464301K863288
297C3969902L348281L943588M682071N608755O786226Q302839J0285308J2918063J6472932
$$ plain form
304 536414421 426932259 332742068 259702546 205378171 165240271 135301952 112621714 95145052
304 95145052 81453019 70559549 61770267 54588481 48653104 43697518 39521892 35974373 32938091
303 32938091 30322025 28054507 26078543 24348387 22827007 21484192 20295114 19239243 18299493 17461573
302 17461573 16713467 16045033 15447678 14914096 14438071 14014293 13638236 13306039 13014418 12760589 12542212
301 12542212 12357336 12204367 12082027 11989336 11925592 11890356 11883445 11904930 11955136 12034651 12144332 12285328 12459099
299 12459099 12667448 12912553 13197022 13523942 13896952 14320331 14799100 15339152 15947412 16632034 17402645
298 17402645 18270649 19249612 20355752 21608551 23031558 24653418 26509229 28642313 31106614 33969902
297 33969902 37318183 41261771 45943842 51552597 58338823 66641662 76926970 89845033 106317965
297A06317965K1353268K8152333L7703844N1014513O8702524Q9103655J04848283J02713225
296F09909610P2945671J8635443m2702750q8464946j06648103r9920416q0936447o1143408
295B21674654m5212491l3535724k5209266j9269830j4983416j1840820r497985p722687o356663
294D8045772n290531m447527l772956l227228k781295k413542k107687j851327j634900j450962
293A9067817j293671j158385j041405r39743q50977p73134p04580o43979n90204n42327m99556
292A0029856m61229m26786l95743l67692l42277l19200k98194k79030k61512k45467k30739
291F401987k17199k04726j93219j82582j72738j63610j55137j47258j39924j33085j26704
290D565805j20738j15158j09929j05027j00424r6098r2030q8197q4585q1178p7960p4920p2042
$$ plain form
297 106317965 127671233 155823566 193527410 244541923 313244447 402348102 507196385 609909610
296 609909610 682855281 701490724 658787974 570323028 463674925 363754509 282818062 221674654
295 221674654 176462163 142926439 117717173 98447343 83463927 71623107 62125122 54402435 48045772
294 48045772 42755241 38307714 34534758 31307530 28526235 26112693 24005006 22153679 20518779 19067817
293 19067817 17774146 16615761 15574356 14634613 13783636 13010502 12305922 11661943 11071739 10529412 10029856
292 10029856 9568627 9141841 8746098 8378406 8036129 7716929 7418735 7139705 6878193 6632726 6401987
291 6401987 6184788 5980062 5786843 5604261 5431523 5267913 5112776 4965518 4825594 4692509 4565805
290 4565805 4445067 4329909 4219980 4114953 4014529 3918431 3826401 3738204 3653619 3572441 3494481 3419561 3347519
289C347519o9320o6740o4293o1972n9767n7673n5680n3784n1979n0259m8618m7053m5559m4133
288B570689m2767m1464m0215l9020l7876l6778l5726l4717l3749l2819l1925l1066l0240k9446
286B072881k8681k7945k7236k6552k5894k5259k4646k4055k3484k2932k2400k1885k1387k0906
285A729619k0440j9990j9553j9131j8722j8325j7941j7568j7207j6857j6516j6187j5866j5555
284A479761j5252j4959j4674j4396j4126j3864j3608j3361j3118j2884j2654j2431j2214j2002
282A290218j1796j1595j1399j1207j1021j0839j0662j0489j0319j0155r993r836r683r532
281A141692r386r242r102q966q831q700q573q447q325q204q088p972p860p750p642p536p433
279I99635p332p233p135p040o947o854o766o677o591o506o423o341o262o183o106o031n957
$$ plain form
289 3347519 3278199 3211459 3147166 3085194 3025427 2967754 2912074 2858290 2806311 2756052 2707434 2660381 2614822 2570689
288 2570689 2527922 2486458 2446243 2407223 2369347 2332569 2296843 2262126 2228377 2195558 2163633 2132567 2102327 2072881
286 2072881 2044200 2016255 1989019 1962467 1936573 1911314 1886668 1862613 1839129 1816197 1793797 1771912 1750525 1729619
285 1729619 1709179 1689189 1669636 1650505 1631783 1613458 1595517 1577949 1560742 1543885 1527369 1511182 1495316 1479761
284 1479761 1464509 1449550 1434876 1420480 1406354 1392490 1378882 1365521 1352403 1339519 1326865 1314434 1302220 1290218
282 1290218 1278422 1266827 1255428 1244221 1233200 1222361 1211699 1201210 1190891 1180736 1170743 1160907 1151224 1141692
281 1141692 1132306 1123064 1113962 1104996 1096165 1087465 1078892 1070445 1062120 1053916 1045828 1037856 1029996 1022246 1014604 1007068 999635
279 999635 992303 985070 977935 970895 963948 957094 950328 943651 937060 930554 924131 917790 911528 905345 899239 893208 887251
278H87251n883n813n742n673n605n539n474n410n346n285n223n164n105n047m991m934m880
276G96137m825m772m720m669m618m568m520m471m423m377m331m286m242m197m154m112m070
274G20782m029l988l949l908l870l832l795l757l720l685l648l614l580l545l512l479l446
273F57425l414l383l351l320l290l260l230l201l172l144l116l088l061l034l008k981k955
271F03417k930k904k880k855k830k807k783k760k736k714k691k669k647k625k604k583k562
270E56837k541k521k500k481k461k441k422k403k385k366k347k329k312k293k276k259k241
268E16259k225k208k191k175k159k142k127k111k096k080k065k050k035k021k006j991j978
266D80599j963j949j936j922j908j895j882j869j855j843j831j817j806j793j780j769j757
$$ plain form
278 887251 881368 875555 869813 864140 858535 852996 847522 842112 836766 831481 826258 821094 815989 810942 805951 801017 796137
276 796137 791312 786540 781820 777151 772533 767965 763445 758974 754551 750174 745843 741557 737315 733118 728964 724852 720782
274 720782 716753 712765 708816 704908 701038 697206 693411 689654 685934 682249 678601 674987 671407 667862 664350 660871 657425
273 657425 654011 650628 647277 643957 640667 637407 634177 630976 627804 624660 621544 618456 615395 612361 609353 606372 603417
271 603417 600487 597583 594703 591848 589018 586211 583428 580668 577932 575218 572527 569858 567211 564586 561982 559399 556837
270 556837 554296 551775 549275 546794 544333 541892 539470 537067 534682 532316 529969 527640 525328 523035 520759 518500 516259
268 516259 514034 511826 509635 507460 505301 503159 501032 498921 496825 494745 492680 490630 488595 486574 484568 482577 480599
266 480599 478636 476687 474751 472829 470921 469026 467144 465275 463420 461577 459746 457929 456123 454330 452550 450781 449024
265D49024j745j733j722j710j699j687j677j665j655j643j633j622j612j601j591j581j571
263D20877j561j550j541j531j522j512j502j493j484j474j466j456j447j439j429j421j413
261C95636j403j395j387j378j371j361j354j346j338j329j322j314j307j299j291j283j277
260C72881j268j262j254j247j240j232j226j219j212j205j198j191j185j178j172j164j159
258C52269j152j146j139j133j127j121j114j109j102j097j091j084j079j073j068j061j056
257C33517j051j045j039j034j028j023j018j012j007j002r96r92r86r81r76r72r66r61r56
255C14472r52r47r41r38r32r28r23r18r14r10r04r01q96q91q87q83q78q74q70q66q61q57q53
253B93748q49q45q41q36q33q29q25q21q17q13q09q06q01p98p94p91p86p84p79p76p72p69p65
$$ plain form
265 449024 447279 445546 443824 442114 440415 438728 437051 435386 433731 432088 430455 428833 427221 425620 424029 422448 420877
263 420877 419316 417766 416225 414694 413172 411660 410158 408665 407181 405707 404241 402785 401338 399899 398470 397049 395636
261 395636 394233 392838 391451 390073 388702 387341 385987 384641 383303 381974 380652 379338 378031 376732 375441 374158 372881
260 372881 371613 370351 369097 367850 366610 365378 364152 362933 361721 360516 359318 358127 356942 355764 354592 353428 352269
258 352269 351117 349971 348832 347699 346572 345451 344337 343228 342126 341029 339938 338854 337775 336702 335634 334573 333517
257 333517 332466 331421 330382 329348 328320 327297 326279 325267 324260 323258 322262 321270 320284 319303 318327 317355 316389 315428 314472
255 314472 313520 312573 311632 310694 309762 308834 307911 306993 306079 305169 304265 303364 302468 301577 300690 299807 298929 298055 297185 296319 295458 294601 293748
253 293748 292899 292054 291213 290377 289544 288715 287890 287069 286252 285439 284630 283824 283023 282225 281431 280640 279854 279070 278291 277515 276743 275974 275209
250B75209p61p59p54p51p48p44p41p38p34p31p28p24p21p18p15p11p09p05p02o99o96o92o90
248B58538o87o83o81o78o75o71o69o66o63o61o57o54o52o49o46o44o40o38o35o33o30o27o24
246B43475o22o20o16o14o12o09o06o04o02n99n96n94n92n89n86n85n82n79n77n75n73n70n68
244B29805n65n63n61n59n56n55n52n50n47n46n43n41n39n37n35n32n31n28n27n24n22n21n18
242B17353n16n14n13n10n08n06n05n02n01m98m97m95m92m91m90m87m85m84m82m80m78m76m75
239B05968m72m71m70m67m66m64m62m61m59m57m56m53m53m50m49m47m46m44m42m41m39m38m36
237A95525m34m33m31m30m28m27m25m23m22m21m19m17m17m14m13m12m10m09m07m06m05m03m02
235A85917m00l99l97l96l95l93l92l91l89l88l87l85l84l83l81l80l79l77l77l74l74l72l72
$$ plain form
250 275209 274448 273689 272935 272184 271436 270692 269951 269213 268479 267748 267020 266296 265575 264857 264142 263431 262722 262017 261315 260616 259920 259228 258538
248 258538 257851 257168 256487 255809 255134 254463 253794 253128 252465 251804 251147 250493 249841 249192 248546 247902 247262 246624 245989 245356 244726 244099 243475
246 243475 242853 242233 241617 241003 240391 239782 239176 238572 237970 237371 236775 236181 235589 235000 234414 233829 233247 232668 232091 231516 230943 230373 229805
244 229805 229240 228677 228116 227557 227001 226446 225894 225344 224797 224251 223708 223167 222628 222091 221556 221024 220493 219965 219438 218914 218392 217871 217353
242 217353 216837 216323 215810 215300 214792 214286 213781 213279 212778 212280 211783 211288 210796 210305 209815 209328 208843 208359 207877 207397 206919 206443 205968
239 205968 205496 205025 204555 204088 203622 203158 202696 202235 201776 201319 200863 200410 199957 199507 199058 198611 198165 197721 197279 196838 196399 195961 195525
237 195525 195091 194658 194227 193797 193369 192942 192517 192094 191672 191251 190832 190415 189998 189584 189171 188759 188349 187940 187533 187127 186722 186319 185917
235 185917 185517 185118 184721 184325 183930 183537 183145 182754 182365 181977 181590 181205 180821 180438 180057 179677 179298 178921 178544 178170 177796 177424 177052
233A77052l69l69l67l66l65l64l62l62l60l58l58l56l56l54l53l51l51l49l49l47l46l44l44
231A68852l43l41l40l40l38l37l36l35l33l33l32l30l30l28l27l27l25l24l23l22l21l20l20
228A61247l18l17l16l15l14l13l12l11l10l09l08l08l06l05l04l04l02l02l00l00k99k97k97
226A54180k96k95k94k94k92k91k91k89k89k88k87k86k85k85k83k83k82k81k80k79k79k77k77
224A47597k76k75k74k74k72k72k71k70k70k69k67k67k67k65k65k64k63k62k62k61k60k59k58
222A41454k58k57k56k56k55k54k53k53k52k51k50k50k49k48k47k47k46k46k45k44k43k43k41
220A35710k42k40k40k39k39k38k37k36k36k35k35k34k33k33k32k31k30k30k30k28k28k28k27
217A30329k26k25k25k25k23k23k23k22k21k21k20k19k19k18k18k17k16k16k15k15k14k14k13
$$ plain form
233 177052 176683 176314 175947 175581 175216 174852 174490 174128 173768 173410 173052 172696 172340 171986 171633 171282 170931 170582 170233 169886 169540 169196 168852
231 168852 168509 168168 167828 167488 167150 166813 166477 166142 165809 165476 165144 164814 164484 164156 163829 163502 163177 162853 162530 162208 161887 161567 161247
228 161247 160929 160612 160296 159981 159667 159354 159042 158731 158421 158112 157804 157496 157190 156885 156581 156277 155975 155673 155373 155073 154774 154477 154180
226 154180 153884 153589 153295 153001 152709 152418 152127 151838 151549 151261 150974 150688 150403 150118 149835 149552 149270 148989 148709 148430 148151 147874 147597
224 147597 147321 147046 146772 146498 146226 145954 145683 145413 145143 144874 144607 144340 144073 143808 143543 143279 143016 142754 142492 142231 141971 141712 141454
222 141454 141196 140939 140683 140427 140172 139918 139665 139412 139160 138909 138659 138409 138160 137912 137665 137418 137172 136926 136681 136437 136194 135951 135710
220 135710 135468 135228 134988 134749 134510 134272 134035 133799 133563 133328 133093 132859 132626 132393 132161 131930 131700 131470 131240 131012 130784 130556 130329
217 130329 130103 129878 129653 129428 129205 128982 128759 128537 128316 128095 127875 127656 127437 127219 127001 126784 126568 126352 126137 125922 125708 125494 125281
215A25281k12k12k11k11k10k09k09k09k08k07k07k06k05k06k04k04k04k02k03k02k01k01k00
213A20538k00j99j99j98j98j97j96j96j96j95j95j94j93j93j93j92j91j91j91j90j90j89j88
211A16074j88j88j87j87j86j86j85j85j84j84j83j83j83j82j81j81j81j80j79j80j78j79j78
209A11866j77j77j77j76j75j75j75j75j73j74j73j73j72j71j72j71j70j70j70j69j69j68j68
206A07896j68j67j67j66j66j65j65j65j64j64j64j63j63j62j62j61j61j61j61j60j59j59j59
204A04144j59j58j57j58j56j57j56j56j55j55j55j54j54j54j53j53j52j53j51j52j51j51j50
202A00594j50j49j50j49j48j48j48j48j47j47j46j47j45j46j45j45j44j44j44j44j43j43j42
200I7232j42j42j42j41j41j40j40j40j40j39j39j39j38j38j38j37j37j37j36j36j36j35j36
$$ plain form
215 125281 125069 124857 124646 124435 124225 124016 123807 123598 123390 123183 122976 122770 122565 122359 122155 121951 121747 121545 121342 121140 120939 120738 120538
213 120538 120338 120139 119940 119742 119544 119347 119151 118955 118759 118564 118369 118175 117982 117789 117596 117404 117213 117022 116831 116641 116451 116262 116074
211 116074 115886 115698 115511 115324 115138 114952 114767 114582 114398 114214 114031 113848 113665 113483 113302 113121 112940 112760 112581 112401 112223 112044 111866
209 111866 111689 111512 111335 111159 110984 110809 110634 110459 110286 110112 109939 109766 109594 109423 109251 109080 108910 108740 108570 108401 108232 108064 107896
206 107896 107728 107561 107394 107228 107062 106897 106732 106567 106403 106239 106075 105912 105749 105587 105425 105264 105103 104942 104781 104621 104462 104303 104144
204 104144 103985 103827 103670 103512 103356 103199 103043 102887 102732 102577 102422 102268 102114 101960 101807 101654 101502 101349 101198 101046 100895 100744 100594
202 100594 100444 100295 100145 99996 99848 99700 99552 99404 99257 99110 98964 98817 98672 98526 98381 98236 98092 97948 97804 97660 97517 97374 97232
200 97232 97090 96948 96806 96665 96524 96384 96244 96104 95964 95825 95686 95547 95409 95271 95133 94996 94859 94722 94586 94450 94314 94179 94043
198I4043j34j35j34j34j34j33j33j33j33j32j32j31j31j31j31j31j30j29j30j29j29j29j28
195I1017j28j28j28j27j27j27j26j26j26j26j25j25j25j24j24j24j24j23j24j22j23j22j22
193H8141j22j22j21j21j21j20j20j20j20j20j19j19j18j19j18j18j18j17j17j17j17j16j16
191H5405j16j16j15j15j15j15j14j15j14j13j14j13j13j13j12j13j12j11j12j11j11j11j11
189H2800j10j10j10j10j10j09j09j09j08j09j08j08j07j08j07j07j07j06j07j06j06j06j05
187H0318j05j05j05j05j04j04j04j04j04j03j03j03j03j02j03j02j01j02j02j01j01j01j00
185G7951j01j00j00j00j00r9r9r9r9r9r8r8r9r7r8r8r7r7r7r6r7r6r6r6r6r6r5r5r5r5r4r5
181G4834r4r4r4r4r3r3r4r2r3r3r2r2r2r2r2r1r2r1r1r1r0r1r0r0r0r0q9r0q9q9q9q9q8q8
$$ plain form
198 94043 93909 93774 93640 93506 93372 93239 93106 92973 92840 92708 92576 92445 92314 92183 92052 91921 91791 91662 91532 91403 91274 91145 91017
195 91017 90889 90761 90633 90506 90379 90252 90126 90000 89874 89748 89623 89498 89373 89249 89125 89001 88877 88754 88630 88508 88385 88263 88141
193 88141 88019 87897 87776 87655 87534 87414 87294 87174 87054 86934 86815 86696 86578 86459 86341 86223 86105 85988 85871 85754 85637 85521 85405
191 85405 85289 85173 85058 84943 84828 84713 84599 84484 84370 84257 84143 84030 83917 83804 83692 83579 83467 83356 83244 83133 83022 82911 82800
189 82800 82690 82580 82470 82360 82250 82141 82032 81923 81815 81706 81598 81490 81383 81275 81168 81061 80954 80848 80741 80635 80529 80423 80318
187 80318 80213 80108 80003 79898 79794 79690 79586 79482 79378 79275 79172 79069 78966 78864 78761 78659 78558 78456 78354 78253 78152 78051 77951
185 77951 77850 77750 77650 77550 77450 77351 77252 77153 77054 76955 76857 76759 76660 76563 76465 76367 76270 76173 76076 75980 75883 75787 75691 75595 75499 75403 75308 75213 75118 75023 74929 74834
181 74834 74740 74646 74552 74458 74365 74272 74178 74086 73993 73900 73808 73716 73624 73532 73440 73349 73257 73166 73075 72984 72894 72803 72713 72623 72533 72443 72354 72264 72175 72086 71997 71908 71820 71732
178G1732q9q8q7q8q8q7q7q7q7q7q6q7q6q6q6q5q6q5q6q5q4q5q5q4q4q4q4q4q4q3q4q3q3q3
175F8825q2q3q2q2q2q2q2q2q1q1q2q0q1q1q1q0q0q0q0q0q0p9q0p9p9p9p9p8p9p8p8p8p8p8
172F6099p8p7p7p8p7p7p6p7p6p7p6p6p6p6p6p5p5p6p5p5p5p4p5p4p5p4p4p4p4p3p4p3p3p3
168F3538p3p3p3p3p2p2p3p2p2p2p1p2p1p2p1p1p1p1p0p1p0p1p0p0p0p0o9p0o9p0o9o9o9o9
165F1127o8o9o8o9o8o8o8o8o8o8o7o7o8o7o7o7o7o6o7o7o6o6o6o6o6o6o6o5o6o5o5o6o5o4
162E8857o5o5o5o4o4o5o4o4o4o3o4o4o3o4o3o3o3o3o3o3o2o3o2o2o3o2o2o2o1o2o2o1o1o2
159E6714o1o1o1o1o1o0o1o0o1o0o0o0o0o0o0n9o0n9o0n9n9n9n9n9n9n8n9n8n9n8n8n8n8n8
156E4691n8n8n7n8n7n8n7n7n7n7n7n7n6n7n6n7n6n6n7n6n6n5n6n6n5n6n5n6n5n5n5n5n5n5
$$ plain form
178 71732 71643 71555 71468 71380 71292 71205 71118 71031 70944 70857 70771 70684 70598 70512 70426 70341 70255 70170 70084 69999 69915 69830 69745 69661 69577 69493 69409 69325 69241 69158 69074 68991 68908 68825
175 68825 68743 68660 68578 68496 68414 68332 68250 68168 68087 68006 67924 67844 67763 67682 67601 67521 67441 67361 67281 67201 67121 67042 66962 66883 66804 66725 66646 66568 66489 66411 66333 66255 66177 66099
172 66099 66021 65944 65867 65789 65712 65635 65559 65482 65406 65329 65253 65177 65101 65025 64949 64874 64799 64723 64648 64573 64498 64424 64349 64275 64200 64126 64052 63978 63904 63831 63757 63684 63611 63538
168 63538 63465 63392 63319 63246 63174 63102 63029 62957 62885 62813 62742 62670 62599 62527 62456 62385 62314 62243 62173 62102 62032 61961 61891 61821 61751 61681 61612 61542 61473 61403 61334 61265 61196 61127
165 61127 61059 60990 60922 60853 60785 60717 60649 60581 60513 60445 60378 60311 60243 60176 60109 60042 59975 59909 59842 59775 59709 59643 59577 59511 59445 59379 59313 59248 59182 59117 59052 58986 58921 58857
162 58857 58792 58727 58662 58598 58534 58469 58405 58341 58277 58214 58150 58086 58023 57959 57896 57833 57770 57707 57644 57581 57519 57456 57394 57332 57269 57207 57145 57083 57022 56960 56898 56837 56776 56714
159 56714 56653 56592 56531 56470 56409 56349 56288 56228 56167 56107 56047 55987 55927 55867 55807 55748 55688 55629 55569 55510 55451 55392 55333 55274 55215 55157 55098 55040 54981 54923 54865 54807 54749 54691
156 54691 54633 54575 54518 54460 54403 54345 54288 54231 54174 54117 54060 54003 53947 53890 53834 53777 53721 53665 53608 53552 53496 53441 53385 53329 53274 53218 53163 53107 53052 52997 52942 52887 52832 52777
152E2777n4n5n5n4n4n5n4n4n4n4n4n3n4n4n3n3n4n3n3n3n3n3n3n3n2n3n2n3n2n2n2n2n2n2
149E0966n2n2n2n1n2n1n1n2n1n1n1n1n1n0n1n1n0n1n0n0n1n0n0n0n0n0m9n0n0m9n0m9m9m9
146D9249n0m9m9m8m9m9m9m8m9m8m9m8m8m8m9m8m7m8m8m8m8m7m8m7m7m8m7m7m7m7m7m7m7m6
143D7620m7m7m6m7m6m6m6m7m6m6m6m5m6m6m6m5m6m5m6m5m5m5m6m5m5m5m4m5m5m5m4m5m4m4
139D6073m5m4m4m4m4m4m4m4m4m4m3m4m4m3m3m4m3m3m3m3m4m2m3m3m3m3m2m3m2m3m2m3m2m2
136D4602m2m2m2m2m2m2m2m2m1m2m1m2m1m2m1m1m1m2m1m1m1m0m1m1m1m0m1m1m0m0m1m0m0m0
133D3203m1m0m0m0m0l9m0m0m0l9m0l9m0l9l9m0l9l9l9l9l9l9l9l9l9l8l9l9l8l9l8l9l8l8
130D1870l8l9l8l8l8l8l8l7l8l8l8l7l8l7l8l7l8l7l7l8l7l7l7l7l7l7l7l7l6l7l7l6l7l6
$$ plain form
152 52777 52723 52668 52613 52559 52505 52450 52396 52342 52288 52234 52180 52127 52073 52019 51966 51913 51859 51806 51753 51700 51647 51594 51541 51488 51436 51383 51331 51278 51226 51174 51122 51070 51018 50966
149 50966 50914 50862 50810 50759 50707 50656 50605 50553 50502 50451 50400 50349 50298 50248 50197 50146 50096 50045 49995 49945 49894 49844 49794 49744 49694 49644 49595 49545 49495 49446 49396 49347 49298 49249
146 49249 49199 49150 49101 49053 49004 48955 48906 48858 48809 48761 48712 48664 48616 48568 48519 48471 48424 48376 48328 48280 48232 48185 48137 48090 48043 47995 47948 47901 47854 47807 47760 47713 47666 47620
143 47620 47573 47526 47480 47433 47387 47341 47295 47248 47202 47156 47110 47065 47019 46973 46927 46882 46836 46791 46745 46700 46655 46610 46564 46519 46474 46429 46385 46340 46295 46250 46206 46161 46117 46073
139 46073 46028 45984 45940 45896 45852 45808 45764 45720 45676 45632 45589 45545 45501 45458 45415 45371 45328 45285 45242 45199 45155 45113 45070 45027 44984 44941 44899 44856 44814 44771 44729 44686 44644 44602
136 44602 44560 44518 44476 44434 44392 44350 44308 44266 44225 44183 44142 44100 44059 44017 43976 43935 43894 43852 43811 43770 43729 43689 43648 43607 43566 43526 43485 43444 43404 43364 43323 43283 43243 43203
133 43203 43162 43122 43082 43042 43002 42963 42923 42883 42843 42804 42764 42725 42685 42646 42607 42567 42528 42489 42450 42411 42372 42333 42294 42255 42216 42178 42139 42100 42062 42023 41985 41946 41908 41870
130 41870 41832 41793 41755 41717 41679 41641 41603 41566 41528 41490 41452 41415 41377 41340 41302 41265 41227 41190 41153 41115 41078 41041 41004 40967 40930 40893 40856 40819 40783 40746 40709 40673 40636 40600
126D0600l7l6l7l6l6l6l6l7l6l6l6l5l6l6l6l6l5l6l5l6l5l6l5l5l6l5l5l5l5l5l5l5l5l5
123C9388l5l5l4l5l4l5l5l4l4l5l4l4l5l4l4l4l4l4l4l4l4l4l3l4l4l3l4l3l4l3l4l3l4l3
120C8231l3l3l3l3l3l3l3l3l3l3l3l3l2l3l3l2l3l2l3l2l2l3l2l2l2l2l3l2l2l2l1l2l2l2
117C7126l2l1l2l2l1l2l1l2l1l2l1l1l2l1l1l1l1l1l1l1l1l1l1l1l1l0l1l1l0l1l0l1l0l1
113C6069l0l0l1l0l0l0l1l0l0l0l0l0l0k9l0l0l0l0k9l0k9l0l0k9k9l0k9l0k9k9k9l0k9k9
110C5058k9k9k9k9k9k9k9k8k9k9k9k8k9k9k8k9k8k9k8k8k9k8k8k9k8k8k8k8k8k8k8k8k8k8
107C4090k8k8k7k8k8k8k7k8k7k8k7k8k7k8k7k7k8k7k7k7k8k7k7k7k7k7k7k7k7k6k7k7k7k7
104C3162k6k7k7k6k7k6k7k6k7k6k6k7k6k6k6k7k6k6k6k6k6k6k6k6k6k6k6k6k5k6k6k6k5k6
$$ plain form
126 40600 40563 40527 40490 40454 40418 40382 40346 40309 40273 40237 40201 40166 40130 40094 40058 40022 39987 39951 39916 39880 39845 39809 39774 39739 39703 39668 39633 39598 39563 39528 39493 39458 39423 39388
123 39388 39353 39318 39284 39249 39215 39180 39145 39111 39077 39042 39008 38974 38939 38905 38871 38837 38803 38769 38735 38701 38667 38633 38600 38566 38532 38499 38465 38432 38398 38365 38331 38298 38264 38231
120 38231 38198 38165 38132 38099 38066 38033 38000 37967 37934 37901 37868 37835 37803 37770 37737 37705 37672 37640 37607 37575 37543 37510 37478 37446 37414 37382 37349 37317 37285 37253 37222 37190 37158 37126
117 37126 37094 37063 37031 36999 36968 36936 36905 36873 36842 36810 36779 36748 36716 36685 36654 36623 36592 36561 36530 36499 36468 36437 36406 36375 36344 36314 36283 36252 36222 36191 36161 36130 36100 36069
113 36069 36039 36009 35978 35948 35918 35888 35857 35827 35797 35767 35737 35707 35677 35648 35618 35588 35558 35528 35499 35469 35440 35410 35380 35351 35322 35292 35263 35233 35204 35175 35146 35116 35087 35058
110 35058 35029 35000 34971 34942 34913 34884 34855 34827 34798 34769 34740 34712 34683 34654 34626 34597 34569 34540 34512 34484 34455 34427 34399 34370 34342 34314 34286 34258 34230 34202 34174 34146 34118 34090
107 34090 34062 34034 34007 33979 33951 33923 33896 33868 33841 33813 33786 33758 33731 33703 33676 33649 33621 33594 33567 33540 33512 33485 33458 33431 33404 33377 33350 33323 33296 33270 33243 33216 33189 33162
104 33162 33136 33109 33082 33056 33029 33003 32976 32950 32923 32897 32871 32844 32818 32792 32766 32739 32713 32687 32661 32635 32609 32583 32557 32531 32505 32479 32453 32427 32402 32376 32350 32324 32299 32273
100C2273k5k6k6k5k6k5k5k6k5k5k6k5k5k5k6k5k5k5k5k5k5k5k5k5k5k4k5k5k5k4k5k5k4k5
97C1420k5k4k5k4k5k4k4k5k4k4k5k4k4k4k4k5k4k4k4k4k4k4k4k4k3k4k4k4k4k3k4k4k3k4k4
94C0577k3k4k3k4k3k4k3k3k4k3k3k3k4k3k3k3k3k3k3k4k3k3k2k3k3k3k3k3k3k2k3k3k3k2k3
90B9769k3k2k3k2k3k2k3k2k2k3k2k2k3k2k2k3k2k2k2k2k2k2k2k2k2k2k2k2k2k2k2k2k1k2k2
87B8993k2k1k2k2k1k2k1k2k1k2k1k2k1k2k1k1k2k1k1k1k2k1k1k1k1k1k1k2k1k1k1k0k1k1k1
84B8248k1k1k1k1k0k1k1k0k1k1k0k1k1k0k1k0k1k0k1k0k0k1k0k0k1k0k0k1k0k0k0k0k0k0k1
80B7531k0k0k0k0k0k0j9k0k0k0k0k0k0j9k0k0j9k0k0j9k0k0j9k0j9k0j9k0j9k0j9j9k0j9j9
77B6843k0j9j9j9k0j9j9j9j9j9j9j9j9k0j9j8j9j9j9j9j9j9j9j9j8j9j9j9j8j9j9j8j9j9j8
$$ plain form
100 32273 32248 32222 32196 32171 32145 32120 32095 32069 32044 32019 31993 31968 31943 31918 31892 31867 31842 31817 31792 31767 31742 31717 31692 31667 31642 31618 31593 31568 31543 31519 31494 31469 31445 31420
97 31420 31395 31371 31346 31322 31297 31273 31249 31224 31200 31176 31151 31127 31103 31079 31055 31030 31006 30982 30958 30934 30910 30886 30862 30838 30815 30791 30767 30743 30719 30696 30672 30648 30625 30601 30577
94 30577 30554 30530 30507 30483 30460 30436 30413 30390 30366 30343 30320 30297 30273 30250 30227 30204 30181 30158 30135 30111 30088 30065 30043 30020 29997 29974 29951 29928 29905 29883 29860 29837 29814 29792 29769
90 29769 29746 29724 29701 29679 29656 29634 29611 29589 29567 29544 29522 29500 29477 29455 29433 29410 29388 29366 29344 29322 29300 29278 29256 29234 29212 29190 29168 29146 29124 29102 29080 29058 29037 29015 28993
87 28993 28971 28950 28928 28906 28885 28863 28842 28820 28799 28777 28756 28734 28713 28691 28670 28649 28627 28606 28585 28564 28542 28521 28500 28479 28458 28437 28416 28394 28373 28352 28331 28311 28290 28269 28248
84 28248 28227 28206 28185 28164 28144 28123 28102 28082 28061 28040 28020 27999 27978 27958 27937 27917 27896 27876 27855 27835 27815 27794 27774 27754 27733 27713 27693 27672 27652 27632 27612 27592 27572 27552 27531
80 27531 27511 27491 27471 27451 27431 27411 27392 27372 27352 27332 27312 27292 27272 27253 27233 27213 27194 27174 27154 27135 27115 27095 27076 27056 27037 27017 26998 26978 26959 26939 26920 26901 26881 26862 26843
77 26843 26823 26804 26785 26766 26746 26727 26708 26689 26670 26651 26632 26613 26594 26574 26555 26537 26518 26499 26480 26461 26442 26423 26404 26385 26367 26348 26329 26310 26292 26273 26254 26236 26217 26198 26180
74B6180j9j8j9j8j9j8j9j8j8j9j8j9j8j8j8j9j8j8j8j9j8j8j8j8j8j8j8j8j8j8j8j8j8j8j8
70B5542j8j8j8j7j8j8j8j8j7j8j8j7j8j8j7j8j7j8j7j8j7j8j7j8j7j8j7j7j8j7j7j8j7j7j8
67B4927j7j7j7j7j7j8j7j7j7j7j7j7j7j7j7j7j7j7j7j7j6j7j7j7j7j6j7j7j7j6j7j7j6j7j7
64B4335j6j7j6j7j6j7j6j7j6j7j6j7j6j6j7j6j6j7j6j6j7j6j6j6j6j7j6j6j6j6j6j6j6j6j6
60B3765j6j6j6j6j6j6j6j6j6j6j6j5j6j6j6j6j5j6j6j5j6j6j5j6j6j5j6j5j6j6j5j6j5j6j5
57B3214j5j6j5j6j5j5j6j5j5j6j5j5j5j6j5j5j5j6j5j5j5j5j5j5j5j5j5j5j5j5j5j5j5j5j5
54B2683j5j5j5j5j5j4j5j5j5j5j4j5j5j5j4j5j5j4j5j4j5j5j4j5j4j5j4j5j4j5j4j5j4j5j4
50B2170j4j5j4j5j4j4j5j4j4j4j5j4j4j4j4j5j4j4j4j4j4j4j5j4j4j4j4j4j4j4j4j4j4j4j3
$$ plain form
74 26180 26161 26143 26124 26106 26087 26069 26050 26032 26014 25995 25977 25958 25940 25922 25904 25885 25867 25849 25831 25812 25794 25776 25758 25740 25722 25704 25686 25668 25650 25632 25614 25596 25578 25560 25542
70 25542 25524 25506 25488 25471 25453 25435 25417 25399 25382 25364 25346 25329 25311 25293 25276 25258 25241 25223 25206 25188 25171 25153 25136 25118 25101 25083 25066 25049 25031 25014 24997 24979 24962 24945 24927
67 24927 24910 24893 24876 24859 24842 24824 24807 24790 24773 24756 24739 24722 24705 24688 24671 24654 24637 24620 24603 24586 24570 24553 24536 24519 24502 24486 24469 24452 24435 24419 24402 24385 24369 24352 24335
64 24335 24319 24302 24286 24269 24253 24236 24220 24203 24187 24170 24154 24137 24121 24105 24088 24072 24056 24039 24023 24007 23990 23974 23958 23942 23926 23909 23893 23877 23861 23845 23829 23813 23797 23781 23765
60 23765 23749 23733 23717 23701 23685 23669 23653 23637 23621 23605 23589 23574 23558 23542 23526 23510 23495 23479 23463 23448 23432 23416 23401 23385 23369 23354 23338 23323 23307 23291 23276 23260 23245 23229 23214
57 23214 23199 23183 23168 23152 23137 23122 23106 23091 23076 23060 23045 23030 23015 22999 22984 22969 22954 22938 22923 22908 22893 22878 22863 22848 22833 22818 22803 22788 22773 22758 22743 22728 22713 22698 22683
54 22683 22668 22653 22638 22623 22608 22594 22579 22564 22549 22534 22520 22505 22490 22475 22461 22446 22431 22417 22402 22388 22373 22358 22344 22329 22315 22300 22286 22271 22257 22242 22228 22213 22199 22184 22170
50 22170 22156 22141 22127 22112 22098 22084 22069 22055 22041 22027 22012 21998 21984 21970 21956 21941 21927 21913 21899 21885 21871 21857 21842 21828 21814 21800 21786 21772 21758 21744 21730 21716 21702 21688 21675
47B1675j4j4j4j4j4j4j3j4j4j4j4j3j4j4j4j3j4j4j3j4j4j3j4j3j4j4j3j4j3j4j3j4j3j4j3
44B1196j3j4j3j4j3j3j4j3j3j4j3j3j4j3j3j3j4j3j3j3j3j4j3j3j3j3j3j3j3j4j3j3j3j3j3
40B0733j3j3j3j3j2j3j3j3j3j3j3j3j3j2j3j3j3j3j2j3j3j3j2j3j3j2j3j3j2j3j3j2j3j2j3
37B0286j3j2j3j2j3j2j3j2j3j2j3j2j2j3j2j3j2j2j3j2j2j3j2j2j3j2j2j2j3j2j2j2j2j3j2
34A9853j2j2j2j2j2j3j2j2j2j2j2j2j2j2j2j2j2j2j2j2j2j2j2j1j2j2j2j2j2j2j1j2j2j2j2
30A9434j1j2j2j2j1j2j2j1j2j2j1j2j2j1j2j2j1j2j1j2j1j2j1j2j2j1j2j1j1j2j1j2j1j2j1
27A9029j1j2j1j2j1j1j2j1j1j2j1j1j1j2j1j1j1j2j1j1j1j1j1j2j1j1j1j1j1j1j1j2j1j1j1
24A8636j1j1j1j1j1j1j1j1j1j1j1j0j1j1j1j1j1j1j1j1j0j1j1j1j1j0j1j1j1j1j0j1j1j0j1
$$ plain form
47 21675 21661 21647 21633 21619 21605 21591 21578 21564 21550 21536 21522 21509 21495 21481 21467 21454 21440 21426 21413 21399 21385 21372 21358 21345 21331 21317 21304 21290 21277 21263 21250 21236 21223 21209 21196
44 21196 21183 21169 21156 21142 21129 21116 21102 21089 21076 21062 21049 21036 21022 21009 20996 20983 20969 20956 20943 20930 20917 20903 20890 20877 20864 20851 20838 20825 20812 20798 20785 20772 20759 20746 20733
40 20733 20720 20707 20694 20681 20669 20656 20643 20630 20617 20604 20591 20578 20565 20553 20540 20527 20514 20501 20489 20476 20463 20450 20438 20425 20412 20400 20387 20374 20362 20349 20336 20324 20311 20299 20286
37 20286 20273 20261 20248 20236 20223 20211 20198 20186 20173 20161 20148 20136 20124 20111 20099 20086 20074 20062 20049 20037 20025 20012 20000 19988 19975 19963 19951 19939 19926 19914 19902 19890 19878 19865 19853
34 19853 19841 19829 19817 19805 19793 19780 19768 19756 19744 19732 19720 19708 19696 19684 19672 19660 19648 19636 19624 19612 19600 19588 19576 19565 19553 19541 19529 19517 19505 19493 19482 19470 19458 19446 19434
30 19434 19423 19411 19399 19387 19376 19364 19352 19341 19329 19317 19306 19294 19282 19271 19259 19247 19236 19224 19213 19201 19190 19178 19167 19155 19143 19132 19120 19109 19098 19086 19075 19063 19052 19040 19029
27 19029 19018 19006 18995 18983 18972 18961 18949 18938 18927 18915 18904 18893 18882 18870 18859 18848 18837 18825 18814 18803 18792 18781 18770 18758 18747 18736 18725 18714 18703 18692 18681 18669 18658 18647 18636
24 18636 18625 18614 18603 18592 18581 18570 18559 18548 18537 18526 18515 18505 18494 18483 18472 18461 18450 18439 18428 18417 18407 18396 18385 18374 18363 18353 18342 18331 18320 18309 18299 18288 18277 18267 18256
20A8256j1j1j0j1j1j0j1j0j1j1j0j1j0j1j1j0j1j0j1j0j1j0j1j0j1j0j1j0j0j1j0j1j0j0j1
17A7887j0j1j0j0j1j0j0j0j1j0j0j1j0j0j0j1j0j0j0j0j1j0j0j0j0j0j1j0j0j0j0j0j0j0j0
14A7530j0j0j0j0j0j0j0j0j0j0j0j0j0j0j0j0j0j0j0j0j0rj0j0j0j0j0rj0j0j0j0rj0j0j0
10A7173rj0j0j0rj0j0rj0j0rj0j0rj0j0rj0rj0rj0j0rj0rj0rj0rj0rj0rj0rj0rrj0rj0rrj0
6A6743rj0rrj0rrj0rrrj0rrj0rrrj0rrrrj0rrrrrj0rrrrrrrrrj0rrrrrrrrrrrrrrrrqrrrr
0A6186rrrrrqrrrrrqrrrrqrrrqrrrqrrrqrrqrrqrrqrqrrqrqrrqrqrqrqrqrqrqrqrqqrqrqr
-7A5580qqrqqrqrqqrqqqrqqrqqqrqqqrqqqrqqqqqrqqqqqqqrqqqqqqqqqqqqqqqqqqqqqqqqq
-13A5017qqqqqqqpqqqqqqqpqqqqqpqqqpqqqqpqqqpqqpqqpqqpqqpqqpqqpqpqqpqpqpqqpqpq
$$ plain form
20 18256 18245 18234 18224 18213 18202 18192 18181 18171 18160 18149 18139 18128 18118 18107 18096 18086 18075 18065 18054 18044 18033 18023 18012 18002 17991 17981 17970 17960 17950 17939 17929 17918 17908 17898 17887
17 17887 17877 17866 17856 17846 17835 17825 17815 17805 17794 17784 17774 17763 17753 17743 17733 17722 17712 17702 17692 17682 17671 17661 17651 17641 17631 17621 17610 17600 17590 17580 17570 17560 17550 17540 17530
14 17530 17520 17510 17500 17490 17480 17470 17460 17450 17440 17430 17420 17410 17400 17390 17380 17370 17360 17350 17340 17330 17320 17311 17301 17291 17281 17271 17261 17252 17242 17232 17222 17212 17203 17193 17183 17173
10 17173 17164 17154 17144 17134 17125 17115 17105 17096 17086 17076 17067 17057 17047 17038 17028 17018 17009 16999 16990 16980 16971 16961 16951 16942 16932 16923 16913 16904 16894 16885 16875 16866 16856 16847 16837 16828 16818 16809 16800 16790 16781 16771 16762 16753 16743
6 16743 16734 16724 16715 16706 16696 16687 16678 16668 16659 16650 16641 16631 16622 16613 16603 16594 16585 16576 16566 16557 16548 16539 16530 16520 16511 16502 16493 16484 16475 16465 16456 16447 16438 16429 16420 16411 16402 16393 16384 16374 16365 16356 16347 16338 16329 16320 16311 16302 16293 16284 16275 16266 16257 16248 16239 16230 16222 16213 16204 16195 16186
0 16186 16177 16168 16159 16150 16141 16133 16124 16115 16106 16097 16088 16080 16071 16062 16053 16044 16036 16027 16018 16009 16001 15992 15983 15974 15966 15957 15948 15939 15931 15922 15913 15905 15896 15887 15879 15870 15861 15853 15844 15836 15827 15818 15810 15801 15793 15784 15775 15767 15758 15750 15741 15733 15724 15716 15707 15699 15690 15682 15673 15665 15656 15648 15639 15631 15623 15614 15606 15597 15589 15580
-7 15580 15572 15564 15555 15547 15539 15530 15522 15513 15505 15497 15488 15480 15472 15464 15455 15447 15439 15430 15422 15414 15406 15397 15389 15381 15373 15364 15356 15348 15340 15331 15323 15315 15307 15299 15291 15282 15274 15266 15258 15250 15242 15234 15226 15217 15209 15201 15193 15185 15177 15169 15161 15153 15145 15137 15129 15121 15113 15105 15097 15089 15081 15073 15065 15057 15049 15041 15033 15025 15017
-13 15017 15009 15001 14993 14985 14977 14969 14961 14954 14946 14938 14930 14922 14914 14906 14898 14891 14883 14875 14867 14859 14851 14844 14836 14828 14820 14813 14805 14797 14789 14781 14774 14766 14758 14750 14743 14735 14727 14720 14712 14704 14697 14689 14681 14674 14666 14658 14651 14643 14635 14628 14620 14612 14605 14597 14590 14582 14574 14567 14559 14552 14544 14537 14529 14521 14514 14506 14499 14491
-20A4491pqpqpqpqpqpqppqpqpqppqpqppqppqppqppqppqpppqppqppppqpppqppppqppppppqp
-26A3993ppppppqppppppppppppppppppppppppppppppppppoppppppppopppppoppppoppppop
-33A3521ppopppopppoppoppoppoppoppoppoppopopoppopopoppopopopopopopopopoopopop
-39A3072opoopopoopoopopoopoopoopoopooopoopooopooopoooopoooopooooopoooooopooo
-46A2646ooooopoooooooooooooooooooooooooooooooooooooonooooooooonoooooonooooon
-52A2241oooonoooonooonooonooonoonooonoonoonoonoonoonoononoononoonononoononon
-59A1855ononoonononononnonononononnonononnononnononnonnonnonnonnonnonnonnonn
-65A1487nonnnonnnonnnonnnonnnnonnnnnonnnnnonnnnnnonnnnnnnonnnnnnnnnnnnonnnnn
$$ plain form
-20 14491 14484 14476 14469 14461 14454 14446 14439 14431 14424 14416 14409 14401 14394 14387 14379 14372 14364 14357 14349 14342 14335 14327 14320 14312 14305 14298 14290 14283 14276 14268 14261 14254 14246 14239 14232 14224 14217 14210 14202 14195 14188 14181 14173 14166 14159 14151 14144 14137 14130 14123 14115 14108 14101 14094 14086 14079 14072 14065 14058 14050 14043 14036 14029 14022 14015 14008 14000 13993
-26 13993 13986 13979 13972 13965 13958 13951 13943 13936 13929 13922 13915 13908 13901 13894 13887 13880 13873 13866 13859 13852 13845 13838 13831 13824 13817 13810 13803 13796 13789 13782 13775 13768 13761 13754 13747 13740 13733 13726 13719 13712 13705 13699 13692 13685 13678 13671 13664 13657 13650 13643 13637 13630 13623 13616 13609 13602 13596 13589 13582 13575 13568 13562 13555 13548 13541 13534 13528 13521
-33 13521 13514 13507 13501 13494 13487 13480 13474 13467 13460 13453 13447 13440 13433 13427 13420 13413 13407 13400 13393 13387 13380 13373 13367 13360 13353 13347 13340 13333 13327 13320 13313 13307 13300 13294 13287 13281 13274 13267 13261 13254 13248 13241 13235 13228 13221 13215 13208 13202 13195 13189 13182 13176 13169 13163 13156 13150 13143 13137 13130 13124 13117 13111 13105 13098 13092 13085 13079 13072
-39 13072 13066 13059 13053 13047 13040 13034 13027 13021 13015 13008 13002 12996 12989 12983 12976 12970 12964 12957 12951 12945 12938 12932 12926 12919 12913 12907 12900 12894 12888 12882 12875 12869 12863 12856 12850 12844 12838 12831 12825 12819 12813 12806 12800 12794 12788 12782 12775 12769 12763 12757 12751 12744 12738 12732 12726 12720 12714 12707 12701 12695 12689 12683 12677 12671 12664 12658 12652 12646
-46 12646 12640 12634 12628 12622 12616 12609 12603 12597 12591 12585 12579 12573 12567 12561 12555 12549 12543 12537 12531 12525 12519 12513 12507 12501 12495 12489 12483 12477 12471 12465 12459 12453 12447 12441 12435 12429 12423 12417 12411 12405 12399 12393 12387 12381 12376 12370 12364 12358 12352 12346 12340 12334 12328 12322 12317 12311 12305 12299 12293 12287 12281 12276 12270 12264 12258 12252 12246 12241
-52 12241 12235 12229 12223 12217 12212 12206 12200 12194 12188 12183 12177 12171 12165 12160 12154 12148 12142 12137 12131 12125 12119 12114 12108 12102 12097 12091 12085 12079 12074 12068 12062 12057 12051 12045 12040 12034 12028 12023 12017 12011 12006 12000 11994 11989 11983 11977 11972 11966 11961 11955 11949 11944 11938 11933 11927 11921 11916 11910 11905 11899 11894 11888 11882 11877 11871 11866 11860 11855
-59 11855 11849 11844 11838 11833 11827 11821 11816 11810 11805 11799 11794 11788 11783 11777 11772 11767 11761 11756 11750 11745 11739 11734 11728 11723 11717 11712 11707 11701 11696 11690 11685 11679 11674 11669 11663 11658 11652 11647 11642 11636 11631 11625 11620 11615 11609 11604 11599 11593 11588 11583 11577 11572 11567 11561 11556 11551 11545 11540 11535 11529 11524 11519 11513 11508 11503 11497 11492 11487
-65 11487 11482 11476 11471 11466 11461 11455 11450 11445 11440 11434 11429 11424 11419 11413 11408 11403 11398 11392 11387 11382 11377 11372 11366 11361 11356 11351 11346 11341 11335 11330 11325 11320 11315 11310 11304 11299 11294 11289 11284 11279 11274 11268 11263 11258 11253 11248 11243 11238 11233 11227 11222 11217 11212 11207 11202 11197 11192 11187 11182 11177 11172 11167 11161 11156 11151 11146 11141 11136
-72A1136nnnnnnnnnnnnnnnnnnnnnnnnnnmnnnnnnnnnnnnmnnnnnnnnmnnnnnnmnnnnnmnnnnnm
-78A0802nnnnmnnnnmnnnmnnnmnnnmnnnmnnmnnnmnnmnnmnnmnnmnnmnnmnnmnnmnmnnmnnmnmn
-85A0482nmnmnmnnmnmnmnmnnmnmnmnmnmnmnmnmnmnmnmnmnmnmnmmnmnmnmnmmnmnmnmmnmnmm
-91A0177nmmnmnmmnmmnmnmmnmmnmmnmmnmmmnmmnmmnmmmnmmnmmmnmmmnmmmnmmmmnmmmnmmmm
-98I885nmmmmnmmmmmnmmmmmnmmmmmmnmmmmmmmnmmmmmmmmmnmmmmmmmmmmmmmnmmmmmmmmmmmm
-104I601mmmmmmmmmmmmmmmmmmmmmmmmmmmlmmmmmmmmmmmmmlmmmmmmmmmlmmmmmmmmlmmmmmml
-111I334mmmmmlmmmmmlmmmmmlmmmmlmmmlmmmmlmmmlmmmlmmmmlmmlmmmlmmmlmmlmmmlmmlmm
-117I077lmmlmmmlmmlmmlmlmmlmmlmmlmmlmlmmlmmlmlmmlmlmmlmlmlmmlmlmlmmlmlmlmlmm
$$ plain form
-72 11136 11131 11126 11121 11116 11111 11106 11101 11096 11091 11086 11081 11076 11071 11066 11061 11056 11051 11046 11041 11036 11031 11026 11021 11016 11011 11006 11002 10997 10992 10987 10982 10977 10972 10967 10962 10957 10952 10947 10942 10938 10933 10928 10923 10918 10913 10908 10903 10898 10894 10889 10884 10879 10874 10869 10864 10860 10855 10850 10845 10840 10835 10831 10826 10821 10816 10811 10806 10802
-78 10802 10797 10792 10787 10782 10778 10773 10768 10763 10758 10754 10749 10744 10739 10735 10730 10725 10720 10716 10711 10706 10701 10697 10692 10687 10682 10678 10673 10668 10664 10659 10654 10649 10645 10640 10635 10631 10626 10621 10617 10612 10607 10603 10598 10593 10589 10584 10579 10575 10570 10565 10561 10556 10551 10547 10542 10537 10533 10528 10524 10519 10514 10510 10505 10500 10496 10491 10487 10482
-85 10482 10477 10473 10468 10464 10459 10455 10450 10445 10441 10436 10432 10427 10423 10418 10414 10409 10404 10400 10395 10391 10386 10382 10377 10373 10368 10364 10359 10355 10350 10346 10341 10337 10332 10328 10323 10319 10314 10310 10305 10301 10296 10292 10287 10283 10278 10274 10270 10265 10261 10256 10252 10247 10243 10238 10234 10230 10225 10221 10216 10212 10207 10203 10199 10194 10190 10185 10181 10177
-91 10177 10172 10168 10164 10159 10155 10150 10146 10142 10137 10133 10129 10124 10120 10115 10111 10107 10102 10098 10094 10089 10085 10081 10076 10072 10068 10063 10059 10055 10051 10046 10042 10038 10033 10029 10025 10020 10016 10012 10008 10003 9999 9995 9990 9986 9982 9978 9973 9969 9965 9961 9956 9952 9948 9944 9939 9935 9931 9927 9923 9918 9914 9910 9906 9901 9897 9893 9889 9885
-98 9885 9880 9876 9872 9868 9864 9859 9855 9851 9847 9843 9839 9834 9830 9826 9822 9818 9814 9809 9805 9801 9797 9793 9789 9785 9780 9776 9772 9768 9764 9760 9756 9752 9747 9743 9739 9735 9731 9727 9723 9719 9715 9711 9706 9702 9698 9694 9690 9686 9682 9678 9674 9670 9666 9662 9658 9654 9649 9645 9641 9637 9633 9629 9625 9621 9617 9613 9609 9605 9601
-104 9601 9597 9593 9589 9585 9581 9577 9573 9569 9565 9561 9557 9553 9549 9545 9541 9537 9533 9529 9525 9521 9517 9513 9509 9505 9501 9497 9493 9490 9486 9482 9478 9474 9470 9466 9462 9458 9454 9450 9446 9442 9438 9435 9431 9427 9423 9419 9415 9411 9407 9403 9399 9396 9392 9388 9384 9380 9376 9372 9368 9364 9361 9357 9353 9349 9345 9341 9337 9334
-111 9334 9330 9326 9322 9318 9314 9311 9307 9303 9299 9295 9291 9288 9284 9280 9276 9272 9268 9265 9261 9257 9253 9249 9246 9242 9238 9234 9231 9227 9223 9219 9215 9212 9208 9204 9200 9197 9193 9189 9185 9182 9178 9174 9170 9166 9163 9159 9155 9152 9148 9144 9140 9137 9133 9129 9125 9122 9118 9114 9111 9107 9103 9099 9096 9092 9088 9085 9081 9077
-117 9077 9074 9070 9066 9063 9059 9055 9051 9048 9044 9040 9037 9033 9029 9026 9022 9019 9015 9011 9008 9004 9000 8997 8993 8989 8986 8982 8978 8975 8971 8968 8964 8960 8957 8953 8949 8946 8942 8939 8935 8931 8928 8924 8921 8917 8913 8910 8906 8903 8899 8896 8892 8888 8885 8881 8878 8874 8871 8867 8863 8860 8856 8853 8849 8846 8842 8839 8835 8831
-124H831lmlmlmlmlmlmlmlmlmlmlmlmlmlmlmlmlmlmllmlmlmlmlmllmlmlmllmlmllmlmlmll
-130H596mllmlmllmlmllmllmllmlmllmllmllmllmllmllmllmlllmllmllmlllmllmlllmlllm
-137H369lllmlllmlllmlllmlllmllllmllllmllllmllllmllllmlllllmlllllmllllllmllll
-143H152lllmlllllllmllllllllmlllllllllllmlllllllllllllllmlllllllllllllllllll
-150G943llllllllllllllllllllllllllllllllllklllllllllllllllklllllllllllklllll
-156G742llllkllllllllkllllllkllllllkllllllklllllklllllkllllklllllkllllkllllk
-163G549lllkllllklllklllkllllklllklllkllklllklllklllkllklllkllkllklllkllkllk
-169G363llkllkllkllkllkllkllkllkllkllkllklkllkllklkllkllklkllklkllklkllklkll
$$ plain form
-124 8831 8828 8824 8821 8817 8814 8810 8807 8803 8800 8796 8793 8789 8786 8782 8779 8775 8772 8768 8765 8761 8758 8754 8751 8747 8744 8740 8737 8733 8730 8726 8723 8719 8716 8712 8709 8705 8702 8699 8695 8692 8688 8685 8681 8678 8674 8671 8667 8664 8661 8657 8654 8650 8647 8643 8640 8637 8633 8630 8626 8623 8620 8616 8613 8609 8606 8602 8599 8596
-130 8596 8592 8589 8586 8582 8579 8575 8572 8569 8565 8562 8558 8555 8552 8548 8545 8542 8538 8535 8532 8528 8525 8521 8518 8515 8511 8508 8505 8501 8498 8495 8491 8488 8485 8481 8478 8475 8471 8468 8465 8461 8458 8455 8451 8448 8445 8442 8438 8435 8432 8428 8425 8422 8418 8415 8412 8409 8405 8402 8399 8395 8392 8389 8386 8382 8379 8376 8373 8369
-137 8369 8366 8363 8360 8356 8353 8350 8347 8343 8340 8337 8334 8330 8327 8324 8321 8317 8314 8311 8308 8304 8301 8298 8295 8292 8288 8285 8282 8279 8276 8272 8269 8266 8263 8260 8256 8253 8250 8247 8244 8240 8237 8234 8231 8228 8224 8221 8218 8215 8212 8209 8205 8202 8199 8196 8193 8190 8186 8183 8180 8177 8174 8171 8168 8164 8161 8158 8155 8152
-143 8152 8149 8146 8143 8139 8136 8133 8130 8127 8124 8121 8118 8114 8111 8108 8105 8102 8099 8096 8093 8090 8086 8083 8080 8077 8074 8071 8068 8065 8062 8059 8056 8053 8049 8046 8043 8040 8037 8034 8031 8028 8025 8022 8019 8016 8013 8010 8007 8004 8000 7997 7994 7991 7988 7985 7982 7979 7976 7973 7970 7967 7964 7961 7958 7955 7952 7949 7946 7943
-150 7943 7940 7937 7934 7931 7928 7925 7922 7919 7916 7913 7910 7907 7904 7901 7898 7895 7892 7889 7886 7883 7880 7877 7874 7871 7868 7865 7862 7859 7856 7853 7850 7847 7844 7841 7839 7836 7833 7830 7827 7824 7821 7818 7815 7812 7809 7806 7803 7800 7797 7794 7792 7789 7786 7783 7780 7777 7774 7771 7768 7765 7762 7759 7757 7754 7751 7748 7745 7742
-156 7742 7739 7736 7733 7730 7728 7725 7722 7719 7716 7713 7710 7707 7704 7702 7699 7696 7693 7690 7687 7684 7682 7679 7676 7673 7670 7667 7664 7662 7659 7656 7653 7650 7647 7644 7642 7639 7636 7633 7630 7627 7625 7622 7619 7616 7613 7610 7608 7605 7602 7599 7596 7594 7591 7588 7585 7582 7579 7577 7574 7571 7568 7565 7563 7560 7557 7554 7551 7549
-163 7549 7546 7543 7540 7538 7535 7532 7529 7526 7524 7521 7518 7515 7513 7510 7507 7504 7502 7499 7496 7493 7490 7488 7485 7482 7479 7477 7474 7471 7468 7466 7463 7460 7458 7455 7452 7449 7447 7444 7441 7438 7436 7433 7430 7427 7425 7422 7419 7417 7414 7411 7408 7406 7403 7400 7398 7395 7392 7390 7387 7384 7381 7379 7376 7373 7371 7368 7365 7363
-169 7363 7360 7357 7355 7352 7349 7347 7344 7341 7339 7336 7333 7331 7328 7325 7323 7320 7317 7315 7312 7309 7307 7304 7301 7299 7296 7293 7291 7288 7285 7283 7280 7277 7275 7272 7270 7267 7264 7262 7259 7256 7254 7251 7249 7246 7243 7241 7238 7235 7233 7230 7228 7225 7222 7220 7217 7215 7212 7209 7207 7204 7202 7199 7196 7194 7191 7189 7186 7183
-175G183klklkllklkllklklklkllklklklkllklklklklklklkllklklklklklklklklklklklk
-182G011lklklklklklklkklklklklklklkklklklklklkklklklkklklklkklklklkklklkklkl
-188F844kklklkklklkklklkklkklklkklkklklkklkklkklkklklkklkklkklkklkklkklkklkk
-195F684klkklkklkklkklkkklkklkkklkklkkklkklkkklkkklkklkkklkkklkkklkkklkkklkk
-201F529klkkkklkkklkkkklkkklkkkklkkkklkkkklkkkklkkkklkkkkklkkkklkkkkklkkkkkl
-208F379kkkkkklkkkkkklkkkkkklkkkkkklkkkkkkklkkkkkkkklkkkkkkkklkkkkkkkkklkkkk
-214F235kkkkkkklkkkkkkkkkkkkkklkkkkkkkkkkkkkkkkklkkkkkkkkkkkkkkkkkkkkkkkkkkk
-221F096kkkkkkkkkkkkkkkkkkkkkkkkkkkkkkkkkkkkkkkkkkkkkkkkkkkkkkkkkkjkkkkkkkkk
$$ plain form
-175 7183 7181 7178 7176 7173 7171 7168 7165 7163 7160 7158 7155 7152 7150 7147 7145 7142 7140 7137 7135 7132 7129 7127 7124 7122 7119 7117 7114 7112 7109 7106 7104 7101 7099 7096 7094 7091 7089 7086 7084 7081 7079 7076 7074 7071 7068 7066 7063 7061 7058 7056 7053 7051 7048 7046 7043 7041 7038 7036 7033 7031 7028 7026 7023 7021 7018 7016 7013 7011
-182 7011 7008 7006 7003 7001 6998 6996 6993 6991 6988 6986 6983 6981 6978 6976 6974 6971 6969 6966 6964 6961 6959 6956 6954 6951 6949 6946 6944 6942 6939 6937 6934 6932 6929 6927 6924 6922 6919 6917 6915 6912 6910 6907 6905 6902 6900 6898 6895 6893 6890 6888 6885 6883 6881 6878 6876 6873 6871 6868 6866 6864 6861 6859 6856 6854 6852 6849 6847 6844
-188 6844 6842 6840 6837 6835 6832 6830 6828 6825 6823 6820 6818 6816 6813 6811 6808 6806 6804 6801 6799 6797 6794 6792 6789 6787 6785 6782 6780 6778 6775 6773 6770 6768 6766 6763 6761 6759 6756 6754 6752 6749 6747 6745 6742 6740 6737 6735 6733 6730 6728 6726 6723 6721 6719 6716 6714 6712 6709 6707 6705 6702 6700 6698 6695 6693 6691 6688 6686 6684
-195 6684 6682 6679 6677 6675 6672 6670 6668 6665 6663 6661 6658 6656 6654 6651 6649 6647 6645 6642 6640 6638 6635 6633 6631 6629 6626 6624 6622 6619 6617 6615 6613 6610 6608 6606 6603 6601 6599 6597 6594 6592 6590 6588 6585 6583 6581 6578 6576 6574 6572 6569 6567 6565 6563 6560 6558 6556 6554 6551 6549 6547 6545 6542 6540 6538 6536 6533 6531 6529
-201 6529 6527 6524 6522 6520 6518 6516 6513 6511 6509 6507 6504 6502 6500 6498 6496 6493 6491 6489 6487 6484 6482 6480 6478 6476 6473 6471 6469 6467 6465 6462 6460 6458 6456 6454 6451 6449 6447 6445 6443 6440 6438 6436 6434 6432 6429 6427 6425 6423 6421 6419 6416 6414 6412 6410 6408 6405 6403 6401 6399 6397 6395 6392 6390 6388 6386 6384 6382 6379
-208 6379 6377 6375 6373 6371 6369 6367 6364 6362 6360 6358 6356 6354 6352 6349 6347 6345 6343 6341 6339 6337 6334 6332 6330 6328 6326 6324 6322 6319 6317 6315 6313 6311 6309 6307 6305 6302 6300 6298 6296 6294 6292 6290 6288 6286 6283 6281 6279 6277 6275 6273 6271 6269 6267 6264 6262 6260 6258 6256 6254 6252 6250 6248 6246 6243 6241 6239 6237 6235
-214 6235 6233 6231 6229 6227 6225 6223 6221 6218 6216 6214 6212 6210 6208 6206 6204 6202 6200 6198 6196 6194 6192 6190 6187 6185 6183 6181 6179 6177 6175 6173 6171 6169 6167 6165 6163 6161 6159 6157 6155 6153 6150 6148 6146 6144 6142 6140 6138 6136 6134 6132 6130 6128 6126 6124 6122 6120 6118 6116 6114 6112 6110 6108 6106 6104 6102 6100 6098 6096
-221 6096 6094 6092 6090 6088 6086 6084 6082 6080 6078 6076 6074 6072 6070 6068 6066 6064 6062 6060 6058 6056 6054 6052 6050 6048 6046 6044 6042 6040 6038 6036 6034 6032 6030 6028 6026 6024 6022 6020 6018 6016 6014 6012 6010 6008 6006 6004 6002 6000 5998 5996 5994 5992 5990 5988 5986 5984 5982 5980 5979 5977 5975 5973 5971 5969 5967 5965 5963 5961
-227E961kkkkkkkkkkjkkkkkkkkkkkkkjkkkkkkkkkkkkjkkkkkkkkkjkkkkkkkkkjkkkkkkkkjk
-234E831kkkkkkkjkkkkkkkjkkkkkkjkkkkkkjkkkkkkjkkkkkkjkkkkkjkkkkkjkkkkkjkkkkkj
-240E705kkkkjkkkkkjkkkkjkkkkjkkkkjkkkkjkkkkjkkkkjkkkkjkkkjkkkkjkkkjkkkkjkkkj
-247E583kkkjkkkjkkkjkkkjkkkjkkkjkkkjkkkjkkkjkkjkkkjkkkjkkjkkkjkkkjkkjkkkjkkj
-253E465kkjkkkjkkjkkjkkkjkkjkkjkkjkkkjkkjkkjkkjkkjkkjkkjkkjkkjkkjkkjkkjkkjkk
-260E350jkkjkkjkkjkjkkjkkjkkjkjkkjkkjkkjkjkkjkkjkjkkjkkjkjkkjkjkkjkkjkjkkjkj
-266E240kkjkjkkjkjkkjkjkjkkjkjkkjkjkjkkjkjkkjkjkjkkjkjkjkkjkjkjkjkkjkjkjkjkk
-273E132jkjkjkjkkjkjkjkjkjkkjkjkjkjkjkjkjkkjkjkjkjkjkjkjkjkjkjkjkjkkjkjkjkjk
$$ plain form
-227 5961 5959 5957 5955 5953 5951 5949 5947 5945 5943 5941 5940 5938 5936 5934 5932 5930 5928 5926 5924 5922 5920 5918 5916 5914 5913 5911 5909 5907 5905 5903 5901 5899 5897 5895 5893 5891 5889 5888 5886 5884 5882 5880 5878 5876 5874 5872 5870 5869 5867 5865 5863 5861 5859 5857 5855 5853 5851 5850 5848 5846 5844 5842 5840 5838 5836 5834 5833 5831
-234 5831 5829 5827 5825 5823 5821 5819 5817 5816 5814 5812 5810 5808 5806 5804 5802 5801 5799 5797 5795 5793 5791 5789 5788 5786 5784 5782 5780 5778 5776 5775 5773 5771 5769 5767 5765 5763 5762 5760 5758 5756 5754 5752 5750 5749 5747 5745 5743 5741 5739 5738 5736 5734 5732 5730 5728 5727 5725 5723 5721 5719 5717 5716 5714 5712 5710 5708 5706 5705
-240 5705 5703 5701 5699 5697 5696 5694 5692 5690 5688 5686 5685 5683 5681 5679 5677 5676 5674 5672 5670 5668 5667 5665 5663 5661 5659 5658 5656 5654 5652 5650 5649 5647 5645 5643 5641 5640 5638 5636 5634 5632 5631 5629 5627 5625 5623 5622 5620 5618 5616 5615 5613 5611 5609 5607 5606 5604 5602 5600 5599 5597 5595 5593 5591 5590 5588 5586 5584 5583
-247 5583 5581 5579 5577 5576 5574 5572 5570 5569 5567 5565 5563 5562 5560 5558 5556 5555 5553 5551 5549 5548 5546 5544 5542 5541 5539 5537 5535 5534 5532 5530 5528 5527 5525 5523 5521 5520 5518 5516 5515 5513 5511 5509 5508 5506 5504 5502 5501 5499 5497 5496 5494 5492 5490 5489 5487 5485 5483 5482 5480 5478 5477 5475 5473 5471 5470 5468 5466 5465
-253 5465 5463 5461 5460 5458 5456 5454 5453 5451 5449 5448 5446 5444 5443 5441 5439 5437 5436 5434 5432 5431 5429 5427 5426 5424 5422 5421 5419 5417 5415 5414 5412 5410 5409 5407 5405 5404 5402 5400 5399 5397 5395 5394 5392 5390 5389 5387 5385 5384 5382 5380 5379 5377 5375 5374 5372 5370 5369 5367 5365 5364 5362 5360 5359 5357 5355 5354 5352 5350
-260 5350 5349 5347 5345 5344 5342 5340 5339 5337 5335 5334 5332 5331 5329 5327 5326 5324 5322 5321 5319 5317 5316 5314 5313 5311 5309 5308 5306 5304 5303 5301 5299 5298 5296 5295 5293 5291 5290 5288 5286 5285 5283 5282 5280 5278 5277 5275 5273 5272 5270 5269 5267 5265 5264 5262 5261 5259 5257 5256 5254 5252 5251 5249 5248 5246 5244 5243 5241 5240
-266 5240 5238 5236 5235 5233 5232 5230 5228 5227 5225 5224 5222 5220 5219 5217 5216 5214 5213 5211 5209 5208 5206 5205 5203 5201 5200 5198 5197 5195 5194 5192 5190 5189 5187 5186 5184 5182 5181 5179 5178 5176 5175 5173 5171 5170 5168 5167 5165 5164 5162 5160 5159 5157 5156 5154 5153 5151 5150 5148 5146 5145 5143 5142 5140 5139 5137 5136 5134 5132
-273 5132 5131 5129 5128 5126 5125 5123 5122 5120 5118 5117 5115 5114 5112 5111 5109 5108 5106 5105 5103 5101 5100 5098 5097 5095 5094 5092 5091 5089 5088 5086 5085 5083 5082 5080 5078 5077 5075 5074 5072 5071 5069 5068 5066 5065 5063 5062 5060 5059 5057 5056 5054 5053 5051 5050 5048 5047 5045 5044 5042 5040 5039 5037 5036 5034 5033 5031 5030 5028
-279E028jkjkjkjkjkjkjkjkjkjkjkjkjjkjkjkjkjkjkjkjkjkjkjkjkjjkjkjkjkjkjkjkjjkj
-286D928kjkjkjkjjkjkjkjkjkjjkjkjkjkjjkjkjkjkjjkjkjkjjkjkjkjjkjkjkjjkjkjjkjkj
-292D830kjjkjkjjkjkjkjjkjkjjkjkjjkjkjjkjkjjkjkjjkjjkjkjjkjkjjkjjkjkjjkjkjjkj
-299D735jkjjkjkjjkjjkjkjjkjjkjjkjkjjkjjkjjkjjkjjkjkjjkjjkjjkjjkjjkjjkjjkjjkj
-305D643jkjjkjjkjjkjjkjjkjjkjjkjjkjjkjjjkjjkjjkjjkjjkjjjkjjkjjkjjjkjjkjjkjjj
-312D554kjjkjjjkjjkjjkjjjkjjkjjjkjjjkjjkjjjkjjkjjjkjjjkjjkjjjkjjjkjjjkjjjkjj
-318D467jkjjkjjjkjjjkjjjkjjjkjjjkjjjjkjjjkjjjkjjjkjjjkjjjjkjjjkjjjkjjjjkjjjk
-325D382jjjjkjjjkjjjjkjjjjkjjjkjjjjkjjjjkjjjjkjjjjkjjjjkjjjjkjjjjkjjjjkjjjjj
$$ plain form
-279 5028 5027 5025 5024 5022 5021 5019 5018 5016 5015 5013 5012 5010 5009 5007 5006 5004 5003 5001 5000 4998 4997 4995 4994 4992 4991 4990 4988 4987 4985 4984 4982 4981 4979 4978 4976 4975 4973 4972 4970 4969 4967 4966 4964 4963 4961 4960 4958 4957 4955 4954 4953 4951 4950 4948 4947 4945 4944 4942 4941 4939 4938 4936 4935 4933 4932 4931 4929 4928
-286 4928 4926 4925 4923 4922 4920 4919 4917 4916 4915 4913 4912 4910 4909 4907 4906 4904 4903 4901 4900 4899 4897 4896 4894 4893 4891 4890 4888 4887 4886 4884 4883 4881 4880 4878 4877 4875 4874 4873 4871 4870 4868 4867 4865 4864 4863 4861 4860 4858 4857 4855 4854 4853 4851 4850 4848 4847 4845 4844 4843 4841 4840 4838 4837 4836 4834 4833 4831 4830
-292 4830 4828 4827 4826 4824 4823 4821 4820 4819 4817 4816 4814 4813 4811 4810 4809 4807 4806 4804 4803 4802 4800 4799 4797 4796 4795 4793 4792 4790 4789 4788 4786 4785 4783 4782 4781 4779 4778 4776 4775 4774 4772 4771 4770 4768 4767 4765 4764 4763 4761 4760 4758 4757 4756 4754 4753 4752 4750 4749 4747 4746 4745 4743 4742 4740 4739 4738 4736 4735
-299 4735 4734 4732 4731 4730 4728 4727 4725 4724 4723 4721 4720 4719 4717 4716 4714 4713 4712 4710 4709 4708 4706 4705 4704 4702 4701 4699 4698 4697 4695 4694 4693 4691 4690 4689 4687 4686 4685 4683 4682 4681 4679 4678 4676 4675 4674 4672 4671 4670 4668 4667 4666 4664 4663 4662 4660 4659 4658 4656 4655 4654 4652 4651 4650 4648 4647 4646 4644 4643
-305 4643 4642 4640 4639 4638 4636 4635 4634 4632 4631 4630 4628 4627 4626 4624 4623 4622 4620 4619 4618 4616 4615 4614 4612 4611 4610 4608 4607 4606 4604 4603 4602 4601 4599 4598 4597 4595 4594 4593 4591 4590 4589 4587 4586 4585 4583 4582 4581 4580 4578 4577 4576 4574 4573 4572 4570 4569 4568 4567 4565 4564 4563 4561 4560 4559 4557 4556 4555 4554
-312 4554 4552 4551 4550 4548 4547 4546 4545 4543 4542 4541 4539 4538 4537 4535 4534 4533 4532 4530 4529 4528 4526 4525 4524 4523 4521 4520 4519 4518 4516 4515 4514 4512 4511 4510 4509 4507 4506 4505 4503 4502 4501 4500 4498 4497 4496 4495 4493 4492 4491 4489 4488 4487 4486 4484 4483 4482 4481 4479 4478 4477 4476 4474 4473 4472 4471 4469 4468 4467
-318 4467 4466 4464 4463 4462 4460 4459 4458 4457 4455 4454 4453 4452 4450 4449 4448 4447 4445 4444 4443 4442 4440 4439 4438 4437 4435 4434 4433 4432 4431 4429 4428 4427 4426 4424 4423 4422 4421 4419 4418 4417 4416 4414 4413 4412 4411 4409 4408 4407 4406 4405 4403 4402 4401 4400 4398 4397 4396 4395 4393 4392 4391 4390 4389 4387 4386 4385 4384 4382
-325 4382 4381 4380 4379 4378 4376 4375 4374 4373 4371 4370 4369 4368 4367 4365 4364 4363 4362 4361 4359 4358 4357 4356 4354 4353 4352 4351 4350 4348 4347 4346 4345 4344 4342 4341 4340 4339 4338 4336 4335 4334 4333 4332 4330 4329 4328 4327 4326 4324 4323 4322 4321 4320 4318 4317 4316 4315 4314 4312 4311 4310 4309 4308 4306 4305 4304 4303 4302 4301
-331D301kjjjjkjjjjkjjjjjkjjjjjkjjjjkjjjjjkjjjjjkjjjjjkjjjjjkjjjjjkjjjjjjkjjj
-338D221jjkjjjjjjkjjjjjkjjjjjjkjjjjjjkjjjjjjjkjjjjjjkjjjjjjjkjjjjjjkjjjjjjjk
-344D143jjjjjjjjkjjjjjjjkjjjjjjjjkjjjjjjjjkjjjjjjjjjkjjjjjjjjjkjjjjjjjjjkjjj
-351D068jjjjjjjkjjjjjjjjjjjkjjjjjjjjjjjjkjjjjjjjjjjjjkjjjjjjjjjjjjjjkjjjjjjj
-357C995jjjjjjjjkjjjjjjjjjjjjjjjjjkjjjjjjjjjjjjjjjjjjjjjkjjjjjjjjjjjjjjjjjjj
-364C924jjjjjjjkjjjjjjjjjjjjjjjjjjjjjjjjjjjjjjjjjjjjjjjjjjjjjjjjkjjjjjjjjjjj
-370C854jjjjjjjjjjjjjjjjjjjjjjjjjjjjjjjjjjjjjjjjj%jjjjjjjjjjjjjjjjjjjjjjjjjj
-377C787jjjjjjjjjjjjjjjjjjjjjjj%jjjjjjjjjjjjjjjjjjjjjjjjjjjj%jjjjjjjjjjjjjjj
$$ plain form
-331 4301 4299 4298 4297 4296 4295 4293 4292 4291 4290 4289 4287 4286 4285 4284 4283 4282 4280 4279 4278 4277 4276 4275 4273 4272 4271 4270 4269 4267 4266 4265 4264 4263 4262 4260 4259 4258 4257 4256 4255 4253 4252 4251 4250 4249 4248 4246 4245 4244 4243 4242 4241 4239 4238 4237 4236 4235 4234 4232 4231 4230 4229 4228 4227 4226 4224 4223 4222 4221
-338 4221 4220 4219 4217 4216 4215 4214 4213 4212 4211 4209 4208 4207 4206 4205 4204 4202 4201 4200 4199 4198 4197 4196 4194 4193 4192 4191 4190 4189 4188 4186 4185 4184 4183 4182 4181 4180 4179 4177 4176 4175 4174 4173 4172 4171 4169 4168 4167 4166 4165 4164 4163 4162 4160 4159 4158 4157 4156 4155 4154 4152 4151 4150 4149 4148 4147 4146 4145 4143
-344 4143 4142 4141 4140 4139 4138 4137 4136 4135 4133 4132 4131 4130 4129 4128 4127 4126 4124 4123 4122 4121 4120 4119 4118 4117 4116 4114 4113 4112 4111 4110 4109 4108 4107 4106 4104 4103 4102 4101 4100 4099 4098 4097 4096 4095 4093 4092 4091 4090 4089 4088 4087 4086 4085 4084 4082 4081 4080 4079 4078 4077 4076 4075 4074 4073 4071 4070 4069 4068
-351 4068 4067 4066 4065 4064 4063 4062 4061 4059 4058 4057 4056 4055 4054 4053 4052 4051 4050 4049 4048 4046 4045 4044 4043 4042 4041 4040 4039 4038 4037 4036 4035 4034 4032 4031 4030 4029 4028 4027 4026 4025 4024 4023 4022 4021 4020 4018 4017 4016 4015 4014 4013 4012 4011 4010 4009 4008 4007 4006 4005 4004 4002 4001 4000 3999 3998 3997 3996 3995
-357 3995 3994 3993 3992 3991 3990 3989 3988 3987 3985 3984 3983 3982 3981 3980 3979 3978 3977 3976 3975 3974 3973 3972 3971 3970 3969 3968 3966 3965 3964 3963 3962 3961 3960 3959 3958 3957 3956 3955 3954 3953 3952 3951 3950 3949 3948 3947 3946 3945 3943 3942 3941 3940 3939 3938 3937 3936 3935 3934 3933 3932 3931 3930 3929 3928 3927 3926 3925 3924
-364 3924 3923 3922 3921 3920 3919 3918 3917 3915 3914 3913 3912 3911 3910 3909 3908 3907 3906 3905 3904 3903 3902 3901 3900 3899 3898 3897 3896 3895 3894 3893 3892 3891 3890 3889 3888 3887 3886 3885 3884 3883 3882 3881 3880 3879 3878 3877 3876 3875 3874 3873 3872 3871 3870 3869 3868 3867 3865 3864 3863 3862 3861 3860 3859 3858 3857 3856 3855 3854
-370 3854 3853 3852 3851 3850 3849 3848 3847 3846 3845 3844 3843 3842 3841 3840 3839 3838 3837 3836 3835 3834 3833 3832 3831 3830 3829 3828 3827 3826 3825 3824 3823 3822 3821 3820 3819 3818 3817 3816 3815 3814 3813 3813 3812 3811 3810 3809 3808 3807 3806 3805 3804 3803 3802 3801 3800 3799 3798 3797 3796 3795 3794 3793 3792 3791 3790 3789 3788 3787
-377 3787 3786 3785 3784 3783 3782 3781 3780 3779 3778 3777 3776 3775 3774 3773 3772 3771 3770 3769 3768 3767 3766 3765 3764 3764 3763 3762 3761 3760 3759 3758 3757 3756 3755 3754 3753 3752 3751 3750 3749 3748 3747 3746 3745 3744 3743 3742 3741 3740 3739 3738 3737 3736 3736 3735 3734 3733 3732 3731 3730 3729 3728 3727 3726 3725 3724 3723 3722 3721
-383C721jjjjjj%jjjjjjjjjjjjjjjjjj%jjjjjjjjjjjjjjjj%jjjjjjjjjjjjjjj%jjjjjjjjj
-390C657jjjj%jjjjjjjjjjjj%jjjjjjjjjjjj%jjjjjjjjjjj%jjjjjjjjjj%jjjjjjjjjj%jjj
-396C595jjjjjjj%jjjjjjjjj%jjjjjjjj%jjjjjjjjj%jjjjjjjj%jjjjjjjj%jjjjjjjj%jjjj
-403C534jjj%jjjjjjjj%jjjjjjj%jjjjjjj%jjjjjj%jjjjjjj%jjjjjj%jjjjjjj%jjjjjj%jj
-409C475jjjj%jjjjjj%jjjjjj%jjjjjj%jjjjjj%jjjjj%jjjjjj%jjjjj%jjjjj%jjjjjj%jjj
-416C417jj%jjjjj%jjjjj%jjjjj%jjjjj%jjjjj%jjjjj%jjjj%jjjjj%jjjjj%jjjj%jjjjj%j
-422C361jjj%jjjjj%jjjj%jjjj%jjjjj%jjjj%jjjj%jjjj%jjjj%jjjj%jjjj%jjjj%jjjj%jj
-429C306jj%jjjj%jjjj%jjjj%jjjj%jjj%jjjj%jjjj%jjjj%jjj%jjjj%jjj%jjjj%jjjj%jjj
$$ plain form
-383 3721 3720 3719 3718 3717 3716 3715 3715 3714 3713 3712 3711 3710 3709 3708 3707 3706 3705 3704 3703 3702 3701 3700 3699 3698 3697 3697 3696 3695 3694 3693 3692 3691 3690 3689 3688 3687 3686 3685 3684 3683 3682 3681 3681 3680 3679 3678 3677 3676 3675 3674 3673 3672 3671 3670 3669 3668 3667 3666 3666 3665 3664 3663 3662 3661 3660 3659 3658 3657
-390 3657 3656 3655 3654 3653 3653 3652 3651 3650 3649 3648 3647 3646 3645 3644 3643 3642 3641 3641 3640 3639 3638 3637 3636 3635 3634 3633 3632 3631 3630 3629 3629 3628 3627 3626 3625 3624 3623 3622 3621 3620 3619 3618 3618 3617 3616 3615 3614 3613 3612 3611 3610 3609 3608 3608 3607 3606 3605 3604 3603 3602 3601 3600 3599 3598 3598 3597 3596 3595
-396 3595 3594 3593 3592 3591 3590 3589 3588 3588 3587 3586 3585 3584 3583 3582 3581 3580 3579 3579 3578 3577 3576 3575 3574 3573 3572 3571 3571 3570 3569 3568 3567 3566 3565 3564 3563 3562 3562 3561 3560 3559 3558 3557 3556 3555 3554 3554 3553 3552 3551 3550 3549 3548 3547 3546 3546 3545 3544 3543 3542 3541 3540 3539 3538 3538 3537 3536 3535 3534
-403 3534 3533 3532 3531 3531 3530 3529 3528 3527 3526 3525 3524 3523 3523 3522 3521 3520 3519 3518 3517 3516 3516 3515 3514 3513 3512 3511 3510 3509 3509 3508 3507 3506 3505 3504 3503 3503 3502 3501 3500 3499 3498 3497 3496 3496 3495 3494 3493 3492 3491 3490 3490 3489 3488 3487 3486 3485 3484 3483 3483 3482 3481 3480 3479 3478 3477 3477 3476 3475
-409 3475 3474 3473 3472 3471 3471 3470 3469 3468 3467 3466 3465 3465 3464 3463 3462 3461 3460 3459 3459 3458 3457 3456 3455 3454 3453 3453 3452 3451 3450 3449 3448 3447 3447 3446 3445 3444 3443 3442 3442 3441 3440 3439 3438 3437 3436 3436 3435 3434 3433 3432 3431 3431 3430 3429 3428 3427 3426 3426 3425 3424 3423 3422 3421 3420 3420 3419 3418 3417
-416 3417 3416 3415 3415 3414 3413 3412 3411 3410 3410 3409 3408 3407 3406 3405 3405 3404 3403 3402 3401 3400 3400 3399 3398 3397 3396 3395 3395 3394 3393 3392 3391 3390 3390 3389 3388 3387 3386 3385 3385 3384 3383 3382 3381 3381 3380 3379 3378 3377 3376 3376 3375 3374 3373 3372 3371 3371 3370 3369 3368 3367 3367 3366 3365 3364 3363 3362 3362 3361
-422 3361 3360 3359 3358 3358 3357 3356 3355 3354 3353 3353 3352 3351 3350 3349 3349 3348 3347 3346 3345 3345 3344 3343 3342 3341 3340 3340 3339 3338 3337 3336 3336 3335 3334 3333 3332 3332 3331 3330 3329 3328 3328 3327 3326 3325 3324 3324 3323 3322 3321 3320 3320 3319 3318 3317 3316 3316 3315 3314 3313 3312 3312 3311 3310 3309 3308 3308 3307 3306
-429 3306 3305 3304 3304 3303 3302 3301 3300 3300 3299 3298 3297 3296 3296 3295 3294 3293 3292 3292 3291 3290 3289 3288 3288 3287 3286 3285 3285 3284 3283 3282 3281 3281 3280 3279 3278 3277 3277 3276 3275 3274 3273 3273 3272 3271 3270 3270 3269 3268 3267 3266 3266 3265 3264 3263 3263 3262 3261 3260 3259 3259 3258 3257 3256 3255 3255 3254 3253 3252
-435C252%jjjj%jjj%jjj%jjjj%jjj%jjjj%jjj%jjj%jjjj%jjj%jjj%jjj%jjj%jjjj%jjj%jj
-442C200j%jjj%jjj%jjj%jjj%jjj%jjjj%jjj%jjj%jjj%jj%jjj%jjj%jjj%jjj%jjj%jjj%jj
-448C149j%jjj%jjj%jj%jjj%jjj%jjj%jj%jjj%jjj%jjj%jj%jjj%jjj%jj%jjj%jjj%jj%jjj
-454C099%jjj%jj%jjj%jj%jjj%jj%jjj%jj%jjj%jj%jjj%jj%jjj%jj%jjj%jj%jjj%jj%jj%j
-461C051jj%jj%jjj%jj%jj%jjj%jj%jj%jjj%jj%jj%jjj%jj%jj%jj%jjj%jj%jj%jj%jjj%jj
-467C003%jj%jj%jjj%jj%jj%jj%jj%jj%jjj%jj%jj%jj%jj%jj%jj%jj%jjj%jj%jj%jj%jj%j
-474B957j%jj%jj%jj%jj%jj%jj%jj%jj%jj%jj%jj%jj%jj%jj%jj%jj%jj%jj%jj%jj%jj%jj%
-480B912jj%jj%j%jj%jj%jj%jj%jj%jj%jj%jj%j%jj%jj%jj%jj%jj%j%jj%jj%jj%jj%jj%j%
$$ plain form
-435 3252 3252 3251 3250 3249 3248 3248 3247 3246 3245 3245 3244 3243 3242 3242 3241 3240 3239 3238 3238 3237 3236 3235 3235 3234 3233 3232 3231 3231 3230 3229 3228 3228 3227 3226 3225 3225 3224 3223 3222 3221 3221 3220 3219 3218 3218 3217 3216 3215 3215 3214 3213 3212 3212 3211 3210 3209 3209 3208 3207 3206 3205 3205 3204 3203 3202 3202 3201 3200
-442 3200 3199 3199 3198 3197 3196 3196 3195 3194 3193 3193 3192 3191 3190 3190 3189 3188 3187 3187 3186 3185 3184 3184 3183 3182 3181 3180 3180 3179 3178 3177 3177 3176 3175 3174 3174 3173 3172 3171 3171 3170 3169 3169 3168 3167 3166 3166 3165 3164 3163 3163 3162 3161 3160 3160 3159 3158 3157 3157 3156 3155 3154 3154 3153 3152 3151 3151 3150 3149
-448 3149 3148 3148 3147 3146 3145 3145 3144 3143 3142 3142 3141 3140 3140 3139 3138 3137 3137 3136 3135 3134 3134 3133 3132 3131 3131 3130 3129 3129 3128 3127 3126 3126 3125 3124 3123 3123 3122 3121 3120 3120 3119 3118 3118 3117 3116 3115 3115 3114 3113 3112 3112 3111 3110 3110 3109 3108 3107 3107 3106 3105 3104 3104 3103 3102 3102 3101 3100 3099
-454 3099 3099 3098 3097 3096 3096 3095 3094 3094 3093 3092 3091 3091 3090 3089 3089 3088 3087 3086 3086 3085 3084 3084 3083 3082 3081 3081 3080 3079 3079 3078 3077 3076 3076 3075 3074 3074 3073 3072 3071 3071 3070 3069 3069 3068 3067 3066 3066 3065 3064 3064 3063 3062 3061 3061 3060 3059 3059 3058 3057 3056 3056 3055 3054 3054 3053 3052 3052 3051
-461 3051 3050 3049 3049 3048 3047 3047 3046 3045 3044 3044 3043 3042 3042 3041 3040 3040 3039 3038 3037 3037 3036 3035 3035 3034 3033 3033 3032 3031 3030 3030 3029 3028 3028 3027 3026 3026 3025 3024 3023 3023 3022 3021 3021 3020 3019 3019 3018 3017 3017 3016 3015 3014 3014 3013 3012 3012 3011 3010 3010 3009 3008 3008 3007 3006 3005 3005 3004 3003
-467 3003 3003 3002 3001 3001 3000 2999 2999 2998 2997 2996 2996 2995 2994 2994 2993 2992 2992 2991 2990 2990 2989 2988 2988 2987 2986 2986 2985 2984 2983 2983 2982 2981 2981 2980 2979 2979 2978 2977 2977 2976 2975 2975 2974 2973 2973 2972 2971 2971 2970 2969 2969 2968 2967 2966 2966 2965 2964 2964 2963 2962 2962 2961 2960 2960 2959 2958 2958 2957
-474 2957 2956 2956 2955 2954 2954 2953 2952 2952 2951 2950 2950 2949 2948 2948 2947 2946 2946 2945 2944 2944 2943 2942 2942 2941 2940 2940 2939 2938 2938 2937 2936 2936 2935 2934 2934 2933 2932 2932 2931 2930 2930 2929 2928 2928 2927 2926 2926 2925 2924 2924 2923 2922 2922 2921 2920 2920 2919 2918 2918 2917 2916 2916 2915 2914 2914 2913 2912 2912
-480 2912 2911 2910 2910 2909 2908 2908 2907 2907 2906 2905 2905 2904 2903 2903 2902 2901 2901 2900 2899 2899 2898 2897 2897 2896 2895 2895 2894 2893 2893 2892 2891 2891 2890 2890 2889 2888 2888 2887 2886 2886 2885 2884 2884 2883 2882 2882 2881 2880 2880 2879 2879 2878 2877 2877 2876 2875 2875 2874 2873 2873 2872 2871 2871 2870 2869 2869 2868 2868
-487B868jj%jj%jj%j%jj%jj%jj%jj%j%jj%jj%jj%j%jj%jj%jj%j%jj%jj%j%jj%jj%jj%j%jj
-493B824%jj%j%jj%jj%j%jj%jj%j%jj%jj%j%jj%jj%j%jj%j%jj%jj%j%jj%j%jj%jj%j%jj%j
-500B782%jj%jj%j%jj%j%jj%jj%j%jj%j%jj%j%jj%j%jj%j%jj%jj%j%jj%j%jj%j%jj%j%jj%
-506B741j%jj%j%jj%j%jj%j%jj%j%jj%j%j%jj%j%jj%j%jj%j%jj%j%jj%j%j%jj%j%jj%j%jj
-513B700%j%j%jj%j%jj%j%j%jj%j%jj%j%j%jj%j%jj%j%j%jj%j%j%jj%j%jj%j%j%jj%j%j%j
-519B661j%j%j%jj%j%j%jj%j%j%jj%j%j%jj%j%j%jj%j%j%jj%j%j%j%jj%j%j%jj%j%j%j%jj
-526B622%j%j%jj%j%j%j%jj%j%j%j%jj%j%j%j%jj%j%j%j%jj%j%j%j%jj%j%j%j%jj%j%j%j%
-532B585j%jj%j%j%j%j%jj%j%j%j%j%jj%j%j%j%j%jj%j%j%j%j%jj%j%j%j%j%j%jj%j%j%j%
$$ plain form
-487 2868 2867 2866 2866 2865 2864 2864 2863 2862 2862 2861 2861 2860 2859 2859 2858 2857 2857 2856 2855 2855 2854 2853 2853 2852 2852 2851 2850 2850 2849 2848 2848 2847 2846 2846 2845 2845 2844 2843 2843 2842 2841 2841 2840 2839 2839 2838 2838 2837 2836 2836 2835 2834 2834 2833 2833 2832 2831 2831 2830 2829 2829 2828 2827 2827 2826 2826 2825 2824
-493 2824 2824 2823 2822 2822 2821 2821 2820 2819 2819 2818 2817 2817 2816 2816 2815 2814 2814 2813 2812 2812 2811 2811 2810 2809 2809 2808 2807 2807 2806 2806 2805 2804 2804 2803 2802 2802 2801 2801 2800 2799 2799 2798 2798 2797 2796 2796 2795 2794 2794 2793 2793 2792 2791 2791 2790 2790 2789 2788 2788 2787 2786 2786 2785 2785 2784 2783 2783 2782
-500 2782 2782 2781 2780 2780 2779 2778 2778 2777 2777 2776 2775 2775 2774 2774 2773 2772 2772 2771 2770 2770 2769 2769 2768 2767 2767 2766 2766 2765 2764 2764 2763 2763 2762 2761 2761 2760 2760 2759 2758 2758 2757 2757 2756 2755 2755 2754 2753 2753 2752 2752 2751 2750 2750 2749 2749 2748 2747 2747 2746 2746 2745 2744 2744 2743 2743 2742 2741 2741
-506 2741 2740 2740 2739 2738 2738 2737 2737 2736 2735 2735 2734 2734 2733 2732 2732 2731 2731 2730 2729 2729 2728 2728 2727 2726 2726 2725 2725 2724 2724 2723 2722 2722 2721 2721 2720 2719 2719 2718 2718 2717 2716 2716 2715 2715 2714 2713 2713 2712 2712 2711 2710 2710 2709 2709 2708 2708 2707 2706 2706 2705 2705 2704 2703 2703 2702 2702 2701 2700
-513 2700 2700 2699 2699 2698 2698 2697 2696 2696 2695 2695 2694 2693 2693 2692 2692 2691 2691 2690 2689 2689 2688 2688 2687 2686 2686 2685 2685 2684 2684 2683 2682 2682 2681 2681 2680 2679 2679 2678 2678 2677 2677 2676 2675 2675 2674 2674 2673 2673 2672 2671 2671 2670 2670 2669 2668 2668 2667 2667 2666 2666 2665 2664 2664 2663 2663 2662 2662 2661
-519 2661 2660 2660 2659 2659 2658 2658 2657 2656 2656 2655 2655 2654 2654 2653 2652 2652 2651 2651 2650 2650 2649 2648 2648 2647 2647 2646 2646 2645 2644 2644 2643 2643 2642 2642 2641 2640 2640 2639 2639 2638 2638 2637 2636 2636 2635 2635 2634 2634 2633 2633 2632 2631 2631 2630 2630 2629 2629 2628 2627 2627 2626 2626 2625 2625 2624 2624 2623 2622
-526 2622 2622 2621 2621 2620 2620 2619 2618 2618 2617 2617 2616 2616 2615 2615 2614 2613 2613 2612 2612 2611 2611 2610 2610 2609 2608 2608 2607 2607 2606 2606 2605 2605 2604 2603 2603 2602 2602 2601 2601 2600 2600 2599 2598 2598 2597 2597 2596 2596 2595 2595 2594 2593 2593 2592 2592 2591 2591 2590 2590 2589 2588 2588 2587 2587 2586 2586 2585 2585
-532 2585 2584 2584 2583 2582 2582 2581 2581 2580 2580 2579 2579 2578 2578 2577 2576 2576 2575 2575 2574 2574 2573 2573 2572 2572 2571 2570 2570 2569 2569 2568 2568 2567 2567 2566 2566 2565 2564 2564 2563 2563 2562 2562 2561 2561 2560 2560 2559 2558 2558 2557 2557 2556 2556 2555 2555 2554 2554 2553 2553 2552 2551 2551 2550 2550 2549 2549 2548 2548
-539B548j%j%jj%j%j%j%j%j%j%jj%j%j%j%j%j%j%jj%j%j%j%j%j%j%j%jj%j%j%j%j%j%j%j%
-545B512jj%j%j%j%j%j%j%j%j%j%jj%j%j%j%j%j%j%j%j%j%j%j%jj%j%j%j%j%j%j%j%j%j%j
-552B476%j%j%j%j%j%jj%j%j%j%j%j%j%j%j%j%j%j%j%j%j%j%j%j%j%j%j%j%j%j%j%j%j%j%
-558B442j%j%j%j%j%j%j%jj%j%j%j%j%j%j%j%j%j%%j%j%j%j%j%j%j%j%j%j%j%j%j%j%j%j%
-565B408j%j%j%j%j%j%j%j%j%j%j%j%j%j%j%j%j%j%j%%j%j%j%j%j%j%j%j%j%j%j%j%j%j%j
-571B374%j%%j%j%j%j%j%j%j%j%j%j%j%j%j%%j%j%j%j%j%j%j%j%j%j%%j%j%j%j%j%j%j%j%
-578B342j%%j%j%j%j%j%j%j%j%j%%j%j%j%j%j%j%j%%j%j%j%j%j%j%j%%j%j%j%j%j%j%j%%j
-584B310%j%j%j%j%j%%j%j%j%j%j%j%%j%j%j%j%j%%j%j%j%j%j%j%%j%j%j%j%j%%j%j%j%j%
$$ plain form
-539 2548 2547 2547 2546 2546 2545 2544 2544 2543 2543 2542 2542 2541 2541 2540 2540 2539 2539 2538 2538 2537 2536 2536 2535 2535 2534 2534 2533 2533 2532 2532 2531 2531 2530 2530 2529 2528 2528 2527 2527 2526 2526 2525 2525 2524 2524 2523 2523 2522 2522 2521 2521 2520 2519 2519 2518 2518 2517 2517 2516 2516 2515 2515 2514 2514 2513 2513 2512 2512
-545 2512 2511 2510 2510 2509 2509 2508 2508 2507 2507 2506 2506 2505 2505 2504 2504 2503 2503 2502 2502 2501 2501 2500 2499 2499 2498 2498 2497 2497 2496 2496 2495 2495 2494 2494 2493 2493 2492 2492 2491 2491 2490 2490 2489 2489 2488 2488 2487 2486 2486 2485 2485 2484 2484 2483 2483 2482 2482 2481 2481 2480 2480 2479 2479 2478 2478 2477 2477 2476
-552 2476 2476 2475 2475 2474 2474 2473 2473 2472 2472 2471 2471 2470 2469 2469 2468 2468 2467 2467 2466 2466 2465 2465 2464 2464 2463 2463 2462 2462 2461 2461 2460 2460 2459 2459 2458 2458 2457 2457 2456 2456 2455 2455 2454 2454 2453 2453 2452 2452 2451 2451 2450 2450 2449 2449 2448 2448 2447 2447 2446 2446 2445 2445 2444 2444 2443 2443 2442 2442
-558 2442 2441 2441 2440 2440 2439 2439 2438 2438 2437 2437 2436 2436 2435 2435 2434 2433 2433 2432 2432 2431 2431 2430 2430 2429 2429 2428 2428 2427 2427 2426 2426 2425 2425 2424 2424 2424 2423 2423 2422 2422 2421 2421 2420 2420 2419 2419 2418 2418 2417 2417 2416 2416 2415 2415 2414 2414 2413 2413 2412 2412 2411 2411 2410 2410 2409 2409 2408 2408
-565 2408 2407 2407 2406 2406 2405 2405 2404 2404 2403 2403 2402 2402 2401 2401 2400 2400 2399 2399 2398 2398 2397 2397 2396 2396 2395 2395 2394 2394 2393 2393 2392 2392 2391 2391 2390 2390 2389 2389 2389 2388 2388 2387 2387 2386 2386 2385 2385 2384 2384 2383 2383 2382 2382 2381 2381 2380 2380 2379 2379 2378 2378 2377 2377 2376 2376 2375 2375 2374
-571 2374 2374 2373 2373 2373 2372 2372 2371 2371 2370 2370 2369 2369 2368 2368 2367 2367 2366 2366 2365 2365 2364 2364 2363 2363 2362 2362 2361 2361 2360 2360 2360 2359 2359 2358 2358 2357 2357 2356 2356 2355 2355 2354 2354 2353 2353 2352 2352 2351 2351 2350 2350 2350 2349 2349 2348 2348 2347 2347 2346 2346 2345 2345 2344 2344 2343 2343 2342 2342
-578 2342 2341 2341 2341 2340 2340 2339 2339 2338 2338 2337 2337 2336 2336 2335 2335 2334 2334 2333 2333 2332 2332 2332 2331 2331 2330 2330 2329 2329 2328 2328 2327 2327 2326 2326 2325 2325 2325 2324 2324 2323 2323 2322 2322 2321 2321 2320 2320 2319 2319 2318 2318 2318 2317 2317 2316 2316 2315 2315 2314 2314 2313 2313 2312 2312 2311 2311 2311 2310
-584 2310 2310 2309 2309 2308 2308 2307 2307 2306 2306 2305 2305 2305 2304 2304 2303 2303 2302 2302 2301 2301 2300 2300 2299 2299 2299 2298 2298 2297 2297 2296 2296 2295 2295 2294 2294 2294 2293 2293 2292 2292 2291 2291 2290 2290 2289 2289 2288 2288 2288 2287 2287 2286 2286 2285 2285 2284 2284 2283 2283 2283 2282 2282 2281 2281 2280 2280 2279 2279
-591B279j%%j%j%j%j%j%%j%j%j%j%j%%j%j%j%j%%j%j%j%j%%j%j%j%j%j%%j%j%j%j%%j%j%j
-597B248%j%%j%j%j%j%%j%j%j%j%%j%j%j%%j%j%j%j%%j%j%j%j%%j%j%j%%j%j%j%j%%j%j%j
-604B218%%j%j%j%j%%j%j%j%%j%j%j%%j%j%j%%j%j%j%%j%j%j%j%%j%j%j%%j%j%j%%j%j%j%
-610B189%j%j%%j%j%j%%j%j%j%%j%j%j%%j%j%j%%j%j%%j%j%j%%j%j%j%%j%j%%j%j%j%%j%j
-617B160%j%%j%j%%j%j%j%%j%j%%j%j%j%%j%j%%j%j%j%%j%j%%j%j%%j%j%j%%j%j%%j%j%%j
-623B132%j%j%%j%j%%j%j%%j%j%%j%j%j%%j%j%%j%j%%j%j%%j%j%%j%j%%j%j%%j%j%j%%j%j
-630B104%%j%j%%j%j%%j%j%%j%j%%j%j%%j%j%%j%j%%j%j%%j%j%%j%%j%j%%j%j%%j%j%%j%j
-636B077%%j%j%%j%j%%j%j%%j%%j%j%%j%j%%j%j%%j%j%%j%%j%j%%j%j%%j%j%%j%%j%j%%j%
$$ plain form
-591 2279 2278 2278 2278 2277 2277 2276 2276 2275 2275 2274 2274 2273 2273 2273 2272 2272 2271 2271 2270 2270 2269 2269 2268 2268 2268 2267 2267 2266 2266 2265 2265 2264 2264 2264 2263 2263 2262 2262 2261 2261 2260 2260 2260 2259 2259 2258 2258 2257 2257 2256 2256 2255 2255 2255 2254 2254 2253 2253 2252 2252 2251 2251 2251 2250 2250 2249 2249 2248
-597 2248 2248 2247 2247 2247 2246 2246 2245 2245 2244 2244 2243 2243 2243 2242 2242 2241 2241 2240 2240 2239 2239 2239 2238 2238 2237 2237 2236 2236 2236 2235 2235 2234 2234 2233 2233 2232 2232 2232 2231 2231 2230 2230 2229 2229 2228 2228 2228 2227 2227 2226 2226 2225 2225 2225 2224 2224 2223 2223 2222 2222 2221 2221 2221 2220 2220 2219 2219 2218
-604 2218 2218 2218 2217 2217 2216 2216 2215 2215 2214 2214 2214 2213 2213 2212 2212 2211 2211 2211 2210 2210 2209 2209 2208 2208 2208 2207 2207 2206 2206 2205 2205 2205 2204 2204 2203 2203 2202 2202 2202 2201 2201 2200 2200 2199 2199 2198 2198 2198 2197 2197 2196 2196 2195 2195 2195 2194 2194 2193 2193 2192 2192 2192 2191 2191 2190 2190 2189 2189
-610 2189 2189 2188 2188 2187 2187 2187 2186 2186 2185 2185 2184 2184 2184 2183 2183 2182 2182 2181 2181 2181 2180 2180 2179 2179 2178 2178 2178 2177 2177 2176 2176 2175 2175 2175 2174 2174 2173 2173 2173 2172 2172 2171 2171 2170 2170 2170 2169 2169 2168 2168 2167 2167 2167 2166 2166 2165 2165 2165 2164 2164 2163 2163 2162 2162 2162 2161 2161 2160
-617 2160 2160 2159 2159 2159 2158 2158 2157 2157 2157 2156 2156 2155 2155 2154 2154 2154 2153 2153 2152 2152 2152 2151 2151 2150 2150 2149 2149 2149 2148 2148 2147 2147 2147 2146 2146 2145 2145 2144 2144 2144 2143 2143 2142 2142 2142 2141 2141 2140 2140 2140 2139 2139 2138 2138 2137 2137 2137 2136 2136 2135 2135 2135 2134 2134 2133 2133 2133 2132
-623 2132 2132 2131 2131 2130 2130 2130 2129 2129 2128 2128 2128 2127 2127 2126 2126 2126 2125 2125 2124 2124 2124 2123 2123 2122 2122 2121 2121 2121 2120 2120 2119 2119 2119 2118 2118 2117 2117 2117 2116 2116 2115 2115 2115 2114 2114 2113 2113 2113 2112 2112 2111 2111 2111 2110 2110 2109 2109 2109 2108 2108 2107 2107 2106 2106 2106 2105 2105 2104
-630 2104 2104 2104 2103 2103 2102 2102 2102 2101 2101 2100 2100 2100 2099 2099 2098 2098 2098 2097 2097 2096 2096 2096 2095 2095 2094 2094 2094 2093 2093 2092 2092 2092 2091 2091 2090 2090 2090 2089 2089 2088 2088 2088 2087 2087 2086 2086 2086 2085 2085 2085 2084 2084 2083 2083 2083 2082 2082 2081 2081 2081 2080 2080 2079 2079 2079 2078 2078 2077
-636 2077 2077 2077 2076 2076 2075 2075 2075 2074 2074 2073 2073 2073 2072 2072 2071 2071 2071 2070 2070 2070 2069 2069 2068 2068 2068 2067 2067 2066 2066 2066 2065 2065 2064 2064 2064 2063 2063 2062 2062 2062 2061 2061 2061 2060 2060 2059 2059 2059 2058 2058 2057 2057 2057 2056 2056 2055 2055 2055 2054 2054 2054 2053 2053 2052 2052 2052 2051 2051
-643B051j%%j%j%%j%%j%j%%j%j%%j%%j%j%%j%j%%j%%j%j%%j%%j%j%%j%j%%j%%j%j%%j%%j%
-649B025j%%j%j%%j%%j%j%%j%%j%j%%j%%j%j%%j%%j%j%%j%%j%j%%j%%j%j%%j%%j%j%%j%%j
-656A999%j%%j%%j%j%%j%%j%j%%j%%j%%j%j%%j%%j%j%%j%%j%%j%j%%j%%j%j%%j%%j%%j%j%
-662A974%j%%j%%j%j%%j%%j%%j%j%%j%%j%%j%j%%j%%j%%j%j%%j%%j%%j%%j%j%%j%%j%%j%j
-669A949%%j%%j%%j%%j%j%%j%%j%%j%%j%j%%j%%j%%j%%j%%j%j%%j%%j%%j%%j%%j%j%%j%%j
-675A925%%j%%j%%j%j%%j%%j%%j%%j%%j%%j%j%%j%%j%%j%%j%%j%%j%%j%j%%j%%j%%j%%j%%
-682A902j%%j%%j%%j%%j%j%%j%%j%%j%%j%%j%%j%%j%%j%%j%%j%%j%j%%j%%j%%j%%j%%j%%j
-688A878%%j%%j%%j%%j%%j%%j%%j%%j%%j%%j%%j%%j%%j%%j%%j%%j%%j%%j%%j%%j%%j%%j%%
$$ plain form
-643 2051 2050 2050 2050 2049 2049 2048 2048 2048 2047 2047 2047 2046 2046 2045 2045 2045 2044 2044 2043 2043 2043 2042 2042 2042 2041 2041 2040 2040 2040 2039 2039 2038 2038 2038 2037 2037 2037 2036 2036 2035 2035 2035 2034 2034 2034 2033 2033 2032 2032 2032 2031 2031 2030 2030 2030 2029 2029 2029 2028 2028 2027 2027 2027 2026 2026 2026 2025 2025
-649 2025 2024 2024 2024 2023 2023 2022 2022 2022 2021 2021 2021 2020 2020 2019 2019 2019 2018 2018 2018 2017 2017 2016 2016 2016 2015 2015 2015 2014 2014 2013 2013 2013 2012 2012 2012 2011 2011 2010 2010 2010 2009 2009 2009 2008 2008 2007 2007 2007 2006 2006 2006 2005 2005 2004 2004 2004 2003 2003 2003 2002 2002 2001 2001 2001 2000 2000 2000 1999
-656 1999 1999 1998 1998 1998 1997 1997 1997 1996 1996 1995 1995 1995 1994 1994 1994 1993 1993 1992 1992 1992 1991 1991 1991 1990 1990 1990 1989 1989 1988 1988 1988 1987 1987 1987 1986 1986 1985 1985 1985 1984 1984 1984 1983 1983 1983 1982 1982 1981 1981 1981 1980 1980 1980 1979 1979 1978 1978 1978 1977 1977 1977 1976 1976 1976 1975 1975 1974 1974
-662 1974 1974 1973 1973 1973 1972 1972 1972 1971 1971 1970 1970 1970 1969 1969 1969 1968 1968 1968 1967 1967 1966 1966 1966 1965 1965 1965 1964 1964 1964 1963 1963 1962 1962 1962 1961 1961 1961 1960 1960 1960 1959 1959 1958 1958 1958 1957 1957 1957 1956 1956 1956 1955 1955 1955 1954 1954 1953 1953 1953 1952 1952 1952 1951 1951 1951 1950 1950 1949
-669 1949 1949 1949 1948 1948 1948 1947 1947 1947 1946 1946 1946 1945 1945 1944 1944 1944 1943 1943 1943 1942 1942 1942 1941 1941 1941 1940 1940 1939 1939 1939 1938 1938 1938 1937 1937 1937 1936 1936 1936 1935 1935 1935 1934 1934 1933 1933 1933 1932 1932 1932 1931 1931 1931 1930 1930 1930 1929 1929 1929 1928 1928 1927 1927 1927 1926 1926 1926 1925
-675 1925 1925 1925 1924 1924 1924 1923 1923 1923 1922 1922 1921 1921 1921 1920 1920 1920 1919 1919 1919 1918 1918 1918 1917 1917 1917 1916 1916 1916 1915 1915 1914 1914 1914 1913 1913 1913 1912 1912 1912 1911 1911 1911 1910 1910 1910 1909 1909 1909 1908 1908 1908 1907 1907 1906 1906 1906 1905 1905 1905 1904 1904 1904 1903 1903 1903 1902 1902 1902
-682 1902 1901 1901 1901 1900 1900 1900 1899 1899 1899 1898 1898 1898 1897 1897 1896 1896 1896 1895 1895 1895 1894 1894 1894 1893 1893 1893 1892 1892 1892 1891 1891 1891 1890 1890 1890 1889 1889 1889 1888 1888 1888 1887 1887 1887 1886 1886 1886 1885 1885 1884 1884 1884 1883 1883 1883 1882 1882 1882 1881 1881 1881 1880 1880 1880 1879 1879 1879 1878
-688 1878 1878 1878 1877 1877 1877 1876 1876 1876 1875 1875 1875 1874 1874 1874 1873 1873 1873 1872 1872 1872 1871 1871 1871 1870 1870 1870 1869 1869 1869 1868 1868 1868 1867 1867 1867 1866 1866 1866 1865 1865 1865 1864 1864 1864 1863 1863 1863 1862 1862 1862 1861 1861 1861 1860 1860 1860 1859 1859 1859 1858 1858 1858 1857 1857 1857 1856 1856 1856
-695A856j%%j%%j%%j%%j%%j%%j%%j%%j%%j%%j%%j%%j%%j%%j%%j%%j%%j%%j%%j%%j%%j%%j%
-701A833%j%%%j%%j%%j%%j%%j%%j%%j%%j%%j%%j%%j%%j%%j%%%j%%j%%j%%j%%j%%j%%j%%j%
-708A811%j%%%j%%j%%j%%j%%j%%j%%j%%j%%%j%%j%%j%%j%%j%%j%%%j%%j%%j%%j%%j%%j%%%
-714A790j%%j%%j%%j%%j%%j%%%j%%j%%j%%j%%j%%%j%%j%%j%%j%%j%%%j%%j%%j%%j%%%j%%j
-721A768%%j%%j%%%j%%j%%j%%j%%%j%%j%%j%%j%%%j%%j%%j%%j%%%j%%j%%j%%j%%%j%%j%%j
-727A747%%%j%%j%%j%%%j%%j%%j%%j%%%j%%j%%j%%%j%%j%%j%%%j%%j%%j%%%j%%j%%j%%%j%
-733A727%j%%j%%%j%%j%%%j%%j%%j%%%j%%j%%j%%%j%%j%%%j%%j%%j%%%j%%j%%j%%%j%%j%%
-740A707%j%%j%%%j%%j%%j%%%j%%j%%%j%%j%%%j%%j%%j%%%j%%j%%%j%%j%%%j%%j%%%j%%j%
$$ plain form
-695 1856 1855 1855 1855 1854 1854 1854 1853 1853 1853 1852 1852 1852 1851 1851 1851 1850 1850 1850 1849 1849 1849 1848 1848 1848 1847 1847 1847 1846 1846 1846 1845 1845 1845 1844 1844 1844 1843 1843 1843 1842 1842 1842 1841 1841 1841 1840 1840 1840 1839 1839 1839 1838 1838 1838 1837 1837 1837 1836 1836 1836 1835 1835 1835 1834 1834 1834 1833 1833
-701 1833 1833 1832 1832 1832 1832 1831 1831 1831 1830 1830 1830 1829 1829 1829 1828 1828 1828 1827 1827 1827 1826 1826 1826 1825 1825 1825 1824 1824 1824 1823 1823 1823 1822 1822 1822 1821 1821 1821 1820 1820 1820 1819 1819 1819 1819 1818 1818 1818 1817 1817 1817 1816 1816 1816 1815 1815 1815 1814 1814 1814 1813 1813 1813 1812 1812 1812 1811 1811
-708 1811 1811 1810 1810 1810 1810 1809 1809 1809 1808 1808 1808 1807 1807 1807 1806 1806 1806 1805 1805 1805 1804 1804 1804 1803 1803 1803 1802 1802 1802 1802 1801 1801 1801 1800 1800 1800 1799 1799 1799 1798 1798 1798 1797 1797 1797 1796 1796 1796 1796 1795 1795 1795 1794 1794 1794 1793 1793 1793 1792 1792 1792 1791 1791 1791 1790 1790 1790 1790
-714 1790 1789 1789 1789 1788 1788 1788 1787 1787 1787 1786 1786 1786 1785 1785 1785 1784 1784 1784 1784 1783 1783 1783 1782 1782 1782 1781 1781 1781 1780 1780 1780 1779 1779 1779 1779 1778 1778 1778 1777 1777 1777 1776 1776 1776 1775 1775 1775 1774 1774 1774 1774 1773 1773 1773 1772 1772 1772 1771 1771 1771 1770 1770 1770 1770 1769 1769 1769 1768
-721 1768 1768 1768 1767 1767 1767 1766 1766 1766 1766 1765 1765 1765 1764 1764 1764 1763 1763 1763 1762 1762 1762 1762 1761 1761 1761 1760 1760 1760 1759 1759 1759 1758 1758 1758 1758 1757 1757 1757 1756 1756 1756 1755 1755 1755 1754 1754 1754 1754 1753 1753 1753 1752 1752 1752 1751 1751 1751 1750 1750 1750 1750 1749 1749 1749 1748 1748 1748 1747
-727 1747 1747 1747 1747 1746 1746 1746 1745 1745 1745 1744 1744 1744 1744 1743 1743 1743 1742 1742 1742 1741 1741 1741 1740 1740 1740 1740 1739 1739 1739 1738 1738 1738 1737 1737 1737 1737 1736 1736 1736 1735 1735 1735 1734 1734 1734 1734 1733 1733 1733 1732 1732 1732 1731 1731 1731 1731 1730 1730 1730 1729 1729 1729 1728 1728 1728 1728 1727 1727
-733 1727 1727 1726 1726 1726 1725 1725 1725 1725 1724 1724 1724 1723 1723 1723 1723 1722 1722 1722 1721 1721 1721 1720 1720 1720 1720 1719 1719 1719 1718 1718 1718 1717 1717 1717 1717 1716 1716 1716 1715 1715 1715 1715 1714 1714 1714 1713 1713 1713 1712 1712 1712 1712 1711 1711 1711 1710 1710 1710 1709 1709 1709 1709 1708 1708 1708 1707 1707 1707
-740 1707 1707 1706 1706 1706 1705 1705 1705 1705 1704 1704 1704 1703 1703 1703 1702 1702 1702 1702 1701 1701 1701 1700 1700 1700 1700 1699 1699 1699 1698 1698 1698 1698 1697 1697 1697 1696 1696 1696 1695 1695 1695 1695 1694 1694 1694 1693 1693 1693 1693 1692 1692 1692 1691 1691 1691 1691 1690 1690 1690 1689 1689 1689 1689 1688 1688 1688 1687 1687
-746A687%%j%%j%%%j%%j%%j%%%j%%j%%%j%%j%%%j%%j%%%j%%j%%%j%%j%%%j%%%j%%j%%%j%%
-753A668j%%%j%%j%%%j%%j%%%j%%j%%%j%%j%%%j%%%j%%j%%%j%%j%%%j%%j%%%j%%%j%%j%%%
-759A649j%%j%%%j%%%j%%j%%%j%%j%%%j%%%j%%j%%%j%%%j%%j%%%j%%j%%%j%%%j%%j%%%j%%
-766A630%j%%j%%%j%%%j%%j%%%j%%%j%%j%%%j%%%j%%j%%%j%%%j%%%j%%j%%%j%%%j%%j%%%j
$$ plain form
-746 1687 1687 1687 1686 1686 1686 1685 1685 1685 1685 1684 1684 1684 1683 1683 1683 1682 1682 1682 1682 1681 1681 1681 1680 1680 1680 1680 1679 1679 1679 1678 1678 1678 1678 1677 1677 1677 1676 1676 1676 1676 1675 1675 1675 1674 1674 1674 1674 1673 1673 1673 1672 1672 1672 1672 1671 1671 1671 1671 1670 1670 1670 1669 1669 1669 1669 1668 1668 1668
-753 1668 1667 1667 1667 1667 1666 1666 1666 1665 1665 1665 1665 1664 1664 1664 1663 1663 1663 1663 1662 1662 1662 1661 1661 1661 1661 1660 1660 1660 1659 1659 1659 1659 1658 1658 1658 1658 1657 1657 1657 1656 1656 1656 1656 1655 1655 1655 1654 1654 1654 1654 1653 1653 1653 1652 1652 1652 1652 1651 1651 1651 1651 1650 1650 1650 1649 1649 1649 1649
-759 1649 1648 1648 1648 1647 1647 1647 1647 1646 1646 1646 1646 1645 1645 1645 1644 1644 1644 1644 1643 1643 1643 1642 1642 1642 1642 1641 1641 1641 1641 1640 1640 1640 1639 1639 1639 1639 1638 1638 1638 1638 1637 1637 1637 1636 1636 1636 1636 1635 1635 1635 1634 1634 1634 1634 1633 1633 1633 1633 1632 1632 1632 1631 1631 1631 1631 1630 1630 1630
-766 1630 1630 1629 1629 1629 1628 1628 1628 1628 1627 1627 1627 1627 1626 1626 1626 1625 1625 1625 1625 1624 1624 1624 1624 1623 1623 1623 1622 1622 1622 1622 1621 1621 1621 1621 1620 1620 1620 1619 1619 1619 1619 1618 1618 1618 1618 1617 1617 1617 1617 1616 1616 1616 1615 1615 1615 1615 1614 1614 1614 1614 1613 1613 1613 1612 1612 1612 1612 1611
$$ [...]
-1251@
##END=		$$ NMR SPECTRUM
##TITLE=	
##JCAMP-DX=	6.0	$$ MestReNova 15.0.0-34764
##DATA TYPE=	NMR PEAK TABLE
##DATA CLASS=	PEAK TABLE
##BLOCK_ID=	3
##ORIGIN=	Mestrelab Research S.L.
##OWNER=	17159
##CROSS REFERENCE=	NMR SPECTRUM: BLOCK_ID=2                                     
##.OBSERVE FREQUENCY=	250.1281240250000053
##.OBSERVE NUCLEUS=	^1H
##NPOINTS=	56
##FIRSTX=	1.1821840721490102233
##LASTX=	4.8828830134180964961
##XFACTOR=	1
##YFACTOR=	1
##FIRSTY=	0.038775610709091690165
##XUNITS=	PPM
##YUNITS=	ARBITRARY UNITS
##PEAK TABLE=	(XYW..XYW)
1.1821840721490102233,0.038775610709091690165,0.0033012051765103265187
1.2178558964707777434,0.040189600725284012339,0.0033012051765103265187
1.2775829141388641563,0.11672758386025479382,0.0033012051765103265187
1.302388200695485887,0.11889322054668602369,0.0033012051765103265187
1.3619746354855108983,5.8608210055606418444e-05,0.0030631843380554374216
1.3659295436496456944,5.8955387581567867262e-05,0.0033363717118541388711
1.3881245837174933655,0.0066844573206525162434,0.0033012051765103265187
1.3924957924860279501,0.0076101753039377762616,0.0030879615285018375236
1.3999865360857695062,0.078728300609360868378,0.0032926193583675310642
1.4163314232669241832,0.015934083273703065348,0.0048516147916311275906
1.4201461491429931971,0.014540132741477642189,0.0033012051765103265187
1.4434963221409791156,0.013267583849416810654,0.0033012051765103265187
1.4471804380310961946,0.013917799705673644314,0.0027298341786486874164
1.4698174669560066796,0.0001539321286810551399,0.0045311890863662567311
1.4738258571064333236,0.00020167246004020028668,0.0028141711955268931475
1.4999523891930020003,0.078183144410320884465,0.0033012051765103265187
1.5284843640233547468,0.00012146074606941317765,0.0032143966579177112031
1.5330839523279384817,0.00010443783446745607516,0.0030517807008552562398
1.5555146171177576253,0.0071702808371520475664,0.0027328096347449858453
1.5589652741909270084,0.0070276039267104673663,0.0033012051765103265187
1.5674753668859160438,8.6510451226897450302e-05,0.0031359970924923542303
1.5825062432420016201,0.0094356654806153281156,0.0036281475634411886402
1.5857052521643908438,0.0046751068922752615428,0.0025836724624602202573
1.5879913398986076345,0.004773366838775773037,0.0027128622727780296771
1.5906198075814450554,0.0070036626034359981269,0.0029943439909967000702
1.5937161765041358841,0.0068394347602069973172,0.0032633399457137296333
1.6093565525960191742,0.0037986700651431010677,0.0032392272409290387772
1.6146971688225157937,0.003214968126869664853,0.0028232956015684009671
1.6177402828126865586,0.0085715314036463093744,0.0040217436133512755175
1.6215594442983536361,0.0090612720702799593592,0.0033012051765103265187
1.6360483459608889945,2.7577196079462074969e-05,0.0028079072845060421004
1.645247115893953449,0.0039061455366353101636,0.0031881671350820141482
1.6490937235716400799,0.0035582603381109781729,0.0032861691669168711927
1.7395446552787607875,0.058640983303023946904,0.0033012051765103265187
$$ [...]
4.8332793547836825354,0.0060583525318272934967,0.0033012051765103265187
4.8370588287332525468,0.0019176115371334471506,0.0032983598127755086281
4.8582327516316814453,0.0045631754720199162526,0.0035327333186138411801
4.8828830134180964961,0.0017661224388293536754,0.0033012051765103265187
##$MNOVA/PEAK_DATA_TABLE=	(T,F,A,ST,SP,APT,APC)
$$ Complementary to PEAK TABLE
$$ T: Type
$$ F: Flags
$$ A: Annotation
$$ ST: Shape Type
$$ SP: Shape Parameter
$$ APT: Attached Peaks Type
$$ APC: Attached Peaks Count
Compound,None,,1,0.28862309092494981,0,0
Compound,None,,1,0.28992302761246346865,0,0
Compound,None,,1,0.3252319671228393605,0,0
Compound,None,,1,0.31932753640836275544,0,0
Compound,None,,1,0.041995382905396783091,0,0
Compound,None,,1,0.083152848197808798547,0,0
Compound,None,,1,0.23217671450453614135,0,0
Compound,None,,1,0.087395121864025260283,0,0
Compound,None,,1,0.31049818136432777438,0,0
Compound,None,,1,0.428794865507609535,0,0
Compound,None,,1,0.44462012135569545235,0,0
Compound,None,,1,0.10116729673131391598,0,0
Compound,None,,1,-0.14242284081440589882,0,0
Compound,None,,1,0.79863839720878537776,0,0
Compound,None,,1,-0.015367668222074640921,0,0
Compound,None,,1,0.32298244687516758367,0,0
Compound,None,,1,-0.19413951534228446327,0,0
Compound,None,,1,-0.077420001063900054095,0,0
Compound,None,,1,-0.090212385169495423742,0,0
Compound,None,,1,-0.20412138018062608857,0,0
Compound,None,,1,-0.0037139032477864972193,0,0
Compound,None,,1,0.3159003642780315313,0,0
Compound,None,,1,0.5093593360805162007,0,0
Compound,None,,1,0.24326976958431062448,0,0
Compound,None,,1,0.0060832898142300483729,0,0
Compound,None,,1,-0.27038741939951077553,0,0
Compound,None,,1,-0.2000000000000000111,0,0
Compound,None,,1,0.49085395532097197968,0,0
Compound,None,,1,0.7226373478645076176,0,0
Compound,None,,1,0.18869712048645304048,0,0
Compound,None,,1,0.015115297406284665394,0,0
Compound,None,,1,-0.013033168761984376127,0,0
Compound,None,,1,0.40504801522058042629,0,0
Compound,None,,1,0.2000000000000000111,0,0
Compound,None,,1,0.12445983865290355386,0,0
Compound,None,,1,0.32453126883797150937,0,0
Compound,None,,1,0.37066119653520618327,0,0
Compound,None,,1,-0.188178923322830427,0,0
Compound,None,,1,0.2000000000000000111,0,0
Compound,None,,1,0.33593817049617596959,0,0
Compound,None,,1,0.43319504729521651765,0,0
Compound,None,,1,0.24422922715831374418,0,0
Compound,None,,1,0,0,0
Compound,None,,1,0.25181300884868462742,0,0
Compound,None,,1,0.35032013492656349785,0,0
Compound,None,,1,0.33283848920590569653,0,0
Compound,None,,1,0.27931402563503271441,0,0
Compound,None,,1,0,0,0
Compound,None,,1,-0.2000000000000000111,0,0
Compound,None,,1,0.028337175938404568498,0,0
Compound,None,,1,0.19298678886299053259,0,0
Compound,None,,1,-0.0053327459395602627712,0,0
Compound,None,,1,0.280186982472550139,0,0
Compound,None,,1,-0.078748150481414758151,0,0
Compound,None,,1,0.11136879057498430545,0,0
Compound,None,,1,0.26898812917798997635,0,0
##END=		$$ NMR PEAK TABLE
##END=		$$ LINK
