##TITLE=	P
PT20
diethyl methylphosphonate
CAS:683-08-9
15.7 mg/0.6mLCDCl3


##JCAMP-DX=	6.0	$$ MestReNova 14.1.2-25024
##DATA TYPE=	LINK
##BLOCK_ID=	1
##BLOCKS=	2    
##ORIGIN=	Mestrelab Research S.L.
##OWNER=	HGL
##$MNOVA/LINK_BLOCK_TYPE=	ITEM	$$ NMR Spectrum
##$MNOVA/ITEM/POLYGON=	(XY..XY)
5321,5835
8722,5835
8722,8208
5321,8208
5321,5835
##$MNOVA/ITEM/Z=	0
##$MNOVA/ITEM/ANGLE=	0
##TITLE=	P
##JCAMP-DX=	6.0	$$ MestReNova 14.1.2-25024
##BLOCK_ID=	2
##DATA TYPE=	NMR SPECTRUM
##DATA CLASS=	XYDATA
##NUMDIM=	1
##ORIGIN=	Varian
##OWNER=	HGL
##.OBSERVE FREQUENCY=	242.81249869999999191
##.OBSERVE NUCLEUS=	^31P
##.SOLVENT NAME=	cdcl3
##.PULSE SEQUENCE=	s2pul
##LONGDATE=	2006/10/31 16:47:44.000
##.ACQUISITIONMODE=	SIMULTANEOUS
##$ORIGINAL FORMAT=	Varian
##$MNOVA/SCALES_VERSION=	9
##$PARAMETER FILE=	(datafile, ASCII, d:/OPCW/NMR-Databases/RICD-NMR-fid_Database/Phosphorus%20compounds/Diethyl%20methylphosphonate/P.fid/fid, 0)
$$ 
##$PARAMETER FILE=	(header, BASE64, d:/OPCW/NMR-Databases/RICD-NMR-fid_Database/Phosphorus%20compounds/Diethyl%20methylphosphonate/P.fid/fid, 0)
AAAAAQAAAAEAAugQAAAABAALoEAAC6BcAAAAyQAAAAE=
##$PARAMETER FILE=	(log, ASCII, d:/OPCW/NMR-Databases/RICD-NMR-fid_Database/Phosphorus%20compounds/Diethyl%20methylphosphonate/P.fid/log, 0)
$$ Tue Oct 31 16:43:29 2006: Experiment started
$$ Tue Oct 31 16:47:44 2006: Acquisition complete
$$ 
##$PARAMETER FILE=	(procpar, ASCII, d:/OPCW/NMR-Databases/RICD-NMR-fid_Database/Phosphorus%20compounds/Diethyl%20methylphosphonate/P.fid/procpar, 0)
$$ email_ 2 2 8 0 0 2 1 0 1 64
$$ 1 ""
$$ 0 
$$ date 2 2 9 0 0 2 1 1 1 64
$$ 1 "Oct 31 2006"
$$ 0 
$$ awc1 1 1 1 -1 0.001 3 1 1 0 64
$$ 1 0 
$$ 0 
$$ alock 2 2 8 0 0 2 1 0 1 64
$$ 1 "n"
$$ 5 "a" "n" "s" "u" "y" 
$$ acqpath 2 2 8 0 0 2 1 0 1 64
$$ 1 ""
$$ 0 
$$ MinSW 2 2 8 0 0 3 1 0 1 64
$$ 1 "off"
$$ 3 "off" "auto" "manual" 
$$ Gmap 2 2 8 0 0 2 1 1 1 64
$$ 1 "lk"
$$ 0 
$$ CARBONnt 7 1 32767 0 0 3 1 1 1 64
$$ 1 0 
$$ 0 
$$ PROTONnt 7 1 32767 0 0 3 1 1 1 64
$$ 1 0 
$$ 0 
$$ PFGflg 4 2 4 0 0 2 1 16385 1 64
$$ 1 "y"
$$ 0 
$$ acqdim 7 1 32767 0 0 2 1 0 1 64
$$ 1 1 
$$ 0 
$$ acqcycles 1 1 9.99999984307e+17 -9.99999984307e+17 0 2 1 0 1 64
$$ 1 1 
$$ 0 
$$ aig 2 2 2 0 0 4 1 1 1 64
$$ 1 "ai"
$$ 2 "nm" "ai" 
$$ actionid 2 2 8 0 0 4 1 0 1 64
$$ 1 "null"
$$ 0 
$$ acqstatus 7 1 32767 0 0 2 1 0 1 64
$$ 2 101 0 
$$ 0 
$$ alfa 6 1 13 13 13 2 1 24578 1 64
$$ 1 9.99999904633 
$$ 0 
$$ arraydim 7 1 32768 1 1 2 1 5 1 64
$$ 1 1 
$$ 0 
$$ archivedir 2 2 8 0 0 2 1 0 1 64
$$ 1 ""
$$ 0 
$$ apptype 2 2 8 0 0 4 1 0 1 64
$$ 1 "std1d"
$$ 0 
$$ ap 2 2 1023 0 0 4 1 6 1 64
$$ [...]
$$ 1 "setsw(100,-30) pw(45)"
$$ 0 
$$ x1 7 1 19 19 19 2 1 8192 1 64
$$ 1 3409 
$$ 0 
$$ wtfile1 2 2 15 0 0 3 2 1 1 64
$$ 1 ""
$$ 0 
$$ wtfile 2 2 15 0 0 3 1 1 1 64
$$ 1 ""
$$ 0 
$$ wtune 4 2 4 0 0 2 1 0 1 64
$$ 1 "st12"
$$ 11 "s" "t" "e" "i" "n" "o" "v" "1" "2" "3" "4" 
$$ x3 7 1 19 19 19 2 1 8192 1 64
$$ 1 7844 
$$ 0 
$$ x2y2 7 1 19 19 19 2 1 8192 1 64
$$ 1 2597 
$$ 0 
$$ x4 7 1 19 19 19 2 1 8192 1 64
$$ 1 0 
$$ 0 
$$ z3y 7 1 19 19 19 2 1 8192 1 64
$$ 1 1213 
$$ 0 
$$ z2xy 7 1 19 19 19 2 1 8192 1 64
$$ 1 -3922 
$$ 0 
$$ yz2 7 1 19 19 19 2 1 8192 1 64
$$ 1 -2954 
$$ 0 
$$ y3 7 1 19 19 19 2 1 8192 1 64
$$ 1 -7130 
$$ 0 
$$ xz2 7 1 19 19 19 2 1 8192 1 64
$$ 1 -2141 
$$ 0 
$$ xz 7 1 19 19 19 2 1 8192 1 64
$$ 1 7795 
$$ 0 
$$ y1 7 1 19 19 19 2 1 8192 1 64
$$ 1 -6262 
$$ 0 
$$ yz 7 1 19 19 19 2 1 8192 1 64
$$ 1 5812 
$$ 0 
$$ y4 7 1 19 19 19 2 1 8192 1 64
$$ 1 0 
$$ 0 
$$ z2 7 1 19 19 19 2 1 8192 1 64
$$ 1 -7868 
$$ 0 
$$ z1 7 1 19 19 19 2 1 8192 1 64
$$ 1 19695 
$$ 0 
$$ z0_ 1 1 19 19 19 2 1 73744 1 64
$$ 1 5166 
$$ 0 
$$ z1c 7 1 19 19 19 2 1 8192 1 64
$$ 1 0 
$$ 0 
$$ z2x2y2 7 1 19 19 19 2 1 8192 1 64
$$ 1 -1063 
$$ 0 
$$ z2c 7 1 19 19 19 2 1 8192 1 64
$$ 1 0 
$$ 0 
$$ z2x3 7 1 19 19 19 2 1 8192 1 64
$$ 1 0 
$$ 0 
$$ z3x 7 1 19 19 19 2 1 8192 1 64
$$ 1 -618 
$$ 0 
$$ z3 7 1 19 19 19 2 1 8192 1 64
$$ 1 18200 
$$ 0 
$$ z2y3 7 1 19 19 19 2 1 8192 1 64
$$ 1 0 
$$ 0 
$$ z3c 7 1 19 19 19 2 1 8192 1 64
$$ 1 0 
$$ 0 
$$ z3x3 7 1 19 19 19 2 1 8192 1 64
$$ 1 0 
$$ 0 
$$ z3x2y2 7 1 19 19 19 2 1 8192 1 64
$$ 1 0 
$$ 0 
$$ z3xy 7 1 19 19 19 2 1 8192 1 64
$$ 1 0 
$$ 0 
$$ z5 7 1 19 19 19 2 1 8192 1 64
$$ 1 -333 
$$ 0 
$$ z4x 7 1 19 19 19 2 1 8192 1 64
$$ 1 -1961 
$$ 0 
$$ z4 7 1 19 19 19 2 1 8192 1 64
$$ 1 -1698 
$$ 0 
$$ z3y3 7 1 19 19 19 2 1 8192 1 64
$$ 1 0 
$$ 0 
$$ z4c 7 1 19 19 19 2 1 8192 1 64
$$ 1 0 
$$ 0 
$$ z4xy 7 1 19 19 19 2 1 8192 1 64
$$ 1 0 
$$ 0 
$$ z4x2y2 7 1 19 19 19 2 1 8192 1 64
$$ 1 0 
$$ 0 
$$ z4y 7 1 19 19 19 2 1 8192 1 64
$$ 1 3532 
$$ 0 
$$ z7 7 1 19 19 19 2 1 8192 1 64
$$ 1 1690 
$$ 0 
$$ z5y 7 1 19 19 19 2 1 8192 1 64
$$ 1 0 
$$ 0 
$$ z5x 7 1 19 19 19 2 1 8192 1 64
$$ 1 0 
$$ 0 
$$ z6 7 1 19 19 19 2 1 8192 1 64
$$ 1 7151 
$$ 0 
$$ zx2y2 7 1 19 19 19 2 1 8192 1 64
$$ 1 -5238 
$$ 0 
$$ z8 7 1 19 19 19 2 1 8192 1 64
$$ 1 0 
$$ 0 
$$ zxy 7 1 19 19 19 2 1 8192 1 64
$$ 1 -2920 
$$ 0 
$$ zx3 7 1 19 19 19 2 1 8192 1 64
$$ 1 138 
$$ 0 
$$ zy3 7 1 19 19 19 2 1 8192 1 64
$$ 1 -1688 
$$ 0 
$$ 
##$PARAMETER FILE=	(text, ASCII, d:/OPCW/NMR-Databases/RICD-NMR-fid_Database/Phosphorus%20compounds/Diethyl%20methylphosphonate/P.fid/text, 0)
$$ PT20
$$ diethyl methylphosphonate
$$ CAS:683-08-9
$$ 15.7 mg/0.6mLCDCl3
$$ 
$$ 
##XUNITS=	HZ
##YUNITS=	ARBITRARY UNITS
##FIRSTX=	49367.411174500004563
##LASTX=	-10156.171283986570415
##DELTAX=	-0.22706531343002323009
##XFACTOR=	1
##YFACTOR=	0.00090753911782495558843
##FIRSTY=	-0.082542344927787780762
##MINY=	-0.88410383462905883789
##MAXY=	281.130950927734375
##NPOINTS=	262144
##XYDATA=	(X++(Y..Y))
$$ [...]
10252h3n1J15Oj49O9P5j5Q4k9o6O6m2jJ41j37j95J58P5j02J12M0j87M4J45j00p6O8P4P0l2
$$ -83 -134 -19 -13 -162 -93 -18 -33 51 22 -44 22 -20 -21 120 -17 -212 -54 21 -81 31 71 -116 -72 73 -27 -103 -35 39 109 77
10245G7n7K7p8j22L0J23J25n8j22J18Oj44J44L2k08K4k9n3K33mp6K38j17l04J05Q6P6J10k83
$$ 77 20 47 -31 -153 -123 0 125 67 -55 63 69 -75 69 101 -107 -83 -112 -165 68 64 -12 226 109 -195 -90 -4 72 182 -101
10239a01j00K20j90o5K95j45r7L13j24k27K53L4k33R8J40p0J5M8p5qM6n5P5J96j04j67R1k8
$$ -101 -201 19 -171 -236 59 -86 -183 130 6 -221 32 66 -167 -69 71 1 16 64 -11 -19 27 -28 47 243 139 -28 63 35
10232C5r4J13j6j22K1j8L2J38Kj3k6o8J27M3j58J1l2j01J80P2j63J6Q5nm3o3k7j03m6K09M3
$$ 35 -59 54 38 -84 -63 -81 -49 89 91 78 52 -16 111 154 -4 7 -25 -126 54 126 -37 -21 64 59 16 -47 -74 -177 -223 -14 29
10225B9r4J13n2j57J24P0l4L2q1j3J02q5q7N3N0N5q3j41J99K21j86j12J61q7j51K55Q4l20
$$ 29 -65 48 -4 -161 -37 33 -1 31 -50 -63 39 -46 -133 -80 -30 25 -58 -199 0 221 35 -77 84 -3 -154 101 185 -135
10219a35j5J67j30n5J56M9k9N6J04o9j53N4Ol7J81j11l33R9J35l1P8p1%K07p2r6M4p1Q3N7
$$ -135 -150 17 -113 -168 -12 37 8 64 168 99 -54 0 6 -31 150 39 -294 -195 -60 -91 -13 -84 -84 123 51 -45 -1 -72 11 68
10212F8j12J12o3k14K39R0k31R4N5j54K3L8j7j9k9J40L2k18m3O4O8K07k7k37O6J78j1j9Rl6
$$ 68 -44 68 5 -209 30 120 -111 -17 38 -116 -93 -55 -72 -91 -120 20 52 -166 -209 -145 -77 130 103 -134 -68 110 99 80 89 53
10205E3pJ3n7r5r0o7P5J39k8J1K06M1j62l3Q6M5n1j11o2k1m4RJ17P5n5lL8j22l1J58p8j87
$$ 53 46 59 2 -93 -183 -250 -175 -36 -64 -53 153 194 32 -1 85 130 79 -32 -94 -115 -159 -150 -33 42 -13 -16 22 -100 -131 27 -51 -238
10198b38R7J55J1k9j3Ql6j0N1o4J8J99m2j43J02L7j00j7k4j4J5m7O5J37j39k28J20J74j23
$$ -238 -141 14 25 -4 -17 -9 -45 -55 -4 -68 -50 149 107 -36 66 103 3 -14 -38 -52 -37 -84 -19 118 -21 -249 -129 45 -78
10192g8k8J81jm7j3j97M4K81j74j96K97P1k52K7O8m2J73N8k56qJ98l7l0kj74M4J62j42l3J53
$$ -78 -106 75 74 27 14 -183 -139 142 -32 -228 69 140 -112 -85 -17 -59 114 172 -84 -92 106 69 39 37 -137 -93 69 -73 -106 47
10185D7o5j3J00q6l4J26P2k1j27j23j3N0J20J5j14K7m9j72J64K21j33j07J24P6q0m5N2p8j24
$$ 47 -18 -31 69 -17 -51 75 147 126 -1 -124 -137 -87 33 48 -66 -39 -88 -260 -96 125 -8 -115 9 85 5 -40 12 -66 -190
10178a90L9k3L8K58nj96J5k5l5J46L6o5k2r0k7J38J18n2j53J9J20j08r9J23M0n5M1L5l1N1
$$ -190 -151 -174 -136 122 117 -79 -64 -89 -124 22 58 -7 -29 -119 -146 -8 110 58 -95 -76 44 -64 -163 -40 0 -55 -14 21 -10 41
10171D1J20r7j90J36R4k97j00K07M2J1P6p6j10L1J34P3r9p4qn0P2Q3r6rP4OJ01O1r9l5p0j62
$$ 41 161 64 -126 10 104 -193 -293 -86 -44 -33 43 -33 -143 -112 22 95 -4 -78 -86 -136 -64 19 -77 -86 -12 -6 95 156 57 22 -48 -210
10164b10pJ06J21N7j38o5J32K5l4%o2P3J81j1j17j36j23R6R7r4L7Q4r6K5J21l9OM2j17p1J7
$$ -210 -217 -111 10 67 -71 -136 -4 21 -13 -13 -75 -2 179 168 51 -85 -208 -112 -15 -109 -72 12 -84 -59 62 23 29 71 -46 -117 -100
10157a00n3KN4L2J07P9k9K9P9M5k3j48j31m7o4N5J06q7k8J10l3j6O0o4O4K03p5k19k4Q9P8
$$ -100 -153 -151 -97 -65 42 121 92 121 200 245 222 74 -57 -104 -168 -113 -7 -94 -122 -12 -45 -61 -1 -65 -1 202 127 -92 -116 -27 51
10150E1oj26l3J39M6q1K5K8j40j08Q2J77Q2r9m0K2r8N6J03j68O1J85k43o2J77j11Q6R9k68
$$ 51 45 -81 -114 25 71 -10 15 43 -97 -205 -123 54 136 37 -3 19 -79 -23 80 -88 -27 158 -85 -147 30 -81 5 104 -164
10143a64J81K56l47K4L25j92j52M4j00J6M5K7J77o0j93J18L9j28J47J27j82o4Q2o7OJ13p8
$$ -164 17 273 -74 -50 275 83 -69 -25 -125 -109 -64 -37 140 80 -113 5 44 -84 63 190 8 -56 26 -41 -35 78 0
10137@o0J1q9J08J43j33L5R8j18J05O5k14Q8J04k18k6R2N8J77p5k51L8O3j24k8J41M7j42J3
$$ 0 -60 -49 -138 -30 113 -20 15 113 -5 100 165 -49 39 143 -75 -101 -9 49 226 151 -100 -62 1 -123 -151 -10 37 -105 -92
10131i2K36K3k30j40Q5J41J0Q5J70j03j55k3o4N9J9j41J14J6k31J50J10k29Q6J69q9n8q6M1
$$ -92 144 167 -63 -203 -118 23 33 118 288 185 30 7 -57 2 21 -120 -6 10 -221 -71 39 -190 -104 65 -24 -82 -168 -127
10124a27K44l0j42P3O3Qp5j61M0J60L0mPm7m9k0j1K3J2p0N1J16k22j93K08K3j36J21O0N6J25
$$ -127 117 87 -55 18 81 89 14 -147 -107 53 83 79 86 39 -10 -30 -41 -18 -6 -76 -25 91 -131 -324 -116 -93 -229 -108 -48 8 133
10117A33j41K5K42j93k28J38Q5n0p4L6J77n0j53N9L6KN4r2j67j1K14J19k21KK46j88j44K57
$$ 133 -8 17 259 66 -162 -24 61 11 -63 -27 150 100 -53 6 42 44 98 6 -161 -172 42 161 -60 -58 188 0 -144 113
10111A13r6k61J58R9j41Q3J88r2r6J72k0k37O3N9j16J65P1k43M2Q7j96JR6k0K14Q5l28M6L33
$$ 113 17 -244 -86 13 -128 -45 143 51 -45 127 107 -130 -67 -8 -124 41 112 -131 -89 -2 -198 -197 -101 -121 93 178 -150 -104 229
10104B29j94k00K17lp7J30j35j41J70K1K6J91j23k50P2J55p4j24J00mk03J66J66k61L4K14
$$ 229 35 -165 52 49 -28 102 -33 -174 -4 17 43 234 111 -139 -67 88 14 -110 -10 -14 -217 -51 115 -146 -112 102
10099A02r5P9R0k14p3jJ1J61l4j05j1j11Q3J53j47l2J14k1J7j1n5N9K4oJ9k1k1n9L4J18j30
$$ 102 7 86 176 -38 -111 -112 -101 60 26 -79 -90 -201 -118 35 -112 -144 -30 -51 -34 -45 -100 -41 -17 -23 -4 -25 -46 -105 -71 47 -83
10091h3q3J60n8j14J38J36K0r0m8Q0o6j14J9L8J35j7k09J18R9j81Q3J79J0n4k10lJ84j50o9
$$ -83 -166 -6 -64 -178 -40 96 116 26 -22 58 -8 -122 -103 -65 70 53 -156 -38 61 -120 -37 142 152 98 -112 -115 69 -81 -150
10085a50J07j22L6J60KP4l6p5Q7j42j22J25j7J47K23k26j53N4p4R4P8j32K6K1l0J34j8o0J45
$$ -150 -43 -165 -129 31 33 107 71 -4 83 -59 -181 -56 -73 74 297 71 -82 -28 -102 -8 70 -62 -36 -15 -45 89 71 11 156
10078A56p2k24N6J19o4r6k9k6J6J52J02n6l4m3l9R1m0j01K07P7k28P3J17k32K5K43j44k04
$$ 156 84 -140 -84 35 -29 -125 -154 -180 -164 -12 90 34 0 -43 -82 9 -31 -132 75 152 -76 -3 114 -118 -93 150 6 -198
10072a98L9R5J41Qj07J23Q5j23j2l2n2J13Jn6K6j20m0J16l9J0R8j9K6n6j41J50J43k25k30
$$ -198 -159 -64 77 85 -22 101 186 63 51 19 -33 80 81 25 51 -69 -109 7 -32 -22 76 57 83 27 -114 36 179 -46 -276
10065b76P1K32O5r4j1o1p0J10K4o2j9r7O0J66l0op9j25K62J30k26L6%j69R4j0q5J99L2j12
$$ -276 -205 27 92 -2 -13 -74 -144 -34 -10 -72 -91 -188 -128 38 8 2 -77 -202 60 190 -36 0 0 -169 -75 -85 -170 29 61 -51
10059e1M2k2O9Q9k16m4K18l4j20orP4L5r5M3J10r2q7J09K7j12O8J56q7j57L4O6l1K4J02p7
$$ -51 -9 -31 38 127 -89 -133 85 51 -69 -75 -84 -10 25 -70 -27 83 -9 -96 13 40 -72 -4 152 65 -92 -58 8 -23 1 103 26
10052B6j81K7Q0mJ51J25j26o3Rj62j44M3J09O3lJ6J7l9M0N0p3L0J09q0o1N8p9o3J25j5j33
$$ 26 -155 -128 -48 -52 99 224 98 35 44 -118 -262 -219 -110 -47 -50 -34 -17 -56 -16 34 -39 -9 100 20 -41 17 -62 -125 0 -15 -148
10044a48J41J95j38j91L1P6N8K7j13oJ90k6j71P2J05r1j40n6J29J82k4r4J9L7Rn2r7l5J5O6
$$ -148 -7 188 50 -141 -110 -34 24 51 -62 -68 122 96 -75 -3 102 11 -129 -185 -56 126 102 8 27 64 73 21 -76 -111 -96 -30
10038c0J03or1n7M4J66R0o8n7p8r7OL1%k2M8K13N8k05j30j00J3K32l6j26J97j4k04O3L3nO7
$$ -30 73 67 -24 -81 -37 129 219 151 94 16 -81 -75 -44 -44 -66 -18 195 253 48 -82 -182 -169 63 27 -99 98 84 -120 -57 -24 -29 38
10030C8j18RK74N7j29m1J1n7j17M4O1j69LK03o9j31P0K3r7J3J94L2j69P3Q7j80k1Q4m7Pj3
$$ 38 -80 -71 203 260 131 90 101 44 -73 -29 32 -137 -134 69 0 -131 -61 -38 -135 -122 72 104 -65 8 95 -85 -106 -22 -69 -62 -75
10023g5K7J72J9r1j20j62R5J52MN9j07o2K65l3j62R9j68r5K33j27r6K64Pr1J5r6l4ML8J34
$$ -75 -48 124 143 52 -68 -230 -135 17 21 80 -27 -89 176 143 -19 80 -88 -183 50 -77 -173 91 98 7 22 -74 -108 -104 -66 68
10017F8n1mJ33j53r0R7j52K5K61j27j83J17M4p1J1O9mj11j8P1p5p7J41J68l0j15L0J35N3r6
$$ 68 17 13 146 -7 -97 0 -152 -127 134 7 -176 -59 -15 -86 -75 -6 -10 -121 -139 -68 -143 -220 -79 89 59 -56 -26 109 162 66
10010F6j68k9P4n4j2R5l9KJ06o4k6J24p5j57Q9J06j27p5J65J0j73J10J83q0p0J4P3P2k47j72
$$ 66 -102 -131 -57 -111 -123 -28 -67 -65 41 -23 -49 75 0 -157 -68 38 -89 -164 1 11 -162 -52 131 51 -19 -5 68 140 -107 -279
10003b79K51J5r1K76o2l26K16K01k44p2J68L8j25j08J20J47o2l5M3lO2M6q6j04p0N5R7j18
$$ -279 -28 -13 -104 172 110 -216 0 201 -43 -115 53 91 -34 -142 -22 125 63 28 71 68 130 176 90 -14 -84 -29 68 -50
9997e0q9J35Mj14M3K3q0K1Q3K7j2q3p2J27J62r8j93K4J61J5j96r8J28K4n2J28Q2l0K0qJ4Q
$$ -50 -139 -4 0 -114 -71 -48 -128 -107 -24 3 -9 -92 -164 -37 125 27 -166 -142 19 34 -162 -260 -132 -108 -160 -32 50 20 40 32 46 54
9989E4q0L6n9k20J92K40k24q6J45K7K6r0p5J37m8m9K00L6kM2j40l8k0o6J63q2k03K23o8k46
$$ 54 -26 10 -49 -269 -77 163 -61 -147 -2 25 51 -39 -114 23 -25 -74 126 162 160 202 62 24 4 -62 101 19 -184 39 -29 -275
9982b75L30Q7l17J05J87j9l2j07M8R3j70o9P5L1J25M3n8j0j36k1J93n8j31R2Jj09J4J08M3
$$ -275 55 142 -175 -70 117 98 66 -41 7 100 -70 -139 -64 -33 92 135 77 67 -69 -90 103 45 -86 6 7 -102 -88 20 63
9976F3q4m7k6m6J56N2k13J28K08k29o8J43q9J8R6q1J1m6j60J18J15j16n2J4J07J48r3l9J49
$$ 63 -21 -68 -94 -140 16 68 -145 -17 191 -38 -106 37 -52 -34 62 -19 -8 -54 -214 -96 19 -97 -149 -135 -28 120 27 -12 137
9969A37o2j07M0k4n7p7J7K36l4k18K10J30k87mK28QKJ6j78j12J56J01j32j00k3J5J31o0j63
$$ 137 75 -32 8 -16 -73 -150 -133 103 69 -149 61 191 -96 -100 128 136 138 154 -24 -136 20 121 -11 -111 -134 -119 12 -48 -211
9963b11K06L4k87J40J27k41N5Q6n0K79L4k84J41J17k31k3J36K7n5k5J01q6k40J20J62j02k4
$$ -211 -5 29 -258 -118 9 -232 -177 -91 -141 138 172 -112 29 146 -85 -108 28 55 0 -25 76 -10 -250 -130 32 -70 -94
9957i4k2j5J71r3k37K41K52j56l4J18j40j81Q0J42pm4Q5N2j35n9R8K0M6M6j85j22M4n8Q6K13
$$ -94 -116 -131 40 -53 -290 -49 203 47 13 131 -9 -190 -110 32 25 -19 66 118 -17 -76 22 42 88 134 -51 -173 -129 -187 -101 112
9950A12n7p7N5j01j13J11J43p2j63R0J51p1k0Jp3M9j27j56L35J56k74J04K49j20j39j9M0O6
$$ 112 55 -22 33 -68 -181 -70 73 1 -162 -72 79 8 -12 -11 -84 -35 -162 -318 17 173 -101 3 252 132 -7 -26 14 80
9943H0m9mP6p9j24j5P3R8j6m5O4j5n8J68J10k36j02J61q0o6J71j20r7K12j42r7K89j67k03
$$ 80 31 27 103 24 -100 -115 -42 56 40 -5 59 44 -14 154 264 28 -74 87 7 -59 112 -8 -105 107 -35 -132 157 -10 -213
9937b13K99n4k50J01J2J0J43p5o7J04J5o9k3M6k6n3O3j16j37K52J08j59P4P2r6p7l3J34J20
$$ -213 86 32 -218 -117 -105 -95 48 -27 -94 10 25 -44 -67 -21 -47 -100 -37 -153 -290 -38 70 -89 -15 57 -39 -116 -149 -15 105
9930A05l0l9k03n3K54j06r7K98j2j05nk19J65K40k77R8J91l80J8K60j90L1J78j73r6M4j3J12
$$ 105 75 36 -167 -220 34 -72 -169 129 117 12 7 -212 -47 193 -84 14 205 -175 -157 103 -87 -56 122 -51 -147 -103 -116 -4
9924dJ17j23j46J06N4j60K3K0j78J50J66j98P0J47j99OJ45m0P6N7j34q5k4J05J92r1k19J12
$$ -4 113 -10 -156 -50 4 -156 -133 -113 -291 -141 25 -173 -103 44 -155 -149 -4 -44 32 89 -45 -130 -154 -49 143 52 -167 -55
9918e5K52j07k55J30K01j27q6M0JO8l8j06J30K2j84MRq8J26J72ll6pn6j03%J24nj08N4J26
$$ -55 197 90 -165 -35 166 39 -47 -7 -6 62 24 -82 48 70 -114 -110 -101 -189 -63 109 106 70 63 7 -96 -96 28 23 -85 -31 95
9910I5rj01n9M1L2k5K5J6m5%l9r3P2J22PO2M2j41r9N7O2j9p9J7J01J9K8k1j66K5J44o2k9J
$$ 95 86 -15 -74 -33 -1 -26 -1 15 -30 -30 -69 -162 -90 32 39 101 143 2 -97 -40 22 3 -76 -59 42 61 89 68 -98 -73 71 9 -20 -19
9903a9j08M3K7r0J33J15l6J25k0k64QJ79Rn7o1q9K8J40l0j12J49J34j28n8l2o5J17K6j4J53
$$ -19 -127 -84 -57 -147 -14 101 65 190 170 -94 -86 93 102 45 -16 -105 -77 63 33 -79 70 204 76 18 -14 -79 38 64 50 203
9896B03j88k45K94J29k41O4J48j11m6J29L8k00j63J12J26n7j43k5J19r8j91J61J79N2J08j65
$$ 203 15 -230 64 193 -48 16 164 53 7 136 174 -26 -189 -77 49 -8 -151 -176 -57 -155 -346 -185 -6 46 154 -11
9890a1j47K12r8j97L01R7k30J26J38j89p0qj71P7K89p7j91R9N5PN5j44k4J75p2n7P6o2Oqo9
$$ -11 -158 54 -44 -241 60 157 -73 53 191 2 -68 -76 -247 -170 119 42 -149 -50 5 12 67 -77 -101 74 2 -55 21 -41 -35 -43 -112
9883a12J33o9k09J57O6o9J16o9l9J66j07m0J90o0o6J9p7R2jk44O8J80q2jN8o2O5N6j51L9J86
$$ -112 21 -48 -257 -100 -34 -103 13 -56 -95 71 -36 -76 114 54 -12 7 -70 22 21 -223 -155 25 -57 -58 0 -62 3 59 -92 -53 133
9876A33j37q0K29q7k09J77O4j20O1l3j00P4P9P2k4j31L3J6n5J03K5k7J2j75K4K35j29j10J68
$$ 133 -4 -84 145 58 -151 26 90 -30 31 -2 -102 -28 51 123 99 -32 1 17 -38 65 90 63 75 -100 -76 159 30 -80 88
9869H8K1m6q6j38J52J41j28j2K7j09mQ5K3l3p8q8m4O3Q9J7N8N4k2J7n3p1J44L7k02j5J66m
$$ 88 109 63 -23 -161 -9 132 4 -8 19 -90 -94 -9 14 -19 -97 -185 -229 -166 -77 -60 -2 52 30 47 -6 -77 67 104 -98 -113 53 49
9862D9j34PR2n5%Q8j52j4L26kk18M9M9L0P9j83k37L8J10N8Q8P2l4l7J1j18p1J28q3j44K09
$$ 49 -85 -78 14 -41 -41 47 -105 -119 207 205 -13 36 85 115 194 11 -226 -188 -78 -20 68 140 106 69 80 -38 -109 19 -64 -208 1
9855AR4j58L6Q1p7r7l7K9j4K6J53n9j39J30N0n0J30J7j31JN3L4k9q7J3J5m0P4N0o4K3J9j26
$$ 1 95 -63 -27 54 -23 -120 -157 -128 -142 -116 37 -22 -161 -31 19 -31 99 116 -15 -14 39 73 44 -43 -30 -15 -55 19 69 5 28 47 -79
9848g9j1K00N5j60o7L1N1P8p1q6J16J7j03J2m5o7J09J09o3j70K2K35j1j02J67J3k38r7R5J91
$$ -79 -90 110 165 5 -62 -31 20 98 27 -59 57 74 -29 -17 -62 -129 -20 89 26 -144 -122 113 102 0 167 180 -58 -155 -60 131
9841A31K2j76n4j15j24K23J35p8jj30k6K43J0j07PL7J69k5k42P7R4j43n0L3J42R7j85q5l6
$$ 131 153 -23 -77 -192 -316 -93 42 -36 -37 -167 -193 50 60 -47 -40 -3 166 141 -101 -24 70 -73 -123 -90 52 149 -36 -121 -157
9834a57r3K31N0l14J2P8JK40L7o7J42j15j21J62q2j77J11J23m4o6P0K5j46j4K0r4J3l7J30
$$ -157 -250 -19 31 -283 -271 -193 -192 48 85 18 160 45 -76 86 4 -173 -62 61 17 -49 21 46 -100 -114 -94 -188 -175 -212 -82
9828h2L88k67m73L61K67j81J38J5k56L3M1j5J55n2j82O8N1r6K8L4j38oJ69J8m0N0L0K9m2o1
$$ -82 306 39 -434 -73 194 13 151 166 -90 -57 -16 -31 124 72 -110 -42 9 -87 -59 -25 -163 -169 0 18 -22 28 58 87 45 -16
9821a6Q1p3j36J63P0k8J40j43k63R4J24Jo8qK60m9l77J34J60k48K1J12l7J56ok36L2J61M1
$$ -16 65 -8 -144 19 89 61 201 58 -205 -111 13 14 -54 -62 198 149 -228 -94 66 -182 -161 -49 -86 70 64 -172 -140 21 62
9814F2o9j59p0Q9R0r6j18K27J97j47j6M0j06P2J8q5J54l0k11P5Pl3K70R5j99p9N3P9l6j05
$$ 62 -7 -166 -236 -147 -57 -153 -271 -44 153 6 -10 30 -76 -4 14 -71 83 53 -158 -83 -76 -109 161 256 57 -22 31 110 74 -31
9807c1J21R3k23q7J99K9j55k4M4jN1J5o7L9R3j1p3pJ27m5k70P4K07j63k4J93n8p8j5rJ69m
$$ -31 90 183 -40 -127 72 101 -54 -78 -34 -35 16 31 -36 3 96 85 12 5 132 87 -183 -109 98 -65 -89 104 46 -32 -47 -56 113 109
9800A09j16K09Q0j51mj63j18K67k6k46J44j8k95J45K35j14K3P7j41O5J15j38M1P7j21R0J4
$$ 109 -7 202 282 131 127 -36 -154 113 87 -159 -15 -33 -328 -183 52 -62 -39 38 -103 -38 77 -61 -20 57 -64 26 40
9794D0k04R7J7j67J57L9p7J96o6j39J57p9r8P6q2J36J08k59P7R0k43J76J05l44J11K71j39
$$ 40 -164 -67 -50 -217 -60 -21 -98 98 32 -107 50 -29 -127 -51 -133 3 111 -148 -71 19 -224 -48 57 -287 -176 95 -44
9788d4p2M4O8J19j13q4J67r7k88R5K26n2k7O2j92p6K52k3j02J62q5j24J57j6PR2j57Q7J94
$$ -44 -116 -72 -4 115 2 -82 85 -12 -300 -205 21 -31 -58 4 -188 -264 -12 -35 -137 25 -60 -184 -27 -43 -36 56 -101 -14 180
9781A80k36l0K02q3l3l4o9K44Lk67J57J19j60O3K0j47Nk2l7J11j7j19J19K38m7k71n1N4j11
$$ 180 -56 -86 116 33 0 -34 -103 141 144 -123 34 153 -7 56 76 -71 -66 -88 -125 -14 -31 -150 -31 207 160 -111 -162 -108 -219
9775b19J16K79j08j53J27jj09Rl7k5J15L2j53j10R0Q8n4jO1JK7Kj9R5j5j21M4l8j11J10mr6
$$ -219 -103 176 68 -85 42 41 -68 -59 -96 -121 -6 26 -127 -237 -147 -59 -113 -114 -53 -52 -25 -23 -42 53 38 -83 -39 -77 -188 -78 -82 -178
9767a78J86P0j21R3O4o2J7q5n4J28k6q0O5j4m5Pj2Q7N6j19k6N8NR7Q6j12j70q0L5L8o2j6N5
$$ -178 8 78 -43 50 114 52 69 -16 -70 58 32 -48 17 3 -42 -35 -47 40 96 -23 -49 9 14 111 197 85 -85 -165 -130 -92 -154 -170 -115
9760a15k9j0J06O0p1j17NJ76J53K4n6j45q6R3K1j10JJ16P5k1o9J7L7o2J0Q8o8j06LNON9K4
$$ -115 -144 -154 -48 12 -59 -176 -171 5 158 182 126 -19 -105 -12 9 -101 -100 16 91 70 1 18 55 -7 3 91 23 -83 -80 -75 -69 -10 14
9752A4p3o9P8P0q7m9Om8O3J21M2O1l2j37J5P9L6j4j77m9K27mk28K6J58j5q4M5P7n7p8J0M0
$$ 14 -59 -128 -50 20 -67 -116 -110 -158 -95 26 68 129 97 -40 -25 54 90 76 -101 -150 77 73 -155 -129 29 14 -70 -25 52 -5 -83 -73 -33
9745c3L5o8o0J21J4p3Q2m8j12R0j8j0J41j26j38K04J26m9m2o0o0m3J47J89j95j28J69p3kJ95
$$ -33 2 -66 -126 -5 9 -64 18 -30 -142 -52 -70 -80 61 -65 -203 1 127 78 36 -24 -84 -127 20 209 14 -114 55 -18 -20 175
9738A75k31j97K29K9j30M8K7m7l4j2j0mM9l4lJ58p4l3K89j88k87L84O9l14J69O9j90O6LMQ7
$$ 175 -56 -253 -24 5 -125 -77 -50 -97 -131 -143 -153 -157 -108 -142 -145 13 -61 -94 195 7 -280 104 173 -141 28 97 -93 -27 -24 -20 67
9731F7k59j64L35L03m4k25l5J01k02r2L27P2j98oN0J1l5j04rO1N1M7qj5p3o3J79J00j55p2
$$ 67 -192 -356 -21 282 238 13 -22 79 -123 -215 112 184 -14 -20 30 41 6 -98 -107 -46 5 52 44 29 -44 -107 72 172 17 -55
9724e5l1M9J81r4j07K15K2j53L3kq6n7K0J15qJ9J51j46o4L19j48l77K24J58k63j1J66k3m2
$$ -55 -86 -37 144 50 -57 158 180 27 60 58 -28 -85 -65 50 42 61 212 66 2 321 173 -204 20 178 -85 -96 70 47 5
9718ERk0QRm7M0O5k00j59K31J44j11K7K9j26o0L3J21J17p2o3K0n4L1Q0j01n3J29M7o8j1N7
$$ 5 14 -6 2 11 -36 4 69 -131 -290 -59 85 -26 1 30 -96 -156 -123 -2 115 43 -20 0 -54 -23 57 -44 -97 32 79 11 0 57
9710E7P1M7o4j79q3L5l6M6J86pj08N3o8k26J3J40oK0J35J19M2j54k65N4K65m6j66J58J87j91
$$ 57 128 175 111 -68 -151 -116 -152 -106 80 73 -35 18 -50 -276 -263 -123 -129 -109 26 145 187 33 -232 -178 87 41 -125 33 220 29
9704B9k56J01J61j03QJ56j00o9J40k4j1N4j89l0J92j17j18J63M8n4%J7K5q3n5R9q0j41J07
$$ 29 -227 -126 35 -68 -60 96 -4 -73 67 43 32 86 -103 -133 59 -58 -176 -13 35 -19 -19 -2 23 -60 -115 -16 -96 -237 -130
9697a30M6m1J27Q6o3n7j7L3J4n7k5N7L0j13n0K22Q0k03L1J64j12j64MJ35J23j33j70J66K46
$$ -130 -84 -125 2 88 25 -32 -49 -16 -2 -59 -84 -27 3 -110 -160 62 142 -61 -30 134 22 -142 -138 -3 120 -13 -183 -17 229
9690B29n5k76r8J64L5o7N4m7OJ65j22j10K13o1j73J24j6n0J43o6n4J86qr4Oj09p3M5M0P8k7
$$ 229 174 -102 -200 -36 -1 -68 -14 -61 -55 110 -12 -122 91 30 -143 -19 -35 -85 58 -8 -62 124 116 22 28 -81 -154 -109 -69 9 -18
9683a8o1J23o3j88J75J34j47J5M3r7L9P6L1L0j32k0K34o9k15J41Q3j21K4o3j51J57J36j42
$$ -18 -79 44 -19 -207 -32 102 -45 -30 13 -84 -45 31 62 92 -40 -60 174 105 -110 31 114 -7 17 -46 -197 -40 96 -46
9677d6k9P9o3j9Q1l0m1J03N9j29j40M4J30k6q7J19J46k3nn1j73K3J47l8m2N8om0J1L0o0r9
$$ -46 -75 4 -59 -78 3 -27 -68 35 94 -35 -175 -131 -1 -27 -114 5 151 128 123 72 -101 -78 69 31 -11 47 41 1 12 42 -18 -117
9670a17J29J82j08q6R7l3o4K7r4j06O7Q2L2O3K7o2k7M1L6P4l1k39o7J17J3J62J48j98QJ35
$$ -117 12 194 86 0 97 64 0 27 -67 -173 -106 -24 8 71 98 36 9 50 86 160 129 -110 -177 -60 -47 115 263 65 73 208
9663B08k64p3K32m1o5k7j07J75P2k93pJ36o2L0o9j28J74O3r0J19Oq6J05K7k7J8p3R9J69j52
$$ 208 -56 -129 103 62 -3 -30 -137 38 110 -183 -190 -54 -116 -86 -155 -283 -109 -46 -136 -17 -11 -97 8 35 8 26 -47 52 221 69
9656F9j17O5j2L3j0q1J49J9k53J02K16j61p5J22k5j3M4r4q1Qm1jR9M2L7J17m6j61R6J41j58
$$ 69 -48 17 5 38 28 -53 96 115 -138 -36 180 19 -56 66 41 28 72 -22 -103 -95 -136 -137 -38 4 41 158 112 -49 47 188 30
9649C0j60M2L8q9r8J29K15k3l6L4j66m6K16j9j67L9M4n4k5n6k0K15K06j80k14R3j8r2K07J02
$$ 30 -130 -88 -50 -139 -237 -108 107 84 48 82 -84 -130 86 67 -100 -61 -17 -71 -96 -152 -172 43 249 69 -145 -52 -70 -162 45 147
9642A47j46k5j3LJ01l7n8K2j7P1Qj13O6%j35N0L8P8K16j39k50R5M4n0N1m0l4P0PnM6K5n9j15
$$ 147 1 -24 -37 -34 67 30 -28 -6 -23 48 56 -57 9 9 -126 -76 -38 40 256 117 -133 -38 6 -44 7 -33 -67 3 10 5 51 76 17 -98
9635i8j3P2K9j3n0N6P9j83j09J90R6pj8m4Q6k2j73P3Q7oJ10r0j48J28M6l7l2j64N7J31j20
$$ -98 -111 -39 -10 -23 -73 -17 62 -121 -230 -40 56 49 31 -13 73 51 -122 -49 38 32 142 52 -96 32 78 41 9 -155 -98 33 -87
9628h7J21J18k89J5K13j91j02J24l1m0j0N4K18K2j59k3r4o1K74J53k19j51P7R6o0j25N2O4
$$ -87 34 152 -137 -122 91 -100 -202 -78 -109 -149 -159 -105 113 135 -24 -47 -141 -202 72 225 6 -145 -68 28 -32 -157 -105 -41
9621d1p2L1P7L7N0j58q5K37q7k30K04Nj93J84L3j58R7k5q9J01j9K1J02o6M4O1j18L4%j18J38
$$ -41 -113 -82 -5 32 82 -76 -161 76 -11 -241 -37 -32 -225 -41 -8 -166 -69 -94 -183 -82 -101 -80 22 -44 0 61 -57 -23 -23 -141 -3
9614cK8j83J35J62j45n6O0p5m8Q1J4j5J27O7j07q2p9l3Q4l1PJ52r6r4K24P0j28n3k9Q7O6j53
$$ -3 25 -158 -23 139 -6 -62 -2 -77 -125 -44 -30 -45 82 149 42 -40 -119 -152 -68 -99 -92 60 -36 -130 94 164 36 -17 -46 41 107 -46
9607d6m4J08M0J7m6q0j5kJ11J18j22r9J5n1M8R9o6l8R1L8m4j9Jo6RJ27r0j31K25R6k32J1J02
$$ -46 -90 18 58 75 29 -51 -66 -68 43 161 39 -60 -45 -96 -48 51 -15 -53 38 76 32 13 14 -52 -43 84 -6 -137 88 184 -48 -37 65
9599F5j10K0K5j33J58K31j60r4J12n6l3K3j32N8K08r5j47M2L7P4M8j22m0J24L7j18p7O5l1
$$ 65 -45 -25 0 -133 25 256 96 2 114 58 25 48 -84 -26 182 87 -60 -18 19 93 141 19 -21 103 140 22 -55 10 -21
9593b1j92N7K93Ok79o7J88J9p1J75O6j93N3J08j61j4R6n1K0m0j74K5R1LR3P4k1j3j03j38O0
$$ -21 -213 -156 137 143 -136 -203 -15 4 -67 108 174 -19 34 142 -19 -33 63 12 32 -8 -182 -157 -66 -63 30 104 83 70 -33 -171 -111
9586a11J82Mj71O1K74j6k74j75k2R6P7L5J31j7j93K7J21L9J6j85p2K64p1j98L10J35k65M5
$$ -111 71 75 -96 -35 239 223 -51 -226 -248 -152 -75 -40 91 74 -119 -92 29 68 84 -101 -173 91 20 -178 132 267 2 47
9579D7J51r1m5L7l9j15N0K29j30k17K71Ml54J49J00k76Q7J49j10nj5O3K07k9o1oj36Q7J41
$$ 47 198 107 62 99 60 -55 -5 224 94 -123 148 152 -202 -53 47 -229 -142 7 -103 -108 -123 -60 147 118 57 51 -85 2 143
9573A43j37n8n3o8K09J10p7m2j75J4K11j61r0K38l5j02P4l5R0J66k16j74K00K6j54J07N2j27
$$ 143 6 -52 -105 -173 36 146 69 27 -148 -134 77 -84 -174 64 29 -73 1 -34 56 222 6 -168 32 58 -96 11 63 -64
9566f4J30N7k28O4J16j24Q2j1k41R3N7j11K94K00l05k06J13J38r6j08K32J09j72mn1m5J73
$$ -64 66 123 -105 -41 75 -49 33 22 -219 -126 -69 -180 114 314 9 -197 -84 54 -42 -150 82 191 19 15 -36 -81 92
9560I2j08j29J94o0p6K02r7j80J14P4k6k3N7J34p5j26L3n2k3N6p0L7J21m3k5k2j39l9J36J51
$$ 92 -16 -145 49 -11 -87 115 18 -162 -48 26 0 -23 34 168 93 -33 0 -52 -75 -19 -89 -52 69 26 1 -21 -160 -199 -63 88
9554H8%j03m3o8j8J63O3o1roQ3Lj85M3N8j98R4K59r2j25J7m6m4O7R7n0q5N7l1J9J77j75j70
$$ 88 88 -15 -58 -126 -144 19 82 21 12 6 89 92 -93 -50 8 -190 -96 163 71 -54 -37 -83 -127 -60 37 -13 -98 -41 -72 -53 124 -51 -221
9546b21K81Oj59J96nj66N7l7QR9j18j1P0j10Q1J25p4j0j31j60J46M5k0J65n0m1J98o1j16K5
$$ -221 60 66 -93 103 98 -68 -11 -48 -40 59 -59 -70 0 -110 -29 96 22 12 -119 -279 -133 -88 -108 57 7 -34 164 103 -13 12
9539A2j36N0J73j48j5R6j40N9J22l3J86p6l54J83J16k44K49J49m11j1J88j43J1Q9k4P2r5j19
$$ 12 -124 -74 99 -49 -64 32 -108 -49 73 40 226 150 -204 -21 95 -149 100 249 -162 -173 15 -128 -117 -28 -52 20 -75 -194
9533a94J81K4o5J38q2j07K08m6j98J47O6r6R7Pj23Rj8K4J14j14p9J75k5q0K00P7j52j27j12
$$ -194 -13 11 -54 84 2 -105 103 57 -141 6 72 -24 73 80 -43 -34 -52 -28 86 -28 -107 68 43 -37 163 240 88 -39 -151
9526a51Q7K30q7k15K1M4J2M9n9j8J01p3q7J55J7j58R8J44q8m9ml1J32O7j83n3J40K1j39q9
$$ -151 -64 166 79 -136 -115 -71 -59 -10 -69 -87 14 -59 -146 9 26 -132 -34 110 22 -27 -31 -62 70 137 -46 -99 41 62 -77 -166
9519a66J29N5k31J2K68j03j79J75J22p6o9J0J08K8k2O3j29j35J69qj36J53N1r4O0n0j18M3
$$ -166 -37 18 -213 -201 67 -36 -215 -40 82 6 -63 -53 55 83 61 124 -5 -140 29 21 -115 38 89 -5 55 5 -113 -70
9513g0J12J69o2k49J38Q5l47K0L36L3m1m9j13M5L6j6J05oj54q1M9J47L9q2L1lj42p3M3N7j19
$$ -70 42 211 149 -100 38 123 -224 -204 132 165 124 75 -38 7 43 27 132 126 -28 -109 -60 87 126 44 75 72 -70 -143 -100 -43 -162
9506a62j34K69K29j62N3J51k42j53R5j9K5J50M7p9q4K0P7rn4J7R4k6k08n5J25L9K2k6n3J41
$$ -162 -296 -27 202 40 93 244 2 -151 -56 -75 -50 100 147 68 -16 4 81 72 18 35 129 103 -105 -160 -35 4 26 0 -53 88
9499H8mk84j1K07O1k5j05m7J69R9q0j05n8J08J14j41j59R3K08M7j39j6J28n1j62o1l1kQ0O9
$$ 88 84 -200 -211 -4 57 32 -73 -120 49 148 68 -37 -95 13 127 -14 -173 -80 128 175 36 20 148 97 -65 -126 -157 -159 -79 -10
9492a0J0L0J19O9j38j47N8O3o8m6J0K8L2r2j9K83P1l00m9J20o5m8m2J3J87n4j35K01L4k02
$$ -10 0 30 149 218 80 -67 -9 54 -14 -60 -50 -22 10 -82 -101 182 253 -47 -96 24 -41 -89 -131 -118 69 15 -120 81 115 -87
9486h7O7J13p7p0M7M7j93j21K67O8j69J20R3r5l6j30l5K32R7m0L3mm1o1r4LJ39R9q5l8P7j24
$$ -87 -20 93 16 -54 -7 40 -153 -274 -7 61 -108 12 105 10 -26 -156 -191 41 138 98 131 127 86 25 -69 -66 73 172 87 49 126 2
9478Bo9J36j55j41K61P5j18J6l3O1R8j77k7K41Qj59o1l3j5N6L7J3J17mk03P3R4k48O1J87k16
$$ 2 -67 69 -86 -227 34 109 -9 7 -26 35 133 -44 -71 170 178 19 -42 -75 -90 -34 3 16 133 129 -74 -1 93 -155 -94 93 -123
9471a23O8K07k18NJ63j50l8L4j8J56L0j09PN6J26o4k33Q9N9j68Q4J00p7qoJ3j4l0J40l5j17
$$ -123 -55 152 -66 -61 102 -48 -86 -52 -70 86 116 7 14 70 196 132 -101 -12 47 -121 -37 63 -14 -22 -28 -15 -29 -59 81 46 -71
9464g1K02m0k36R7k4p7J53q2n9J73p7o9J16l5n1OJ8R7Ro6l0j1P1M3M5J32j39k64J0L5R5K21
$$ -71 131 91 -145 -48 -72 -149 4 -78 -137 36 -41 -110 6 -29 -80 -74 -56 41 50 -16 -46 -57 14 57 102 234 95 -169 -159 -124 -29 192
9457A92n9j68M5R7L5p3m3O2q7o2R8nN8Q1j54m3L3j24J2M3j4J20n2n8K81k8k99J34J02k66o7
$$ 192 133 -35 10 107 142 69 26 88 1 -61 37 32 90 171 17 -26 7 -117 -105 -62 -76 44 -8 -66 215 187 -112 22 124 -142 -209
9450b09J07QQ3K7j67L4K31qr7M8oK2J07j18j48Q4j5j16P3P8m0k1J7Q5N0j63j01J28pp4J58
$$ -209 -102 -94 -11 16 -151 -117 114 106 9 57 51 73 180 62 -86 -2 -17 -133 -60 18 -22 -43 -26 59 109 -54 -155 -27 -34 -108 50
9443E0N2j45M0O2o8M2K8q5l3n2J2J84M3j16j4K0pM9N8o3j36RN2p7qj6p1K01J36j91N4J26k18
$$ 50 102 -43 -3 59 -9 33 61 -24 -57 -109 -97 87 130 14 0 20 13 62 120 57 -79 -70 -18 -95 -103 -119 -190 11 147 -44 10 136 -82
9435h2o9Q7r1J2R0J4J18k2k71J9K92j9j98J26J45k03n4J84j13j04K69M0k96KK12m3q0R6r0
$$ -82 -151 -64 -155 -143 -53 -39 79 57 -214 -195 97 78 -120 6 151 -52 -106 78 -35 -139 130 170 -126 -124 88 45 -35 61 -29
9429b9k13J10J40r1L0N4j01N9J14n9oN3J5L7l2r8o8j7R1M7o6N9N6j03k9n9j17J72J67j55l6
$$ -29 -242 -132 8 -83 -53 1 -100 -41 73 14 8 61 76 113 81 -17 -85 -102 -11 36 -30 29 85 -18 -47 -106 -223 -51 116 -39 -75
9422g5J61J3l1j3j49n8K14J30j47r1J07P4o3j07JJ45l4k20L3Q9j11J20J80k02p7J69n2j0J40
$$ -75 86 99 68 55 -94 -152 62 192 45 -46 61 135 72 -35 -34 111 77 -143 -110 -21 -132 -12 168 -34 -111 58 6 -4 136
9415A36q4r4R3L9n0j12q6Q6O6M6J06j76k19K58K03k19r9N5n0Q1J47k4m9j05j80N6J76jl4K5
$$ 136 52 -42 51 90 40 -72 -158 -72 -6 40 146 -30 -249 9 212 -7 -106 -51 -101 -20 127 103 54 -51 -231 -175 1 0 -34 -9
9408iK6J9q1l5J30J2r1j5o0MJ23m3j32oO2Q9J8m2L3Rl2qk4J14J42j06o4O6o8k3O7o8j41j09
$$ -9 17 36 -45 -80 50 62 -29 -44 -104 -100 23 -20 -152 -158 -96 -7 11 -31 2 11 -21 -29 -53 61 203 97 33 99 31 8 75 7 -134 -243
9401b43M1K02Q3k7K2mn4q9l7J04M8o0q2k3J75M5k14P1Q7j98J22K00j42k6j0p7R5j15r4K75
$$ -243 -202 0 83 56 78 74 20 -69 -106 -2 46 -14 -96 -119 56 101 -113 -42 45 -153 -31 169 27 1 -9 -86 9 -106 -200 75
9394G5l4k43K1lJ22K20r4l9P2j27n9j9k0J68N2m6M2j00j5R3j55J2K23p6j01N4OK9o3j28O3
$$ 75 41 -202 -181 -184 -62 158 64 25 97 -30 -89 -108 -128 40 92 46 88 -12 -27 66 -89 -77 146 70 -31 23 29 58 -5 -133 -70
9387g0N7j3O7No1m3j5P6L3n2j2k7K3K8j47K0K39j3j48n1m6L7O4O0J49p1k25O2R0o2R0O4j51
$$ -70 -13 -26 41 46 -15 -58 -73 3 36 -16 -28 -55 -32 -4 -151 -131 108 95 -53 -104 -150 -113 -49 11 160 89 -136 -74 16 -46 44 108 -43
9379d3o8P4P0O6o6k24k0K23K3r7O6m6k8L00K2l73k2K00Nj6o2q8J19Q2j34l7J43N0o5jo2j58
$$ -43 -111 -37 33 99 33 -191 -211 12 35 -62 4 -42 -70 230 252 -121 -143 57 62 46 -16 -104 15 97 -37 -74 69 119 54 53 -9 -167
9372a67M1J03k6N3lr7Q2l3j50J85J54j49p4j2j7J01Q3nq8j12KK4O1J26k9o7L4qmp7q7J76L3
$$ -167 -126 -23 -49 4 1 -96 -14 -47 -197 -12 142 -7 -81 -93 -110 -9 74 69 -19 -131 -129 -105 -44 82 53 -14 20 12 8 -69 -156 20 53
9365E3j78J20Q3j36M5M4l5L1l9LK0r0K7J7q1L7M5J61J97j56j02M6j09J15L6k54J81J22k95
$$ 53 -125 -5 78 -58 -13 31 -4 27 -12 -9 11 -79 -52 -35 -116 -79 -34 127 324 168 66 112 3 118 154 -100 81 203 -92
9358i2P9J9j73L27O8l27J72J32j59Q1o6j89J34P9j05lkq3j4J02K0p2R1O5j42jJ41O8M5j17
$$ -92 -13 6 -167 160 228 -99 73 205 46 127 61 -128 6 85 -20 -23 -25 -108 -122 -20 0 -72 19 84 -58 -59 82 150 195 78
9351G8j97Q0J57r6j36R5J50m5n5O2p9j63L6J72Q4r3j25n0k7R2J35o4j31j23KL81K38k38j08
$$ 78 -119 -39 118 22 -114 -19 131 86 31 93 14 -149 -113 59 143 50 -75 -125 -152 -60 75 11 -120 -243 -241 140 378 140 32
9345C2k9j92K9O5r1R7M1j59P9J64o7p3L5j1j0J10N7j47j02P7R8M1n9n8L2o2m0J49J7j39J3
$$ 32 3 -189 -160 -95 -186 -89 -48 -207 -128 36 -31 -104 -69 -80 -90 20 77 -70 -172 -95 3 44 -15 -73 -41 -103 -143 6 23 -116 -103
9338a03R4J3l6k5QM6J51k4l75m9L38k6r8J47j18j17J85l2q7J90K1j46K5Pq1M3J10L1o8r1k0
$$ -103 -9 4 -32 -57 -49 -3 148 124 -251 -300 38 12 -86 61 -57 -174 11 -21 -108 82 103 -43 -18 -11 -92 -49 61 92 24 -67 -87
9331h7K1J6L8l8q6J12J50j43j86N1R9M7M2mo9j9J25K6j45N0M6k12J03K57k45j71K85Q3j97
$$ -87 -66 -50 -12 -50 -136 -24 126 -17 -203 -152 -53 -6 36 32 -37 -56 69 95 -50 0 46 -166 -63 194 -51 -222 63 146 -51
9324e1q4N5O7k1KR8%p2k3JJ8n5l6J02Qj8R1q3r8J34M2p7l6l0N2K9j04l7Q0Q7ln3Q4Kj56O6
$$ -51 -135 -80 -13 -34 -32 66 66 -6 -29 -28 -10 -65 -101 1 9 -9 82 -1 -99 35 77 0 -36 -66 -14 15 -89 -126 -46 41 38 -15 69 71 -85 -19
9316a9J08j9L8j20o4J93j47j72J85j37j20K90j6l0K15j75q3K78n9j20L1j50O4K00j66r9J34
$$ -19 89 70 108 -12 -76 117 -30 -202 -17 -154 -274 16 0 -30 185 10 -73 205 146 26 57 -93 -29 171 5 -94 40
9310D0k6m9M6l8m6J03J13o9k4J18j71k34K80K28k79j36J37J7J2J9j11K2K18O7j75j48P7J71
$$ 40 14 -35 11 -27 -73 30 143 74 50 168 -3 -237 43 271 -8 -144 -7 10 22 41 -70 -48 170 237 62 -86 -9 162
9303A62jj64p2P6j5j36N3J52q3m7K05M5j35j9n8r2O1J4k7J26N6j38j09QQ9R6Rn0o8m1O1Q7
$$ 162 161 -3 -75 1 -14 -150 -97 55 -28 -75 130 175 40 21 -37 -129 -68 -54 -81 45 101 -37 -146 -138 -49 47 56 6 -62 -103 -42 45
9296D5L2l1q0j8J6p1nJ10K8l6n6l4J11J5j88R6K89j02k54J1J19R7n0k43j6K01m0o1P3j29m9
$$ 45 77 46 -34 -52 -36 -107 -112 -2 26 -10 -66 -100 11 26 -162 -66 223 121 -133 -122 -3 94 44 -199 -215 -14 -54 -115 -42 -171 -220
9289b20K53M3j42M0L9l7m1q1M4M9j29M8J71j4N9j1k72M8J86k20RL68n5k46N0O3o6j24nK61
$$ -220 33 76 -66 -26 13 -24 -65 -146 -102 -53 -182 -134 37 23 82 71 -201 -153 33 -187 -178 190 135 -111 -61 2 -64 -188 -193 68
9282F8N5k57M8J85n2K4j7j82N3L6j81J21K09j16p3J6m7J12R2j11l9l3j02P3O6j82p9K44K06
$$ 68 123 -134 -86 99 47 71 54 -128 -75 -39 -220 -99 110 -6 -79 -63 -110 2 94 -17 -56 -89 -191 -118 -52 -234 -313 -69 137
9276A37j09j81j0L5M3J21M4o7m7m4JR9L2q3j1J11N5j02o9J01R2q2q1P5l2k22P2K62j37j53
$$ 137 28 -153 -163 -128 -85 36 80 13 -34 -78 -77 22 54 -29 -40 71 126 24 -45 56 148 66 -15 60 28 -194 -122 140 3 -150
9269a50J90k0j47J19L2n9M1p1J4J74o4r4M3j05k6J94M6q2m3j1J09M5k09r2J94N2j45P4J67
$$ -150 40 20 -127 -8 24 -35 6 -65 -51 123 59 -35 8 -97 -123 71 117 35 -8 -19 90 135 -74 -166 28 80 -65 9 176
9262A76j01m7J70l5j10L6j62j33K56Q6k22PJ04n5ML0o8mQ5L7k9l1j5p6j01M3J40J01N5j2q5
$$ 176 75 28 198 163 53 89 -73 -206 50 136 -86 -79 25 -30 -26 4 -64 -68 17 54 25 -6 -21 -97 -198 -155 -15 86 141 129 44
9255D4j35j09J17J90p2j12M3l6n0P6L4j8lljm4K8Q3j62j27K28R7p9J02j6j30J77J55k25j96
$$ 44 -91 -200 -83 107 35 -77 -34 -70 -120 -44 -10 -28 -31 -34 -35 -79 -51 32 -130 -257 -29 68 -11 91 75 -55 122 277 52 -144
9248a44P3N0l4P2j1j38J09R9k05K1K17o2l6O5j02l2L3q9K7R0p0q9j2L4M4QK1L3M6J13J5j12
$$ -144 -71 -21 -55 17 6 -132 -23 76 -129 -108 109 47 11 76 -26 -58 -25 -114 -87 3 -67 -156 -168 -134 -90 -82 -61 -28 18 131 146 34
9241C4qL6q7n1Q7J9r7j9kn5Q1R1l7L2j0j18M2L7r7jKm7J6P5J65pk28Q2J93j16n0O1J3O2j34
$$ 34 26 62 -25 -76 11 30 -67 -86 -88 -143 -62 29 -8 24 14 -104 -62 -25 -122 -123 -121 -168 -152 -77 88 81 -147 -65 128 12 -38 23 36 98 -36
9233c6j65J62M9j26O0N7j2J1KP9L4m0M2p7j05Q4qn9L5q2m5L9q3K7J40J4J6K6J6Q0k7p1O1%
$$ -36 -201 -39 10 -116 -56 1 -11 0 2 81 115 75 117 40 -65 19 11 -48 -13 -95 -140 -101 -184 -157 -17 -3 13 39 55 135 108 37 98 98
9225I8j39j66k2K55K05j42j88K4R8j0k9P9%o0N0n8j05Mj42%K96J9m1J57j55j04K59l7j90N5
$$ 98 -41 -207 -229 26 231 89 -99 -75 23 13 -16 63 63 3 53 -5 -110 -106 -248 -248 48 67 26 183 28 -76 183 146 -44 11
9219A1km6j5J9J79o6k48J75J22j87N8j4k03J16P3r7J08K0n5R8m4r1K5J3R1lo5J59j53l00L14
$$ 11 9 -37 -52 -33 146 80 -168 7 129 -58 0 -14 -217 -101 -28 -125 -17 3 -52 46 2 -89 -64 -51 40 37 -28 131 -22 -322 -8
9212hJ22k85K18O7l70J67J94k51N2J49j27l8J0OP1k8L5N8j43j8J33J4N6k6j67P7L5k15J15
$$ -8 114 -171 47 114 -256 -89 105 -146 -94 55 -72 -110 -100 -94 -23 -51 -16 42 -101 -119 14 28 84 58 -109 -32 3 -212 -97
9205i7K54j75j89Q8J11J18o0k46Q9K29p4J1J20j42o5J21p5j43K4N9j0p9m4P4O1l0j1Q0K3j00
$$ -97 157 -18 -207 -119 -8 110 50 -196 -107 122 48 59 179 37 -28 93 18 -125 -101 -42 -52 -131 -175 -101 -40 -70 -81 -1 22 -78
9198g8L6J33l3l6l1j53P4J81j18p4J30J2n5K0N1j6l5J31Ok30Q5J91j62r1J12Q6K7j66r9P9
$$ -78 -42 91 58 22 -9 -162 -88 93 -25 -99 31 43 -12 8 59 43 8 139 145 -85 0 191 29 -62 50 136 163 -3 -102 -23
9191b3j26L5K69j45j71J16n1J0Q4j78L1K75jj41q5j3J00L6k9K0kl2r3o7J32N5j09R4J35j55
$$ -23 -149 -114 155 10 -161 -45 -96 -86 -2 -180 -149 126 125 -16 -101 -114 -14 22 -7 13 11 -21 -114 -181 -49 6 -103 -9 126 -29
9185b9j24R7K7lJ06o4j38J51J32p0%n2o9P0m0l1M2j54NJ85j12j05P0N2O3j89j57L07L2k45
$$ -29 -153 -56 -29 -32 74 10 -128 23 155 85 85 33 -36 34 -6 -37 5 -149 -144 41 -71 -176 -106 -54 9 -180 -337 -30 2 -243
9178b43J75J37p1M1n5k2M5j24J6J04j9Oj18j7K15j37j22K46p6j36J89Pp1q4j73K18K17k53
$$ -243 -68 69 -2 39 -16 -38 7 -117 -101 3 -16 -10 -128 -145 70 -67 -189 57 -19 -155 34 41 -30 -114 -287 -69 148 -105
9171a05pK62l5j10j4l3k0l5JO6M6O7L5q8p7J9j0p6K5M6j08N6K20n5j8K41n2k34JRk5R5O8q4
$$ -105 -112 150 115 5 -9 -42 -62 -97 -96 -30 16 83 118 30 -47 -28 -38 -114 -89 -43 -151 -95 125 70 52 293 241 7 8 17 -8 87 155 71
9164G1j60j8J27L4%%j09K7J54p1j70J6J18jq0M4j2q2J72j4l15J70K43k52qJ34j80Q5J82j71
$$ 71 -89 -107 20 54 54 54 -55 -28 126 55 -115 -99 19 18 -62 -18 -30 -112 60 46 -269 -99 144 -108 -116 18 -162 -77 105 -66
9157f6o4ln6K18N8k46O2J98m1j18j11N9J89p6j50J01O4o8j8KL5O2jk3o0j05J0J16Q5l2j31
$$ -66 -130 -133 -189 29 87 -159 -97 101 60 -58 -169 -110 79 3 -147 -46 18 -50 -68 -66 -31 31 30 7 -53 -158 -148 -32 53 21 -110
9150a10K2J39r6p7J23p9j1K62j66k67L30J43k96MP1p9P5o6j21J99M7j39J23P1j21J1L8m0n
$$ -110 -88 51 -45 -122 1 -78 -89 173 7 -260 70 213 -83 -79 -8 -87 -12 -78 -199 0 47 -92 31 102 -19 -8 30 -10 -15
9143a5Oqj5L6O4o1m7N6l3k0K3j01J6J50j0o0l3rJ17L7p7l4n7J42K26k23k07J95Kj89m4K0J32
$$ -15 -9 -17 -32 4 68 7 -40 16 -17 -37 -14 -115 -99 51 41 -19 -52 -61 56 93 16 -18 -75 67 293 70 -137 58 60 -129 -173 -153 -21
9136b1M4j29J59K11j97j91L9O0K2l0K5N7j15r6J29J24n3j40k3N6p3o6K4j3P1P9n3P7J29p6
$$ -21 23 -106 53 264 67 -124 -85 -25 -3 -33 -8 49 -66 -162 -33 91 38 -102 -125 -69 -142 -208 -184 -197 -126 -47 -100 -23 106 30
9129C0j20j31n9K02J59n2o2n7L7J19m4n2N7k8m2rpJ62J00j32J6k4l06J6K82r5j52J14Q0N1
$$ 30 -90 -221 -280 -78 81 29 -33 -90 -53 66 22 -30 27 -1 -43 -52 -59 103 203 71 87 63 -243 -227 55 -40 -192 -78 2 53
9122E3L5p9n5l6Q1J63j67j26K96J1k28J11N7j17k4k5P3Mj92P3R7r3J52K1k08J38J22m6R3j16
$$ 53 88 9 -46 -82 -1 162 -5 -131 165 176 -52 59 116 -1 -25 -50 23 27 -165 -92 5 -88 64 85 -123 15 137 91 184 68
9115F8j30J04j42j38J49J4n3O8R1L1r5L4P9j65M1J07j81J06P8l09J51K73k38j69k3J56L68
$$ 68 -62 42 -100 -238 -89 -75 -128 -60 31 62 -33 1 80 -85 -44 63 -118 -12 66 -243 -92 181 -57 -226 -249 -93 275
9109B75j48k88J43l5j00N6o5J88R5l53R3K24k56Q8K06k97p1K12KN3M2j65o4P6O7Q1Rp5J8O3
$$ 275 127 -161 -18 -53 -153 -97 -162 26 121 -232 -139 85 -171 -83 123 -174 -245 -33 -31 22 64 -101 -165 -89 -22 59 68 -7 11 74
9102G4l1J1Q1RK0l7k30p9J37%n9nPJ22L0j42Q5J82r7j32K6J3J4L6r5p8J25lj73N9N5j30R6
$$ 74 43 54 135 144 164 127 -103 -182 -45 -45 -104 -109 -102 20 50 -92 -7 175 78 -54 -28 -15 -1 35 -60 -138 -13 -16 -189 -130 -75 -205 -109
9095a09R1j90K3K64P5j23j10M5M0m9J19J02j43j19p1M2J80q9r7K03k1j71J7LP3O4j11P0P5
$$ -109 -18 -208 -185 79 154 31 -79 -34 6 -43 76 178 35 -84 -155 -113 67 -22 -119 84 63 -108 -91 -88 -15 49 -62 8 83
9088H3j63K7J32p9j42j01N7K14J55n1k96q7K70qn7K16q4p7J66k18j35J81j30L8K98j26j22
$$ 83 -80 -53 79 0 -142 -243 -186 28 183 132 -164 -251 19 11 -46 170 86 9 175 -43 -178 3 -127 -89 209 83 -39
9082c9Q0p7M6J12j18q8L5N1j9n7R2M2p3M4p3j35R6J7K7J74j15j12J89k7j60L5K1PJ5j02r1
$$ -39 41 -36 10 122 4 -84 -49 2 -17 -74 18 60 -13 31 -42 -177 -81 -64 -37 137 22 -90 99 72 -88 -53 -32 -25 -10 -112 -203
9075b03k2J2J12J78O6j23p1L4p8J7J22j13l1J63j6K5M3j33P7J5k28J66J69j98O7O3j83L1p8
$$ -203 -225 -213 -101 77 143 20 -51 -17 -95 -78 44 -69 -100 63 47 72 115 -18 59 74 -154 12 181 -17 50 113 -70 -39 -117
9069a17j22K07j8k7K79j53j88K34j21j17K75j36j91K47L3j47k5k4R2L2n6J55M0j06O3p3j43
$$ -117 -239 -32 -50 -77 202 49 -139 95 -26 -143 132 -4 -195 52 85 -62 -87 -111 -19 13 -43 112 152 46 109 36 -107
9062a07Jo9J03J81r0O1N2j77K04Q4m61OL04j56j14Q9K9K6r7%K11n9j92M8J54J95J2k46p7P5
$$ -107 -106 -175 -72 109 19 80 132 -45 159 243 -218 -212 92 -64 -178 -89 -60 -34 -131 -131 80 21 -171 -123 31 226 238 -8 -85 -10
9056a0K0M7q9j54J17J42q4o0P9N8on4j29l2J55J6j30RN7O7M2j51K7K14j53j47J85Qn8J17m1
$$ -10 10 57 -32 -186 -69 73 -11 -71 8 66 60 6 -123 -155 0 16 -114 -105 -48 19 61 -90 -63 151 -2 -149 36 44 -14 103 62
9049F2j52n5k4K6Q4M5j01j23J16J21m6N0N5l0k0j14L2J75j28q6J31j17j04O8K4J93M2k94N0
$$ 62 -90 -145 -169 -143 -59 -14 -115 -238 -122 -1 -47 3 58 28 8 -106 -74 101 -27 -113 18 -99 -203 -135 -111 82 124 -170 -120
9042a20J67j88k6J74K5J0j7o0L7kq5M9J27p0j49J12J08j73l8J87J7j20j2J34N3j66nK05l7
$$ -120 47 -141 -167 7 32 42 25 -35 2 0 -85 -36 91 21 -128 -16 92 -81 -119 68 85 -35 -47 87 140 -26 -31 174 137
9035A37j45K7M2o8j19O2J17j93p5K38rm1R6j67l5K26k4kO6k31r6J97M0j17m2J05O0j11qL9
$$ 137 -8 19 61 -7 -126 -64 53 -140 -215 23 14 -27 69 -98 -133 93 69 67 133 -98 -194 3 43 -74 -116 -11 49 -62 -70 -31
9029c1q1P0O1j44J3J22qp2j18O0K11m2j15Qm0P2J33k3ql0o2N4o8r9J37K5p7N1p6p7J34P5M1
$$ -31 -112 -42 19 -125 -112 10 2 -70 -188 -128 83 41 -74 -66 -106 -34 99 76 68 38 -24 30 -38 -137 0 25 -52 -1 -77 -154 -20 55 96
9021I6K4j32j3J13q0j02M8Q8L9j16p5J50J9j10J05M1j44N3O5j46J3J15p3qM7j73p0J65K3r
$$ 96 120 -12 -25 88 8 -94 -46 42 81 -35 -110 40 59 -51 54 95 -49 4 69 -77 -64 51 -22 -30 17 -156 -226 -61 -38 -47
9014d7J25%m0O1p3q1J46R2j30j06RomP1K2j9R3j5j59N1M9j02J21N7k06J05J65k29l6J92j18
$$ -47 78 78 38 99 26 -55 91 183 53 -53 -44 -50 -54 17 39 20 113 98 -61 -10 39 -63 58 115 -91 14 179 -50 -86 106 -12
9007a2j19J31M3o1pL8M1l4r7n3M4J18N1j00r1j6m2K0J60P7j02k8J16J8j43n9J18J8j65%J47
$$ -12 -131 0 43 -18 -25 13 54 20 -77 -130 -86 32 83 -17 -108 -124 -166 -146 14 91 -11 -39 77 95 -48 -107 11 29 -136 -136 11
9000A1j1m3M3K6Rp0lJ99o7k78P5J06l8J60n2k95J49K78j31j71O6J27oj11J0N8n6NO0o6o1P6
$$ 11 0 -43 0 26 35 -35 -38 161 94 -184 -109 -3 -41 119 67 -228 -79 199 68 -103 -37 90 84 -27 -17 41 -15 -10 50 -16 -77 -1
8993aP3j7n5r4m9R3k2j86N2J59M1J98R5k50m0J50j00j45lP1P7k7j4J7o0J25J65k95l01K44
$$ -1 72 55 0 -94 -143 -50 -72 -258 -206 -47 -6 192 287 37 -3 147 47 -98 -101 -30 47 20 6 23 -37 88 253 -42 -343 -99
8986i9K13k01k1K33r8j20K26j5k01P1L6O8J54j92r7J69j06l6P5j69J31K13k53n3J34j59pJ49
$$ -99 114 -87 -108 125 27 -93 133 118 -83 -12 24 92 246 54 -43 126 20 -16 59 -110 21 234 -19 -72 62 -97 -104 45
8980D5nj6n0n8j9j7J95J40j92j15j0j4R2o1m5K06j8q6J35j00j32J91R3q2j10j06J94K04k43
$$ 45 40 24 -26 -84 -103 -120 75 215 23 -92 -102 -116 -24 -85 -130 76 58 -28 107 7 -125 66 159 77 -33 -139 55 259 16
8973A6j69J13p7o3K02O9m1Q5o2j31J21N4j64l3J00P5K4l1K2j6j32j3oj16O2R4J0J72J7k53
$$ 16 -153 -40 -117 -180 22 91 50 135 73 -58 63 117 -47 -80 20 95 119 88 110 94 -38 -51 -57 -173 -111 -17 -7 165 182 -71
8966g1m5P1k9J6m7k3J59L3o6P8Jn6P3q8k00P9R9n8J19O3j94L6R6j79M0J35j63L6J22k04lJ13
$$ -71 -116 -45 -74 -58 -105 -128 31 64 -2 76 77 21 94 6 -194 -115 -16 -74 45 108 -86 -50 46 -133 -93 42 -121 -85 37 -167 -170 -57
8959e7j31J53K12k16p6Q9o0J39J20j41L0K4j34P7K8j42K6o6j10K09O6j19J79P7k58o0J07n6
$$ -57 -188 -35 177 -39 -115 -26 -86 53 173 32 62 86 -48 29 57 -85 -59 -125 -235 -26 40 -79 100 177 -81 -141 -34 -90
8953i0q1P9J42Jo0Q1L4j12l3J6j4l1j03lJ55M8qN4p6j38Q4J78q4j86J08J06j63M9K08j46j71
$$ -90 -171 -92 50 51 -9 72 106 -6 -39 -23 -37 -68 -171 -174 -19 29 21 75 -1 -139 -55 123 39 -147 -39 67 -96 -47 161 15 -156
8946a56P6L2P6J43j16j42J45O6k16o8J99N7j04L4K2j74k7K14Mj45J62J32k26j10k7j55J74
$$ -156 -80 -48 28 171 55 -87 58 124 -92 -160 39 96 -8 26 48 -126 -153 61 65 -80 82 214 -12 -122 -149 -304 -130
8940a30K26j96n8J35n5K4J8q0J74J20j49l7pr3j1M7O1L0K4L8j41j19R7L0K1Kj07J92J73k45
$$ -130 96 -100 -158 -23 -78 -54 -36 -116 58 178 29 -8 -15 -108 -119 -72 -11 19 43 81 -60 -179 -82 -52 -31 -29 -136 56 229 -16
8933a6k9O2j84J39J56k47n2R9m2M4K9JP9lK1N2l8M3n6k81j0L12O9k60j6K92q8l10J34J62j21
$$ -16 -45 17 -167 -28 128 -119 -171 -72 -114 -70 -41 -40 39 36 57 109 71 114 58 -223 -233 79 148 -112 -128 164 76 -234 -100 62 -59
8926e9LK6l1J29P2j07j19n1Q8P3q8q0K4P0J4o0K8P1k7q6p2R9J31q7K0J39r3j9R0k6J05k0k33
$$ -59 -56 -30 -61 68 140 33 -86 -137 -49 24 -64 -144 -120 -50 -36 -96 -68 3 -24 -110 -182 -83 48 -39 -19 120 27 8 98 72 177 157 -76
8918g6J26J35j65K7k8j39K01k2l48J54K71j83p7J41qKmj73j5J71J6k2M7j0m6q5M7J92j08r1
$$ -76 50 185 20 47 19 -120 81 59 -289 -135 136 -47 -124 17 9 11 7 -166 -181 -10 6 -16 31 21 -25 -110 -63 129 21 -70
8911g0K76q3k57J82n1k21K23J04o6O6j42o5J43m4K0L6j27P3j7j90J36J00n0J31j9j31m0o8
$$ -70 206 123 -134 48 -3 -224 -1 103 37 103 -39 -104 39 -5 15 51 -76 -3 -20 -210 -74 26 -24 107 88 -43 -83 -151
8905a51J98J64k90j6K55j03q2K2j33N8K01K7q6q3Q2R3j69r2J33P5J3q2j48j5J8lK7k2N8M6
$$ -151 47 211 -79 -95 160 57 -25 -3 -136 -78 123 150 64 -19 63 156 -13 -105 28 103 116 34 -114 -129 -111 -114 -87 -109 -51 -5
8898ej12Q7J54j18j0N1j31O2R0j25R2Q4k22n9L3p2J43J34q3K3N0j00o0O1R3m7j14P7M6j27
$$ -5 -117 -30 124 6 -4 47 -84 -22 68 -57 35 119 -103 -162 -129 -201 -58 76 -7 16 66 -34 -94 -33 60 13 -101 -24 22 -105
8891a05KO0OJ27Q6j07j56p3N9m3j47J59K10o9j6k1j18P1P8N9J27k20j87L73J37l11l9M8j04
$$ -105 -103 -43 -37 90 176 69 -87 -160 -101 -144 -291 -132 78 9 -7 -28 -146 -75 3 62 189 -31 -218 155 292 -19 -58 -10 -114
8885a14O1M0j27lP8l2o0N8J67M5j67j11L8N9R6M9j02m8K3p5K4J35o6r0J13K6q6L3L1o9J6J17
$$ -114 -53 -13 -140 -143 -65 -97 -157 -99 68 113 -54 -165 -127 -68 28 77 -25 -73 -50 -125 -101 34 -32 -122 -9 17 -69 -36 -5 -74 -58 59
8878E9Mj05qO2L5J0r8q3O0n5k4K06n9j84J97N7j84J22Q6j19Q2L3j31kmjK8k20j64K30K21J1
$$ 59 63 -42 -50 12 47 57 -41 -124 -64 -119 -143 63 4 -180 17 74 -110 12 98 -21 61 94 -37 -39 -43 -44 -16 -236 -400 -170 51 62
8870F2n1j2J58R7k03j25P5k5k7J02M4q4j73q2K43K73q5j99n8l2K0J41Jk09OK44k6j83P6M5
$$ 62 11 -1 157 254 51 -74 1 -24 -51 51 95 11 -162 -244 -1 272 187 -12 -70 -102 -82 59 60 -149 -143 101 75 -108 -32 13
8864A3j53j9Q9O3P6o1j75k6J25J01m3r7j4n0J2J47o9q7K13J3j77Q5N8l9O3p0r3Q8K3k8j4o0
$$ 13 -140 -159 -70 -7 69 8 -167 -193 -68 33 -10 -107 -121 -171 -159 -12 -81 -168 45 58 -119 -34 24 -15 48 -22 -115 -27 -4 -32 -46 -106
8856a06j6l2N1J69j36j56J83n7r6K90K4q4K45q8k38J17j13k07J60N1l0J07k2L9L4k01Q8J94
$$ -106 -122 -154 -103 66 -70 -226 -43 -100 -196 94 118 34 279 191 -47 70 -43 -250 -90 -39 -69 38 16 55 89 -112 -24 170
8850A70k72j44J98L1OL1n7J09P5j39JK3j13L7J22M3pq0lK9j46k5J00j53k9K85Lj97O1P8n1
$$ 170 -102 -246 -48 -17 -11 20 -37 72 147 8 9 32 -81 -44 78 121 114 34 31 60 -86 -111 -11 -164 -193 92 95 -102 -41 37 -14
8843a4kqjR0K5n4N0N2j66k02P1J30q2L4K24l1j29Q7k4j44M1L7j4O0o2r9P1O4ll9m8J10Q1j10
$$ -14 -16 -24 -25 65 90 36 86 138 -28 -230 -159 -29 -111 -77 147 116 -13 74 50 -94 -53 -16 -30 30 -32 -131 -60 4 1 -38 -86 24 105 -5
8835ek6oo2J09P5j7J16n6k28LM9QR5o1j09P3M9Q7J69j07k88QK46j9k03R5K3k87J68M00j51
$$ -5 -31 -37 -99 10 85 68 184 128 -100 -97 -48 -40 55 -6 -115 -42 7 94 263 156 -132 -124 122 103 -100 -5 18 -269 -101 299 148
8828A48j81M5r1J1N4l2J11q3j46K51J7k28J44N3j27J22P3p6j61k28J58K68j22j3J26j41p5
$$ 148 -33 12 -79 -68 -14 -46 65 -18 -164 87 104 -124 20 73 -54 68 141 65 -96 -324 -166 102 -20 -33 93 -48 -123
8822a23Q5j2k4mnL7Q3Q2r9j27P9K4l0Q9J3J0M8j16p4Mm2R4J02l2r1j54O8J54j90m7J73j09
$$ -123 -38 -50 -74 -78 -83 -46 37 119 20 -107 -28 -4 -34 55 68 78 126 10 -64 -60 -102 -8 94 62 -29 -183 -115 39 -151 -198 -25 -134
8815a34O4K27j73j03J35m7l3Q9R6Pk25n9J86n9j2J40k15j88J79J07LJ0n7OM8K1R1lk05o8J94
$$ -134 -70 157 -16 -119 16 -31 -64 25 121 128 -97 -156 30 -29 -41 99 -116 -304 -125 -18 -15 -5 -62 -56 -8 13 104 101 -104 -172 22
8808B2P9j10M8J13j08j60j9J29J34p8j19L8J13J69q7l29O8J18k53P8K00j87J01K21k43r5J13
$$ 22 101 -9 39 152 44 -116 -135 -6 128 50 -69 -31 82 251 164 -165 -97 21 -232 -154 46 -141 -40 181 -62 -157 -44
8802d4j10P7K47o1j37P5R2p9j09N6K5j71n5J51N9KP5k6n6P8p4j49J27Kj81J21J5j76K26J28
$$ -44 -154 -77 170 109 -28 47 139 60 -49 7 32 -139 -194 -43 16 18 93 67 11 89 15 -134 -7 -5 -186 -65 -50 -226 0 128
8795A28k32Q4J15j39N9j1k12J25K24r6p2J38Nk31q7J22M8M0L0j21j3R4j4J3k1m2J37K1j01
$$ 128 -104 -20 95 -44 15 4 -208 -83 141 45 -27 111 116 -115 -202 -80 -32 8 38 -83 -96 -2 -16 -3 -24 -66 71 92 -9
8788iR0j4j30P2Nj30k5j3L9J15o0j19J08J79J8k9K6o7n8O4j39j95K08J88j20J4J05n7o0l0
$$ -9 81 67 -63 9 14 -116 -141 -154 -115 0 -60 -179 -71 108 126 97 123 56 -2 62 -77 -272 -64 124 4 18 123 66 6 -24
8781b4n0k1L0R2rj20L3J2j55P0K07k8n9pn6R2O1j67K0J39j24l3J26o2K9Q8j79N8K78j88k40
$$ -24 -74 -95 -65 27 18 -102 -69 -57 -212 -142 65 37 -22 -29 -85 7 68 -99 -79 60 -64 -97 29 -33 -4 84 -95 -37 241 53 -187
8774a87J15k2p9J21L2LR3m3o4R6L8q0k1n2j76K9K46m0j42J92O9k32n0O9L0P6o5j06Q1P2N4
$$ -187 -72 -94 -173 -52 -20 -17 76 33 -31 65 103 23 2 -50 -226 -197 49 9 -133 59 128 -104 -154 -85 -55 21 -44 -150 -69 3 57
8767E7Qj64j1J09r1N1J56j32qJ85j10r8J26o5r1J38nj74k0L4LR8R5K2qr7oJ19j29j13J98n3
$$ 57 65 -99 -110 -1 -92 -41 115 -17 -25 160 50 -48 78 13 -78 60 55 -119 -139 -105 -102 -4 91 113 105 8 2 121 -8 -121 77 24
8760B4j52K45Lk63J33L6k36J31K00j07n0J04J20pj97q4J43R0j33k46m4J57Q5M7k9p7J77J29
$$ 24 -128 117 120 -143 -10 26 -210 -79 121 14 -36 68 188 181 -16 -100 43 133 0 -246 -290 -133 -48 -1 -30 -107 70 199
8754A99j29M9L1k13qJ10o7n1P2J14j8j25N9M8j23K7J00K4qj09M8J43j56m2J68p7p2J4o6L7
$$ 199 70 119 150 -63 -71 39 -28 -79 -7 107 89 -36 23 71 -52 -25 75 99 91 -18 30 173 17 -25 143 66 -6 8 -58 -21
8747b1l5k5K07q0j49K45Kj87Q2n1q8O0j34n4J15k7Q2J26j08j07K5J75J70j68j39J45J2j09
$$ -21 -56 -81 126 46 -103 142 144 -43 39 -12 -100 -40 -174 -228 -113 -140 -58 68 -40 -147 -122 53 223 55 -84 61 73 -36
8740c6o7n5J57K05l4p3KN9K4j30jL4k95q1K89j0j01J14kJ7R9r2m0R2m3r3l3j2l1n5O7J25N3
$$ -36 -103 -158 -1 204 170 97 99 158 182 52 51 85 -210 -291 -2 -12 -113 1 -1 16 115 23 -17 75 32 -61 -94 -106 -137 -192 -125 0 53
8733E3P2r1j99J13J01j34M2N3p1J2q8O2K86j73k57J91K7o3J45q2r0J06l9J8P1p1N6n5k29J86
$$ 53 125 34 -165 -52 49 -85 -43 10 -61 -49 -137 -75 211 38 -219 -28 -1 -64 81 -1 -91 15 -24 -6 65 -6 50 -5 -234 -48
8726d8J79k62m1K19jp3o1p0J09J40l5o7k5K2K6j90k03K21K50q3L7Q2k08j9K06k9o4j2k9J26
$$ -48 131 -131 -172 47 46 -27 -88 -158 -49 91 56 -11 -36 -14 12 -178 -381 -160 90 7 44 126 -82 -101 105 76 12 0 -29 97
8719I7n0k19J40O2k05J78J52k83K2K17j09rL2k25P4K72j03k3J47k33j73K55J28j40j56k1J89
$$ 97 47 -172 -32 30 -175 3 155 -128 -106 111 2 -7 25 -200 -126 146 43 20 167 -66 -239 16 144 4 -152 -173 16
8713A6Q5j22k9K5M8L8j25MM9k10K5J89q2R3J46j27K5o9k05K42J48k15L8P2k0N3k14j83K29
$$ 16 101 -21 -50 -25 23 61 -64 -60 -11 -221 -196 -7 -89 4 150 23 48 -21 -226 16 164 -51 -13 59 39 92 -122 -305 -76
8707g6J43q5k3J16P6j85q1J36j40q2K29m1r5J51o8j80K3N7L9L9O6N2j01k1J03m5j6Q6J3L3
$$ -76 67 -18 -41 75 151 -34 -115 21 -119 -201 28 -13 -108 43 -25 -205 -182 -125 -86 -47 19 71 -30 -51 52 7 -9 77 90 123
8700A23m6j03J43P9k03m7J09k9p4l5j2O3P0l6l1J10N9j28m8P0n6j28L3J62M4j23q1j7O1J85
$$ 123 77 -26 117 196 -7 -54 55 26 -48 -83 -95 -32 38 2 -29 81 140 12 -36 34 -22 -150 -117 45 89 -34 -115 -132 -71 114
8693A14j4j28J17m6j77K56Q2l91JK43q6m5J03P2N9j57j68J79J03j65jJ44oj36j08L9J22jj27
$$ 114 100 -28 89 43 -134 122 204 -187 -186 57 -29 -74 29 101 160 3 -165 14 117 -48 -49 95 89 -47 -155 -116 6 5 -122
8686a22N3K32j08l05J64J83k47M2K13j86K8K55j39p7Q2j36P2J81j57RK01j28j55L7q7j41P8
$$ -122 -69 163 55 -250 -86 97 -150 -108 105 -81 -53 202 63 -14 68 -68 4 185 28 37 238 110 -45 -8 -95 -236 -158
8680a58J68n0j63N6J46J8n7r0L9J83N5n8j22j88P1K11m5n2P7n0j00MP0R8L4q6j23K7J89oj94
$$ -158 10 -40 -203 -147 -1 17 -40 -130 -91 92 147 89 -33 -221 -150 61 16 -36 41 -9 -109 -105 -35 63 97 11 -112 -85 104 98 -96
8673i6jN9j09o1J49K08o0k42R2J78k38j49K56J11j13nJ6n8J4N3mqn8j23k9kqJ55J20l5L3k4
$$ -96 -97 -38 -147 -208 -59 149 89 -153 -61 117 -121 -270 -14 97 -16 -21 -5 -63 -49 4 0 -8 -66 -189 -218 -220 -228 -73 47 12 45 21
8666B1r1P3l8j48J56J47j68r7N8n9q8J05J75N5O0M9j65j04J61M1j82q4P0R2Q4k3k07q4J53
$$ 21 -70 3 -35 -183 -27 120 -48 -145 -87 -146 -234 -129 46 101 161 210 45 -59 102 143 -39 -123 -53 39 123 100 -107 -191 -38
8659c8o0j29K25R2j83K9L6r1J5J6J32J52k45j51K70N5k59o2K21ll64N6L89j16q3K59j29j82
$$ -38 -98 -227 -2 90 -93 -64 -28 -119 -104 -88 44 196 -49 -200 70 125 -134 -196 25 22 -342 -286 103 -13 -96 163 34 -148
8653a48P8r1LJ41kL7r0j00K27l1k33J48P7q1Q3n8j13N3L7N6m9j31J57R0j94j1J13R9J44j21
$$ -148 -70 -161 -158 -17 -19 18 -72 -172 55 24 -209 -61 16 -65 18 -40 -153 -100 -63 -7 -56 -187 -30 60 -134 -145 -32 67 211 90
8646I0j70J28oj88oM0O3J13p3o0J32j6j20Q1Q5j07j07P3J38oo4M0j4j06p4k2J17Q6j66RK62
$$ 90 -80 48 42 -146 -152 -112 -49 64 -9 -69 63 47 -73 8 93 -14 -121 -48 90 84 20 60 46 -60 -134 -156 -39 47 -119 -110 152
8639A52k0j03Q9p5j10J11M5j15q9P2J37j19j97J16J55k7m5p6q7P6K44J04k50j39J94J0p6J22
$$ 152 132 29 118 43 -67 44 89 -26 -115 -43 94 -25 -222 -106 49 22 -23 -99 -186 -110 134 238 -12 -151 43 53 -23 99
8633I9o8q0J60o5j24J12l9p4N5j23l5J82k3p1O3n9m0J03K0l6nQQ0J0j16O1J49j03j16K7j30
$$ 99 31 -49 111 46 -78 34 -5 -79 -24 -147 -182 0 -23 -94 -31 -90 -130 -27 -7 -43 -48 -40 40 50 -66 -5 144 41 -75 -48 -178
8626a78r9J97N3j59J22K08j02j46KO1J17m5k52RK24l9q2J15n9j41J88J91j24q4M9r1q3J24
$$ -178 -277 -80 -27 -186 -64 144 42 -104 -102 -41 76 31 -221 -212 12 -27 -109 6 -53 -194 -6 185 61 -23 26 -65 -148 -24
8619b4O2r3k5M1K2Mr2m4J42N1q7J5Pj4J29L1j63k8P2l2%L8r3o6O0l4LK04J7j38J10jk05J31
$$ -24 38 -55 -80 -39 -17 -13 -105 -149 -7 44 -43 -28 -21 -35 94 125 -38 -66 6 -26 -26 12 -81 -147 -87 -121 -118 86 103 -35 75 74 -131 0
8612@J48j67L5J55n1jr3k34Q5J75r2p3OJ2J39P3j30n0R3k1j07Q2Q2j49K9J90j35r6J80qo7
$$ 0 148 -19 16 171 120 119 26 -208 -123 52 -40 -113 -107 -95 44 117 -13 -63 30 9 -98 -16 66 -83 -54 136 1 -95 85 77 10
8605A0Lj22N2P4j82R6J87j51M2J26j33L4lj62J38M6j99L5jm1K23N1j09P8o6k18L3K14qk38
$$ 10 13 -109 -57 17 -165 -69 118 -33 9 135 2 36 33 -129 9 55 -144 -109 -110 -151 72 123 14 92 26 -192 -159 55 47 -191
8598a91J31L47k27k48K07o7j05K40r6j87J74or5J05k0jJ75L3j12o3K2N5J4L3mj18n6K2L2N1
$$ -191 -60 287 60 -188 19 -48 -153 87 -9 -196 -22 -28 -123 -18 -38 -39 136 169 57 -6 16 71 85 118 114 -4 -60 -38 -6 45
8591D5n7l4J28j6r1R5j9k01K1K61J48j19j28O3J8j14k4M7k6r2m3N4P6J18J29j17j92O3P5k0
$$ 45 -12 -46 82 66 -25 70 51 -150 -129 132 280 161 33 96 114 0 -24 23 -3 -95 -138 -84 -8 110 239 122 -70 -7 68 48
8584D8R5K0j74j18LN6J6p6J0M8j07j2J48J1j5j1k06QL36K4j63R5N6lP4j57j29J67J0q7M2q2
$$ 48 143 163 -11 -129 -126 -70 -54 -130 -120 -72 -179 -191 -43 -32 -47 -58 -264 -256 80 104 -59 36 92 89 163 6 -123 44 54 -33 9 -73
8577g3OJ41j78j28K15J9r9R0K6p1n9jJ20n1k30P0J99MJ9%j47j19j2R5J56P4o9j95m0K48K9
$$ -73 -67 74 -104 -232 -17 2 -97 -7 19 -52 -111 -112 8 -43 -273 -203 -4 0 19 19 -128 -247 -259 -164 -8 66 -3 -198 -238 10 39
8570C9k31J12K69q8k09kR6K6K1qk54j49L38J84j86LMj14J66Q5k13pJ10mN6k5j22J05J44j05
$$ 39 -192 -80 189 101 -108 -110 -14 12 33 25 -229 -378 -40 144 -42 -39 -35 -149 17 102 -111 -118 -8 -12 44 19 -103 2 146 41
8563D1p1P5n5j09N6N8J4J5r6k9P5m0P5R6k06l1J13j79N8K25j79o6J34q7N1M5k57l8J03PK11
$$ 41 -30 45 -10 -119 -63 -5 9 24 -72 -101 -26 -66 9 105 -101 -132 -19 -198 -140 85 -94 -160 -26 -113 -62 -17 -274 -312 -209 -202 9
8556IN0k59P4K06r9k8N9j31nK16P8JJ0j60r5R3k4k2M9j39l1J73m6j12j9j2K11J20k50k4J61
$$ 9 59 -200 -126 80 -19 -47 12 -119 -124 92 170 171 181 21 -74 19 -5 -27 22 -117 -148 25 -21 -133 -152 -164 47 167 -83 -107 54
8549E4j16l6J55k9j34j3R0Rq5N3J6j94kJ73o3j07R1J10O3O5o8j86O9K51j30k58J13J08k2O8
$$ 54 -62 -98 57 28 -106 -119 -29 -20 -105 -52 -36 -230 -232 -59 -122 -229 -138 -28 35 100 32 -154 -85 166 36 -222 -109 -1 -23 45
8542D5j23j73J60J11p4L5K8o4NJ05Q2r6j02L1l6N9J55j92j46K02p0r1K98J7j96O2p9j28J74
$$ 45 -78 -251 -91 20 -54 -19 9 -55 -50 55 137 41 -61 -30 -66 -7 148 -44 -190 12 -58 -149 149 166 -30 32 -47 -175 -1
8536aN6r9L9O5N9lj02M5J40l3j90j31J71K08j67j57J18L7n5pk3M9J0j66o4J26P2l6n7k6M2
$$ -1 55 -44 -5 60 119 116 14 59 199 166 -24 -155 16 224 57 -100 18 55 0 -7 -30 19 29 -137 -201 -75 -3 -39 -96 -122 -80
8529h0J02Q6P2O7j47k40Q2J57p9l8J6RJ05m7j21R7N7q0r9j03J00R1q0J57Q5k80L6J98k09o2
$$ -80 22 108 180 247 100 -140 -58 99 20 -18 -2 7 112 65 -56 41 98 18 -81 -184 -84 7 -73 84 169 -111 -75 123 -86 -148
8522a48L09O1j78k9n0j69Q0J47j14M0J04j46J31J20l76j5K92r4oJ16l0Q4p7j51J66nj92j5
$$ -148 161 222 44 15 -35 -204 -124 23 -91 -51 53 -93 38 158 -218 -233 59 -35 -41 75 45 129 52 -99 67 62 -130 -145
8515a45mJ24J18r3J07Q1k85j73Q8J77J1j82K13K22l85p4L21j21q7J99l5j32K9J12k4j46R0
$$ -145 -149 -25 93 0 107 188 -97 -270 -182 -5 6 -176 37 259 -126 -200 121 0 -87 112 77 -55 -26 86 62 -84 6
8509FN2j85N7L9j50J36J31k7Lk60r1L65M5j72J03K2j21j1N8Rn0O6O2j15LRj03J55J10j45j0
$$ 6 58 -127 -70 -31 -181 -45 86 59 62 -198 -289 76 121 -51 52 74 -47 -58 0 9 -41 25 87 -28 -25 -16 -119 36 146 1 -9
8502ij1OJ21j64r5K20p2j09J77l0j10O7J0k5k7k3Q6K7r4m8N7J06m6j59J7J01J8%nL2L8k7n
$$ -9 -20 -14 107 -57 -152 68 -4 -113 64 34 -76 -9 1 -24 -51 -74 12 39 -55 -103 -46 60 14 -145 -128 -27 -9 -9 -14 18 56 29 24
8495B4k3l7M1o5j27J17J67p2j00N9l6j62J21J73j59J1J56k21j21J68M8R8rk18J23J55j23R2
$$ 24 1 -36 5 -60 -187 -70 97 25 -75 -16 -52 -214 -93 80 -79 -68 88 -133 -254 -86 -38 60 51 -167 -44 111 -12 80
8488H0O3j85%M8j6Kj45L9K44j30j75J79J08l1N6L8o7j04n1OQ1J19q6j17J62L4k24l5J02Q3
$$ 80 143 -42 -42 6 -10 -8 -153 -114 130 0 -175 4 112 81 137 175 108 4 -47 -41 40 159 73 -44 118 152 -72 -107 -5 78
8482G8O3o5n6j02j77J88J90j74J39K32k97j65J54K6K5p0j45J29M9j13J30N3j94k0J04n7j06
$$ 78 141 76 20 -82 -259 -71 119 -55 84 316 19 -146 8 34 59 -11 -156 -27 22 -91 39 92 -102 -122 -18 -75 -181
8475a81J34K64m8k07J6L0n4o4o6J48J11k13j7J62o7M0J00j58n9R5Oj7k1O6O1j22J13K35k44
$$ -181 -47 217 169 -38 -22 8 -46 -110 -176 -28 83 -130 -147 15 -52 -12 88 -70 -129 -34 -28 -45 -66 0 61 -61 52 287 43
8469D3j98J48j06j06K35Q0n7N8r1j20J44J02j25r7l4j4R6M3o5N8L6q8O0N0q0J3j02p9L29M8
$$ 43 -155 -7 -113 -219 16 96 39 97 6 -114 30 132 7 -90 -124 -138 -42 1 -64 -6 30 -58 2 52 -28 -15 -117 -196 133 181
8462A81m01R9L41j90k94N0K05P1j10O6J63j50n8J21k26j09L07oj87J24M7n1Q7p4j23J22M4
$$ 181 -220 -121 220 30 -264 -214 -9 62 -48 18 181 31 -27 94 -132 -241 66 60 -127 -3 44 -7 80 6 -117 5 49
8456D9q7J04J21o6n0l4r6J6N0o2M2O2j42k0J18o2j6R5n3o1J4O8J57n4k36j6J16Q4Mj00N3P2
$$ 49 -38 66 187 121 71 37 -59 -43 7 -55 -13 49 -93 -113 5 -57 -73 22 -31 -92 -78 -10 147 93 -143 -159 -43 41 45 -55 -2 70
8449G0j37j9Q2M5J00j17j49J17k3mJ36j45nJ82j25L7O3k49J31J37k23J80J26k30J26k6l24
$$ 70 -67 -86 -4 41 141 24 -125 -8 -31 -35 101 -44 -49 133 8 45 108 -141 -10 127 -96 84 210 -20 106 80 -244
8443b44R9J04l6J68p2k27L5M2pM6M1M4k8r8m8J18J70j70j68K66L9j96J89J12j64o1o3P6J64
$$ -244 -145 -41 -77 91 19 -208 -173 -131 -138 -92 -51 -7 -35 -133 -181 -63 107 -63 -231 35 74 -122 67 179 15 -46 -109 -33 131
8436A31r6MJ01j40J9J59n1k1k7j89o9J35J38O1K2m9j47m6P3O2N9j34j23K42K5k72K0j9j11
$$ 131 35 39 140 0 19 178 127 106 79 -110 -179 -44 94 155 177 128 -19 -65 8 70 129 -5 -128 114 139 -133 -113 -132 -243
8429b43J07n5J8K31j23o4J54j36O9K38j79j15L0o9J37R6o0M6j37j42J90P8r7m2J1Q4k0rJ68
$$ -243 -136 -191 -173 58 -65 -129 25 -111 -42 196 17 -98 -68 -137 0 96 36 82 -55 -197 -7 71 -26 -68 -57 27 7 -2 166
8423A66j10k10J69M2j74P6P7j07n8L3O5K3%L0l2j3M5q8m3K11J20k08j87J56K46j2j51p0K5
$$ 166 56 -154 15 57 -117 -41 36 -71 -129 -96 -31 -8 -8 22 -10 -23 22 -66 -109 102 222 14 -173 -17 229 217 66 -4 21
8416B1Nj32n1J78J34M5l1j73NJ07j50l0J32j30r8R2RL0J6o2L8Om0K4l4J01J49j83r5J08j47
$$ 21 26 -106 -157 21 155 200 169 -4 1 108 -42 -72 60 -70 -168 -76 -67 -37 -21 -83 -45 -39 -79 -55 -89 12 161 -22 -117 -9 -156
8409a56n3J66l3mK1j68M4J90k0n5k9O5J43j70k00J75J44qq0j83R2J97j45q4J01J7O7k5r5J57
$$ -156 -209 -43 -76 -80 -59 -227 -183 7 -13 -68 -97 -32 111 -59 -259 -84 60 52 -28 -211 -119 78 -67 -151 -50 -33 34 9 -86 71
8402G1nk16J19Q3k20K5K09J9j9j3o9N6Q1j60j23J40N8n0N4m7r6R4Jj56j7R6O8J5K7M2j27j31
$$ 71 66 -150 -31 52 -168 -143 66 85 66 53 -16 40 121 -39 -162 -22 36 -14 40 -7 -103 -9 -8 -164 -181 -85 -17 -2 25 67 -60 -191
8395a91O7M5Q3J25m6P2N5k64J3J68k10K8K33k02j33J89O4o2r9l3Q9k5J4J67l0j43JM9Qr6r6
$$ -191 -124 -79 4 129 83 155 210 -54 -41 127 -83 -55 178 -24 -157 32 96 34 -65 -98 -9 -34 -20 147 117 -26 -25 24 32 -64 -160
8388a60Q7J29L0p4j07PL0J6J29L2p3J00P9j43j79oK12J14j43j06r3j35O6Q7l9P9Q2j07j40
$$ -160 -73 56 86 12 -95 -88 -58 -42 87 119 46 146 225 82 -97 -103 109 223 80 -26 -119 -254 -188 -101 -140 -61 21 -86 -226
8381b26RJ53N2r1O7J27o9n1N5l0o0M0L2m3j3O6N1k1m1pKJ6Q8J3j43lJ03l0L5M7j31j1M5j10
$$ -226 -217 -64 -12 -103 -36 91 22 -29 26 -4 -64 -24 8 -35 -48 18 69 48 7 0 2 18 106 119 -24 -27 76 46 81 128 -3 -14 31 -79
8374g9N3J24q8j2O4j10j03O4J22K7j02p7QM1L0l4kN4nOJ8M5J35n5j31J12l0j59M8p2K4L12
$$ -79 -26 98 10 -2 62 -48 -151 -87 35 62 -40 -117 -109 -68 -38 -72 -74 -20 -25 -19 -1 44 179 124 -7 105 75 -84 -36 -108 -84 228
8366B28j11k35K16J7j97N5No7l2r9Q3J45p1mJ10K7q3j62K8J49m4j3M8m3J02K7j94J0N3k0J70
$$ 228 117 -118 98 115 -82 -27 -22 -89 -121 -220 -137 8 -63 -67 43 70 -13 -175 -147 2 -42 -55 -7 -50 52 79 -115 -105 -52 -72 98
8359I8Kj54P2o2j24J78Oj89RK1M0Q0j53j17J43J47R1l0j64k6K4j12J7K11L9k08m2K09J7j34
$$ 98 100 -54 18 -44 -168 10 16 -173 -164 -143 -103 -23 -176 -293 -150 -3 88 58 -106 -132 -108 -220 -203 8 47 -161 -203 6 23 -111
8353a11R1P9r7j7J8j2N7nq3%Q7P9p1r5J04K9j49N9J40q3q0P3P7p7j87L7K53Kk34r1O7J16J09
$$ -111 -20 59 -38 -55 -37 -49 8 3 -80 -80 7 86 15 -80 24 53 -96 -37 103 20 -60 13 90 13 -174 -137 116 118 -116 -207 -140 -24 85
8345H5j8r3K2R1lm5K3M5J0j01j78O1K43l5j72J4j0k3J34jj63RJ25O7l0j40p7J9n3M2K25R8
$$ 85 67 -26 -4 87 84 39 62 107 117 16 -162 -101 142 107 -65 -51 -61 -84 50 49 -114 -105 20 87 57 -83 -160 -141 -194 -152 73 171
8338A71r7j06nJ47Q9j42j12K3j1k0Jm9m0J2P1R7Ll2K5r6j42J11J49j16j32P1M7n9R0J80j03
$$ 171 74 -32 -37 110 199 57 -55 -32 -43 -63 -62 -111 -151 -139 -68 29 32 0 25 -71 -213 -102 47 -69 -201 -130 -83 -142 -52 128 25
8331B5k66L9J86m4q5N0P3N7n9q7J60J19j27k3k1j28N1k0q9K35P1k53j6Lm3K41N1j55J28O0
$$ 25 -241 -202 -16 -60 -145 -95 -22 35 -24 -111 49 168 41 18 -3 -131 -80 -100 -189 46 117 -136 -152 -149 -192 49 100 -55 73 133
8324A33j07Oo2oQ7j09j2Q4j22J05K67j43j98Q0O0m7l6P8Q0j69j05J71Oj39J3k8l3J34Lj59
$$ 133 26 32 -30 -36 51 -58 -70 14 -108 -3 264 121 -77 3 63 16 -20 58 138 -31 -136 35 41 -98 -85 -113 -146 -12 -9 -168
8317a68N1K35O9j86j33J52J43j48j20J74J24k14j83J74Q5k20O3K96j08j68J81K6j94jJ17Q1
$$ -168 -117 118 187 1 -132 20 163 15 -105 69 193 -21 -204 -30 55 -165 -102 194 86 -82 99 125 -69 -70 47 128
8311A28K0o1m4n4o0P1P8j3nL7P8l6j64J2R6k8n7j26m8J17q6o8J98K7nJ38p6m4P5j39k3J57
$$ 128 148 87 43 -11 -71 0 78 65 60 97 175 139 -25 -13 83 55 -2 -128 -176 -59 -145 -213 -15 12 7 145 69 25 100 -39 -62 95
8304I5K5L9j7o9P8j22k29O6K1n0J76R3o8L7K2j47r5J43L1k09L2J21n7J87Q8l11M0J67k30o2
$$ 95 120 159 142 73 151 29 -200 -134 -113 -163 13 106 38 75 97 -50 -145 -2 29 -180 -148 -27 -84 103 191 -120 -80 87 -143 -205
8297b05N2n2K93J44m43j61L51J40j65m1J23K2k1pj32M5K12j28j07K04l2j10R2j13j74Q8J15
$$ -205 -153 -205 88 232 -211 -372 -21 119 -46 -87 36 58 37 30 -102 -57 155 27 -80 124 92 -18 74 -39 -213 -125 -10
8291a0L4j19j81J11J19r7J28J50k19j01J41m8l9J28LNQ0j30n8J78o0j25J47Jj18R2L0o5k6
$$ -10 24 -95 -276 -165 -46 -143 -15 135 -84 -185 -44 -92 -131 -3 0 5 85 -45 -103 75 15 -110 37 38 -80 12 42 -23 -49
8284d9r8P2J40k13r7K12l6jK50q8j81J44J6n5J49r9k20J29J02k0J12j22k02J86nk86J73K13
$$ -49 -147 -75 65 -148 -245 -33 -69 -70 180 92 -89 55 71 16 165 66 -154 -25 77 57 169 47 -155 31 26 -260 -87 126
8278A26k14k4J30q5O4J27j62o6J69Nj04L7L5m7O5R2r8q3j5j53OL10N8k55m9J70L4j26J4J58
$$ 126 -88 -112 18 -67 -3 124 -38 -104 65 70 -34 3 38 -9 56 148 50 -33 -48 -201 -195 115 173 -82 -131 39 73 -53 -39 119
8271A19o8k06L3J21n7j34k5J24R8L9P0p9j34O3j1m6J92L9j18J04l3j87J04N8j88nJ36M5L7
$$ 119 51 -155 -122 -1 -58 -192 -217 -93 5 44 114 35 -99 -36 -47 -93 99 138 20 124 91 -96 8 66 -122 -127 9 54 91
8265I1J8kJ6o8o1J06O6j14p6O7J79Q0k86j93K78Ll55O3J29j24J42J10j43P0K7j48Q5Q1p1l
$$ 91 109 107 123 55 -6 100 166 52 -24 43 222 302 16 -177 101 104 -251 -188 -59 -183 -41 69 -74 -4 23 -125 -40 41 -30 -33
8258c3lJ9Kj01Mnl9J93J00j01L1k8q9L7p4l8J29lk5J2m1P2m7j56K29J88k43j05R6k6MQ3k7
$$ -33 -36 -17 -15 -116 -112 -117 -156 37 137 36 67 39 -50 -13 -87 -125 4 1 -24 -12 -53 19 -28 -184 45 233 -10 -115 -19 -45 -41 42 15
8250A5j46K6K38p3k88R4J32r6J10J09j27jK6q8JK7J19J92j72k78O1O5K1J40j04j82J32N1j06
$$ 15 -131 -105 133 60 -228 -134 -2 -98 12 121 -6 -7 19 -69 -68 -41 78 270 98 -180 -119 -54 -33 107 3 -179 -47 4 -102
8244a02Q2L3n5J22L3j34M1M9k01j55J47K01m7j08R2M8j04j9j1m1R5L2m8J44O3k08o7J19N4
$$ -102 -20 13 -42 80 113 -21 20 69 -132 -287 -140 61 14 -94 -2 46 -58 -77 -88 -129 -34 -2 -50 94 157 -51 -118 1 55
8237E5Oo1m2J22Qj41R2J28j96k01K1O4P8O5l3j7M9Jl1j8p8l6J76J82m7o3J9q4q2O0K4o3k4
$$ 55 61 0 -42 80 88 -53 39 167 -29 -230 -209 -145 -67 -2 -35 -52 -3 -2 -33 -51 -129 -165 11 193 146 83 102 18 -64 -4 20 -43 -67
8230f7M7K0p2J2J45n8j97N7R6j63j01J87J90m3j40j4J20J32j9k08j34O5O8R0J26q1j43J2p2
$$ -67 -20 0 -72 -60 85 27 -170 -113 -17 -180 -281 -94 96 53 -87 -101 19 151 132 -76 -210 -145 -77 13 139 58 -85 -73 -145
8223a45j06J14L8r9J55J86j09j07j9l0Q6M9p1J8j7p6N3J3NO2j14k6J32q3N0J99j86j26J50
$$ -145 -251 -137 -99 -198 -43 143 34 -73 -92 -122 -36 13 -58 -40 -57 -133 -80 -67 -62 0 -114 -140 -8 -91 -41 158 -28 -154 -4
8217dn5RJ39j07m1J09n3q9MQ1J4j43N9J76j07r0K9l8M9J1k5Q6r3o1J26j63m0L34J3j45l5j20
$$ -4 -59 -50 89 -18 -59 50 -3 -92 -88 -7 7 -136 -77 99 -8 -98 -69 -107 -58 -47 -72 14 -79 -140 -14 -177 -217 117 130 -15 -50 -170
8209a70J09R8j81J21J22k22K4L7j33J78Q0j37J36pk66N4K28P5m9j13n9o7o0J65J63l6m8j30
$$ -170 -61 37 -144 -23 99 -123 -99 -62 -195 -17 63 -74 62 55 -211 -157 71 146 97 -16 -75 -142 -202 -37 126 90 42 -88
8203h8j42J73J95j15r0K5j15K0K62l5k04J43R5j93j3J27jl8m0OM0l0j5j0pP4p1p0J90j2j60
$$ -88 -230 -57 138 23 -67 -42 -157 -137 125 90 -114 29 124 -69 -82 45 44 6 -34 -28 12 -18 -33 -43 -50 24 -47 -117 73 61 -99
8196i9J31O4l0R1j28j01R4j73p4J96j40r4K52j1j05J08jpM7j41q4J15M3j1N4L9k9j0P3Jr4
$$ -99 32 96 66 157 29 -72 22 -151 -225 -29 -169 -263 -11 -22 -127 -19 -20 -27 20 -121 -205 -90 -47 -58 -4 35 6 -4 69 70 -24
8189b4K2m7k22Q5K83p5j11J39k2j07M0p8m9J84L8m9J06r4k08Q6J11j1M0o4p2J57L8j21R8K5
$$ -24 -2 -49 -271 -186 97 22 -89 50 28 -79 -39 -117 -166 18 56 7 113 19 -189 -103 8 -3 37 -27 -99 58 96 -25 73 98
8182I8k28L3J88r7q0P4n1k2L8j06L6J95n8r7J36L8j14j0O5N1m8j57L4K16k5j03J00q9k19J43
$$ 98 -130 -97 91 -6 -86 -12 -63 -85 -47 -153 -117 78 20 -77 59 97 -17 -27 38 89 41 -116 -82 134 109 6 106 17 -202 -59
8175e9K06l3o0j18p0J35M3J0J04r8j45Nk9Jj5m3J27mj17J34pj44J16J5o5M9j26L7K50j16j09
$$ -59 147 114 54 -64 -134 1 44 54 158 60 -85 -80 -109 -108 -123 -166 -39 -43 -160 -26 -33 -177 -61 -46 -111 -62 -188 -151 99 -17 -126
8168a26K10J12n8k54k01K10J08q9J01m9j47P7n4m1J92kp9L9j13j2K74N4k65q4K19J10j22k4
$$ -126 84 196 138 -116 -317 -107 1 -88 13 -36 -183 -106 -160 -201 -9 -11 -90 -51 -164 -176 98 152 -113 -197 22 132 10 -14
8162a4O6j02j24J07J31j10j07J20N3k3J41rk31N0J80j57j76J49J02q5N2N0q9Q8L6j69J15J31
$$ -14 52 -50 -174 -67 64 -46 -153 -33 20 -3 138 129 -102 -52 128 -29 -205 -56 46 -39 13 63 -26 62 98 -71 44 175
8156A75j90j5N9j02pj03n7K62K1j23J68Oj37L2j3O6J11j71q9J75K2j54j9J50O3r9r7l9J04
$$ 175 -15 -30 29 -73 -80 -183 -240 22 43 -80 88 94 -43 -11 -24 42 153 -18 -107 68 90 -64 -83 67 130 31 -66 -105 -1
8149aJ10j09J6Q3k71p6L35J00j62j92n0K02K2q7R6j00j21J08J3J17R3k04N3J20j31N5o8j71
$$ -1 109 0 16 99 -172 -248 87 187 25 -167 -217 -15 7 -80 16 -84 -205 -97 -84 33 126 -78 -25 95 -36 19 -49 -220
8143b20K18J2j60J28o0j3K47q2r3Q4o2P9Rj88J77P2l65l9K75P4j06n7R5L8lL0k65j71L22J20
$$ -220 -2 10 -150 -22 -82 -95 152 70 -23 61 -1 78 87 -101 76 148 -217 -256 19 93 -13 -70 25 63 60 90 -175 -346 -24 96
8136I6j21L9o2m9L1r8Q8J16r7J00J02r0Mr0J2K07k16j61L03q3k63J04L0N2J40j75r4J47n8
$$ 96 -25 14 -48 -97 -66 -164 -76 40 -57 43 145 55 59 -31 -19 188 -28 -189 114 31 -232 -128 -98 -46 94 -81 -175 -28 -86
8129h6n0J36N2m2l4k3k6L1J14q6j47K10J17j87K0O9m1R1n7j33J53P2j04n0j42JK68N0j59n7
$$ -86 -136 0 52 10 -24 -47 -73 -42 72 -14 -161 49 166 -21 -1 68 27 118 61 -72 81 153 49 -1 -143 -142 126 176 17 -40
8122d0l2m2M5J57Q9j25n4L9j71p4K80J65j40j23L9O4n6j01l1M3N3l2m9PK4R1K0j16M1n8k61
$$ -40 -72 -114 -69 88 177 52 -2 37 -134 -208 72 237 97 -26 13 77 21 -80 -111 -68 -15 -47 -96 -89 -65 26 46 -70 -29 -87 -348
8115c48K13K91k82r0K63qk0R1m0m3j17j41O3Lj00O0J59J54N1j14j11m3K9J07N2o8j83j36J40
$$ -348 -135 156 -126 -216 47 39 19 110 70 27 -90 -231 -168 -165 -265 -205 -46 108 159 45 -66 -109 -80 27 79 11 -172 -308 -168
8109a68J64k5oj7o6O4Q8l4o2N3J48K1j16m5M8N8j05k13K0J64J12J40m4j93K7J24M5o3j76k
$$ -168 -4 -29 -35 -52 -118 -54 34 0 -62 -9 139 160 44 -1 47 105 0 -213 -193 -29 83 223 179 -14 13 137 182 119 -57 -59
8102e9J04j6L7o4j53Q0Jn1J50q6p5K95l3k82R5J14j59j37J03J94PpJ2j85L4K28j44j52M1q4
$$ -59 45 29 66 2 -151 -71 -70 -121 29 -57 -132 163 130 -152 -57 57 -102 -239 -136 58 65 58 70 -115 -81 147 3 -149 -108 -192
8095a92J15J90j89o7K15j16k79J21K44q8j46N7N7P0M3j26j3N9p5J16J43j13k6k3j14Q7K7q1
$$ -192 -77 113 -76 -143 72 -44 -323 -202 42 -46 -192 -135 -78 -8 35 -91 -104 -45 -120 -4 139 26 0 -23 -137 -50 -23 -104
8089a04P3m6j00N8m8K9K29j9j44R4J24m9j26l9Q7M1r3l6J45P2j79r3J46L8j14M6J08j97k10
$$ -104 -31 -77 -177 -119 -167 -138 91 72 -72 22 146 97 -29 -68 19 60 -33 -69 76 148 -31 -124 22 60 -54 -8 100 -97 -307
8082c07K51J19l32P7L57j24j12J25n4j2L2q4L3l3j16J52P0k12k6K05R4o1j3O0n4j50j26K0
$$ -307 -56 63 -269 -192 165 41 -71 54 0 -12 20 -64 -31 -64 -180 -28 42 -170 -196 9 103 42 29 89 35 -115 -241 -221
8076b21K04j8k10J55J68j14R9P5k41k9J61j6q0k1K7k2n1J09Q2r7n5J1K1N9M9Q1M4j01r9j7
$$ -221 -17 -35 -245 -90 78 -36 63 138 -103 -132 29 13 -67 -88 -61 -83 -134 -25 57 -40 -95 -84 -63 -4 45 126 170 69 -30 -47
8069d7K2m1j17P3J36p9J7J39m0r6q5K5K21M9p9N0q0j76o7O2K75N9l42m5J94r5j00N8L0M6P5
$$ -47 -25 -66 -183 -110 26 -53 -36 103 63 -33 -118 -93 128 177 98 148 68 -108 -175 -113 162 221 -121 -166 28 -67 -167 -109 -79 -33 42
8062D2M7p4j48O8J85L7jqr1r6p7k8N5J00N3o8j7R9LJ3O1j06r2L3J0K6p3j05J75J07j43N1R9
$$ 42 89 15 -133 -65 120 157 156 148 57 -39 -116 -144 -89 11 64 -4 -21 78 81 94 155 49 -43 -10 0 26 -47 -152 23 130 -13 38 137
8054A37j28n2N1n2l2J01P2j6N7mj97l1Q7j00K9J04j19O4J49j87o2J57m7p4ml4L7l1l8J03j13
$$ 137 9 -43 8 -44 -76 25 97 81 138 134 -63 -94 -7 -107 -78 26 -93 -29 120 -67 -129 28 -19 -93 -97 -131 -94 -125 -163 -60 -173
8047a73j75K53K03k15p5K66J00k11r2R2o1n6J48N2l1J4j00k8J34K7Mj0j43k4N7k8L6l0o9J23
$$ -173 -348 -95 108 -107 -182 84 184 -27 -119 -27 -88 -144 4 56 25 39 -61 -89 45 72 76 66 -77 -101 -44 -72 -36 -66 -135 -12
8041a2Nq9J23nj53J5j8m0J08P3M3N6l5n6l7K3Q3k3n0K1l5n0k3KN8qM6J65p2j52N2j5k7O4q7
$$ -12 -7 -96 27 22 -131 -116 -134 -174 -66 7 50 106 71 15 -22 1 84 61 11 32 -3 -53 -76 -74 -16 -24 22 187 115 -37 15 0 -27 37 -50
8033e0m0Q8p6l6J43Mj27J2R4o3p0J44K4j10J01%j16J96P1k23O0J12j41O4K37o7k94j51M5M4
$$ -50 -90 -2 -78 -114 29 33 -94 -82 12 -51 -121 23 47 -63 38 38 -78 118 189 -34 26 138 -3 61 298 231 -63 -214 -169 -125
8026a25N7J44jj71l6P0j5N8J46j29k51J69K05j84M0K08k89j81L15M8j55N4o7o8J64Pj14K4
$$ -125 -68 76 75 -96 -132 -62 -77 -19 127 -2 -253 -84 121 -63 -23 185 -104 -285 30 78 -77 -23 -90 -158 6 13 -101 -77
8019g7K0N4M5j62n8J75M4p2M7J89O2k84r1K57j82k65K56k3j37L75r5m86K46K85k56m5K22N7
$$ -77 -57 -3 42 -120 -178 -3 41 -31 16 205 267 -17 -108 149 -33 -298 -42 -65 -202 173 78 -408 -162 123 -133 -178 44 101
8013A01r5j0J35o1j94P1R9k9j1o6K9J05j1Q1Qj68L6n4k20J63J75j07J0k2q4R7m9j77J68L10
$$ 101 6 -4 131 70 -124 -53 46 17 6 -60 -31 74 63 144 152 -16 20 -34 -254 -91 84 -23 -13 -35 -119 -22 -71 -248 -80 230
8006B30m9k58K8J22k10j81J43J42N2O4N6p4k39j4K41K9m7K5o0L7Nj10J28J1k22J71J93k52
$$ 230 181 -77 -49 73 -137 -318 -175 -33 19 83 139 65 -174 -188 53 82 35 60 0 37 42 -68 60 71 -151 20 213 -39
8000c9j42R6Jo0K2J42N7j14j9M7n8n0MK4K9M8Q0l7j30k6L0P6N3j12m7N1K1J43jk01J30J11
$$ -39 -181 -85 -84 -144 -122 20 77 -37 -56 -9 -67 -117 -113 -89 -60 -12 68 31 -99 -125 -95 -19 34 -78 -125 -74 -53 90 89 -112 18 129
7993A29k87q3J43K5P1K1p9R1J08r9q5J24O9k11j3K70j29k45K26J81m2K7j11j24O1m0p3Nl4
$$ 129 -158 -241 -98 -73 -2 19 -60 31 139 40 -45 79 148 -63 -76 194 65 -180 46 227 185 212 101 -23 38 -2 -75 -70 -104
7986a04R4J05q7m9n2m6J85O4j68k4K9N8J23j29j55N2k9O9J80q9o1O8r6lR6n8n2m2JJ12p9q4
$$ -104 -10 95 8 -41 -93 -139 46 110 -58 -82 -53 5 128 -1 -156 -104 -133 -64 116 27 -34 34 -62 -65 31 -27 -79 -121 -120 -8 -87 -171
7979a71J92J39jr6j46Q9K7j80Q5M6j54J48J11q9J13J4j03Q6o4j13P9m3oJ37p1o1R0NO3M0k04
$$ -171 21 160 159 63 -83 6 33 -147 -62 -16 -170 -22 89 0 113 127 24 110 46 -67 12 -31 -37 100 29 -32 58 63 126 166 -38
7972c8q5J10o7j40L5R4J9k6P9J69p4k34M5P6j61J9J19j22mJ69j6m0K4l4Pl6o3J74J68j17q2
$$ -38 -123 -13 -80 -220 -185 -91 -72 -98 -19 150 76 -158 -113 -37 -198 -179 -60 -182 -186 -17 -33 -73 -49 -83 -76 -112 -175 -1 167 50 -32
7965c2O8k9p5LJ8R6R1j42j04P4l9L4J19j48kK08j20n6J07j88oK24q5k8M9j32J10J36j78j1
$$ -32 36 7 -68 -65 -47 49 140 -2 -106 -32 -71 -37 82 -66 -68 140 20 -36 71 -117 -123 101 16 -12 37 -95 15 151 -27 -38
7958c8P8j22j1R4j3m3L1P0n0j14L8N1l9OM3N1J7n9l0K2M7M4q1q1O9P0Ll7l9P4N8j66j83J10
$$ -38 40 -82 -93 1 -12 -55 -24 46 -4 -118 -80 -29 -68 -62 -19 32 49 -10 -40 -18 29 73 -8 -89 -20 50 53 16 -23 51 109 -57 -240 -130
7950a30K20j0n7O8n8p4J7j35nJ83j10j07J00l9Q5J37k15l0K53o6j25J22J4j39LJ31j7j47j1
$$ -130 90 80 23 91 33 -41 -24 -159 -164 19 -91 -198 -98 -137 -52 85 -130 -160 93 27 -98 24 38 -101 -98 33 16 -131 -142
7944a42O1j7l2l3lQ3J14O0o5o0qo7Q0J23k05r7K12K9j4J08n5q1l0r2n0K3J45J47j11q4Q6p
$$ -142 -81 -98 -130 -163 -166 -83 31 91 26 -34 -42 -109 -29 94 -111 -208 4 33 19 127 72 -9 -39 -131 -181 -158 -13 134 23 -61 25 18
7936A8K6L4j38l7O5l0nm6j20K9J22L2j1J2j3pQ3M8j1R4O5n6p8j70j32J00J56L1j30o0J11q2
$$ 18 44 78 -60 -97 -32 -62 -67 -113 -233 -204 -82 -50 -61 -49 -62 -69 14 62 51 145 210 154 76 -94 -226 -126 30 61 -69 -129 -18 -100
7929a00k8K74k3j25J51j15j91O8N7J84j8k77K82J51m41J10K05l51K4K30o5L3n4j48Q7L1J4
$$ -100 -128 146 123 -2 149 34 -157 -89 -32 152 134 -143 139 290 -151 -41 164 -187 -163 67 2 35 -19 -167 -80 -49 -35
7923c5J22o8j23N0P2k8p7K5N8j6NJ3K4Lj08K1J18jM8n8j55J44O8j37L0j16j08K60M8j78K3
$$ -35 87 19 -104 -54 18 -10 -87 -62 -4 -20 -15 -2 22 25 -83 -62 56 55 103 45 -110 34 102 -35 -5 -121 -229 31 79 -99 -76
7916g6P7O7p3j35J81R5k07j04l5J11K05j00j04mj42R6K03n2moq0N9nm0N4l4j2jl7J58Q0j51
$$ -76 1 68 -5 -140 41 136 -71 -175 -210 -99 106 6 -98 -102 -244 -148 55 3 -1 -7 -87 -28 -33 -73 -19 -53 -65 -66 -103 55 135 -16
7909a6kQ1K3L3k5j2p5j97k0O2rP4l3p1J77L7j35J07P7r3P7P6j39r6%L4J37rk24j2Q4j41J5
$$ -16 -18 63 86 119 94 82 7 -190 -210 -148 -157 -83 -116 -187 -10 27 -108 -1 76 -17 60 136 -3 -99 -99 -65 72 63 -161 -173 -89 -230 -215
7901b15K12nn8O9L9j2p8o0O7lo8Q7J57Oj90q0K05O6j65j0N3o1k7K7%k8NK8p0n3Q5O2K0l7j08
$$ -215 -3 -8 -66 3 42 30 -48 -108 -41 -44 -112 -25 132 138 -52 -132 73 139 -26 -36 17 -44 -71 -44 -44 -72 -67 -39 -109 -162 -77 -15 5 -32 -140
7893a40N1L6j86n8P3M9K44J70k37j71J34Q3j3N8nq0M9k0k00J7J58m4J0J30n4j23J1L9j9K1
$$ -140 -89 -53 -239 -297 -224 -175 69 239 2 -169 -35 48 35 93 88 8 57 37 -163 -146 12 -32 -22 108 54 -69 -58 -19 -38 -17
7886a7O3o0m2J06n7r2J15o7j35J22Kp2J00m9j19J04J45K8r4r8P2J22l4j79q5J18J6q2M9k6
$$ -17 46 -14 -56 50 -7 -99 16 -51 -186 -64 -62 -134 -34 -83 -202 -98 47 75 -19 -117 -45 77 43 -136 -221 -103 -87 -169 -120 -146
7880a46l2J40j2r5O8j3m5J59J34j89k42K10K28k89j56K09P5P4k9k04J90K09k45q2J25q9j51
$$ -146 -178 -38 -50 -145 -77 -90 -135 24 158 -31 -273 -63 165 -124 -280 -71 4 78 49 -155 35 244 -1 -83 42 -47 -198
7873a98J1J98Q6j56k5L0k1J04p7j37K13J20j02k0o0q3p2j9J90rk14R9R5n0R8o2j77M5O2J07
$$ -198 -187 11 97 -59 -84 -54 -75 29 -48 -185 28 148 46 26 -34 -117 -189 -208 -18 -27 -241 -142 -47 -97 1 -61 -238 -193 -131 -24
7867b4J36r2k6J31p6j63L9J18oq9m1nL0L1k3R0N7k31n4K96R6j39q0m7lQ2J03Nj08n2mj9M8
$$ -24 112 20 -6 125 49 -114 -75 43 37 -52 -93 -98 -68 -37 -60 30 87 -144 -198 98 194 55 -25 -72 -75 7 110 115 7 -45 -49 -68 -20
7859b0P1R1J4k46j35J44k1q4O7J5J5j4p2J63J47j12l9m5j10J34J02j69l7J88Q6p6o3mpJ7J6
$$ -20 51 142 156 -90 -225 -81 -102 -186 -119 -104 -89 -103 -175 -12 135 23 -16 -61 -171 -37 65 -104 -141 47 133 57 -6 -10 -17 0 16
7852A6k8Jp4j28J64K34j00p5O2j89j23K23K2j99Q5J39j02m8O7L7K7l4j9O7n8n5J15o4j90Q2
$$ 16 -12 -11 -85 -213 -49 185 85 10 72 -117 -240 -17 5 -194 -109 30 -72 -120 -53 -16 11 -23 -42 25 -33 -88 27 -37 -227 -145
7845a45J77J6r4j35k2R8K3k5lj8N8R6p5p9J89J21k29j29K17J44j14j43n3L6Q4N1m3j32r8L4
$$ -145 32 48 -46 -181 -203 -105 -82 -107 -110 -128 -70 26 -49 -128 61 182 -47 -176 41 185 71 -72 -125 -89 -5 46 3 -129 -227 -193
7839a93J20J44M3j27n5J34L1j19k7k9p7J13J10j13k6Q4K4R0J7j18L8j8k38n8J67J15l2j20
$$ -193 -73 71 114 -13 -68 66 97 -22 -49 -78 -155 -42 68 -45 -71 13 37 127 144 26 64 46 -192 -250 -83 32 0 -120
7832a20J2J07J5k1p6j3J20m8n6J29l4m4M1j26O9J70j65j2J23j29O5J68j41j21qM5J38Mn0J4
$$ -120 -108 -1 14 -7 -83 -96 24 -24 -80 49 15 -29 12 -114 -45 125 -40 -52 71 -58 7 175 34 -87 -95 -50 88 92 42 56
7825E6q3l3Jj06M3J04n4J9Q9j7m5m0o2k7L9On5M8R1LJ9l5n8P1p1j29J51J06m0lr9O8K33k24
$$ 56 -27 -60 -59 -165 -122 -18 -72 -53 36 19 -26 -66 -128 -155 -116 -110 -165 -117 -26 -23 -4 -39 -97 -26 -97 -226 -75 31 -9 -12 -111 -43 190 -34
7818c4l28J56J70J7J26k9j90M4R9q5MO8j29r3J01J13R0n2k01jJ89O1j12p9J17M2k07n7J16
$$ -34 -362 -206 -36 -19 107 78 -112 -68 31 -54 -50 18 -111 -204 -103 10 100 48 -153 -154 35 96 -16 -95 22 64 -143 -200 -84
7811h4J6Lo9n6K18J64j13j47m4J53J11j48n8K5p0J7j4o6J28J25n6j27qJ71k9j47J83O3l00
$$ -84 -68 -65 -134 -190 28 192 79 -68 -112 41 152 4 -54 -29 -99 -82 -96 -162 -34 91 35 -92 -100 71 42 -105 78 141 -159
7804a59p6J77O5n6J3Q6j36q6K74O1j18R8p4q7J40r1j34O0K1P5nj71rN6L0K6q5M7Q8j24m4L5
$$ -159 -235 -58 7 -49 -36 50 -86 -172 102 163 45 143 69 -18 122 31 -103 -43 -22 53 48 -123 -132 -76 -46 -20 -105 -58 30 -94 -138 -103
7797a03P0J77o8j61K2l6M4N2p9J03q2j89K78m6l71K49J67j59J42p4k13K46J28j45K1N1m3n3
$$ -103 -33 144 76 -85 -63 -99 -55 -3 -82 21 -61 -250 28 -18 -389 -140 27 -132 10 -64 -277 -31 97 -48 -27 24 -19 -72
7791g2QR0Or7k3N8k4m2J22Rj49J30M5k73M8J79mJ24k3j76L9kj1Rj68N7J06j67J21J50k23K5
$$ -72 -64 26 32 -65 -88 -30 -54 -96 26 35 -114 16 61 -212 -164 15 11 135 112 -64 -25 -27 -38 -29 -197 -140 -34 -201 -80 70 -153 -128
7784a28J67j17p6J0pJ03R9l3r5n9l9j0J18Q1m6l9p2L2Q5j00J00J52k25j8J37p5J28qj68K38
$$ -128 39 -78 -154 -144 -151 -48 51 18 -77 -136 -175 -185 -67 14 -32 -71 -143 -111 -26 -126 -26 126 -99 -117 20 -55 73 65 -103 135
7777A35l8k82J87Q6k4Q6k09l1Q7k19J12J40k15Q5Q4j43Jl0J50J60k54J9J47j84J30J42j78
$$ 135 97 -185 2 88 64 150 -59 -90 -3 -222 -110 30 -185 -100 -16 -159 -158 -188 -38 122 -132 -113 34 -150 -20 122 -56
7771e6N2m8j38K02K3j06R1n9n3O0p7N4J43j35j29J36mj78J84J91k30O4J97k68j9J70j67M1
$$ -56 -4 -52 -190 12 35 -71 20 -39 -92 -32 -109 -55 88 -47 -176 -40 -44 -222 -38 153 -77 -13 184 -84 -103 67 -100 -59
7764e9Q1r5J49j3j13J38j40j41J48m6lK9j25J16O5n2J44q3j04J04j45m5J36k7J08p2l54J32
$$ -59 22 -73 76 63 -50 88 -52 -193 -45 -91 -94 -65 -190 -74 -9 -61 83 0 -104 0 -145 -190 -54 -81 27 -45 -399 -267
7758b67L27k5j63o0K12J62j20k8J1LP8p8m8n0j75J33J05q5J55j52l07K34J25m3P2j25Q2J26
$$ -267 60 35 -128 -188 24 186 66 38 49 52 130 52 4 -46 -221 -88 17 -68 87 -65 -372 -138 -13 -56 16 -109 -27 99
7752I9k04J10R9j68J07p8j19K23j74j49K53j20j30J32LJ21R8m5K4j45r0P9k3R0n5j73K37M3
$$ 99 -105 5 104 -64 43 -35 -154 69 -105 -254 -1 -121 -251 -119 -116 5 103 58 82 -63 -153 -74 -97 -7 -62 -235 2 45
7745D5j58K20j3j99L4p3N5R1j91N0Q6j22J39J17o8no5J2O4j9O3m7m5Q0j69p2R8p6K21J44l53
$$ 45 -113 107 94 -105 -71 -144 -89 2 -189 -139 -53 -175 -36 81 13 8 -57 -45 19 0 63 16 -29 51 -118 -190 -92 -168 53 197 -156
7738a56OJ50j07J46L1j71Q6rm1J17l0J4N2j43j27n0N9R0k8P9j6k20N7K01J50R5k15j48M8p8
$$ -156 -150 0 -107 39 70 -101 -15 -24 -65 52 22 36 88 -55 -182 -232 -173 -83 -111 -32 -48 -268 -211 -10 140 235 20 -128 -80 -158
7731a58J14R5j49J45J06j88j5Lj0Mr0J79N3k81J11O7j82K25J41n7J09j42n9J89l0L67P71J75
$$ -158 -44 51 -98 47 153 -35 -50 -47 -57 -53 -143 36 89 -192 -81 -14 -196 29 170 113 222 80 21 210 180 547 1318 1493
7725A493m45n13j82m5k53j3R1j87O1J22j31K8n2j20R6n4J2Q9k38PK25j23n6J16L8Kp1J10J78
$$ 1493 1048 535 353 308 55 42 133 -54 7 129 -2 26 -26 -146 -50 -104 -92 -3 -241 -234 -9 -132 -188 -72 -34 -32 -103 7 185
7718A85j59j02L3q5J8N1K8M1j38j7J57n2o0J7jN5q3k6K28O4j18j30oK90K1l70m1J42n1j4Q3
$$ 185 26 -76 -43 -128 -110 -59 -31 10 -128 -145 12 -40 -100 -83 -84 -29 -112 -138 90 154 36 -94 -100 190 211 -159 -200 -58 -109 -123 -40
7711d0jj53N6K31j94j70K10n3j1K06j32n9J16m2P3k9j50Q9JMP8j29M1N8j04J73Jk10M6n0J15
$$ -40 -41 -194 -138 93 -101 -271 -61 -114 -125 81 -51 -110 6 -36 37 8 -142 -53 -52 -48 30 -99 -58 0 -104 69 70 -140 -94 -144 -29
7704b9J73l14J25L05m12l6K67k32mJ47k6N0j99j20K26O4M9k3j67Q9L3j7J04j34L3J08k46J03
$$ -29 144 -170 -45 260 -152 -188 79 -153 -157 -10 -36 14 -185 -305 -79 -15 34 11 -156 -67 -34 -51 53 -81 -48 60 -186 -83
7698h3K15j38L9p0j19K12o2n9J60j19N5L5k20K25L6j78L28l01k22J675J260j113j348k25J6
$$ -83 132 -6 33 -37 -156 56 -6 -65 95 -24 31 66 -154 71 107 -71 257 -44 -266 1409 2669 1556 208 -17 -1
7692al3P3j38r1K60p9k38K01n0j14K66j12o2K73j93o7J92j88L9J24j70J6o2k1K12k21k02J77
$$ -1 -34 39 -99 -190 70 -9 -247 -46 -96 -210 56 -56 -118 155 -38 -105 87 -101 -62 62 -108 -92 -154 -175 37 -184 -386 -209
7686b09M8M7r2q4K79n8j44K28m3q1k3j65J52J1q5K72j42j07K66k04J6J71k35K22ql40L47j63
$$ -209 -161 -114 -206 -290 -11 -69 -213 15 -28 -109 -132 -297 -145 -134 -219 53 -89 -196 70 -134 -118 53 -182 40 32 -308 39 -124
7680a24l35M70q6pM31n09k31L32j42J92P6k33L49L4j62K1l45L14K78o32L40M35l89N82P01
$$ -124 -459 11 -75 -82 349 -160 -391 -59 -201 -9 67 -166 183 217 55 76 -269 45 323 -309 31 466 77 659 1360
7674A360J318L581J278l730l678n67L79j55p8O0q8J83P4j99K67J35j87Q5j66n4J94k73O4J54
$$ 1360 2678 6259 7537 3807 129 -438 -59 -214 -292 -232 -320 -137 -63 -262 5 140 -47 38 -128 -182 12 -261 -197 -43
7668d3k44L06p4l95M34j12k11M15l66m8M02l32K31O3m94M85L7k97L62l14J03L25o03L96J05
$$ -43 -287 19 -55 -450 -16 -128 -339 76 -290 -338 64 -268 -37 26 -468 17 54 -243 119 -195 -92 233 -370 26 131
7663A31o06Q69m2n59P16m97q1O64q45N31N61r95Q83R2q87J112k57j42J093q69O65Q69r48J996
$$ 131 -475 394 352 -207 509 12 -69 595 -250 281 842 -153 730 822 -65 1047 790 648 1741 872 1537 2406 1458 3454
7657C454P71r1M380J609n46N50k387J212K319n11O323M031N512K1411K2753O4703J27942M6337
$$ 3454 4225 4134 8514 10123 9577 10127 7740 8952 11271 10760 17083 21114 26626 48037 70790 135493 263435 309772
7653C09772j03855j09018m0368k0199r281k271p894j759j46l220J251k23l30J546l908k949
$$ 309772 205917 96899 56531 36332 27051 24780 16886 15127 14981 11761 13012 12789 12459 14005 10097 7148
7650G148O6k410k42K64j384J252n2j547L70r26n58O59r51J07L90r10M38L1n68N23m15j96M92
$$ 7148 7214 4804 4562 4826 3442 4694 4642 3095 3465 2539 1981 2640 1689 1796 2186 1276 1714 1745 1177 1700 1285 1089 1581
7644A581o50L6K77m27M12j53m05O46m4lK29o66J09J03o36M22J36m24L00j25j4L10m07J06K24
$$ 1581 931 967 1244 817 1229 1076 671 1317 1273 1270 1499 833 942 1045 409 831 967 543 843 718 704 1014 607 713 937
7639I37l43K03r9k81L27j27L3K09m29J57R7m12M53Q4m18K79j43j19M25j65J05M97n0j81n47
$$ 937 594 797 698 417 744 617 650 859 430 587 684 272 725 809 391 670 527 408 833 668 773 1270 1220 1039 492
7633D92m66K17j05L9L74k99p3K51j69M8K1j10J54k08j13K95o5j3P6j53Q0Kn9J46j61j07J25
$$ 492 26 243 138 177 551 252 179 430 261 309 330 220 374 166 53 348 283 270 346 193 273 275 216 362 201 94 219
7627B19L3J88r4k58J52j24j24K59p1J2Q3k03J85M9j93K42j33j83K79j26J25L10l89K0J70l38
$$ 219 252 440 346 88 240 116 -8 251 180 192 275 72 257 306 113 355 222 39 318 192 317 627 238 258 428 90
7621I0J65L8l19K62O3j56J24j16P0J61j22K17m0l20K36k9j42K93j99k06K57j03j13R0l5R8
$$ 90 255 293 -26 236 299 143 267 151 221 382 260 477 437 117 353 324 182 475 276 70 327 224 111 201 166 264
7615B64O1l1n7j87J19l4o85m13j1J90N48J47j33K57J02q5Mj16%M6p7J1l0R3J92j44n8J59k6
$$ 264 325 294 237 50 169 135 -550 -963 -974 -784 -236 -89 -222 35 137 52 56 -60 -60 -14 -91 -80 -110 -17 175 31 -27 132 106
7609A06j5n3j37M5P3N9o9j49K33M6l59J31K45n4O1j40j13K80oj45R4p7r2J21J97J15j92j88
$$ 106 91 38 -99 -54 19 78 9 -140 93 139 -220 -89 156 102 163 23 -90 190 184 39 133 56 -36 85 282 397 205 17
7602A7K0o3L9J19j01p4Q0J35m3k16J28Q9l26M5K12l4K05M4j82Q6j37j10K59j20k09J56J35
$$ 17 37 -26 13 132 31 -43 37 172 129 -87 41 130 -196 -151 61 27 232 276 94 180 43 -67 192 72 -137 19 154
7596A54J21o2j38J51j19j96K35k0j40J57m7j0K04p9j39L2K4j7l7P9j3k19P3J84o1K5j7j77
$$ 154 275 213 75 226 107 -89 146 126 -14 143 96 86 290 211 72 104 128 111 74 153 140 -79 -6 178 117 142 125 -52
7590e2lO8M9O7k1Nrr4K3L9l0J1K8K2j12j16K09J83j07p8K0P6K3j08k1n9q2K06O5k32J0J54
$$ -52 -55 13 62 129 108 113 104 10 33 72 42 53 81 103 -9 -125 84 267 160 82 102 178 201 93 72 13 -69 137 202 -30 -20 134
7582A34Oo8O6K61R0K26P53J93o35m01k36k53M0Kj23k3Q6K02m8k50O2O1j49MJ45J16j25k21
$$ 134 140 72 138 399 489 715 1468 1661 1026 625 389 136 176 178 55 32 118 320 272 22 84 145 -4 0 145 261 136 -85
7576h5J67J83j44p8pN9J24q0NR2j48k1M4j50%P0M4J21k9K6P5k24k8K06q2q2j3j14L3N4LP0
$$ -85 82 265 121 43 36 95 219 139 144 236 88 67 111 -39 -39 31 75 196 167 193 268 44 16 222 140 58 45 -69 -36 18 21 91
7569I1o6p9N3JJk8j00O0J82R1q6j06K8j01p2K54Mj99J54L0j56R6L2m0mj49J53L09k22k15J20
$$ 91 25 -54 -1 0 1 -27 -127 -67 115 206 120 14 42 -59 -131 123 127 -72 82 112 -44 52 84 44 40 -109 44 353 131 -84 36
7562C6m5mJ92m3j15J06J3j36L1N9j12rQ4n9J2J29kJ5N1j59j00J53j3j82O0O3j22R7J48j26
$$ 36 -9 -13 179 136 21 127 140 4 35 94 -18 -27 57 -2 10 139 137 152 203 44 -56 97 84 -98 -38 25 -97 0 148 22
7555B2m3K2m8R4m6j24K37K2k80J64K01j61n6m1n4K43J23k75j31K07N6j33P9o1l50J73L50k91
$$ 22 -21 1 -47 47 1 -123 114 136 -144 20 221 60 4 -37 -91 152 275 0 -131 76 132 -1 78 17 -333 -160 190 -101
7549a01j39K81oJ0R7j79M8J77k14p1J97l3p9pk8J74J65j58j47J3qklm8LN2N6n4j12J71J18
$$ -101 -240 41 35 45 142 -37 11 188 -26 -97 100 67 -12 -19 -47 127 292 134 -13 0 -8 -10 -13 -61 -58 -6 50 -4 -116 55 173
7542A73l50qM84l9k75J50J8j95P7J25k6j3n1p8Q6J10k06k06K56J99k50j13J97P2q8l2J3m8
$$ 173 -177 -185 299 260 -15 135 153 -42 35 160 134 121 70 -8 78 188 -18 -224 32 231 -19 -132 65 137 49 17 30 -18
7535a8j9P7k2q7J0M9J05K3j17M5k0j47K09J53j80L6N2j09j0p6O5J92j50k2J62j57OJ30j60
$$ -18 -37 40 18 -69 -59 -10 95 118 1 46 26 -121 88 241 61 97 149 40 30 -46 19 211 61 39 201 44 50 180 20
7529B0L9J21q2N4l8j53J04L0j08N7O6k6m4pL5m5m6m1r1Q3R9o8N2M8n9O2m6j04J86J19j68j02
$$ 20 59 180 98 152 114 -39 65 95 -13 44 110 84 40 33 68 23 -23 -64 -155 -72 27 -41 11 59 0 62 16 -88 98 217 49 -53
7521e3L3J1lJ4n9j7J69J3j50N0P3N8M7k06L2K39k51j23K48p9r1k9j78K02K58j30j30j14J14
$$ -53 -20 -9 -12 2 -57 -74 95 108 -42 8 81 139 186 -20 12 251 0 -123 125 46 -45 -74 -252 -50 208 78 -52 -166 -52
7515e2L09j81k11K03K2j26m5%O3n6J13J87k97l4K91k66q0K48k14j2K02j10J25L3k56K08J40
$$ -52 257 76 -135 68 90 -36 -81 -81 -18 -74 39 226 -71 -105 186 -80 -160 88 -126 -138 64 -46 79 112 -144 64 204
7509B04k09J25L3k35M9K5j39L2Q9O8m1k30PK42m6q9K12N1j34R5L0j54OJ6l6Qj09pJ42k6N0
$$ 204 -5 120 153 -82 -33 -8 -147 -115 -26 42 1 -229 -222 20 -26 -115 97 148 14 109 139 -15 -9 7 -29 -21 -130 -137 5 -21 29
7502B9M0k42M1K36j17l0J72q5j12J35Q5j36nK11n4j64P2j02j81O5K7R2J18j34L9J04j47R2
$$ 29 69 -173 -132 104 -13 -43 129 44 -68 67 152 16 11 222 168 4 76 -26 -207 -142 -115 -23 95 -39 0 104 -43 49
7495D9Q5k41J9J55j6N4n1r9J19J2j45M4J46k5q9R0Kk03O5K05n5j10q8k2J56M8o5k4k9N7l9
$$ 49 134 -107 -88 67 51 105 54 -45 74 86 -59 -15 131 106 17 107 109 -94 -29 176 121 11 -77 -99 57 105 40 16 -13 44 5
7488Ej22J09m2j34K17L9q3K46Nj98K4j01o7J80J7m7R5m3j83M1K36o4k08Q5km6K65J1k84j05
$$ 5 -117 -8 -50 -184 33 72 -11 235 240 42 66 -35 -102 78 95 48 143 100 -83 -42 194 130 -78 7 5 -41 224 235 -49 -154
7481a54rJ95J55j92Q0J54k21N1J50j74q0m0M5J87j60j01K62k5j86n3k3J45O3j07M0k3o7Q8
$$ -154 -163 32 187 -5 75 229 8 59 209 35 -45 -85 -40 147 -13 -114 148 123 -63 -116 -139 6 69 -38 2 -21 -88 0
7475@J5N3K7k22mJ85p1j02J8J04J74r4k62M2K09N8l6k1n1n7L8k0j15O1J14l5l3K4P6J8j52
$$ 0 15 68 95 -127 -131 54 -17 -119 -101 3 177 83 -179 -137 72 130 94 73 22 -35 3 -17 -132 -71 43 8 -25 -1 75 93 -59
7468e9j2K01O8r7q7O5O0k20r8K22O6j16j68o8K83J17j80N3o6j63K72J40j85r3q2J48J91k47
$$ -59 -71 130 198 101 14 79 139 -81 -179 43 109 -7 -175 -243 40 157 -23 30 -36 -199 73 213 28 -65 -147 1 192 -55
7462e5k3K31j88j20J50K7P1kj52L9P5J2N1n5NJ10n7o2M7k8q2m5L2l1j77J1J95O7Q6R2r0o6
$$ -55 -78 153 -35 -155 -5 22 93 91 -61 -22 53 65 116 61 66 176 119 57 104 76 -6 -51 -19 -50 -227 -216 -21 46 132 224 134 68
7454F8k1n5M9qj32MQ0K5m0j66mK68O7j42KL2j5O8O8o8k14r3K33J24j34ko5j61J99J83j12N3
$$ 68 47 -8 41 33 -99 -95 -15 10 -30 -196 -200 68 135 -7 -5 27 12 80 148 80 -134 -227 6 130 -4 -6 -71 -232 -33 150 38 91
7447I1k4l30j7L15J03j01m8N6O2M5K9j23o8K09j4l36M4K84j72k57K50K47j68o7J16o7m6k7
$$ 91 67 -263 -280 35 138 37 -11 45 107 152 181 58 -10 199 185 -151 -107 177 5 -252 -2 245 77 10 126 59 13 -14
7441a4j86N3J93m2K7J1k12K0J76l3m9NR4J20j95q7L18o9l90O5K17K0Nr8o3J39K6n0M4o1l9
$$ -14 -200 -147 46 4 31 42 -170 -150 26 -7 -56 -51 43 163 -32 -119 199 130 -260 -195 22 42 47 -51 -114 25 51 1 45 -16 -55
7434e5Q6Lml3n6J56nj75J92j3l06K94J94l91P1K35k13k8J02m8m0j72P0L57r7k03R3n7k8Q7
$$ -55 31 34 30 -3 -59 97 92 -83 109 96 -210 84 278 -113 -42 193 -20 -48 54 6 -34 -206 -136 221 124 -79 14 -43 -71 16
7427A6j00N2K33oj52o5nj13p6K19Q1j35J13J2j26J53l0j37J88o7k33J06N5J3P6j17N1J30k04
$$ 16 -84 -32 201 195 43 -22 -27 -140 -216 3 84 -51 62 74 -52 101 71 -66 122 55 -178 -72 -17 -4 72 -45 6 136 -68
7420f8lJ62j89r2J27l9L2J25l3j1K3p5o2j2P2J12o9n7J50J3j10N2J5n1M5jL2L9k27j50J29
$$ -68 -71 91 -98 -190 -63 -102 -70 55 22 11 34 -41 -103 -115 -43 69 0 -57 93 106 -4 48 63 12 57 56 88 127 -100 -250 -121
7413a21P0J36J30k20j06J62p4r7J12nj9J06n6j62L1J23K4Rlp0L7J08j8Kj3j66K3J59j53j55
$$ -121 -51 85 215 -5 -111 51 -23 -120 -8 -13 -32 74 18 -144 -113 10 34 43 40 -30 7 115 97 99 86 -80 -57 102 -51 -206
7406b06J84J08j27j6J29N6l1j24j18J53R1l05m7L48M6j19K5k6L0k1j75J33J84k03o8J69OL5
$$ -206 -22 86 -41 -57 72 128 97 -27 -145 8 99 -206 -253 95 141 22 47 21 51 30 -145 -12 172 -31 -99 70 76 111
7400A11P8j59j30J48J40o4j33j39n5J47P4j20M4J39n8j00J1J30R0j43o5J02o7q4L4L7J31l3
$$ 111 189 30 -100 48 188 124 -9 -148 -203 -56 18 -102 -58 81 23 -77 -66 64 154 11 -54 48 -19 -103 -69 -32 99 66
7394F6k50O1J72j25p6J60J40j17k35J03K33r1q6R9Qj21j15R7J30j47l5Q2j78Q9L19j46j45
$$ 66 -184 -123 49 -76 -152 8 148 31 -204 -101 132 41 -45 54 62 -59 -174 -77 53 -94 -129 -47 -225 -136 183 37 -108
7388a08J26p2k6J12l3P5J21o6k4o1j12Q3N8nN8j67j55J91M3j64J8R9J02K4j93m2J52k1p9r5
$$ -108 18 -54 -80 32 -1 74 195 129 105 44 -68 15 73 68 126 -41 -196 -5 38 -126 -108 -9 93 117 -76 -118 34 13 -66 -161
7381a61p8K14R6k08O1J38o3N6o5k07R7O0j02J23P2j00j5j9L8O1j61mK81k2k19R3J65o3o8P2
$$ -161 -239 -25 71 -137 -76 62 -1 55 -10 -217 -120 -60 -162 -39 33 -67 -82 -101 -63 -2 -163 -167 114 92 -127 -34 131 68 0 72
7374G2K3j92j63K15J98k54j04K16j73j23M34P9k78P6k3j46J51l0j65J29P9j8L5l0L4Ol1J95
$$ 72 95 -97 -260 -45 153 -101 -205 11 -162 -285 149 228 -50 26 3 -143 8 -22 -187 -58 21 3 38 8 42 48 17 212
7368B12j5k60J63J39k71K8J83j94q8K24R0j10j89j33J31J67p4o6O6J3l8l7k2j7j09MK18L4
$$ 212 197 -63 100 239 -32 -4 179 -15 -103 121 211 101 -88 -221 -90 77 3 -63 3 16 -22 -59 -81 -98 -207 -203 15 49
7361D9n3J17p2j67R0K9j04mO4J49kk74jK18r7j28J86J76j20k17K7J63J9k1J0j2L7j4j41o3
$$ 49 -4 113 41 -126 -36 -7 -111 -115 -51 98 96 -178 -179 39 -58 -186 0 176 56 -161 -134 29 48 27 37 25 62 48 -93 -156
7354a56J01N6m8J27J70k59k89J44J55Pm6q0J47Q6j33J76O6k98Q6J20j71J12k8k58J79J29j48
$$ -156 -55 1 -47 80 250 -9 -298 -154 1 8 -38 -118 29 115 -18 158 224 -74 12 132 -39 73 45 -213 -34 95 -53
7348e3K5OM9J40j38o7J09q9J2J51n7q0PL6O7j9k3Rp3l7l2k4R4n3j58O7P4J1P9o0j03QJJ33
$$ -53 -28 -22 27 167 29 -38 71 -18 -6 145 88 8 15 51 118 99 76 85 12 -25 -57 -81 13 -40 -198 -131 -57 -46 33 -27 -130 -122 -121 12
7341A2J25j62j1K04o6j42rp9L7J57k1pL3j30L4J37j67p4J69k0rJ16r5r2O6j8n7j1J1M6K9J2
$$ 12 137 -25 -36 168 102 -40 -49 -128 -91 66 45 38 71 -59 -25 112 -55 -129 40 20 11 127 32 -60 6 -12 -69 -80 -69 -23 6 18
7333A8p7o4K25J20k00L5J28q8mq2j72P8K8k4J18n1J2J23k04k0K58j80k28J53J56O8o4o0J61
$$ 18 -59 -123 102 222 22 57 185 97 93 11 -161 -83 -55 -79 39 -12 0 123 -81 -101 157 -23 -251 -98 58 126 62 2 163
7327A63j4j22J21k9j59k2j04O0K42q7j30M5m9Q3J28r6L7K2k31P6K10j89p6J72p3n5J32o6o2
$$ 163 149 27 148 119 -40 -62 -166 -106 136 49 -81 -36 -85 -2 126 30 67 89 -142 -66 144 -45 -121 51 -22 -77 55 -11 -73
7320g3J68L1j15kqj03j11l4J55K37M8r6n4o7q3J02J33j47q8J90q6k67J66J72j25J29J69k08
$$ -73 95 126 11 9 1 -102 -213 -247 -92 145 193 97 43 -24 -107 -5 128 -19 -107 83 -3 -270 -104 68 -57 72 241 33
7314C3l8J83j06q8J78Nj59j4L7N2K0j77o3K17Qj91N0O8j21kJ30M7k8r0q3J22J64j33j80J00
$$ 33 -5 178 72 -16 162 167 8 -6 31 83 103 -74 -137 80 88 -103 -53 15 -106 -108 22 69 41 -49 -132 -10 154 21 -159 -59
7307e9R8nL8j45j33K52J36j82k9P3O1P0j75j83J39J25o8q1L9J09n3n2Q9j38j45J78L2p6J37
$$ -59 39 34 72 -73 -206 46 182 0 -29 44 105 175 0 -183 -44 81 13 -68 -29 80 27 -25 64 -74 -219 -41 -9 -85 52
7300E2L3r4l7l5P0M9q4N5Q3q1m6J7P3R8n4o6K3p7m6J46M8j46J0R8j50qK58j35j88K62k7k41
$$ 52 85 -9 -46 -81 -11 38 -46 9 92 11 -35 -18 55 153 99 33 56 -21 -67 79 127 -19 -9 89 -61 -69 189 54 -134 128 101 -140
7293a40J84L7k57K2R3q4n4J25K06m6j11J30j7j64l5l1J10J00j82K8J81o7K5J6j83mP4L2R0
$$ -140 44 81 -176 -154 -61 -145 -199 -74 132 86 -25 105 88 -76 -111 -142 -32 68 -114 -86 95 28 53 69 -114 -118 -44 -12 78
7287G8k8j4K5p6R2L9j92Q3J65n9J2o7j94j7O7Qj35o5L13J41k03L2J7r0J63Jj34J53Lk10lP4
$$ 78 50 36 61 -15 77 116 -76 7 172 113 125 58 -136 -153 -86 -78 -213 -278 35 176 -27 5 22 -68 95 96 -38 115 118 -92 -95 -21
7279b1Jq1q6P6N0mJ18k1j82jJ07M1K5M5k3j02QP5m0j6Po1M1L7n8K3j7l8R8on8P7l1j11L3N7
$$ -21 -20 -101 -187 -111 -61 -65 53 32 -150 -151 -44 -3 22 67 44 -58 -50 25 -15 -31 -24 -85 -44 -7 -65 -42 -59 -97 1 -5 -63 14 -17 -128 -95 -38
7271c8k2n7K8J32K4j18r3K0R7NJ8J21j13j30J67m2j50K12Q0j70l4k1R7K34l5j21l5j18K6R9
$$ -38 -60 -117 -89 43 67 -51 -144 -124 -27 -22 -4 117 4 -126 41 -1 -151 61 141 -29 -63 -84 13 247 212 91 56 -62 -36 63
7264F3p0J6K4j20N3J09o0j4Oo0k7J4J36O7k45m5K52n3q5J14j63m0L26j12k89K16J52j36MJ3
$$ 63 -7 9 33 -87 -34 75 15 1 7 -53 -80 -66 70 137 -108 -153 99 46 -39 75 -88 -128 198 86 -203 13 165 29 33 46
7257D6l3K6q4l7J74O6j34m3J22K6j50n2M7JJ06J01j11j08l2j4O4L5J1M2n8l6N4l8l0J7mP5
$$ 46 13 39 -45 -82 92 158 24 -19 103 129 -21 -73 -26 -25 81 182 71 -37 -69 -83 -19 16 27 69 11 -25 29 -9 -39 -22 -26 49
7250D9l7j32J33R4j36M6R1m9O5%j47L6Q3r9q1OJ6P6N9o9oN8k02j56K82Q7k56R6K14q9m2M0
$$ 49 12 -120 13 107 -29 17 108 59 124 124 -23 13 96 -3 -84 -78 -62 14 73 4 -2 56 -146 -302 -20 67 -189 -93 121 32 -10 30
7243C0M4Q6q2l1J26j58j42J39l0o0R5n8n1K8o8L7L4r7N7P8l1R3Q2r8j04L2J11o2j80M0J02
$$ 30 74 160 78 47 173 15 -127 12 -18 -78 17 -41 -92 -64 -132 -95 -61 -158 -101 -23 -54 39 121 23 -81 -49 62 0 -180 -140 -38
7236c8k9L5R2K3n6l8J01L1o6J16J9j73P8P8k00p1R8M4Kp5o0O0K9o1p6lP5L0m2J0J09J3j79
$$ -38 -67 -32 60 83 27 -11 90 121 55 171 190 17 95 173 -27 -98 0 44 46 -29 -89 -29 0 -61 -137 -140 -65 -35 -77 -67 42 55 -124
7228a24L8K28j48j79J54p2r0K47q2l19J46K73o0j77KJ18o4j16J10J35P9P3q3j60o8K2P3L8
$$ -124 -86 142 -6 -185 -31 -103 -193 54 -28 -347 -201 72 12 -165 -163 -45 -109 -225 -115 20 99 172 89 -71 -139 -117 -44 -6
7222fQn0j08J01J17j89r6J44O9K5LKP9o6j40N8J04Oo3j6J03oj00J3rj6L4j7M9rj38J46K06
$$ -6 2 -48 -156 -55 62 -127 -223 -79 -10 15 18 20 99 33 -107 -49 55 61 -2 -18 85 79 -21 -8 -17 -33 1 -16 33 24 -114 32 238
7215B38j79k25J8J59Q9r3l3O2N3J16p8k33P0J54l7q6r0N8J07q7l1J43J23j37l74Q5L87j53
$$ 238 59 -166 -148 11 100 7 -26 36 89 205 127 -106 -36 118 81 -5 -95 -37 70 -17 -48 95 218 81 -293 -208 179 26
7208B6q3K61j78j93J04L4K14N4l13Q0J55j69K2K8j36jN0R0M0n6P5n9j18J66L4l9J09j57j23
$$ 26 -57 204 26 -167 -63 -29 185 239 -74 6 161 -8 14 42 -94 -95 -45 45 85 29 104 45 -73 93 127 88 197 40 -83
7202h3N7j54O2K49m7L3P5j43l9j2m4N6l2M2J52m8k3N1r2n5pj8Kr6k6J04J1N2P1j28r3R0J00
$$ -83 -26 -180 -118 131 84 117 192 49 10 -2 -46 10 -22 20 172 124 101 152 60 5 -2 -20 -18 -114 -140 -36 -25 27 98 -30 -123 -33 67
7194F7k7j48j1K19J65r3k07K9J22j87q4K73kk36P6J51j19q8J98P5k37mJ86q2q6K2m9M4N1q
$$ 67 40 -108 -119 100 265 172 -35 -6 116 -71 -155 118 116 -120 -44 107 -12 -100 98 173 -64 -68 118 36 -50 -28 -77 -33 18 10
7187A0J2j53q8J23%P7J03k53j05K10M7j9j9k3J44J9j56L3J50O5p7q1P1p5j62J32J15q7m6%
$$ 10 22 -131 -219 -96 -96 -19 84 -169 -274 -64 -17 -36 -55 -78 66 85 -71 -38 112 177 100 19 90 15 -147 -15 100 13 -33 -33
7180c3J06O9j40j8K9r8N9K8q5J45J00o1M4j18k26J03K06m1j53k4P1J9K3l3q8J31M8j77J59
$$ -33 73 142 2 -16 13 -85 -26 2 -83 62 162 101 145 27 -199 -96 110 69 -84 -108 -37 -18 5 -28 -116 15 63 -114 45
7174D5J23l24NK31j47K1K31j59j57J89P3j27O4J35j90j70J92L7j85P8P5r2Q6R1p0j2j4o1K9
$$ 45 168 -156 -151 80 -67 -46 185 26 -131 58 131 4 68 203 13 -157 35 72 -113 -35 40 -52 34 125 55 43 29 -32 -3
7167cJ13N7j17m3J53p8j65J23j3j40J08J1m5J63M0l8jj27K9N0j79J09J56j97Q7J81j99MQ6
$$ -3 110 167 50 7 160 82 -83 40 27 -113 -5 6 -39 124 164 126 125 -2 27 77 -102 7 163 -34 53 234 35 39 125
7161A25k28oJ96j0o0o6m9P6Q1P7m9k62k0K72j0k41lJ25L1J10Q3j17N4J36j78q6L0k00L6J78
$$ 125 -103 -109 87 77 17 -49 -98 -22 59 136 87 -175 -195 77 67 -174 -177 -52 -21 89 172 55 109 245 67 -19 11 -189 -153 25
7154B5j08J40J97k68p3J48q4L9N6j61K8J12m8l7j4K5O4NMqRR0Kp6p9m4J36K0j99R5J62j71
$$ 25 -83 57 254 -14 -87 61 -23 16 72 -89 -61 51 3 -34 -48 -23 41 46 50 42 51 141 143 67 -12 -56 80 100 -99 -4 158 -13
7147a3j05N1K8N5k9j2R3o8j26l7j5J78J88r4r3Km9K3O9J5N2M7n6r3o5m7K4M5j33q9K77J85
$$ -13 -118 -67 -39 16 -13 -25 68 0 -126 -163 -178 0 188 94 1 3 -46 -23 46 61 113 160 104 11 -54 -101 -77 -32 -165 -254 23 208
7139B08k08q9J11l6r8NJ06J18k6r0J2J07O0j63j15J85ok41R8J99r3j24n9L4J88N6j07l4lM4
$$ 208 0 -89 22 -14 -112 -107 -1 117 91 1 13 120 180 17 -98 87 81 -160 -62 137 44 -80 -139 -105 83 139 32 -2 -5 39
7133C9O6o7m2lp2J07P3l07n9L66J0k57M6J36k0k1N9N3n2m6m3j73J4K40Nm0O7j98j41J48j2
$$ 39 105 38 -4 -7 -79 28 101 -206 -265 101 111 -146 -100 36 16 -5 54 107 55 9 -34 -207 -193 47 52 12 79 -119 -260 -112 -124
7126a24LJ63j18j22J82J0o5J94nk47M1Q8j25Q2J67j21j11K1L2P6q4o4K46K4k15M4j7j29O5
$$ -124 -121 42 -76 -198 -16 -6 -71 123 118 -129 -88 0 -125 -43 124 3 -108 -87 -55 21 -63 -127 119 143 -72 -28 -45 -174 -109
7119a09L7J04J41j84p9J94l0j38l4N4O2k09q0L53L6k04J64P7j70kQ0Lr8n3J37k8k41l6J08
$$ -109 -72 32 173 -11 -90 104 74 -64 -98 -44 18 -191 -271 82 118 -86 78 155 -15 -17 63 66 -32 -85 52 24 -217 -253 -145
7112a45P0NjJ91R7k26j13K3L1K12M3k56p3Q1J3k3k9R5N7j40K2J31j0Q9M0k20r0J34J30M0p8
$$ -145 -75 -70 -71 120 217 -9 -122 -99 -68 144 187 -69 -142 -61 -48 -71 -100 -5 52 -88 -66 65 55 144 184 -36 -126 8 138 178 100
7105A00k2J9j10m6q5j95K01L00j31m7N7j62L8Q3j51J41K66n7j21p6L9O8j96KK34j30j6J64
$$ 100 78 97 -13 -59 -144 -339 -138 162 31 -16 41 -121 -83 0 -151 -10 256 199 78 2 41 109 -87 -85 149 19 3 167
7099A67k77r6K13r6J09K23k73o2K28j30n1J67m1m8K3j13p3Q6N9j4O9N0r1L2R4j01n2L8k8j2
$$ 167 -110 -206 7 -89 20 243 -30 -92 136 6 -45 122 81 33 56 -57 -130 -44 15 1 70 120 29 61 155 54 2 40 12 0
7092@p7QJ42j62j28K24j5q4J78L7l1j36l31J34L90l5j27l5rQ9q0j15J32L5q8L6R2N4m9J0J30
$$ 0 -77 -69 73 -89 -217 7 -8 -92 86 123 92 -44 -375 -241 149 114 -13 -48 -57 32 -48 -163 -31 4 -84 -48 44 98 49 59 189
7085A89o5j16L0mM9j9j49J08O1j87Q8J01j48J0L7PJ40p0k04j7M7J02P3j7J07l4k81jJ67m8
$$ 189 124 8 38 34 83 64 -85 23 84 -103 -15 86 -62 -52 -15 -8 132 62 -142 -159 -112 -10 63 46 153 119 -162 -163 4 -44
7078d4m3J7m3Q9J06j70r5K36M0j59J77J26k98j52J21O1L9N1L1q3k23P6L18o3k23K0N2P9O3
$$ -44 -87 -70 -113 -24 82 -88 -183 53 93 -66 111 237 -61 -213 -92 -31 8 59 90 7 -216 -140 178 115 -108 -88 -36 43 106
7072A06j85r4K20J08j11o2j9jO6n1j74K9J51k6k8R0l3p4J09L9j24J10J75k04r7K19q3j54J49
$$ 106 -79 -173 47 155 44 -18 -37 -38 28 -23 -197 -168 -17 -43 -71 19 -14 -88 21 60 -64 46 221 17 -80 139 56 -98 51
7065E1Lq2J5o1J49P0l34Q8L13j65M9J56l07l6J64j83k2R5o9R1R5J4K1k26q4K50m6j04K10m2
$$ 51 54 -28 -13 -74 75 145 -189 -101 212 47 96 252 -55 -91 73 -110 -132 -37 -106 -15 80 94 115 -111 -195 55 9 -95 115 73
7058G3k40R4J93No2j12j91l6K12J25k2P1j9j68oK7j08L6K08R0r1p0M2mm1J4o8m5R0p4q5K11
$$ 73 -167 -73 120 125 63 -49 -240 -276 -64 61 39 110 91 -77 -83 -56 -164 -128 80 170 79 9 51 47 6 20 -48 -93 -3 -77 -162 49
7051D9N2k19Q9K55r9k00O5Q6r5n4M8k0J6J08j5q2J1j0k3O0P0M2m7j57n2K8n4R0J79p7m5J98
$$ 49 101 -118 -29 226 127 -73 -8 78 -17 -71 -23 -43 -27 81 66 -16 -5 -15 -38 22 92 134 87 -70 -122 -94 -148 -58 121 44 -1 197
7044A97pj76J9o4j92J27K02p3L6J29j70p4K18p8k34J44J11j93n5O0l0Q1R0q5rR5m4l6J06j0
$$ 197 190 14 33 -31 -223 -96 106 33 69 198 28 -46 172 94 -140 4 115 -78 -133 -73 -103 -22 68 -17 -26 69 25 -11 95 85
7037H5j30N4J45n9j50k7O4L2l9PM5r1l7J57oj42N1P6l1mJ9J3o7p0J33P4r6L6j4j30O5lj37
$$ 85 -45 9 154 95 -55 -82 -18 14 -25 -18 27 -64 -101 56 50 -92 -41 35 4 0 19 32 -35 -105 28 102 6 42 28 -102 -37 -40 -177
7029a77J12J10j02jJ52O4j40q4J46L0o1rk47n5L52Kq4J88j23p5J55j63O5L02k42k21P8o6O4
$$ -177 -65 45 -57 -58 94 158 18 -66 80 110 49 40 -207 -262 90 92 8 196 73 -2 153 -10 55 357 115 -106 -28 -94 -30
7023c0O9j69m0M2J17J79j58j45J18n6p3N6N6J90L5j88LL9j8K2l8K6o5j71J48J01q5J35n7j42
$$ -30 39 -130 -170 -128 -11 168 10 -135 -17 -73 -146 -90 -34 156 191 3 6 45 27 49 11 37 -28 -199 -51 50 -35 100 43 -99
7016i9K35J9j80Rq1K7Q5j22J13Q2j44J82K2k67J02L1p2J72k04k79K58J77n0k5j10%J05J6O
$$ -99 136 155 -25 -16 -97 -70 15 -107 6 88 -56 126 148 -119 -17 14 -58 114 -90 -369 -111 66 16 -9 -119 -119 -14 2 8
7010Ho7r8l8L1K01N1j95K6P8J4J65r6k57J21J27q7k4Onk4l1N8Q0J35R4k05j96P4Q5p6j66R9
$$ 8 -59 -157 -195 -164 37 88 -107 -81 -3 11 176 80 -177 -56 71 -16 -40 -34 -39 -63 -94 -36 44 179 273 68 -128 -54 31 -45 -211 -112
7002a12K90j08j49J80m8j39O4l8O7J73o7r1r6j0K56nj86O9m1o2O5j45J3K20n4q2m9j6K81L7
$$ -112 178 70 -79 101 53 -86 -22 -60 7 180 113 22 -74 -84 172 167 -19 50 9 -53 12 -133 -120 100 46 -36 -85 -101 180 217
6995B17l03M5J50l3k3j35n8J81Q5Lk8j17k3J0J3J21j6j06J9m8qJ87J3j72l9j2l5J09N3j09
$$ 217 -86 -41 109 76 53 -82 -140 41 126 129 101 -16 -39 -29 -16 105 89 -17 2 -46 -54 133 146 -26 -65 -77 -112 -3 50 -59
6989e9K7P4q9K2M3j72%J08r1R8J89p1K2P7j04n7j28j58J28J22pM3l8m5J0j2Q6j6j38J02J02
$$ -59 -32 42 -47 -25 18 -154 -154 -46 -137 -39 150 79 101 178 74 17 -111 -269 -141 -19 -26 17 -21 -66 -56 -68 18 2 -136 -34 68
6982F8k0O4q5m8J12k27j36L18lk00J19N3K6J12j51j12J28Kn2n5j32R0J87n6k9Q6m3m3K7n3
$$ 68 48 112 27 -21 91 -136 -272 46 43 -157 -38 15 41 153 2 -110 18 20 -32 -87 -219 -129 58 2 -27 59 16 -27 0 -53
6975e3j6J10K1j15q0J8M5l0k6J24P8o4N1N4j45p8N7N3L8j37j12K21J04j42J2p4j63K30K42
$$ -53 -69 41 62 -53 -133 -115 -70 -100 -126 -2 76 12 63 117 -28 -106 -49 4 42 -95 -207 14 118 -24 -12 -86 -249 -19 223
6968B23j55j26P2N0J2J7om4j9L2J8Qq2j51Q4J35r6lL6j21J09J61j71j16N3N6J45O7m2o8k16
$$ 223 68 -58 14 64 76 93 87 43 24 56 74 82 0 -151 -67 68 -28 -31 5 -116 -7 154 -17 -133 -80 -24 121 188 146 78 -138
6961a38J0L07m9k45mM1Q7Q1j31m3J30pj68j41Q0J38l3O2J20o7n6j09l2L49K4l55J34J38k18
$$ -138 -128 179 130 -115 -119 -78 9 90 -41 -84 46 39 -129 -270 -190 -52 -85 -23 97 30 -26 -135 -167 182 206 -149 -15 123 -95
6955i5P0N1j33J22nj13J50n1j49J27L1RO7j54K4J60k27q3K72l8j73R1Q2Jj1r7MJ72L5j16l2
$$ -95 -25 26 -107 15 10 -103 47 -4 -153 -26 5 14 81 -73 -49 111 -116 -199 73 35 -138 -47 35 36 25 -72 -68 104 139 23 -9
6948iMnL8l7n3J04M0j07k5j0m8K6l%P9l3q4M4N5Om0p3K1P3M0J8n4K9J52p9j71J08J21n2J4
$$ -9 -5 -10 28 -9 -62 42 82 -25 -50 -60 -108 -82 -85 -85 -6 -39 -123 -79 -24 -18 -58 -131 -110 -37 3 21 -33 -4 148 69 -102 6 127 75 89
6940H9L4j07j45l0P2L3kN6L9k8nQo8p9J03J55o9q8K4r4k9J27k3J9P1k04m8K25o6n7J71j04
$$ 89 123 16 -129 -159 -87 -54 -56 0 39 11 6 14 -54 -133 -30 125 56 -32 -8 -102 -131 -4 -27 -8 63 -141 -189 36 -30 -87 84 -20
6932b0j24J61M4k8O8o2j14K6J40J18q0r7O5j6j11l7K5J12L8j15j0j8j44N3J75N2k1j26q9J17
$$ -20 -144 17 61 33 101 39 -75 -49 91 209 129 32 97 81 -30 -67 -42 70 108 -7 -17 -35 -179 -126 49 101 80 -46 -135 -18
6925a8O6j30j76N0K91J8k00R0kj76K37K10k21r9M7m7L8O6l2p5k1N9p7p6J99K5k28O6K13L0
$$ -18 48 -82 -258 -208 83 101 -99 -9 -11 -187 50 260 39 -60 -13 -60 -22 44 12 -63 -84 -25 -102 -178 21 46 -182 -116 97 127
6919A27j04k08n5J69P8%l9l6J44K2j58R7J17j38j04j9P7R8j27p7J12k7l8N5PO6l3j34J55J31
$$ 127 23 -185 -240 -71 7 7 -32 -68 76 98 -60 37 154 16 -88 -107 -30 68 -59 -136 -24 -51 -89 -34 -27 39 6 -128 27 158
6912A58j64nN3j25J9J19O8R0j15j56J72Q5j84k9M2n8k7o2k4J47P1l2N4J7q7l1R7R9j06j35
$$ 158 -6 -11 42 -83 -64 55 123 213 98 -58 114 199 15 -14 28 -30 -57 -119 -143 4 75 43 97 114 27 -4 93 192 86 -49
6905d9R0rj99O2K06j6k2P7q6k14p1J16J30K8k1j3l8n3K7R2L5l8p0o2J3J2l2L8L5m0k6m4M5
$$ -49 41 32 -167 -105 101 85 63 140 54 -160 -231 -115 15 43 22 9 -29 -82 -55 37 72 34 -36 -98 -85 -73 -105 -67 -32 -72 -98 -142 -97
6898i7J57n3q8J78O0q8Q5k7j65N7M3j79j6J93J7p2J14rj90Q1J23j24M1J15j32j11j6M0J44
$$ -97 60 7 -81 97 157 69 154 127 -38 19 62 -117 -133 60 77 5 119 110 -80 1 124 0 41 156 24 -87 -103 -63 81
6891H1k1j22O7O7m4n5j0J06nj79jR2k5K8M8n3o1L1R0k4p6O6L3m6P6N1r2r3n8K6J26N7j41j19
$$ 81 60 -62 5 72 28 -27 -37 69 64 -115 -116 -24 -49 -21 27 -26 -87 -56 34 10 -66 0 33 -13 63 114 22 -71 -129 -103 23 80 -61 -180
6883a80J70J34j38LR3j27k5J32Qn0%Q2p0k95M8K01j28J07J91k24J0J68j24N9Pk59J24K27o1
$$ -180 -10 124 -14 -11 82 -45 -70 62 70 20 20 102 32 -263 -215 -14 -142 -35 156 -68 -58 110 -14 45 52 -207 -83 144 83
6877H3l4j39j44J75R2q1J03J17j48j85R1J25j19j08k9m3R1Q2M0Q7r4JJ99j71j91J47n5n9J86
$$ 83 49 -90 -234 -59 33 -48 55 172 24 -161 -70 55 -64 -172 -201 -244 -153 -71 -31 56 -38 -37 162 -9 -200 -53 -108 -167 19
6870A9L9M5Q5j29o8K8qK6p1k5J03j05n6J88k9j50M6P5L3l9r3L4R3O2M5r2q8J29R2j00p4QM7
$$ 19 58 103 188 59 -9 19 11 37 -34 -59 44 -61 -117 71 42 -108 -62 13 46 7 -86 -52 41 103 148 56 -32 97 189 89 15 23 70
6863G0P9p6j96N4K20l3j82J8J23m1r4K5p9j00K58J96j82n2jj62J18J98j11j01L3K8j01j84
$$ 70 149 73 -123 -69 151 118 -64 -46 77 36 -58 -33 -112 -212 46 242 60 8 7 -155 -37 161 50 -51 -18 10 -91 -275
6856b75J26J71j38J05J82k06o1M4r7J37L3j48J54K4j31J90O6j43Jm7mO7j19m0Q3J3J08n3k91
$$ -275 -149 22 -116 -11 171 -35 -96 -52 -149 -12 21 -127 27 51 -80 110 176 33 34 -13 -17 50 -69 -109 -26 -13 95 42 -249
6850b49P1K31j36p0K10oj57N0P4nj3j38o6J77R0L0P9j13j10P0K5Rrm6L4r1j02J76P1k2J26
$$ -249 -178 53 -83 -153 57 51 -106 -56 18 13 0 -138 -204 -27 63 93 172 59 -51 19 44 53 44 -2 32 -59 -161 15 86 64 190
6843A90j16k20N1R1N9o4k27J07K90o7j64M7J38L8j40o2J07K3q9m2J03R7o9RL3j44O0J28k08
$$ 190 74 -146 -95 -4 55 -9 -236 -129 161 94 -70 -23 115 153 13 -49 58 81 -8 -50 53 150 81 90 123 -21 39 167 -41
6836d1p3J57PMj9n5J06k6k13n9O5J31N6j31L6J42q3l4O1j06o1J69J26o0kN0j84j18K09N0j74
$$ -41 -114 43 50 54 35 -20 86 60 -153 -212 -147 -16 40 -91 -55 87 4 -30 31 -75 -136 33 159 99 97 147 -37 -155 54 104 -70
6829g0l0M3N7J1j28nJ20K8Op8q8J49J31o4l0L7l7j35rJ62k2j16O3L3K3M4r5j9o8j99K26K51
$$ -70 -100 -57 0 11 -117 -122 -2 26 32 -46 -134 15 146 82 52 89 52 -83 -92 70 48 -68 -5 28 51 95 0 -19 -87 -286 -60 191
6822A91k34MJ74j48L8J02k09o7K1J2K41l8k83J50J71m2R6j74k77L04K30k07O5J11j90K0J45
$$ 191 -43 -39 135 -13 25 127 -82 -149 -128 -116 125 87 -196 -46 125 83 179 5 -272 32 262 55 120 231 41 61 206
6816B06p8n4kr2n5L1O7Q7R0o2k43N2K73j68j81K36L1o3J37j28j67M2n8Q5J49j61j41j2P2J99
$$ 206 128 74 72 -20 -75 -44 23 110 200 138 -105 -53 220 52 -129 107 138 75 212 84 -83 -41 -99 -14 135 -26 -167 -179 -107 92
6809I2r8j81J67K4r3R6m1n4P7k7L8M1r9j6k1L1J62n2q6nk00mK43k0o8N8K1K6n3n4P1K9L3k7
$$ 92 -6 -187 -20 4 -89 7 -34 -88 -11 -38 0 41 -58 -74 -95 -64 98 46 -40 -45 -245 -249 -6 -26 -94 -36 -15 11 -42 -96 -25 4 37 10
6801A0j19Q3N4j01N5M2L8N0k39K2L30k08k50J92N0m7q6j50K12K19j37j25q6P5K02j27j24Q0
$$ 10 -109 -26 28 -73 -18 24 62 112 -127 -105 225 17 -233 -41 9 -38 -124 -274 -62 157 20 -105 -191 -116 86 -41 -165 -85
6795h5k1J39J15j81j9l9j00K73O7k45P9K8j06J52J3j27O5p1j54J06J06m5jl0q3J32J62j40
$$ -85 -106 33 148 -33 -52 -91 -191 82 149 -96 -17 11 -95 57 70 -57 8 -63 -217 -111 -5 -50 -51 -81 -164 -32 130 -10
6788a0l2J43j52n3J73j80j02K29m6q1J35L0L1l0j06J26P1o9M3o3%R6j97j1K24j97j33K36M3
$$ -10 -42 101 -51 -104 69 -111 -213 16 -30 -111 24 54 85 55 -51 75 146 77 120 57 57 153 -44 -55 169 -28 -161 75 118
6782A18l2Lj27k4K4PJ46j4j33J30R7j68j41k1J2J2MK8P3N3q1n8J77J31p2o9j29o1J68j6j47
$$ 118 86 89 -38 -62 -38 -31 115 101 -32 98 195 27 -114 -135 -123 -111 -107 -79 -6 47 -34 -92 85 216 144 75 -54 -115 53 37 -110
6775a10J00N4l5Q7m8q1N3j06k7K21m7j61J24M6p7O8k1j14L8K9PN0j14n9J74p4k48Q0J26j3
$$ -110 -10 44 9 96 48 -33 20 -86 -113 108 61 -100 24 70 -7 61 40 -74 -36 -7 0 50 -64 -123 51 -23 -271 -191 -65 -78
6768g8O6p0j11J42k1j19K70J26k70m9N8p9M8m3j26J95J78o3n3r5M4J88j54r6K69j8j21J12
$$ -78 -12 -82 -193 -51 -72 -191 79 205 -65 -114 -56 -135 -87 -130 -256 -61 117 54 1 -94 -50 138 -16 -112 157 139 18 130
6762A30j59j29K46L8p2J14j04j94P7J07q6j18J11J06k02kK73j24j92K06O3j93jJ94Q3j62p2
$$ 130 -29 -158 88 126 54 168 64 -130 -53 54 -32 -150 -39 67 -135 -137 136 12 -180 26 89 -104 -105 89 172 10 -62
6755f2J37n9r5P1j21l3K81j9k09N9L1m1Q8K7q0n6J9N2r0r8R7M9L9K48K2l69j56J48M0L3J11
$$ -62 75 16 -79 -8 -129 -162 119 100 -109 -50 -19 -60 28 55 -25 -81 -62 -10 -100 -198 -101 -52 -13 235 257 -112 -268 -120 -80 -47 64
6748F4o3n2J38n3j87P1O7j09%Q2O9Q1m5q3N3L6k5L0Jq6m7P0O2p8p8L6L4J3J8n2m0J00J00o4
$$ 64 1 -51 87 34 -153 -82 -15 -124 -124 -42 27 108 63 -20 33 69 44 74 75 -11 -58 12 74 -4 -82 -46 -12 1 19 -33 -73 27 127 63
6741F3r8oJ6P6J06j06j21J15K8p5N9m8j01P2p2j25J52Q0j34k4J37J42nj08l9l0N2J66o5j34
$$ 63 -35 -41 -25 51 157 51 -70 45 73 -2 57 9 -92 -20 -92 -217 -65 15 -119 -143 -6 136 131 23 -16 -46 6 172 107 -27
6734b7J10k5k15J6J88N6j45r2J12J1l7J11n3p1J42l5m3J59o5p8J02p9oJ61m7n4k1j76q4L0
$$ -27 83 58 -157 -141 47 103 -42 -134 -22 -11 -48 63 10 -61 81 46 3 162 97 19 121 42 36 197 150 96 75 -101 -185 -155
6727a55R9J54j14j54J31Op6J33L0r3Nlj4K3J9Ll8K1P2k0LK5j00r9jJ23J45j20j47J20M1n4
$$ -155 -56 98 -16 -170 -39 -33 -109 24 54 -39 -34 -37 -51 -28 -9 -6 -44 -23 49 29 32 57 -43 -142 -143 -20 125 5 -142 -22 19 -35
6720c5K6o8nJ06m1L9J06j15m3Pj20J52K02k13j54J05K9Kqj2O1j02r6K37J00j87q2q1k2J85
$$ -35 -9 -77 -82 24 -17 22 128 13 -30 -23 -143 9 211 -2 -156 -51 -22 -20 -28 -40 21 -81 -177 60 160 -27 -109 -190 -212 -27
6713b7j3p1J73k3j14J45l3j83J14J47o0j26k1J98P3k22q0P3L9J35O8o6ln7n0P0m0pJ29o0j08
$$ -27 -40 -111 62 39 -75 70 37 -146 -32 115 55 -71 -92 106 179 -43 -123 -50 -11 124 192 126 123 66 16 86 46 39 168 108 0
6706@J3p3pP9r3OK28N0j15p4p9KM5j20n7J64N4j08k8M1N0O7N0kj29j42L4jk8K09J17j38oN0
$$ 0 13 -60 -67 12 -81 -75 153 203 88 14 -65 -63 -18 -138 -195 -31 23 -85 -113 -72 -22 45 95 93 -36 -178 -144 -145 -173 36 153 15 9 59
6698E9o6k8l5L0J04j48j75J37J04n8k2JR3J49o0k06n8J45R6j11j04Q6J34k2j83j4K53M6k23
$$ 59 -7 -35 -70 -40 64 -84 -259 -122 -18 -76 -98 -97 -4 145 85 -121 -179 -34 62 -49 -153 -67 67 45 -138 -152 101 147 -76
6692g6r7L3R9J08j32j56J29P4j03L9R4m9k8O1j0o2M4P4o0r5O1O9j02k5J50m0j11K13J62k24
$$ -76 -173 -140 -41 67 -65 -221 -92 -18 -121 -82 12 -37 -65 -4 -14 -76 -32 42 -18 -113 -52 17 -85 -110 40 0 -111 102 264 40
6685D0j70J03O4p3J3M6j83l1L25j14l94K78K90l00n4J82q4M3J95Jp6o7m6j0RJ11K8j69m7M4
$$ 40 -130 -27 37 -36 -23 23 -160 -191 134 20 -374 -96 194 -106 -160 22 -62 -19 176 177 101 34 -12 -22 -13 98 126 -43 -90 -46
6678d6l6qk6J6Q9n6mJ16q9o4J29Mn2L2K8Po3l2N6l2NN9q4MK8j77J6K00N6M5j02k26J15K17
$$ -46 -82 -90 -116 -100 -11 -67 -71 45 -44 -108 21 25 -27 5 33 40 -23 -55 1 -31 -26 33 -51 -47 -19 -196 -180 20 76 121 19 -207 -92 125
6670A25p3j47j2J53N5k14q0J20kl4M6N9m6j10K00J94k62PL04j74j44J96k9j31j13r9J72P2
$$ 125 52 -95 -107 46 101 -113 -193 -73 -75 -109 -63 -4 -50 -160 40 234 -28 -21 283 109 -35 161 132 1 -112 -211 -39 33
6664C3n5J46j66k79K43J10j55J34M4j58J7O6N4J8j15l1N8J0L7L4J8l5o7J27L4k69L0K55q8
$$ 33 -22 124 -42 -321 -78 32 -123 11 55 -103 -86 -20 34 52 -63 -94 -36 -26 11 45 63 28 -39 88 122 -147 -117 138 50
6657E0q4J45K8o1m7q8r1m3J18J32j39o4J84j03k18K23J89j17M1n1k78J80L18j98j44P9o9J08
$$ 50 -34 111 139 78 31 -57 -148 -191 -73 59 -80 -144 40 -63 -281 -58 131 14 55 4 -274 -94 224 26 -118 -39 -108 0
6651@J84o8L5k3k48J02K17j52p3J06l9r1k2L7k5j33Q2K43l0j05J04j0k18n7Q0m7O4K07j16
$$ 0 184 116 151 128 -120 -18 199 47 -26 80 41 -50 -72 -35 -60 -193 -111 132 102 -3 101 91 -127 -184 -104 -151 -87 120 4
6644Dj78K28J34j79J3J36o2r8j7o0n7J23J28n8K7P1j13j4K8j27M7N4j15Q7k7k77J19K61m2
$$ 4 -174 54 188 9 22 158 96 -2 -19 -79 -136 -13 115 57 84 155 42 28 56 -71 -24 30 -85 2 -25 -302 -183 78 36
6638C6k3J9l6K5L5O1lj73r5O6J47J23j00p9O0j01m8Q0p6K9J06q7N8K21O1p1j78p1J24l3p5
$$ 36 13 32 -4 21 56 117 114 -59 -154 -88 59 182 82 3 63 -38 -86 -6 -82 -53 53 -34 24 245 306 235 57 -14 110 77 2
6631BN4q4r1N0N3J18Q7n9n3j18j49N9J01m4J3J32j2j25N7O9p7L5J5r1M4q4o4L39J5l71R1K13
$$ 2 56 -28 -119 -69 -16 102 189 130 77 -41 -190 -131 -30 -74 -61 71 59 -66 -9 60 -17 18 33 -58 -14 -98 -162 177 192 -179 -88 125
6624A25m7M2Lj00m7m0O8lj18J68J38j63QQ5j19n6R1L0j56n5K35N6j20K1j13j4K24j09q9J44
$$ 125 78 120 123 23 -24 -64 4 1 -117 51 189 26 34 119 0 -56 35 65 -91 -146 89 145 25 46 -67 -81 143 34 -55 89
6617H9r9J29K15l99j38K68j29K1J63k36N3J92k59J0K48r2L4J16k10m9J71p5j06N8kJ8J40M6
$$ 89 -10 119 334 -65 -203 65 -64 -43 120 -116 -63 129 -130 -120 128 36 70 186 -24 -73 98 23 -83 -25 -27 -9 131 177
6610A77r2m9Nn6r5O8J77k9j16O7N1l5j9j13nJ63j11j60J60J7j17J37O0q7P4l9j68O3J8j50
$$ 177 85 36 41 -15 -110 -42 135 106 -10 57 108 73 54 -59 -64 99 -12 -172 -12 5 -112 25 85 -2 72 33 -135 -72 -54 -204
6604b04P8J38n3rJ4k9R1N0o1J7%n5p7j30M2J68M5Q1j3j91Q7J84r7n8L2m6k0K5O9n7j34J96
$$ -204 -126 12 -41 -50 -36 -65 26 76 15 32 32 -23 -100 -230 -188 -20 25 106 93 -98 -11 173 76 18 50 4 -16 9 78 21 -113 83
6596H3J01k64P1J40k15%O5j14Q1M0LJ63j06j20J09q9O1J88k77p8L06j18j95J31J7m5N7j1j5
$$ 83 184 -80 -9 131 -84 -84 -19 -133 -52 -12 -9 154 48 -72 37 -52 9 197 -80 -158 148 30 -165 -34 -17 -62 -5 -16 -31
6590c1K8J1L2Nq4j02K3J36N7n5lN8l4j02M4J35j5r7k6N7P3j15j27J90J17j84k9Q8j35j25J47
$$ -31 -3 8 40 45 -39 -141 -118 18 75 20 17 75 41 -61 -17 118 103 6 -20 37 110 -5 -132 58 175 -9 -38 50 -85 -210 -63
6583f3J67n7p4K8o9j9J60j7j29Q2J26No3rJ14m6j53R0K5k04j9J58R1p3j68R3K40o4j37K5n6
$$ -63 104 47 -27 1 -68 -87 73 56 -73 9 135 140 77 68 182 136 -17 73 98 -106 -125 33 124 51 -117 -24 216 152 15 40 -16
6576a6q1J13J52r5k14O1J82m7n5Q2%j07o7Q7J12p7j11M5P8j5q0J2Q0k1J4%j84L8K34r2j22
$$ -16 -97 16 168 73 -141 -80 102 55 0 82 82 -25 -92 -5 107 30 -81 -36 42 27 -53 -41 39 18 32 32 -152 -114 120 28 -94
6569i4R8po5l9k0J43K7j49Q7R8j13J9Q9k5M3M6q5o7L8M0n7j01q0m6J27J72j18j39J40O8m6
$$ -94 4 -3 -68 -107 -127 16 43 -106 -19 79 -34 -15 74 49 92 138 53 -14 24 64 7 -94 -174 -220 -93 79 -39 -178 -38 30 -16
6562a6P3J6p4j8j1J8n4j01K12J67k76j07J41n4M2Q7j43RJ20NQ8m9k18jR5J33J35j62r2J56
$$ -16 57 73 -1 -19 -30 -12 -66 -167 45 212 -64 -171 -30 -84 -42 45 -98 -89 31 36 124 75 -143 -144 -49 84 219 57 -35 121
6555A21o9p8R5o9m8J8j43L4J70q2j0K49R2j84j76L7J18q1j39J12J21r8l5M3j20l8J46K4m6
$$ 121 52 -26 69 0 -48 -30 -173 -139 31 -51 -61 188 280 96 -80 -43 75 -6 -145 -33 88 -10 -45 -2 -122 -160 -14 10 -36
6548c6j3j8P6Kj39J7M6l2N1k7J0J51j29j56K40J62j07q8k9J4l7n0J01K1j11J3O6J0RM2K3j63
$$ -36 -49 -67 9 11 -128 -111 -65 -97 -46 -73 -63 88 -41 -197 43 205 98 10 -19 -5 -42 -92 9 30 -81 -68 -2 8 17 59 82 -81
6541h1j11J75N1r7M6J5k3ol2J25N9j25J8q1j31K34P0j87J06Q4r3K2j3oQ9J6l9j39p5J66Ko8
$$ -81 -192 -17 34 -63 -17 -2 -25 -31 -63 62 121 -4 14 -67 -198 36 106 -81 25 109 16 38 25 19 108 124 85 -54 -129 37 39 -29
6534b9J65n5k08M4J7l9M6n5k3J41J42L9j27j24N9Q2K1p2j93n4J29N5jN3N4m1o7N7N4mM8j23
$$ -29 136 81 -127 -83 -66 -105 -59 -114 -137 4 146 185 58 -66 -7 75 96 24 -169 -223 -94 -39 -40 13 67 26 -41 16 70 66 114 -9
6526ij85J76J74j18m6QqR5l7j58L1J08L9J7L1J7j57j24K51J63k21r9L7n8L6M9m8Jj5l8lmJ57
$$ -9 -194 -18 156 38 -8 0 -8 87 50 -108 -77 31 70 87 118 135 -22 -146 105 268 47 -52 -15 -73 -37 12 -36 -35 -50 -88 -91 -95 62
6519F2J61j40j12J6o7J6Km2J68Lj72J21J0j63J01j6q4J70l4m7J94j14j46J21m0K5Q9k05pJ44
$$ 62 223 83 -29 -13 -80 -64 -62 -104 64 67 -105 16 26 -137 -36 -52 -136 34 0 -47 147 33 -113 8 -32 -7 82 -123 -130 14
6512A4j54Q4K72j60j50J51k1j74k7P0L6KK8O6M8q7j96j7J94N9r3J6J34M7j42j30Q8J26jm4
$$ 14 -140 -56 216 56 -94 57 36 -138 -165 -95 -59 -57 -29 37 85 -2 -198 -215 -21 38 -55 -39 95 142 0 -130 -42 84 83 39
6505C9o9k4J34P6j12n5O9Q0M9r4j79o7oP1J29q9r1J56m3j77J12R1m4j4q9N3J88o3q5O1rm3
$$ 39 -30 -54 80 156 44 -11 58 138 187 93 -86 -153 -159 -88 41 -48 -139 17 -26 -203 -91 0 -44 -58 -147 -94 94 31 -54 7 -2 -45
6498d5p8J8J70j15p2L21o0l11R9Qj01J76Rj21P9K6k0Qk4J9j13r8K17J2k49J42K39j24q7J29
$$ -45 -123 -105 65 -50 -122 199 139 -172 -73 -65 -166 10 19 -102 -23 3 -17 -9 -33 -14 -127 -225 -8 4 -245 -103 136 12 -75 54
6491E4L0j24QJ52q2k26K9P3jJ77P8j85j3J10r6q4Q9K6l5P7J9j84n5J85P2n0m4j18M2J15k74
$$ 54 84 -40 -32 120 38 -188 -159 -86 -87 90 168 -17 -30 80 -16 -100 -11 15 -20 57 76 -108 -163 22 94 44 0 -118 -76 39 -235
6484b35j28M36R2l65qJ33q4M1J36N5O9rj30l7R9L4r2k7L7l7NN1m2K4J53L5j58k00o1P6P8R7
$$ -235 -363 73 165 -200 -208 -75 -159 -118 18 73 142 133 3 -34 65 99 7 -20 17 -20 -15 36 -6 18 171 206 48 -152 -213 -137 -59 38
6477C8N6q9n3M6L9K1l7l7N0J6n0l1L3M6j19n8J86m2j82J13N2n4J37J9j02kLR7oj98J05Q7k54
$$ 38 94 5 -48 -2 37 58 21 -16 34 50 0 -31 2 48 -71 -129 57 15 -167 -54 -2 -56 81 100 -2 -4 -1 96 90 -108 -3 84 -170
6469a70R4K33k38j37J99M8q3K8J36mj99K3J66r0n5P8r4n9J17R3P0o4j47Q7K7k34K2J97o3n6
$$ -170 -76 157 -81 -218 -19 29 -54 -26 110 106 -93 -70 96 6 -49 29 -65 -124 -7 86 156 92 -55 32 59 -175 -153 44 -19 -75
6463g5Q9M5K3q7j26O2O2J1m0k64k3L73O8j21Q2k3k4O8j88j22J87P0k7Q2Rj10r7r1p5R4J90
$$ -75 14 59 82 -5 -131 -69 -7 4 -36 -300 -323 50 118 -3 79 56 32 100 -88 -210 -23 47 20 102 111 1 -96 -187 -262 -168 22
6455B2L1j5J2j16K0J61n8k7N4j31K9J33r4L3Q4j42j8M3r6Jj3m6J76R3j80m8J39Or1M7O3j37
$$ 22 53 38 50 -66 -46 115 57 30 84 -47 -18 115 21 54 138 -4 -22 21 -75 -74 -87 -133 43 136 -44 -92 47 53 -38 9 72 -65
6448f5j15J27O0j84J5K71n6j49K25lk39J62N3k14Q9Jj50J44M3n6J30l7j37l6PJ64pj91J54
$$ -65 -180 -53 7 -177 -162 109 53 -96 129 126 -113 49 102 -112 -23 -22 -172 -28 15 -41 89 52 -85 -121 -114 50 43 -148 6
6442FJ29j35J0j4l8J35m2j23M8J4J2L3k3N3P4Pl4p5m8r0l0J94J8j84Pm2j19J14J45P1L9q5
$$ 6 135 0 10 -4 -42 93 51 -72 -24 -10 2 35 12 65 139 146 112 37 -11 -101 -131 63 81 -103 -96 -138 -257 -143 2 73 112 27
6434B7j08p3K9J42k1p5P6Nm4k0j8Q2k8j02R6k9p7J60k1j42Nr9L8K44l9j25M4j3l2PO0J51J4
$$ 27 -81 -154 -125 17 -4 -79 -3 2 -42 -62 -80 2 -26 -128 -32 -61 -138 22 1 -141 -136 -235 -197 47 8 -117 -73 -86 -118 -111 -51 100 114
6427A14j27l1%j1Q9Q6l3j2M9r8j22R7Q6m6rj3J0N3k8j0P0M4p1k19m3J66o1l7J86p4j77M9L7
$$ 114 -13 -44 -44 -55 34 120 87 75 124 26 -96 1 87 41 32 19 29 82 54 44 114 158 87 -132 -175 -9 -70 -107 79 5 -172 -123 -86
6419h6J3K5ON3j04j43J48J20m5Q6R9j12j02P7n9j86K03K19k42j11R4k1P8o6j54J86M6n3K12
$$ -86 -73 -48 -42 11 -93 -236 -88 32 -13 73 172 60 -42 35 -24 -210 -7 212 -30 -141 -47 -68 10 -56 -210 -24 22 -31 181
6413A81l4r6J05j77o5K18p3o1P4j01l3N4Jj2p1L8N9n0R7j0j80O5J9m0J91j3j12J04p1j25J38
$$ 181 147 51 156 -21 -86 132 59 -2 72 -29 -62 -8 -7 -19 -90 -52 7 -43 54 44 -136 -71 -52 -92 99 86 -26 78 7 -118 20
6406B0R7j58j95J15J52j37M8J11j65Q0Q4j91J12K1k42J59J28j26P7M9l6q1j62J59J52j31J67
$$ 20 117 -41 -236 -121 31 -106 -58 53 -112 -32 52 -139 -27 -6 -248 -89 39 -87 -10 39 3 -78 -240 -81 71 -60 107
6400A07J82j34J2j0k02j13K1J56M3j20L4n5m7K50o3k69J32R9n1N2m9o2Mm0L7J0RJ43l0j40
$$ 107 289 155 167 157 -45 -158 -137 19 62 -58 -24 -79 -126 124 61 -208 -76 23 -28 24 -25 -87 -83 -123 -86 -76 -67 76 46 -94
6393i4L0Jl6O7M2m5m2J02O8j85l7J62j01r8J84M1q1R4m1k36M8J46o9J52J76k75r3J48r9N9
$$ -94 -64 -63 -99 -32 10 -35 -77 25 93 -92 -129 33 -68 -166 18 59 -22 72 31 -205 -157 -11 -80 72 248 -27 -120 28 -71 -12
6386a2K3k35K38K15k82Q2J05k88R2K13o0K4k5m4K2j28j1P0l7J19k5k37M5J11K8O2n9L1O6j52
$$ -12 11 -224 14 229 -53 29 134 -154 -62 151 91 115 90 46 68 -60 -71 -1 -38 81 56 -181 -136 -25 3 65 6 37 103 -49
6379d9k1N0k3J61pk26N8J25o4j13l5J31j7j30K01R7k01K3K9j21R2R7r7q0J8K0p3M6K08l5j23
$$ -49 -70 -20 -43 118 111 -115 -57 68 4 -109 -144 -13 -30 -160 41 138 -63 -40 -11 -132 -40 57 -40 -120 -102 -82 -155 -109 99 64 -59
6372e9R1Ln4J26L0k59k19J70J98j64lK61q0k11M4J53J27r7j57N1MQ1J28k57RM03j83l33J20
$$ -59 32 35 -19 107 137 -122 -341 -171 27 -137 -140 121 41 -170 -126 27 154 57 -100 -49 -45 36 164 -93 -84 319 136 -197 -77
6366g7M3mQj00J60N4k63J55K47j91p2O0q2J8O4L7Q2m5p3N7l0o3J42J11j64j19P1o3o4J62j6
$$ -77 -34 -38 -30 -130 30 84 -179 -24 223 32 -40 20 -62 -44 20 57 139 94 21 78 48 -15 127 238 74 -45 26 -37 -101 61 45
6359D5j77K2J5J6J05o7J4J42j23m5O8j75R1K19k46m7K29j47l6J77j64r9J43k1j7O6j9J7M7
$$ 45 -132 -110 -95 -79 26 -41 -27 115 -8 -53 15 -160 -69 150 -96 -143 86 -61 -97 80 -84 -183 -40 -61 -78 -12 -31 -14 33
6352C3Nj5j1R1K5k00o9J30K5L3O0j09p7L7o1K0J33r3m8K25k4j68P7n1o6J94o3q6K27r9j45
$$ 33 38 23 12 103 128 -72 -141 -11 14 47 107 -2 -79 -42 -103 -83 50 -43 -91 134 110 -58 19 -32 -98 96 33 -53 174 75 -70
6345g0K64k4k30K5kJ05J43j91p5P3q5R1Q5j95p4O6J01P5j93l0K82q2k07J52L9j67M8J27o7
$$ -70 194 170 -60 -35 -37 68 211 20 -55 18 -67 24 109 -86 -160 -94 7 82 -111 -141 141 59 -148 4 43 -124 -76 51 -16
6338a6o5Q0n6q9K39J38j98n0j7o1K43Q4k49K2O3j62N0J02q9J9L2j07K3J04p0j00P2J05lMR
$$ -16 -81 -1 -57 -146 93 231 33 -17 -34 -95 148 232 -17 5 68 -94 -44 58 -31 -12 20 -87 -64 40 -30 -130 -58 47 44 48 57
6331E7j32p9J68R7j64j40O7J83M1j83J5K45j07k55J64K16j08j74l6J27P9j08O5J61j84j73
$$ 57 -75 -154 14 111 -53 -193 -126 57 98 -85 -70 175 68 -187 -23 193 85 -89 -125 2 81 -27 38 199 15 -158
6325a58J28K6p7L0k1NJ20o5j47J12N6r7J58R2k44pJ48j19q2k1l6J83N7j41P5K2j02Q3l1j35
$$ -158 -30 -4 -81 -51 -72 -67 53 -12 -159 -47 9 -88 70 162 -82 -89 59 -60 -142 -163 -199 -16 41 -100 -25 -3 -105 -22 -53 -188
6319a88P4L2r6k8J00J80m3k42OJ39J0J3j5r0QO6m5o6L7nkJ48J4p5R2m1k5K33j16k70J16k3
$$ -188 -114 -82 -178 -206 -106 74 31 -211 -205 -66 -56 -43 -58 -148 -140 -74 -119 -185 -148 -153 -155 -7 7 -68 24 -17 -42 191 75 -195 -79 -102
6311a02q6K54P0j51q2j13L6J10lJ33R4j36p6L3R8M8p7J1n2j25J22k6k23J80K08k10j55J49
$$ -102 -188 66 136 -15 -97 -210 -174 -64 -67 66 160 24 -52 -19 79 127 50 61 9 -116 6 -20 -243 -63 145 -65 -220 -71
6305g1J44q4n2J22n7m4J71j33k12J90J80Lo2p3O1p4j47N9r4%L17p6j35K38r0j76J78J2p7L7
$$ -71 73 -11 -63 59 2 -42 129 -4 -216 -26 154 157 95 22 83 9 -138 -79 -173 -173 144 68 -67 171 81 -95 83 95 18 55
6298E5p4j9M8m1LQ7J23k1j97mJ19qM6j4k24r5J47R5q5j6J12p5q8J52J3j48M1J89O5k61j57
$$ 55 -19 -38 10 -31 -28 59 182 161 -36 -40 79 71 117 103 -121 -216 -69 26 -59 -75 37 -38 -126 26 39 -109 -68 121 186 -75 -232
6291b32K95O9j83J09qj51N5l2M5J39j61o1O8o9J83Q8k56O7J56p6L1n2p2J64K0j20o4j43p1
$$ -232 63 132 -51 58 50 -101 -46 -78 -33 106 -55 -116 -48 -117 66 154 -102 -35 121 45 76 24 -48 116 136 16 -48 -191 -262
6284b62O7J38J71p4p2K32m7l16J30K61j52j24J35n2j71Q3L7j45L7J59J21K9j68l4J31j01l8
$$ -262 -195 -57 114 40 -32 200 153 -163 -33 228 76 -48 87 35 -136 -53 -16 -161 -124 35 156 185 17 -17 114 13 -25
6278b5Q4j65p7K6j33J13J90j06K3J21p9m4J7j0L2M0O5m0j73M0J64m8j22L1J47J7j69N1K62
$$ -25 59 -106 -183 -157 -290 -177 13 -93 -70 51 -28 -72 -55 -65 -33 7 72 32 -141 -101 63 15 -107 -76 71 88 -81 -30 232
6272B32K6j58r7j2O3J1q0m5o2q4L7J02Mp6j9M5L1N6Q7K3o9j03l6N8K6j8K1L8J3PK4l9j09k0
$$ 232 258 100 3 -9 54 65 -15 -60 -122 -206 -169 -67 -63 -139 -158 -113 -82 -26 61 84 15 -88 -124 -66 -40 -58 -37 1 14 21 45 6 -103 -123
6264a23jkJ71M6j99k1L2l7J38qj44J22N9mJ45j15j38J80K6r2K2n9J0R1m6m1K2Q8N0j62OJ94
$$ -123 -124 -126 45 91 -108 -129 -97 -134 4 -4 -148 -26 33 29 174 59 -79 101 127 35 57 -2 8 99 53 12 34 122 172 10 16 210
6257B10j21j51J4r5L9J30p1L2J07q2j2J03n1j34Q1K11q7k02L6j02j21K65N3j89K30J85k07
$$ 210 89 -62 -48 -143 -104 26 -45 -13 94 12 0 103 52 -82 -1 210 123 -79 -43 -145 -266 -1 52 -137 93 278 71
6251G1k0N8j67KJ68r1j60J15J17p2K2J05m4j22j33n8J26J28k4j37q8J56J34r5J7P2q7K3O3
$$ 71 51 109 -58 -56 112 21 -139 -24 93 21 43 148 104 -18 -151 -209 -83 45 21 -116 -204 -48 86 -9 8 80 -7 16 79
6244G9n6J6l1p8N1o0j01J46J09j11r6J00J72p1j56P4M0n7Qn2O3J61j25r5Q8q0K5J00k42q5
$$ 79 23 39 8 -70 -19 -79 -180 -34 75 -36 -132 -32 140 69 -87 -13 27 -30 -22 -74 -11 150 25 -70 18 -62 -37 63 -179 -264
6237b64K19o1o0K44R4j33r4j0M9M5M8j2j44N2K19j09j52J10q0j08K16J4k22l6r1m1L05J24
$$ -264 -45 -106 -166 78 172 39 -55 -65 -16 29 77 65 -79 -27 192 83 -69 41 -39 -147 69 83 -139 -175 -266 -307 -2 122
6231A22j74mM4j05j07J2J70Q0p5Q9O4j49jL8q1J07J05j28m6M0m1KL5m9o3K9J00O2qp4j10l8
$$ 122 -52 -56 -12 -117 -224 -212 -42 38 -37 52 116 -33 -34 4 -77 30 135 7 -39 1 -40 -38 -3 -52 -115 -86 14 76 68 -6 -116 -154
6224a54j6OJ56J32m4j22r1J43K01j30r6J34k2o7n0j33R0O5j83L6J01JJ72m1j57J77o4k11K38
$$ -154 -170 -164 -8 124 80 -42 -133 10 211 81 -15 119 97 30 -20 -153 -63 2 -181 -145 -44 -43 129 88 -69 108 44 -167 71
6217G1N2k31R4Q9m8N0o7m8Q4o5m8Q0J9J7k3k2J74R4j44j02l8j4M4Lnj1r0K2J24k0o9M0R0J2
$$ 71 123 -108 -14 75 27 77 10 -38 46 -19 -67 13 32 49 26 4 178 272 128 26 -12 -26 18 21 16 5 -85 -63 61 41 -28 12 102 114
6209A14j40q3J50J25p9j21J1J50L0j77o2R6L1j8k4MN7m5q9N3M9o7o2J4O0O8O3n2j74j5J34
$$ 114 -26 -109 41 166 87 -34 -23 127 157 -20 -82 14 45 27 3 7 64 19 -70 -17 32 -35 -97 -83 -23 45 108 56 -118 -133 1
6202AN6O9kj21Q2P8j70o0M8K8J12J0l5Mj48RJ52j52n7J39j29l2K14J5j34j21K9J72l4k9J23
$$ 1 57 126 124 3 85 163 -7 -67 -19 9 121 131 96 100 -48 -39 113 -39 -96 43 -86 -118 96 111 -23 -144 -115 57 23 -6 117
6195A17j13m7J57j05m0J88q6j89J3J05J00m9j5J43r9j68J17j3j66P3P3q3J1L2r3m2Q6N7%N
$$ 117 4 -43 114 9 -31 157 71 -118 -105 0 100 51 36 179 80 -88 29 16 -150 -77 -4 -87 -76 -44 -137 -179 -93 -36 -36 -31
6188c1k7K8J45kj98m0J22k4m9J24k0k06N0J60p7l9Q1p3j11Q9J88k3k23k9J49P2M0p1p6J22
$$ -31 -58 -30 115 113 -85 -125 -3 -27 -76 48 28 -178 -128 32 -45 -84 -3 -76 -187 -98 90 67 -156 -185 -36 36 76 5 -71 51
6182E1K2k1O3k22o9L31j20k81J85K1j29J62Ok06j3J16K7o8Q4J77n0o4L8K6J52l8k86O1J28
$$ 51 73 52 115 -107 -176 155 35 -246 -61 -40 -169 -7 -1 -207 -220 -104 -77 -145 -61 116 66 2 40 66 218 180 -106 -45 83
6175H3j10L8j0p3J80K8r5O4j34n5K83l7k49M3L3n5Q5N3q8l9J27J07j18j43oOK6M9KL4j5r3
$$ 83 -27 11 1 -72 108 136 41 105 -29 -84 199 162 -87 -44 -11 -66 19 72 -16 -55 72 179 61 -82 -88 -82 -56 -7 -5 29 14 -79
6168g9N2O1p8M6P9q4jJ9o0P9L3k8J58p9k84P3O2q7J40k8j66J31oj24J98J33j05r8j13lJ19
$$ -79 -27 34 -44 2 81 -3 -4 15 -45 34 67 39 197 118 -166 -93 -31 -118 22 -6 -172 -41 -47 -171 27 160 55 -43 -156 -159 -40
6161d0L7qQN0K1o4Q0N9j66K3P9k16l9K17M4NJ01nj58j17Q4Q9l1j4r2j03J44J29j20j11P8J06
$$ -40 -3 -11 -3 47 68 4 84 143 -23 0 79 -137 -176 41 85 90 191 186 28 -89 -5 84 53 39 -53 -156 -12 117 -3 -114 -36 70
6153G0j1qn1j83M9J56p0J36J27l19n8K01k9J13J0k73N5O3j52J35J02j26pR4J47l5k26O7J09
$$ 70 59 51 0 -183 -134 22 -48 88 215 -104 -162 39 10 123 133 -140 -85 -22 -174 -39 63 -63 -70 24 171 136 -90 -23 86
6147H6p5O9l9j09J20m1j04J08OnM6n8Q4J29m8j70k26J71L29l17k53L51K7k40N5L3MP3m4M4
$$ 86 11 80 41 -68 52 11 -93 15 21 16 62 4 88 217 169 -1 -227 -56 273 -44 -297 54 81 -159 -104 -71 -67 6 -38 6
6140FJ17q9r3M7O3O6k9j49m0P9LM4J39p4k12RJ02l7l7R5R4j01j42P2Q2r1l2J19K8r5J25K12
$$ 6 123 34 -59 -12 51 117 88 -61 -101 -22 -19 25 164 90 -122 -113 -11 -48 -85 10 104 3 -139 -67 15 -76 -108 11 39 -56 69 281
6133B81j93k16O9n6P8K31k15j03K37q0K8J39k90k4J32k86Q9L34j06k8O0r9K7m0j01M4j7O8
$$ 281 88 -128 -59 -115 -37 194 -21 -124 113 33 61 200 -90 -114 18 -268 -179 155 49 21 81 -18 9 -31 -132 -88 -105 -37
6126c7R4j01P0J23r9jK3l5Q3j1r3m9o3O4J2j20R5J15J2Q1q8n2J85q0j66P3q2m4K78J3l50r0
$$ -37 57 -44 26 149 50 49 72 37 120 109 16 -33 -96 -32 -20 -140 -45 70 82 163 75 23 208 128 -38 35 -47 -91 187 200 -150 -240
6119b40K22O8j20k2M6K4L3p0o6J28R8k7NJ6l1n7KM3k4M2J7k03j6K04l5j01j8l9R3O2m3J13
$$ -240 -18 50 -70 -92 -46 -22 11 -59 -125 3 101 74 79 95 64 7 9 52 28 70 87 -116 -132 72 37 -64 -82 -121 -28 34 -9 104
6112A04N6j92k20m8K02J17p1Q9%j53M2p5o8K35l9j37J05j22%K47q5K2J76j91r0N4l4J61m0
$$ 104 160 -32 -252 -300 -98 19 -52 37 37 -116 -74 -149 -217 18 -21 -158 -53 -175 -175 72 -13 9 185 -6 -96 -42 -76 85 45
6105D5j84K31R8j73l7p8J36K19k05j5J28k88m2J95k6J83N3k93J00J32k61LK40K1j16n9Q7J4
$$ 45 -139 92 190 17 -20 -98 38 257 52 37 165 -123 -165 30 4 187 240 -53 47 179 -82 -79 161 182 66 7 94 108
6099A08j39L6R1q1n1P2J34k1j62Q3M9k22L8Q8j16J45M9k45J11J76j34j18q7J07J84k33n8L49
$$ 108 -31 5 96 15 -36 36 170 149 -13 70 119 -103 -65 23 -93 52 101 -144 -33 143 9 -109 -196 -89 95 -138 -196 153
6093A53q3j79K12Qj32M4r9j48P7J50P8r2j55P0J87J3q7M9Q9r6j13J5l2N3K06k8j48P5j2j89
$$ 153 70 -109 103 111 -21 23 -76 -224 -147 3 81 -11 -166 -96 91 104 17 66 155 59 -54 -39 -71 -18 188 160 12 87 75 -114
6086a14pR7L4M3l6o6N0j3m7R3l7j09J73N8k38K0J32j31KJ56p7m0J44r7k12O1L8r9J32J33j17
$$ -114 -121 -24 10 53 17 -49 1 -12 -59 34 -3 -112 61 119 -119 -99 33 -98 -96 60 -17 -57 87 -10 -222 -161 -123 -222 -90 43 -74
6079g4L1J01j16oN9j29L7K11l2j50J4Q5lJ1P1r2r6J07n4j62P2K6k1J33K2n0L8J5Mr3m6J84
$$ -74 -43 58 -58 -64 -5 -134 -97 114 82 -68 -54 31 28 39 110 18 -78 29 -25 -187 -115 -89 -110 23 45 -5 33 48 52 -41 -87 97
6072I7lj05J17r9j99J02J15N8o4j15K43P9k53J61R1k75O1Q3j03Q4J0PM5k01J9J51j72l9M1
$$ 97 94 -11 106 7 -192 -90 25 83 19 -96 147 226 -27 134 225 -50 11 94 -9 75 85 92 137 -64 -45 106 -66 -105 -64
6065f4q3J30M7l6J41q9j05M2k29J1L50k6j77q4qK68R8j94J0j1j30P4J11k8j07J7J35j71j48
$$ -64 -147 -17 30 -6 135 46 -59 -17 -246 -235 115 89 -88 -172 -180 88 186 -8 2 -9 -139 -65 46 18 -89 -72 63 -108 -256
6058b56K75P9n1J54j63k05J57J9LJ29j12l8J50m8j15n6j8J17Q9n2j19j27N5J28rK2K1r1QN8
$$ -256 19 98 47 201 38 -167 -10 9 12 141 29 -9 141 93 -22 -78 -96 21 110 58 -61 -188 -133 -5 -14 8 29 -62 -54 4
6052Dn4n2LJ00J94k2k90j20J63K2j41Q5J58n6m1J9r4m6N4L9Q6P4l2l9m4o7J3Q5P6J8m5k0J
$$ 4 -50 -102 -99 1 195 173 -117 -237 -74 -52 -193 -108 50 -6 -47 -28 -122 -168 -114 -75 11 85 53 14 -30 -97 -84 1 77 95 50 30 31
6044C1m8RN7p0n9J08M1p6j0Nk5j8k8L0L0m6J9k3r4J51J42j56l3R3j29q2J44M3j18NJ51J3r2
$$ 31 -17 -8 49 -21 -80 28 69 -7 -17 -12 -37 -55 -83 -53 -23 -69 -50 -73 -167 -16 126 -30 -63 30 -99 -181 -37 6 -112 -107 44 57 -35
6037c5l8j02OK02j1p9J13k8k6J13j18p0J36r6o1J69q9j89J25J46l6K8N4j75j08J91L5j22M2
$$ -35 -73 -175 -169 33 22 -57 56 28 2 115 -3 -73 63 -33 -94 75 -14 -203 -78 68 32 60 114 -61 -169 22 57 -65 -23
6030b3n1o6J33km0O5n4M6Q1j48J0J06p1NJOJ15j72j58K73J38j04n1n1O6kj64J04O3j93Q1J21
$$ -23 -74 -140 -7 -9 -49 16 -38 8 89 -59 -49 57 -14 -9 -8 -2 113 -59 -217 56 194 90 39 -12 54 52 -112 -8 55 -138 -57 64
6023F4j02N2K3q3J64O8k87j55J12R0N5N8l8k4L1r3n4Q5l7M7J57j96j56K70P6k15p0M9R5M8
$$ 64 -38 14 37 -46 118 186 -101 -256 -144 -54 1 59 21 -3 28 -65 -119 -34 -71 -24 133 -63 -219 51 127 -88 -158 -109 -14 34
6016C4p9lO0m3m7O3J4j58NK51m1j93Q9j6p1J88rj75N7M5j2Q1P5M6j05k12N6K38N5j68j57J0
$$ 34 -45 -48 12 -31 -78 -15 -1 -159 -154 97 56 -137 -48 -64 -135 53 44 -131 -74 -29 -41 40 115 161 56 -156 -100 138 193 25 -132 -122
6009a22K4N1J96L4j50p3m4P1R2j15J1J47p3j66p2J68K08j70q3J82j09r5P8p0N0K8p6J56j02
$$ -122 -98 -47 149 183 33 -40 -84 -13 79 -36 -25 122 49 -117 -189 -21 187 17 -66 116 7 -88 -10 -80 -30 -2 -78 78 -24
6002b4k22K36N3j02J41m7N4J35k94n2J74j04R9Pk91L3O9M0J63j67j2K71j57j02P1j58J18J90
$$ -24 -246 -10 43 -59 82 35 89 224 -70 -122 52 -52 47 54 -237 -204 -135 -95 68 -99 -111 160 3 -99 -28 -186 -68 122
5996A22l7O9j71j38K72j04j65K65kj08J9j28J14P8k94L0J97m5K1j3l8O3m2O9J49j26j30n1
$$ 122 85 154 -17 -155 117 13 -152 113 111 3 22 -106 8 86 -208 -178 19 -26 -5 -18 -56 7 -35 34 183 57 -73 -124
5989a24j4J49m7j67J43Q6m8R7m6j70M3O0j09l9J82J40o7k5Nj23l6M4JP6L7j6R2k0j19K6m6
$$ -124 -138 11 -36 -203 -60 26 -22 75 29 -141 -98 -38 -147 -186 -4 136 69 44 49 -74 -110 -66 -65 11 48 32 124 104 -15 11 -35
5982c5j52L9J33Q2O2r4j87Q2K28l8j30Pj9N8J31j14j20L4q2M3K17q4k43n3J15J80%r0M8j11
$$ -35 -187 -148 -15 67 129 35 -152 -70 158 120 -10 -3 -22 36 167 53 -67 -33 -115 -72 145 61 -182 -235 -120 60 60 -30 18 -93
5975i3j40J68M7o0J69J5r7P5r4o6K27p2k86J04J73o3j1Jj05L8J18j52j95J60K09l7n7k9k2
$$ -93 -233 -65 -18 -78 91 106 9 84 -10 -76 151 79 -207 -103 70 7 -4 -3 -108 -70 48 -104 -299 -139 70 33 -24 -53 -75
5969g5O0o2o6K82J83k39j44Jj25K6J66p2j53O4J64J03K5n2j14n6J12Q1j16rJ55j19k48J24
$$ -75 -15 -77 -143 139 322 83 -61 -60 -185 -159 7 -65 -218 -154 10 113 138 86 -28 -84 28 109 -7 -16 139 20 -228 -104
5963a04K24kql3r3Q3N4j28k4j2n5J14L8q7N0l0p7J16l5j51Q5L7n6J34R1q8ML2j98j19L35K01
$$ -104 120 118 110 77 -16 67 121 -7 -31 -43 -98 16 54 -33 17 -13 -90 26 -9 -160 -75 -38 -94 40 131 43 47 79 -119 -238 97 298
5955B98l55j00L24l7k45j6pqQ4N4M2O1M5p5j55Q4J16j88n4J87L1n3q2p2J29P6p2L8J9m9K0
$$ 298 -57 -157 167 130 -115 -131 -138 -146 -62 -8 34 95 140 65 -90 -6 110 -78 -132 55 86 33 -49 -121 8 84 12 50 69 20 40
5948D0K6J5p5j04R7P8p2j0k6LO5r9j9J45l0m5k2j40Q3J54j41n2J78Q7n5r2j4qr8L0Q1q2l7
$$ 40 66 81 6 -98 -1 77 5 -5 -31 -28 37 -62 -81 64 34 -11 -33 -173 -90 64 -77 -129 49 136 81 -11 -25 -33 -131 -101 -20 -102 -139
5941a39L6M7J52oj83N1J46l2m5J0l1n0L4J13J5o8kj5o8j1O2O3j3l4op6j0J78M5j62o4K3n2
$$ -139 -103 -56 96 90 -93 -42 104 72 27 37 6 -44 -10 103 118 50 48 33 -35 -46 16 79 66 32 26 -50 -60 118 163 1 -63 -40 -92
5933i2n8O5J04j0k1J5m2L2L5j47j4J10j10LK18m2j59L4N3K2J4l8J2M4n1o3P5J77Q3j66k51
$$ -92 -150 -85 19 9 -12 3 -39 -7 28 -119 -133 -23 -133 -130 88 46 -113 -79 -26 -4 10 -28 -16 28 -23 -86 -11 166 249 83 -168
5926a68oJ44j6O1K55m9k28J8o1j00J94M7j19P3m7j12J17N3K9P5j56j03O2n9N6R7j49L7J51
$$ -168 -174 -30 -46 15 270 221 -7 11 -50 -150 44 91 -28 45 -2 -114 3 56 85 160 4 -99 -37 -96 -40 57 -92 -55 96
5920I6j97l8K98l4k04M7JkJ69p5k27P5J02j1O6j2J6J19j43j70J19O1p6j04l5K50J73j46j0
$$ 96 -101 -139 159 125 -79 -32 -31 -33 136 61 -166 -91 11 0 66 54 70 189 46 -124 -5 56 -20 -124 -159 91 264 118 108
5913A08P9l5m9j69k7K15n9n7K23p5j87J31M2j73n1J66J13j39j7J15j84q0K21l9j27P2L5R1
$$ 108 187 152 103 -66 -93 122 63 6 229 154 -33 98 140 -33 -84 82 195 56 39 154 -30 -110 111 72 -55 17 52 143
5907A43Q2j71j09J12N6r1j08m4K7J35J33m8j2M9j39l6Q8j32k5J32o6pJ12nK2j0j09k3K6Mn5
$$ 143 225 54 -55 57 113 22 -86 -130 -103 32 165 117 105 154 15 -21 67 -65 -90 42 -24 -31 81 76 98 88 -21 -44 -18 -14 -69
5900f9j8J78K0j25J72N5k34pN7J7J20r9j43R8J7l9J9m0P1J05j42k06K7K42N0k47l4J83K2o4
$$ -69 -87 91 111 -14 158 213 -21 -28 29 46 166 67 -76 22 39 0 19 -21 50 155 13 -193 -166 76 126 -121 -155 28 50 -14
5893a4p3k9L6n8L4J26n6K2N6j86k9J30m2m8j4Q1J13j71J6L02j85k42K42J05p8j0q5NNj33L4
$$ -14 -87 -116 -80 -138 -104 22 -34 -12 44 -142 -171 -41 -83 -131 -145 -64 49 -122 -106 196 11 -231 11 116 38 28 -57 -52 -47 -180 -146
5886a46P7M5J18j55j80K28R3j19P6k3j52N8Q7J8Q2K5j26r2J15Q9j44N5K59j55k06J81n2k17
$$ -146 -69 -24 94 -61 -241 -13 80 -39 37 14 -138 -80 7 25 107 132 6 -86 29 118 -26 29 288 133 -73 108 56 -161
5879a61J51L6j69J30J15q5M6J9o2L4p4j07J14O7p2N3J05k0l6nm4K5P4j23j22J40Q1q0o3j14
$$ -161 -10 26 -143 -13 102 17 63 82 20 54 -20 -127 -13 54 -18 35 140 120 84 79 35 60 134 11 -111 29 110 30 -33 -147
5873a47J5J31q8J0J69j68j39J77Nn6P7KO8L1j73L6J48j04p5Mq9N0J18o4pJ48Rj31q9RJ93K02
$$ -147 -132 -1 -89 -79 90 -78 -217 -40 -35 -91 -14 -12 56 87 -86 -50 98 -6 -81 -77 -166 -116 2 -62 -69 79 88 -43 -132 -123 70 272
5865B72j60k35Q2J5j78N2J57l2o6jN4J04M6K8K0j55j17J28L6j09O7L6j20L8k9j77J81J84j97
$$ 272 112 -123 -41 -26 -204 -152 5 -27 -93 -94 -40 64 110 138 158 3 -114 14 50 -59 8 44 -76 -38 -67 -244 -63 121 -76
5859g6M2J46k07j1J67j17n4P8%M4k6k0O6j31M0K56j98j11L37r4k39J85m3j71K24J09k28j60
$$ -76 -34 112 -95 -106 61 -56 -110 -32 -32 12 -14 -34 32 -99 -59 197 -1 -112 225 131 -108 77 34 -137 87 196 -32 -192
5852a92M8J21o2j02K15J51j68JJ33j01r9K9j4rk3o6Q3J36j4L2J15p1j76q7l2L2O7J9J6KoN6
$$ -192 -144 -23 -85 -187 28 179 11 12 145 44 -55 -26 -40 -49 -72 -138 -55 81 67 99 214 143 -33 -120 -152 -120 -53 -34 -18 -16 -22 34
5845C4m7j34R2J25j13j7J93N6j24j00K7R8k8j44J5J88P7j51j54O0R9q0o4R6j2j44P6J89m4
$$ 34 -13 -147 -55 70 -43 -60 133 189 65 -35 -8 90 62 -82 -67 121 198 47 -107 -47 52 -28 -92 4 -8 -152 -76 113 69
5839F9n7R3j06k03Q4J76K0q7k9J80M6k71OK25j08j03M1r9R1K03j36q6J27r1j14J67J17j51
$$ 69 12 105 -1 -204 -120 56 76 -11 -40 140 186 -85 -79 146 38 -65 -24 -123 -32 171 35 -51 76 -15 -129 38 155 4
5832Dj08J11N8p8J2L5j5M1k5r9J2Q4Q2K4r8j09j2R5O9j08j6J53p4j61P0Q9J2PJ7N6q8j76L6
$$ 4 -104 7 65 -13 -1 34 19 60 35 -64 -52 32 114 138 40 -69 -81 14 83 -25 -41 112 38 -123 -53 36 48 55 72 128 40 -136 -100
5825a00Q4J4N1n7p0P8O9O6j7j46L4J2k22Q3K57j46j40J79N1j34l6P4O5k0k8M5r9k30O0K49
$$ -100 -16 -2 49 -8 -78 0 69 135 118 -28 6 18 -204 -121 136 -10 -150 29 80 -54 -90 -16 49 29 1 46 -53 -283 -223 26
5818B6Rr1J7L0K0n3q0M6j2LJ74q3k00J30J6j03J56K4l6J70m4r1O5j74o1K49l0j88K5P1%n0
$$ 26 35 -56 -39 -9 11 -42 -122 -76 -88 -85 89 6 -194 -64 -48 -151 5 29 -7 163 119 28 93 -81 -142 107 77 -111 -86 -15 -15 -65
5811f5N6%l58k9N11M9k25J34l9j57J26Mr3L1m0N3J26q8n9N4JL0jKQ5j14j45J38K9j69%J44
$$ -65 -9 -9 -367 -396 115 164 -61 73 34 -123 3 7 -86 -55 -95 -42 84 -4 -63 -9 -8 22 21 23 108 -6 -151 -13 16 -153 -153 -9
5803iJ13j4o3J00K1j62L4N1j37P0J02j97k4K32k3j87nN5QJ9o2p7P5N4%Q6l3j27J9M1P2Q8r2
$$ -9 104 90 27 127 148 -14 20 71 -66 4 106 -91 -115 117 94 -93 -98 -43 -35 -16 -78 -155 -80 -26 -26 60 27 -100 -81 -40 32 120 28
5796B8jL9j87M4J70j04Q1O9k85M1K12r1K2J7j11R4Pj01P3l6n3Q0n6LJ40Kk6Rk9p4j31PQ3k2
$$ 28 27 66 -121 -77 93 -11 70 139 -146 -105 107 16 38 55 -56 38 45 -56 17 -19 -72 8 -48 -45 95 97 71 80 51 -23 -154 -147 -64 -86
5788h6Q1O0p5J08P2j70n9P6N9n3j60P8J90p0o0L8m4k9n0j05k2R1J11p9n5K40K1j90J29P4j11
$$ -86 -5 55 -20 88 160 -10 -69 7 66 13 -147 -69 121 51 -9 29 -15 -44 -94 -199 -221 -130 -19 -98 -153 87 108 -82 47 121 10
5781A0R6N0q1l7k0J72J21k21j10P7k9j06r5J15J29j59M5J89j91j04P0j72k9J46K5J39J42k6
$$ 10 106 156 75 38 18 190 311 90 -20 57 28 -78 -173 -58 71 -88 -43 146 -45 -149 -79 -251 -280 -134 -109 30 172 146
5775A46pj30j80J18J79l6m1M9k3n0L3o8j05J60Q6k51p1K11L1j28K6P8o4QJ08p9n7P7j15j6
$$ 146 139 9 -171 -53 126 90 49 98 75 25 58 -10 -115 45 131 -120 -191 20 51 -77 -51 27 -37 -29 79 0 -57 20 -95 -111
5768a11J90j34j58J78P2l1L5n0rN7k0k4j5k7l8NJ06q8k11J45J65q8Q2O8j99k6J71J4q0M9J31
$$ -111 79 -55 -213 -35 37 6 41 -9 -18 39 19 -5 -20 -47 -85 -80 26 -62 -273 -128 37 -51 31 99 -100 -126 45 59 -21 28 159
5761A59l6j49m1L5K1q8j05J50R4j44M8O5r7J02K6j74N0N3l6J02m3o7J85J1k12n1J04P4p0p9
$$ 159 123 -26 -67 -32 -11 -99 -204 -54 40 -104 -56 9 -88 14 40 -134 -84 -31 -67 35 -8 -75 110 121 -91 -142 -38 36 -34 -113
5754a13P4N1L1J9j57l4J98L7j02r9q2J03R0n9P5J12p0o8P0J47o1k71M4K50l1j25j14j13J03
$$ -113 -39 12 43 62 -95 -129 69 106 4 -95 -177 -74 16 -43 32 144 74 6 76 223 162 -109 -65 185 154 29 -85 -198 -95
5747i5P2oJ72l3j93J01O8l5L3j99j19J55q9o3J84JM3J39j22o6O4q7m2O4J9NPJ7k8OJ17n8r3
$$ -95 -23 -29 143 110 -83 18 86 51 84 -115 -234 -79 -168 -231 -47 -46 -3 136 14 -52 12 -75 -117 -53 -34 -29 -22 -5 -33 -27 90 32 -61
5740f1J13m4m0J27j48j14J18n0J18K08j70o1N0j07J42J23j74J7J20q7j82m9J87oj67J64O2
$$ -61 52 8 -32 95 -53 -167 -49 -99 19 227 57 -4 46 -61 81 204 30 47 167 80 -102 -151 36 30 -137 27 89
5734H9j09R0k28k29L90J63k00O4Q0kk3j20L8N3r1K4qo0P7L8Lk7p4N2k6r7J04K7o2L0l8J02
$$ 89 -20 70 -158 -387 3 166 -34 30 110 108 85 -35 3 56 -35 -11 -19 -79 -2 36 39 12 -62 -10 -36 -133 -29 -2 -64 -34 -72 30
5727C0J67j39o3J17n2q2rPJ6QR8k2j66J08J27j56r7M1J18K2k00K8J01j68O5J49m5J31j5j43
$$ 30 197 58 -5 112 60 -22 -31 -24 -8 0 98 76 -90 18 145 -11 -108 -67 51 73 -127 -99 2 -166 -101 48 3 134 119 -24
5720b4J72l4j67J37m5j29O3j0P4O5j03O6L8j10l3n2P8L3k22J88K85k74o6J81j66l8K03O8k5
$$ -24 148 114 -53 84 39 -90 -27 -37 37 102 -1 65 103 -7 -40 -92 -14 19 -203 -15 270 -4 -70 111 -55 -93 110 178 153
5713A53n5k1j27j97J77J53k04k9N3QJ62j05j35L00J8l08P0J74o6j39o1J23J20p3j25k9J76
$$ 153 98 77 -50 -247 -70 83 -121 -150 -97 -89 73 -32 -167 133 151 -157 -87 87 21 -118 -179 -56 64 -9 -134 -163 13
5707A3J83j19j35L4l5l4K5J7J09j7j59K02K51k73k07J91J7j41K9M7k5n2K2J15j19j05L45J07
$$ 13 196 77 -58 -24 -59 -93 -68 -51 58 41 -118 84 335 62 -145 46 63 -78 -49 -2 -27 -79 -57 58 -61 -166 179 286
5701B86k86P8R0k26QJ03m4om9K2N3j67J2J39j72O7M19j4l40l2J88m2k53j4J75k8o9J00P8m1
$$ 286 0 78 168 -58 -50 53 9 3 -46 -24 29 -138 -126 13 -159 -92 327 313 -27 -59 129 87 -166 -180 -5 -33 -102 -2 76 35
5694C5l5O0L8m6j5j5M5J02r2o2J08p9l1J33j17p7J13j08j79n0O9K01K9m6Q0j05n4J47j40r1
$$ 35 0 60 98 52 37 22 67 169 77 15 123 44 13 146 29 -48 65 -43 -222 -272 -203 -2 27 -19 61 -44 -98 49 -91 -182
5687a82K28j1j13R6qj55jK41J07k19QJ91j91j26K01Lq3M0n4k7P1m0m2J24R0j01p4Pq2mR9m1
$$ -182 46 35 -78 18 10 -145 -146 95 202 -17 -9 182 -9 -135 66 69 -14 26 -28 -55 16 -24 -66 58 148 47 -27 -20 -102 -106 -7 -48
5680d8L2J12j00rJ38r9r2O8n5l5J35R2k6l2rr7j33J6jp6J00J55P9J14n6k44n2J18J0j15l0
$$ -48 -16 96 -4 -13 125 26 -66 2 -53 -88 47 139 113 81 72 -25 -158 -142 -143 -219 -119 36 115 229 173 -71 -123 -5 5 -110 -140
5673a40K11J47j51q7O3m7l9O6O5M9p0r8P0m7j56J46J30j49p1j3L4J98p0k28J75J66j34J2J37
$$ -140 71 218 67 -20 43 -4 -43 23 88 137 67 -31 39 -8 -164 -18 112 -37 -108 -121 -87 111 41 -187 -12 154 20 32 169
5666A69J7r2j34n7p7o5K05J30j96j35J2J39J80j71j26L45P5k83K5J2k07R5J63j50k6J49j14
$$ 169 186 94 -40 -97 -174 -239 -34 96 -100 -235 -223 -84 96 -75 -201 144 219 -64 -39 -27 -234 -139 24 -126 -152 -3 -117
5660a17j00J66j8j56P8R4K2O2l2k2N7l3oK3o7jM1QJ4j04l1J87J4r9P6M9m8q3j18roKK38J03
$$ -117 -217 -51 -69 -225 -147 -53 -31 31 -1 -23 34 1 -5 18 -49 -50 -9 -1 13 -91 -122 65 79 -20 56 105 57 -26 -144 -153 -159 -157 81 184
5652A84j97j9N0j10N5R8j16J0J73J3n9o5q5J14J46r1m7l5j87N1J59j51r5J40J04L2j23j11
$$ 184 -13 -32 18 -92 -37 61 -55 -45 128 141 82 17 -68 46 192 101 54 19 -168 -117 42 -109 -204 -64 40 72 -51 -162
5646a62J50O4o3P5J7q4q0j7K05J6l12R9K61k53k25J53J75R2q5j84L7J82O6j20j14J09J05p8
$$ -162 -12 52 -11 64 81 -3 -83 -100 105 121 -191 -92 169 -84 -309 -156 19 111 26 -158 -121 61 127 7 -107 2 107 29
5640B9q4k9Q4O9j75k6J75j32q5K44Pj37Q7M2m0M3qr2n9M9P4m0k1rj29P4K27j01j04J36r5j39
$$ 29 -55 -84 0 69 -106 -132 43 -89 -174 70 77 -60 27 69 29 72 64 -28 -87 -38 36 -4 -25 -34 -163 -89 138 37 -67 69 -26 -165
5632a65J94R6j54l5R6Kj08K0J51r8k13J00J63J9No9qQ4j38j38J08K5k6N4n7J8J35r5j12J48
$$ -165 29 125 -29 -64 32 34 -74 -54 97 -1 -214 -114 49 68 73 4 -4 80 -58 -196 -88 -63 -89 -35 -92 -74 61 -34 -146 2
5626BP7j08l9j2j02QJ66Qj18R3J35j24j70j7N8J32J74O4j20k06n0J49mj54J54K35k20k68J13
$$ 2 79 -29 -68 -80 -182 -174 -8 0 -118 -25 110 -14 -184 -201 -143 -11 163 227 107 -99 -149 0 -4 -158 -4 231 11 -257 -144
5619a44R7l3R0O0q4j3J22R8n6j33r6l5Q1R8jL4j9j37M2M6j52M8J36j08nJ18k9P1J49j14j98
$$ -144 -47 -80 10 70 -14 -27 95 193 137 4 -92 -127 -46 52 51 85 66 -71 -29 17 -135 -87 49 -59 -64 54 25 96 245 131 -67
5612f7MP7o6q4J00L8j26O3J54n5k4O9p0n2O8L1j8r9j27P6J25mO5J5j69QJ10n9Q1J44j61q4
$$ -67 -63 14 -52 -136 -36 2 -124 -61 93 38 14 83 13 -39 29 60 42 -57 -184 -108 17 13 78 93 -76 -68 42 -17 64 208 47 -37
5605c7J71j5j71n7l4k2J07J24m9j23N2J11q1p1J06ko1J60Rk57J38K89k45j88J82n2m6J93q9
$$ -37 134 119 -52 -109 -143 -165 -58 66 17 -106 -54 57 -24 -95 11 9 -52 108 117 -140 -2 287 42 -146 36 -16 -62 131 42
5598D2j12J53j13k28K21L19q7k53M8K04o1j82l6N3P8k5j26K9J30mo5O1J56oj31lL7j6n6r7
$$ 42 -70 83 -30 -258 -37 282 195 -58 -10 194 133 -49 -85 -32 46 21 -105 -76 54 50 -15 46 202 196 65 62 99 83 27 -70
5591g0Q5R1j43J09K07k14j06J21o0k8p4j62J56J48j10p6r6QK48J11j02j33k5J34j5j51l8p
$$ -70 15 106 -37 72 279 65 -41 80 20 -8 -82 -244 -88 60 -50 -126 -222 -214 34 145 43 -90 -115 19 4 -147 -185 -192
5585a92J30J54p8N5L8k87l0J95m6n4K1J13J48j69p8K04j21j06K56J8j75l9o9oR4p1j30N5J17
$$ -192 -62 92 14 69 107 -180 -210 -15 -61 -115 -94 19 167 -2 -80 124 3 -103 153 171 -4 -43 -112 -118 -24 -95 -225 -170 -53
5578e3L3jq7k8K46k2l37J80K36j74J90J43l35L7L4k79K12J63j99J15p7k82K80K03j74J6k5
$$ -53 -20 -21 -108 -136 110 88 -249 -69 167 -7 183 326 -9 28 62 -217 -5 158 -41 74 -3 -285 -5 198 24 40 15
5572A5j39Q2P7o5JP3l1j42m5O1P1J37M5j92j95OK01J74p6j80l7J00K2m6J93J55k33j12P3p9
$$ 15 -124 -42 35 -30 -29 44 13 -129 -174 -113 -42 95 140 -52 -247 -241 -40 134 58 -122 -159 -59 -37 -83 110 265 32 -80 -7 -86
5565h6Q3J28r2Lp4j77J41J27l1Mj92j02K12P8OL0p6N0O8p3nk1M4J64n4q6K8q1mj1j51Q2J09
$$ -86 -3 125 33 36 -38 -215 -74 53 22 26 -166 -268 -56 22 28 58 -18 32 100 27 22 1 45 209 155 69 97 16 12 1 -150 -68 41
5558D1q0J14P6k27o0K04J08j09j29Q3J32o1p9M7j0j33pJ43Nk0J7j86l0K54j2p0J44o8j35O3
$$ 41 -39 75 151 -76 -136 68 176 67 -62 21 153 92 13 60 50 -83 -90 53 58 38 55 -131 -161 93 81 11 155 87 -48 15
5551A5P3L7j20j75Q4M1k2J93l1k36P8P1j22M8J21k9o1J7P6K5o8q7n3mL0J01Q7j00l1J74m9
$$ 15 88 125 5 -170 -86 -45 -67 126 95 -141 -63 8 -114 -66 55 26 -35 -18 58 83 15 -72 -125 -129 -99 2 89 -11 -42 132 83
5544H3k42m7P4O7M9%Nl9rJ55J5k18j07Q9J91N5k44o5K66O3j15PJ1j8k4m5L9Nj31PJ43l0j19
$$ 83 -159 -206 -132 -65 -16 -16 -11 -50 -59 96 111 -107 -214 -125 66 121 -123 -188 78 141 26 33 44 26 2 -43 -4 1 -130 -123 20 -10 -129
5537a29M6J14l3j22M1K18Q8j42q7N7k8j58n7J43J32j8k8j2q3qO4n9m6P2J8m5m9l9M8R7P2n
$$ -129 -83 31 -2 -124 -83 135 223 81 -6 51 23 -135 -192 -49 83 65 37 25 -58 -66 -2 -61 -107 -35 -17 -62 -111 -150 -102 -5 67 62
5529F2j05rO7o3%R8nR0P7k58j63J61J13M0Jq0N9O4j57o3Q0q5r5J08J14m7j13L4J71K0q7M0
$$ 62 -43 -52 15 -48 -48 50 45 135 212 -46 -209 -48 65 105 106 26 85 149 -8 -71 9 -76 -171 -63 51 4 -109 -75 96 116 29 69
5522F9lq0J3j3N4J47k12k50K23J15j36N1j0n7R5n7m7Q2o3O1R5j87j1J37o3l8o3L2K62j22k49
$$ 69 66 -14 -1 -14 40 187 -25 -275 -52 63 -73 -22 -32 -89 6 -51 -98 -16 -79 -18 77 -110 -121 16 -47 -85 -148 -116 146 24 -225
5515b25J87Q2l8M4j88L8K80j68j61J58M2op0r6J13j9r5J17rm5L6j14Q5J79j81q8J43J7J0O
$$ -225 -38 44 6 50 -138 -100 180 12 -149 9 51 45 -25 -121 -8 -27 -122 -5 -14 -59 -23 -137 -52 127 -54 -142 1 18 28 34
5508C4m3k3o9J07J59j89q4J61j04j08J43N8J0N2n2r5k9M7P6jj53j68Q2K06L0k9j2n4J3K0K2
$$ 34 -9 -32 -101 6 165 -24 -108 53 -51 -159 -16 42 52 104 52 -43 -72 -25 51 50 -103 -271 -189 17 47 18 6 -48 -35 -15 7
5501GP5m2M9J59j36p4J56r1r8K9q6N3Rj22K17J15j79Q0Lj26J37%j01J5j89q7J02o0J18J65
$$ 7 82 40 89 248 112 38 194 103 5 34 -52 1 10 -112 105 220 41 121 124 -2 135 135 34 49 -140 -227 -125 -185 -67 98
5494I8j15K9M6j30L5LNK20l2k03j8q1RK15L3q5p0j02O3J49N6M7l0o4N2m4j91m4Q9k0k6J01
$$ 98 -17 12 58 -72 -37 -34 -29 191 159 -44 -62 -143 -134 81 114 29 -41 -143 -80 69 125 172 142 78 130 86 -105 -149 -60 -80 -106 -5
5487el7j33J22J14p7P1O9j11QK3k9J45N5j14qm2q7N5O5K1Rk1j4j38j06K22J36j62n8K6NQj14
$$ -5 -42 -175 -53 61 -16 55 124 13 21 44 15 160 215 101 93 51 -36 19 84 105 114 93 79 -59 -165 57 193 31 -27 -1 4 12 -102
5480a02K7J75j24o8K22l0j25P1k7l2jj58K1K31N7l0J6k9r8j07O3P0j49L2K41q5k01R6J52K
$$ -102 -75 100 -24 -92 130 100 -25 46 19 -13 -14 -172 -151 80 137 107 123 94 -4 -111 -48 22 -127 -95 146 61 -140 -44 108 110
5473A10n8n4m6J3M6j00q3J72Mj94J36J75r9J0N2j13m0P5N7J6M6N5j51j82Q3P4n3NO2J07p9
$$ 110 52 -2 -48 -35 11 -89 -172 0 4 -190 -54 121 22 32 84 -29 -69 6 63 79 125 180 29 -153 -70 4 -49 -44 18 125 46
5466D6k36R6J12j76O8J48p9N2L6n4J45N1j24q0j14j7O7j9K4m5k9K12L8j30P4O9J8k5j23N5
$$ 46 -190 -94 18 -158 -90 58 -21 31 67 13 158 209 85 5 -109 -126 -59 -78 -54 -99 -128 84 122 -8 66 135 153 128 5 60
5459F0j6j63J59J3j91K79Q8l16J34J44j82L1l3j54J30J11k5K5l4l4M1N5L5j08j14P0R4J5p9
$$ 60 44 -119 40 53 -138 141 229 -87 47 191 9 40 7 -147 -17 94 69 94 60 26 67 122 157 49 -65 5 99 114 35
5452C5j22J1J2j14m2J7K0N4j3K1J57Q1o4p5jN5l0j03l8N9J20N4o2n0J2Q1J1j69pJ41r8k7J54
$$ 35 -87 -76 -64 -178 -220 -203 -183 -129 -142 -121 36 117 53 -22 -23 32 2 -101 -139 -80 40 94 32 -18 -6 75 86 -83 -90 51 -47 -74 80
5445H0j25q2K70Q5j50MJ0j59j28L3Q6Q3Q9k9j25mJ40J09j21j83J40J48k02p0J18q8n7P3m8
$$ 80 -45 -127 143 228 78 82 92 -67 -195 -162 -76 7 96 67 -58 -62 78 187 66 -117 23 171 -31 -101 17 -71 -128 -55 -103
5438a03l9K8o1r0J16K62p2k76J09J77n8J8m6q6J24k9r9J15Kk7L5j01J6jj43J60N8k20J80J64
$$ -103 -142 -114 -175 -265 -149 113 41 -235 -126 51 -7 11 -35 -121 3 -26 -125 -10 -8 -35 0 -101 -85 -86 -229 -69 -11 -231 -51 113
5431A13k19kR5rJ09Np0k4j53j7J58M9N9m1j48R1L4j44J48J88j29q0L8q7p1J11P3j65j14J86
$$ 113 -106 -108 -13 -22 87 92 22 -2 -155 -172 -14 35 94 53 -95 -4 30 -114 34 222 93 13 51 -36 -107 4 77 -88 -202 -16
5425a6J26j53o9J02K6N7P3j85j15K17L5j30J50R0j99j09N8P0Ln0j3r0j20O5J35J52J08j25
$$ -16 110 -43 -112 -10 16 73 146 -39 -154 63 98 -32 118 208 9 -100 -42 28 31 -19 -32 -122 -242 -177 -42 110 218 93
5418I3j11n4j55Q8K08k7l2o7m2K13K8j26Q5kj7K4j92k1J03j07O9N8j60N9N5p3O8J9L9oj81
$$ 93 -18 -72 -227 -139 69 42 10 -57 -99 114 142 16 101 99 82 106 -86 -107 -4 -111 -42 16 -144 -85 -30 -103 -35 -16 23 17 -164
5411a64J65J60k93lJ76j19m3NP2J58j33j4J73j19M7N6l04P6K00j32J00N2j48J11q2k15J65
$$ -164 1 161 -132 -135 41 -78 -121 -116 -44 114 -19 -33 140 21 68 124 -180 -104 96 -36 64 116 -32 79 -3 -218 -53
5405e3J04o0l1p8R9J12r7pJ2pJ11q9k19J9J34J16N5l6n3j12k5K09J49r9j67J2J01j15n4J82
$$ -53 51 -9 -40 -118 -19 93 -4 -11 1 -6 105 16 -203 -184 -50 66 121 85 32 -80 -105 104 253 154 -13 -1 100 -15 -69 113
5398A13l5q8J03l9l1M0j54k5J45L9P8j3j61o9r9j0K15M4q1Qj07j01R6Q5k9JJ26O4j05l1N9
$$ 113 78 -10 93 54 23 63 -91 -116 29 68 146 133 -28 -97 -196 -206 9 53 -28 -20 -127 -228 -132 -47 -76 -75 51 115 10 -21 38
5391C8J0k9q1O9K08j32k78J7Q5J06K06n5l04p0K31J18j24o3L4N4R4j06j74J14O2p1P8l8j15
$$ 38 48 19 -62 7 215 83 -195 -178 -93 13 219 164 -140 -210 21 139 15 -48 -14 40 134 28 -146 -32 30 -41 37 -1 -116
5385a16J49J06j47j52L1J44K3L4J20j37j42Q2j05o2J83k2j2K03n2j89k1jQ3J42j03j59J34
$$ -116 33 139 -8 -160 -129 15 38 72 192 55 -87 -5 -110 -172 11 -11 -23 180 128 -61 -82 -83 0 142 39 -120 14
5379A4J13j48K1J61j14q7N6j01jJ39k6J9Q1p0j12m8J99K39k07k28P1j2k1nj5K40j7l80J12
$$ 14 127 -21 0 161 47 -40 16 -85 -86 53 27 46 127 57 -55 -103 96 335 128 -100 -29 -41 -62 -67 -82 158 141 -239 -127
5372a27K32j91M4J81j77o9J56l2q1P3k2j48QO9J9J38P2q1N7rj60J8j2q8J66J00j67l8J17o
$$ -127 105 -86 -42 139 -38 -107 49 17 -64 9 -13 -161 -153 -84 -65 73 145 64 121 112 -48 -30 -42 -130 36 136 -31 -69 48 42
5365D2j30j9J27L6L6J15j49k19J52J71j58j26J64J10j93j25J07L1k2O4M7Nk9l4j1l4L1j7j30
$$ 42 -88 -107 20 56 92 207 58 -161 -9 162 4 -122 42 152 -41 -166 -59 -28 -50 14 61 66 37 3 -8 -42 -11 -28 -158
5359a58Q6J11j31rK2j32N3R8rM3q4o7J95J65Nj09q2R2j2o0N0j59qK39j98j07L05j46j98K61
$$ -158 -72 39 -92 -101 -79 -211 -158 -60 -69 -26 -110 -177 18 183 188 79 -3 89 77 17 67 -92 -100 139 -59 -166 139 -7 -205 56
5352E6nj84R5J14K3r4j64J0J04L8JN8J10j00j59N0p6n5K77N0j55J32K5k20k6Q6n4o1J32J55
$$ 56 51 -133 -38 76 99 5 -159 -149 -45 -7 -6 52 162 62 -97 -47 -123 -178 99 149 -6 126 151 -69 -95 -9 -63 -124 8 163
5345A63o9l6R9p1j46o5k9J14J02o3JM8n1l3L3J5l3k0J3j0R7J06j27l3J08j13m9P8j36o5J73
$$ 163 94 58 157 86 -60 -125 -154 -40 62 -1 0 48 -3 -36 -3 12 -21 -41 -28 -38 59 165 38 5 113 0 -49 29 -107 -172 1
5338AJ27j0j80j14J21K0k8Q1n5j16r4n1J87M8j37K22J02k65J32J99k56p7J46o6kJ31k9n7M9
$$ 1 128 118 -62 -176 -55 -35 -63 18 -37 -153 -247 -298 -111 -63 -200 22 124 -141 -9 190 -66 -143 3 -63 -65 66 37 -20 29
5331B9j3o4J9k9j02J12J49j92j61K43K07j22j12P1J8j06jO7r5o6J48j4k35L3J67r7j5J75m1
$$ 29 16 -48 -29 -58 -160 -48 101 -91 -252 -9 198 76 -36 35 53 -53 -54 13 -82 -148 0 -14 -249 -216 -49 -146 -161 14 -27
5325b7l5J66l1j18L7n9o3J06M0PO1m6m7N1ll1Jm3oP0l0r7J2J0MJ22n4k65J5J77lMLo8P9J15
$$ -27 -62 104 73 -45 -8 -67 -130 -24 16 23 84 38 -9 42 39 8 9 -34 -40 30 0 -97 -85 -75 -71 51 -3 -268 -253 -76 -79 -75 -72 -140 -61 54
5317E4J2Oo6n9N1k2m4N4J4n5q5n6O8Q1K6j0j16l6J44K0q1P4P7n4m1k4n3N0Q5l7K4O6r1N5J23
$$ 54 66 72 6 -53 -2 -24 -68 -14 0 -55 -140 -196 -128 -47 -21 -31 -147 -183 -39 -19 -100 -26 51 -3 -44 -68 -121 -71 14 -23 1 67 -24 31 154
5309A54k34r9K38Lm6Q7j12j04KK8J74m7j59K11K4k10Q6n3j21J89j1o1J02j51K8K66j09o7N9
$$ 154 -80 -179 59 62 16 103 -9 -113 -111 -83 91 44 -115 96 120 -90 -4 -57 -178 11 0 -61 41 -110 -82 184 75 8 67
5302F7j54J24J83j80K3N1k39P1J94j83j01J63N8q3p2j8N5J13K3j10K2J31p6j42L1Q9K7m1k6
$$ 67 -87 37 220 40 63 114 -125 -54 140 -43 -144 19 77 -6 -78 -96 -41 72 95 -15 7 138 62 -80 -49 40 67 26 0
5295@k1j05NJ54j1j02M0R0O2Kr3r5K1J28l7k15M5J79j22j49R1J20K9j9N3P7o5n2m0j34N7J52
$$ 0 -21 -126 -121 33 22 -80 -40 50 112 114 21 -74 -53 75 38 -177 -132 47 -75 -224 -133 -13 16 -3 50 127 62 10 -30 -164 -107 45
5288D5m4n3k8J2J31l0n4R0j34p2K11k9k5J88j47j79J43j3j54k2O5J57N4j24m9j1L6R9j16p2
$$ 45 1 -52 -80 -68 63 33 -21 69 -65 -137 74 45 20 208 61 -118 25 12 -142 -164 -99 58 112 -12 -61 -72 -36 63 -53 -125
5281a25K60J6k80O0J54j27J6J11j63o7J01q0Q9K79n6j31Nj37j4J18j34q1J42N0Ml1j07L7J01
$$ -125 135 151 -129 -69 85 -42 -26 85 -78 -145 -44 -124 -35 244 188 57 62 -75 -89 29 -105 -186 -44 6 10 -21 -128 -91 10
5275A0PJ1K0M1P6k3r8n0j5lrNQ6P7r8j28R6J08r4l9k8j19J03Q5j53J28K17j74r8J02lL1nj27
$$ 10 17 28 48 89 165 142 44 -6 -21 -24 -33 -28 58 135 37 -91 5 113 19 -20 -48 -167 -64 21 -132 -4 213 39 -59 43 40 71 66 -61
5267f1J8J60R9j09j82Q9J07j72p5P5J8J6k0K1pk32J4L40J3j71J2K5L4Pq2K7O7k6l9RP8m4j15
$$ -61 -43 117 216 107 -75 14 121 -51 -126 -51 -33 -17 -37 -16 -23 -255 -241 99 112 -59 -47 -22 12 19 -63 -36 31 5 -34 -25 53 9 -106
5260a06J39N6k24J2J93N7j6j16j17o6p2J81K04j14j8K6j68L2J30k2kq3MJ84j27j50J74l0n6
$$ -106 33 89 -135 -123 70 127 111 -5 -122 -188 -260 -79 125 11 -7 19 -149 -117 13 -9 -11 -94 -90 94 -33 -183 -9 -39 -95
5253i5K17j4j38P3K5m7j3K1R8q4j91J39J26k04m1J54k4PP6j52n7K57O9j59L3J22L5l6j83j36
$$ -95 122 108 -30 43 68 21 8 29 127 43 -148 -9 117 -87 -128 26 2 9 85 -67 -124 133 202 43 76 198 233 197 14 -122
5246a22O2L7J9N9l1k4K8l2J5J00Jj18q5M5M6k3K8J4q3p8n6J00K26m7j48M8o4p5J49qj17L7
$$ -122 -60 -23 -4 55 24 0 28 -4 11 111 112 -6 -91 -46 0 -23 5 19 -64 -142 -198 -98 128 81 -67 -19 -83 -158 -9 -17 -134 -97
5239i7l5m3R9O8J02P4j87j76J03J39n1j19RJ4k0J43L0k29L3J51j54J4K10j43j45K11J53j2
$$ -97 -132 -175 -76 -8 94 168 -19 -195 -92 47 -4 -123 -114 -100 -120 23 53 -176 -143 8 -146 -132 78 -65 -210 1 154 142
5232A42n2j98j87P7K16J08q3j30J4R1J4KN8J1j02p3N7M9k1J1np2ON1k8oL9k6j9N3N1J0k3j9
$$ 142 90 -108 -295 -218 -2 106 23 -107 -93 -2 12 14 72 83 -19 -92 -35 14 -7 4 -1 -73 -67 -16 -44 -50 -11 -37 -56 -3 48 58 35 16
5225A6k8p6NJ26J4j23j2R5J4l4k7p8l7O3j8m4P9J4m2L0p7l9J78M5o0L2r8k8K21rj66P1L7j39
$$ 16 -12 -88 -83 43 57 -66 -78 17 31 -3 -30 -108 -145 -82 -100 -144 -65 -51 -93 -63 -140 -179 -1 44 -16 16 -82 -110 111 102 -64 7 44 -95
5217i5k3J59Q5j79j07J80l4k69K8J59J1Lm1k7J10O4J7L6j06j63j9N5O2N4qj7J6j7l1L0K3N4
$$ -95 -118 41 126 -53 -160 20 -14 -283 -255 -96 -85 -82 -123 -150 -40 24 41 77 -29 -192 -211 -156 -94 -40 -48 -65 -49 -66 -97 -67 -44 10
5210A0J69l3k91M4L16n3j91O7nj38J9N3j9O3O9m7l2J9LK0o0j57M8J82K8Lm1j58P4J54j60r6
$$ 10 179 146 -145 -101 215 162 -29 38 33 -105 -86 -33 -52 11 80 33 1 20 23 43 -17 -174 -126 56 84 87 46 -112 -38 116 -44 -140
5203a40J44K3o2j6K5R4n4j75P8J27r8j6Q4r0q8P5P4L4j2n7O0N7j26m3Oj70jK07Q1R3L6j50
$$ -140 4 27 -35 -51 -26 68 14 -161 -83 44 -54 -70 14 -76 -164 -89 -15 19 7 -50 10 67 -59 -102 -96 -266 -267 -60 21 114 150 0
5195@L5J12o0K8n5k12J7O6PJ36l5j18Q4n6n1K45Lk57KO7o9P8J49o2r8N8Jp7M7P6R6J38j27
$$ 0 35 147 87 115 60 -152 -135 -69 -62 74 39 -79 5 -51 -102 143 146 -111 -109 -42 -111 -33 116 54 -44 14 15 -62 -15 61 157 295 168
5188A68k70K6J76L3p6MJ58J0k00n0L5k5K7om0J5KN9nj50O5J46n9J4Mj37O4Q5j74q2J61J22
$$ 168 -102 -76 100 133 57 61 219 229 29 -21 14 -11 16 10 -30 -15 -13 46 41 -109 -44 102 43 57 61 -76 -12 73 -101 -183 -22 100
5181A00n2o4O3O0Jj7p9lQj34L1J07j13KQ5j6J66J7l13J0J87o0L2J20r2j35QO2m4j5J40Lq4
$$ 100 48 -16 47 107 108 91 12 9 17 -117 -86 21 -92 -90 -5 -21 145 162 -151 -141 46 -14 18 138 46 -89 -81 -19 -63 -78 62 65 -19
5173a9P7J2N4J91k27m01J46K94m7n6R8%p9O2O9j23j08M2N2j0j1P1j0j54lk0j48K00J73k34
$$ -19 58 70 124 315 88 -313 -167 127 80 24 122 122 43 105 174 51 -57 -15 37 27 16 87 77 -77 -80 -100 -248 -48 125 -109
5166a09O2J92j72L3J54j36j0N8p9om1k1P5q1j7J55L1l8j30j19J88Q9j16J19J49k9r2j30J01
$$ -109 -47 145 -27 6 160 24 14 72 -7 -13 -54 -75 0 -81 -98 57 88 50 -80 -199 -11 78 -38 81 230 201 109 -21 80
5160H0J30k39p6J84q9o3J87J0j75m0J30L7q5R1L4k19M1J21j75J52L58k24l04J53Q5j46n4J8
$$ 80 210 -29 -105 79 -10 -73 114 124 -51 -91 39 76 -9 82 116 -103 -62 59 -116 36 394 170 -134 19 104 -42 -96 -78
5153g8M1J22Kk06RK89%k34M8P0j71j1J45o5j05O3K4l0O4O5O4J02r5j49J48K9l02kK30o2n2
$$ -78 -37 85 87 -119 -110 179 179 -55 -7 63 -108 -119 26 -39 -144 -81 -57 -87 -23 42 106 208 113 -36 112 141 -161 -163 67 5 -47
5146d7J25Pk5K5Mkj37j01J54L1j00O7ql1J42m7j49J7m9K1J68k3k7M1k00j16J89J24M4O5p7
$$ -47 78 85 60 85 89 87 -50 -151 3 34 -66 1 -7 -38 104 57 -92 -75 -124 -103 65 42 15 56 -144 -260 -71 53 97 162 85
5139H5j77o4P3K3m1O3J13L1j20j88J42L18p0j53K2j20j3J30j11rJ80l7j11r4n1J65J0j94O0
$$ 85 -92 -156 -83 -60 -101 -38 75 106 -14 -202 -60 258 188 35 57 -63 -76 54 -57 -66 114 77 -34 -128 -179 -14 -4 -198 -138
5133a38J20j3N7O9k8j48o2K70J12k70o0R2q8m1M9M6K2r9j8J01m1n3K7pL7Mk6R6k3j09J49J28
$$ -138 -18 -31 26 95 67 -81 -143 127 239 -31 -91 1 -87 -128 -79 -33 -11 -110 -128 -27 -68 -121 -94 -101 -64 -60 -86 10 -13 -122 27 155
5125A55j15l6P4m9j49n9Q8N8j5J7m3m0J06J5r5M1R0R9N2k26j60J66K5o8J05n3p6J50J9j8N3
$$ 155 40 4 78 29 -120 -179 -91 -33 -48 -31 -74 -114 -8 7 -88 -47 43 142 194 -32 -192 -26 -1 -69 36 -17 -93 57 76 58 111
5118A11j84j15J15KM9O7j02L6L9j23K5J0k7J54pm3J59n7p2R6j72j65P5K6Q1j1j54J54J48j33
$$ 111 -73 -188 -73 -71 -22 45 -57 -21 18 -105 -80 -70 -97 57 50 7 166 109 37 133 -39 -204 -129 -103 -22 -33 -187 -33 115 -18
5111a8l1m2m5J39m5o1K29J0j81Q3P2j76j44O4J11mM7J33k0n9K4p5o2P0J3k8M9qp9J9Q4L8L
$$ -18 -49 -91 -136 3 -42 -103 126 136 -45 38 110 -66 -210 -146 -35 -39 8 141 121 62 86 11 -51 19 32 4 53 45 -34 -15 69 107 110
5104A10q7r6M8j5o0J43mj81J33R5j86O3J65j01o8M7J1J7N6L7q4n6R6o2j29J26P7l1L3j37r7
$$ 110 23 -73 -25 -40 -100 43 39 -142 -9 86 -100 -37 128 27 -41 6 17 34 90 127 43 -13 83 21 -108 18 95 64 97 -40 -137
5097a37J88N9j04K4Q3Qr3n4K3j12m3J81M9o5J8K0Q4Mk25j07Q9Q8R0j7r5OK2L3N2p6n8Q2K4
$$ -137 51 110 6 30 113 121 28 -26 -3 -115 -158 23 72 7 25 45 129 133 -92 -199 -110 -22 68 51 -44 -38 -16 17 69 -7 -65 17 41
5089D1n5%L9J0KN3Ro0K9L3p4j3N0K7N3Oj25j57k1J54M0j59k6K9j21Q6K82lj30J1l7L2K19m8
$$ 41 -14 -14 25 35 37 90 99 39 68 101 27 14 64 91 144 150 25 -132 -153 1 41 -118 -144 -115 -236 -150 132 129 -1 10 -27 5 224 176
5082A76k84m3P3K1O6k4l8K1j77l4K70l1p6K34j02k49J03n7q0K55J5j10J41p2j40J88J01k9
$$ 176 -108 -151 -78 -57 9 -15 -53 -32 -209 -243 27 -4 -80 154 52 -197 -94 -151 -231 24 39 -71 70 -2 -142 46 147 118
5075A18L0j21q5Q4n8q7R9P4o3j11oJ19J5n7N8N0l9m9%J03jj45N9N0j68R4J75k56j79K09J43
$$ 118 148 27 -58 26 -32 -119 -20 54 -9 -120 -126 -7 8 -49 9 59 20 -29 -29 74 73 -72 -13 37 -131 -37 138 -118 -297 -88 55
5068E5mnJ8M5o2j11j2LO8Q4j07m7J22j3%J51k1j69n9J1n7j43l0K00J29n1K4N7o3p1jR6Q8j39
$$ 55 51 46 64 109 47 -64 -76 -73 -5 79 -28 -75 47 34 34 185 164 -5 -64 -53 -110 -253 -283 -83 46 -5 19 76 13 -58 -59 37 125 -14
5061a4j78K4J2M4J92l1r8K32K0l34QJ29j47K6J15j48j6J38n7M2J66j40j21K13P2j03J7j02
$$ -14 -192 -168 -156 -112 80 49 -49 183 203 -131 -123 6 -141 -115 0 -148 -164 -26 -83 -41 125 -15 -136 77 149 46 63 -39
5054c9m3L35Q8k91k0R8p2o8q1Q4J82k04j92J77J9k7J72m2j93p5N8K45N8k47L7J94j64k59L3
$$ -39 -82 253 341 50 30 128 56 -12 -93 -9 173 -31 -223 -46 -27 -54 118 76 -117 -192 -134 111 169 -78 -41 153 -11 -270 -237
5048b37K16M0j10J55J60k21r1Q9j72o1K34P1n5mo0l5L0j4%J7j9K1J0o9L8J42o4j68Q9J49r0
$$ -237 -21 19 -91 64 224 3 -88 1 -171 -232 2 73 18 14 -46 -81 -51 -65 -65 -48 -67 -46 -36 -105 -67 75 11 -157 -68 81 -9
5041in1J70L8k00m8J54Rr7N4O1j03l6J60jl12o7L12K2k20P8R1n2J13J5j50J19J10k44j32J75
$$ -9 -60 110 148 -52 -100 54 63 -34 20 81 -22 -58 102 101 -211 -278 34 56 -164 -86 5 -47 66 81 -69 50 160 -84 -216 -41
5034d1O8j08J2J04n5j34l8K6J21R4j22m2J58k1j40j6j3M1J31ln6kn8M0J24j30k15O9K04R4
$$ -41 27 -81 -69 35 -20 -154 -192 -166 -45 49 -73 -115 43 22 -118 -134 -147 -106 25 22 -34 -36 -94 -54 70 -60 -275 -206 -2 92
$$ [...]
-10156b
##END=	
##TITLE=	P
##JCAMP-DX=	6.0	$$ MestReNova 14.1.2-25024
##BLOCK_ID=	3
##DATA TYPE=	NMR PEAK TABLE
##DATA CLASS=	PEAK TABLE
##CROSS REFERENCE=	NMR SPECTRUM: BLOCK_ID=2                                     
##.OBSERVE FREQUENCY=	242.81249869999999191
##.OBSERVE NUCLEUS=	^31P
##NPOINTS=	1
##FIRSTX=	31.521924037440609112
##LASTX=	31.521924037440609112
##XFACTOR=	1
##YFACTOR=	1
##FIRSTY=	285.85412663321767468
##XUNITS=	PPM
##YUNITS=	ARBITRARY UNITS
##PEAK TABLE=	(XYW..XYW)
31.521924037440609112,285.85412663321767468,0.0029750790313499662909
##$MNOVA/PEAK_DATA_TABLE=	(T,F,A,ST,SP,APT,APC)
$$ Complementary to PEAK TABLE
$$ T: Type
$$ F: Flags
$$ A: Annotation
$$ ST: Shape Type
$$ SP: Shape Parameter
$$ APT: Attached Peaks Type
$$ APC: Attached Peaks Count
Compound,None,,1,0.26043939367809176844,0,0
##END=	
##END=	
