##TITLE=	H
PT20
diethyl methylphosphonate
CAS:683-08-9
15.7 mg/0.6mLCDCl3


##JCAMP-DX=	6.0	$$ MestReNova 14.1.2-25024
##DATA TYPE=	LINK
##BLOCK_ID=	1
##BLOCKS=	1    
##ORIGIN=	Mestrelab Research S.L.
##OWNER=	HGL
##$MNOVA/LINK_BLOCK_TYPE=	ITEM	$$ NMR Spectrum
##$MNOVA/ITEM/POLYGON=	(XY..XY)
5321,5835
8722,5835
8722,8208
5321,8208
5321,5835
##$MNOVA/ITEM/Z=	0
##$MNOVA/ITEM/ANGLE=	0
##TITLE=	H
##JCAMP-DX=	6.0	$$ MestReNova 14.1.2-25024
##BLOCK_ID=	2
##DATA TYPE=	NMR SPECTRUM
##DATA CLASS=	XYDATA
##NUMDIM=	1
##ORIGIN=	Varian
##OWNER=	HGL
##.OBSERVE FREQUENCY=	599.77808939999999893
##.OBSERVE NUCLEUS=	^1H
##.SOLVENT NAME=	cdcl3
##.PULSE SEQUENCE=	s2pul
##LONGDATE=	2006/10/31 16:41:30.000
##.ACQUISITIONMODE=	SIMULTANEOUS
##$ORIGINAL FORMAT=	Varian
##$MNOVA/SCALES_VERSION=	9
##$PARAMETER FILE=	(datafile, ASCII, d:/OPCW/NMR-Databases/RICD-NMR-fid_Database/Phosphorus%20compounds/Diethyl%20methylphosphonate/H.fid/fid, 0)
$$ 
##$PARAMETER FILE=	(header, BASE64, d:/OPCW/NMR-Databases/RICD-NMR-fid_Database/Phosphorus%20compounds/Diethyl%20methylphosphonate/H.fid/fid, 0)
AAAAAQAAAAEAAJnkAAAABAACZ5AAAmesAAAAyQAAAAE=
##$PARAMETER FILE=	(log, ASCII, d:/OPCW/NMR-Databases/RICD-NMR-fid_Database/Phosphorus%20compounds/Diethyl%20methylphosphonate/H.fid/log, 0)
$$ Tue Oct 31 16:41:15 2006: Experiment started
$$ Tue Oct 31 16:41:30 2006: Acquisition complete
$$ 
##$PARAMETER FILE=	(procpar, ASCII, d:/OPCW/NMR-Databases/RICD-NMR-fid_Database/Phosphorus%20compounds/Diethyl%20methylphosphonate/H.fid/procpar, 0)
$$ dof3 5 1 20 20 20 2 1 8202 1 64
$$ 1 0 
$$ 0 
$$ datname 2 2 8 0 0 3 1 0 1 64
$$ 1 ""
$$ 0 
$$ celem 1 1 9.99999984307e+17 -9.99999984307e+17 0 2 1 0 1 64
$$ 1 1 
$$ 0 
$$ arraydim 7 1 32768 1 1 2 1 5 1 64
$$ 1 1 
$$ 0 
$$ alfa 6 1 13 13 13 2 1 24578 1 64
$$ 1 6.6 
$$ 0 
$$ PROTONnt 7 1 32767 0 0 3 1 1 1 64
$$ 1 0 
$$ 0 
$$ MinSW 2 2 8 0 0 3 1 0 1 64
$$ 1 "off"
$$ 3 "off" "auto" "manual" 
$$ Gmap 2 2 8 0 0 2 1 1 1 64
$$ 1 "lk"
$$ 0 
$$ CARBONnt 7 1 32767 0 0 3 1 1 1 64
$$ 1 0 
$$ 0 
$$ Hprescan 2 2 8 0 0 3 1 0 1 64
$$ 6 "off"
$$ "auto"
$$ "off"
$$ ""
$$ "Complete"
$$ "Complete"
$$ 0 
$$ PFGflg 4 2 4 0 0 2 1 16385 1 64
$$ 1 "y"
$$ 0 
$$ acqpath 2 2 8 0 0 2 1 0 1 64
$$ 1 ""
$$ 0 
$$ acqdim 7 1 32767 0 0 2 1 0 1 64
$$ 1 1 
$$ 0 
$$ acqcycles 1 1 9.99999984307e+17 -9.99999984307e+17 0 2 1 0 1 64
$$ 1 1 
$$ 0 
$$ actionid 2 2 8 0 0 4 1 0 1 64
$$ 1 "null"
$$ 0 
$$ acqstatus 7 1 32767 0 0 2 1 0 1 64
$$ 2 101 0 
$$ 0 
$$ aig 2 2 2 0 0 4 1 1 1 64
$$ 1 "ai"
$$ 2 "nm" "ai" 
$$ archivedir 2 2 8 0 0 2 1 0 1 64
$$ 1 ""
$$ 0 
$$ ap 2 2 1023 0 0 4 1 6 1 64
$$ [...]
$$ 1 ""
$$ 0 
$$ wshim 4 2 4 0 0 2 1 1 1 64
$$ 1 "n"
$$ 15 "e" "f" "g" "n" "s" "0" "1" "2" "3" "4" "5" "6" "7" "8" "9" 
$$ wtfile1 2 2 15 0 0 3 2 1 1 64
$$ 1 ""
$$ 0 
$$ z3x 7 1 19 19 19 2 1 8192 1 64
$$ 1 -618 
$$ 0 
$$ z2 7 1 19 19 19 2 1 8192 1 64
$$ 1 -7868 
$$ 0 
$$ y1 7 1 19 19 19 2 1 8192 1 64
$$ 1 -6262 
$$ 0 
$$ x4 7 1 19 19 19 2 1 8192 1 64
$$ 1 0 
$$ 0 
$$ x2y2 7 1 19 19 19 2 1 8192 1 64
$$ 1 2597 
$$ 0 
$$ x1 7 1 19 19 19 2 1 8192 1 64
$$ 1 3409 
$$ 0 
$$ x3 7 1 19 19 19 2 1 8192 1 64
$$ 1 7844 
$$ 0 
$$ xz 7 1 19 19 19 2 1 8192 1 64
$$ 1 7795 
$$ 0 
$$ xy 7 1 19 19 19 2 1 8192 1 64
$$ 1 -2058 
$$ 0 
$$ xz2 7 1 19 19 19 2 1 8192 1 64
$$ 1 -2141 
$$ 0 
$$ yz2 7 1 19 19 19 2 1 8192 1 64
$$ 1 -2954 
$$ 0 
$$ y4 7 1 19 19 19 2 1 8192 1 64
$$ 1 0 
$$ 0 
$$ y3 7 1 19 19 19 2 1 8192 1 64
$$ 1 -7130 
$$ 0 
$$ yz 7 1 19 19 19 2 1 8192 1 64
$$ 1 5812 
$$ 0 
$$ z1 7 1 19 19 19 2 1 8192 1 64
$$ 1 19695 
$$ 0 
$$ z0_ 1 1 19 19 19 2 1 73744 1 64
$$ 1 5166 
$$ 0 
$$ z1c 7 1 19 19 19 2 1 8192 1 64
$$ 1 0 
$$ 0 
$$ z2xy 7 1 19 19 19 2 1 8192 1 64
$$ 1 -3922 
$$ 0 
$$ z2x2y2 7 1 19 19 19 2 1 8192 1 64
$$ 1 -1063 
$$ 0 
$$ z2c 7 1 19 19 19 2 1 8192 1 64
$$ 1 0 
$$ 0 
$$ z2x3 7 1 19 19 19 2 1 8192 1 64
$$ 1 0 
$$ 0 
$$ z3 7 1 19 19 19 2 1 8192 1 64
$$ 1 18200 
$$ 0 
$$ z2y3 7 1 19 19 19 2 1 8192 1 64
$$ 1 0 
$$ 0 
$$ z3c 7 1 19 19 19 2 1 8192 1 64
$$ 1 0 
$$ 0 
$$ z4y 7 1 19 19 19 2 1 8192 1 64
$$ 1 3532 
$$ 0 
$$ z4c 7 1 19 19 19 2 1 8192 1 64
$$ 1 0 
$$ 0 
$$ z3xy 7 1 19 19 19 2 1 8192 1 64
$$ 1 0 
$$ 0 
$$ z3x3 7 1 19 19 19 2 1 8192 1 64
$$ 1 0 
$$ 0 
$$ z3x2y2 7 1 19 19 19 2 1 8192 1 64
$$ 1 0 
$$ 0 
$$ z3y3 7 1 19 19 19 2 1 8192 1 64
$$ 1 0 
$$ 0 
$$ z3y 7 1 19 19 19 2 1 8192 1 64
$$ 1 1213 
$$ 0 
$$ z4 7 1 19 19 19 2 1 8192 1 64
$$ 1 -1698 
$$ 0 
$$ z4x2y2 7 1 19 19 19 2 1 8192 1 64
$$ 1 0 
$$ 0 
$$ z4x 7 1 19 19 19 2 1 8192 1 64
$$ 1 -1961 
$$ 0 
$$ z4xy 7 1 19 19 19 2 1 8192 1 64
$$ 1 0 
$$ 0 
$$ z6 7 1 19 19 19 2 1 8192 1 64
$$ 1 7151 
$$ 0 
$$ z5x 7 1 19 19 19 2 1 8192 1 64
$$ 1 0 
$$ 0 
$$ z5 7 1 19 19 19 2 1 8192 1 64
$$ 1 -333 
$$ 0 
$$ z5y 7 1 19 19 19 2 1 8192 1 64
$$ 1 0 
$$ 0 
$$ zx2y2 7 1 19 19 19 2 1 8192 1 64
$$ 1 -5238 
$$ 0 
$$ z8 7 1 19 19 19 2 1 8192 1 64
$$ 1 0 
$$ 0 
$$ z7 7 1 19 19 19 2 1 8192 1 64
$$ 1 1690 
$$ 0 
$$ zxy 7 1 19 19 19 2 1 8192 1 64
$$ 1 -2920 
$$ 0 
$$ zx3 7 1 19 19 19 2 1 8192 1 64
$$ 1 138 
$$ 0 
$$ zy3 7 1 19 19 19 2 1 8192 1 64
$$ 1 -1688 
$$ 0 
$$ 
##$PARAMETER FILE=	(text, ASCII, d:/OPCW/NMR-Databases/RICD-NMR-fid_Database/Phosphorus%20compounds/Diethyl%20methylphosphonate/H.fid/text, 0)
$$ PT20
$$ diethyl methylphosphonate
$$ CAS:683-08-9
$$ 15.7 mg/0.6mLCDCl3
$$ 
$$ 
##XUNITS=	HZ
##YUNITS=	ARBITRARY UNITS
##FIRSTX=	8430.2587416299993492
##LASTX=	-1184.9791546343990376
##DELTAX=	-0.14671912560104369283
##XFACTOR=	1
##YFACTOR=	2.7318788747120576849e-05
##FIRSTY=	0.17465049028396606445
##MINY=	0.098451852798461914062
##MAXY=	99.26380157470703125
##NPOINTS=	65536
##XYDATA=	(X++(Y..Y))
$$ [...]
2216D622q4J1O4jm3K5N8kMQ9N7o1o8J4L6J2oo2j05l0P9R4M7qp9r1J6J08M6o2l4Q2Q8j9m1P0
2210D826R1o3j42QJ33K2j27q1M5M1l7k4M5L4k7j0M1jq4o7K2O5M7Nn6q6k4P8R2mr1n9L8O7L9
2205D756O1P1l7j31p0K3L3L0J8n1n3O7Q6n4r6J3N8jn4q0m8P3J26J6o1pJ1k1K1K8j12j68JJ35
2200D583P2%K9K4l6k7K7J3l0jL9Jm1J0O1K1k3K8Q0K6p1r9k8P5J21O5m1j08q9PR3P0m0j07j03
2195D601o5RP8N6MJ2Jq2o7Q4J44L8n9p1l0O6J20J3r3kR5j1r0M1J22k5j44n9L6Nl7k6k0pL6
2190D673K6o0j09n9J2K8LpK1J4n3m2J10J77L2p0J1M2l1OP5m4j21N8J69Jj11l7l6q7MP3NK3
2185D696J13Pj50n5R5L1n4J0N9K0pl3p3j2J12J15jq3r8q6m5J4N4O4M5Lk3k3j9j0J6J8k1n3
2180D626m1qL4P4P4No7o1ML2J6J1ro5n1P4J44M5q8j06k7M1K4l9k4M5K3l4K3O6p5j78l8J15
$$ plain form
2216 4622 4538 4549 4613 4612 4569 4594 4652 4650 4654 4743 4800 4739 4671 4685 4721 4733 4727 4665 4560 4530 4609 4703 4750 4742 4663 4572 4588 4696 4742 4680 4646 4728 4816 4797 4756 4826
2210 4826 4917 4854 4712 4720 4853 4875 4748 4667 4712 4753 4716 4692 4737 4771 4744 4734 4775 4774 4690 4623 4645 4710 4757 4762 4706 4620 4596 4674 4766 4762 4671 4612 4650 4717 4756
2205 4756 4817 4888 4851 4720 4650 4673 4706 4736 4754 4703 4650 4717 4803 4749 4653 4666 4724 4723 4669 4589 4541 4614 4740 4756 4695 4688 4699 4678 4699 4727 4615 4447 4448 4583
2200 4583 4655 4655 4684 4708 4672 4645 4672 4685 4655 4654 4693 4694 4653 4663 4724 4745 4722 4750 4830 4856 4785 4686 4658 4733 4854 4919 4878 4770 4681 4688 4781 4851 4811 4704 4601
2195 4601 4536 4545 4623 4679 4683 4695 4696 4614 4547 4631 4775 4813 4754 4683 4653 4719 4839 4852 4759 4757 4852 4841 4751 4792 4914 4889 4745 4686 4722 4727 4690 4664 4644 4637 4673
2190 4673 4699 4639 4530 4471 4483 4511 4514 4507 4528 4542 4489 4447 4557 4734 4766 4696 4707 4749 4718 4724 4799 4755 4634 4692 4861 4862 4751 4714 4678 4591 4595 4668 4673 4696
2185 4696 4809 4816 4666 4611 4706 4737 4683 4693 4752 4772 4765 4732 4659 4647 4759 4874 4873 4790 4692 4606 4561 4575 4629 4693 4738 4741 4718 4695 4676 4666 4682 4700 4679 4626
2180 4626 4585 4577 4611 4685 4759 4764 4697 4636 4640 4672 4688 4699 4690 4625 4574 4648 4792 4837 4749 4643 4616 4657 4681 4642 4618 4663 4686 4652 4675 4741 4666 4488 4450 4565
2175D565Q5L5N0K8rMj7p0l0K9l4r0J0J34J04l4j05k8Q3O6l7p1n8o7j6P4K8p5j0J18P9j5QN3
2170D787K3JQrl9o6r0m0P9J25L8n5n1K2O5J4o2n1ol5p1l1L3O1M5j5l4N5Q2p8j76m0Q3K8MJ00
2165D704J47O7p2j85j55j2K9l7LR4M5j4N5N3o8n8R1J11lm8J3J03J25Mj52j40j3L0mj6m0n7
2160D600QP7N4K7N4N5np2j16r9QJ00P5kl6j2L8M9j7o9l4K2N2P9N7l8p5oK6j9l4j4j2J8O0L3
2155D832k1j7pl3l2MK7J7l0q3l3O4M3j3P0J09n0j16N1R0r5j11P3P2q0l6J08N6q6q0kJ5J3J8
2150D737J1J7M3L0%L4P3J6q0q3j2J4j0J0O6O2qm8k1Pmk3nL5J0q6j17j2P9N3J7K9Pm3m2l5k9
2144D692P0J64M8j34j06K5J2n3j1N2M8K2l3q1j9P4K7o5m9j9m6OJ07Q1JM6J12L2q8p6O%r1j07
2139D647PP9J8j5N9Q5L2L0L7k3k2M2j2r6k2L2o3m6J04N6j09m5O4l5n6J56K04j5j24n6n8r9
$$ plain form
2175 4565 4650 4685 4735 4763 4754 4758 4741 4671 4641 4670 4636 4546 4556 4690 4794 4760 4655 4627 4710 4776 4739 4668 4610 4543 4527 4601 4629 4554 4544 4662 4741 4726 4734 4787
2170 4787 4810 4811 4819 4810 4771 4705 4615 4575 4654 4779 4817 4762 4711 4733 4798 4812 4750 4699 4693 4658 4587 4556 4589 4650 4695 4680 4646 4701 4783 4705 4529 4489 4572 4600 4604 4704
2165 4704 4851 4918 4846 4661 4506 4494 4523 4486 4489 4583 4628 4614 4669 4722 4654 4596 4687 4798 4795 4747 4760 4863 4988 4992 4840 4700 4687 4717 4713 4697 4657 4600
2160 4600 4608 4685 4739 4766 4820 4875 4870 4798 4682 4583 4591 4691 4766 4764 4728 4716 4754 4803 4786 4717 4683 4705 4757 4836 4893 4855 4780 4774 4800 4781 4747 4733 4721 4739 4799 4832
2155 4832 4811 4794 4787 4754 4722 4726 4753 4770 4740 4657 4624 4688 4731 4718 4788 4897 4847 4731 4782 4872 4777 4666 4739 4811 4731 4695 4803 4859 4773 4693 4691 4706 4719 4737
2150 4737 4748 4765 4808 4838 4838 4872 4945 4961 4881 4798 4786 4800 4790 4800 4866 4928 4920 4872 4851 4858 4854 4831 4826 4861 4871 4785 4668 4656 4735 4788 4805 4834 4841 4798 4756 4721 4692
2144 4692 4762 4926 4974 4840 4734 4759 4771 4718 4707 4759 4807 4829 4796 4715 4696 4770 4797 4732 4683 4664 4618 4624 4731 4812 4813 4859 4971 5003 4915 4839 4845 4845 4754 4647
2139 4647 4654 4733 4751 4736 4795 4880 4912 4942 4979 4956 4934 4976 4964 4868 4846 4878 4815 4769 4873 4929 4820 4775 4839 4804 4748 4904 5108 5093 4969 4913 4855 4756
2135D756l3L6K3L1O5M0k5o3m4L1O7%m8J5M6l2m4P3J08k2q2O0J45m2k26q0J67J17q1q3mm0l3
2130D798P1M4p5l2P6L2n8m9j3J9O9O3LJ7P3O1J1o1j58j25O8J27l9j09J9P5k5q9l0Q1J41N2
2125E037r7r2K7M3pJ0K1j3J6O5No1k2J1j0K2N5k3r2k2M3m1j21kJ67J03j33j83lP0m8p8M1P0
2120D758mk0nl0rP6J00N8K0k4q8j21j02k6O8Q1J4OM6Oj6Q7J14l8q7N4Q0m3m6O7Q0J7l6j12
2115D925j20L5J32Jj36q5RM1P5M4q8r3J12K16N3r8n7j7r2j05K1J30J09K1o3r9n7K5P6P9M6
2110E040j0l4j0j1n7m1N5P2k8p8KP7L7l0j7M9M9j2j2O2O0m1q0l2k0m2jN0K2k9m1k3J7N0kq5
2105D906p7LP1J26J13k9j36m4O1j2r4n1j6oR0J32k6j50o0K2m2n9L0P5P3O4l1j39m3J34Q4j03
2101D866r1Q9J74J21K1q8j42o7N4R4M6n2j25o8P0P0p1j12k1K2OM3P0mn6%M1PmL1K0l4n3k8
$$ plain form
2135 4756 4723 4759 4782 4813 4878 4918 4893 4830 4786 4817 4884 4884 4836 4851 4897 4865 4821 4894 5002 4980 4898 4958 5103 5061 4835 4755 4922 5039 4958 4875 4871 4831 4798
2130 4798 4869 4913 4838 4806 4882 4914 4856 4807 4794 4813 4882 4945 4948 4965 5038 5099 5110 5049 4891 4766 4834 4961 4922 4813 4832 4907 4882 4793 4763 4844 4985 5037
2125 5037 4940 4848 4875 4918 4911 4921 4942 4929 4945 5010 5015 4954 4932 4943 4933 4955 5010 4987 4895 4873 4916 4875 4754 4752 4919 5022 4889 4706 4703 4773 4725 4647 4688 4758
2120 4758 4754 4734 4729 4699 4690 4766 4866 4924 4944 4920 4832 4711 4609 4583 4651 4732 4746 4752 4798 4804 4788 4875 4989 4951 4864 4918 4998 4955 4909 4976 5056 5073 5037 4925
2115 4925 4805 4840 4972 4973 4837 4752 4761 4802 4877 4921 4833 4740 4852 5068 5121 5023 4966 4949 4857 4752 4773 4903 5012 5033 4970 4871 4814 4839 4915 4994 5040
2110 5040 5030 4996 4986 4975 4918 4877 4932 5004 4976 4898 4900 4977 5014 4984 4967 5016 5065 5053 5041 5103 5163 5122 5042 5010 4990 4948 4947 4997 5019 4990 4949 4926 4943 4993 4991 4906
2105 4906 4829 4832 4903 5029 5142 5113 4977 4933 4994 4982 4888 4837 4821 4815 4905 5037 5011 4861 4801 4823 4781 4722 4752 4827 4900 4964 4933 4794 4751 4885 4969 4866
2101 4866 4775 4864 5038 5159 5180 5092 4950 4883 4937 5031 5077 5025 4900 4832 4902 4972 4901 4789 4768 4790 4796 4839 4909 4905 4849 4849 4890 4897 4893 4924 4944 4910 4857 4829
2096D829J0L3K8J2J1Rk5o6m7L0R7R0L7Lj5n1m3L6N7l2p6qJ2m1nR9P7l8n6KPl1l6pL4N8K9j3
2090E010LL3J0j4Jl1j08q1N3Q3l1p1K8M5n5k8J24Q9j19j37L2N7k6M5J45L3j01l6N7J3l3QM5
2085E043L5nq0j09j6P7L5o5q8k7M7N6kl3lj6p7n2K6K5K6J17J49L6l7J5K8m7r2q8p4nR2P3l6
2080D928n3K1K4l5k2No0q2O3J80P6q5j01m0K1Q7N8j02j58k0N7LM1J34M0j11m2J05N4p9n2O9
2075D924P8rl9QJ5m3n6j0lj7J2K0KN5P0q6j61K2J25m0j10M3P9j4L1Q8l0r9j4Pk8K7J5j07o8
2070D687O4pj02O8J99K2j21OJ25O1k4q0j44j37l1N6Q0Q9Q0K5o1j32j18k1M4M7O6P5jm5M4J00
2065D914Nq4n0M%l2o5n6M7J41P4p7j13k0M2Kj3P4J21j6j63r0P8Q3lJ3O2J5k6L0P2K9l7q9j10
2060D762n8K0L0lk0l6l3M0R1K4n3m2l8o7k8N1M7J0L3M7Ol0m1m1K1J06O4o9j00j6M0J7k7m2
$$ plain form
2096 4829 4839 4872 4900 4912 4923 4932 4907 4841 4794 4824 4921 5011 5048 5051 5036 4985 4942 4978 5035 5003 4927 4919 4931 4890 4885 4984 5061 5023 4967 4969 4976 4945 4909 4902 4936 4994 5023 5010
2090 5010 5013 5046 5056 5042 5043 5012 4904 4823 4876 4959 4928 4857 4885 4930 4875 4847 4971 5060 4941 4804 4836 4893 4867 4912 5057 5090 4989 4953 5010 5023 4990 4998 5043
2085 5043 5078 5073 4993 4884 4868 4945 4980 4915 4827 4800 4847 4903 4901 4868 4865 4849 4772 4720 4746 4771 4797 4914 5063 5099 5062 5077 5105 5058 4966 4878 4804 4799 4891 4964 4928
2080 4928 4875 4896 4920 4885 4863 4868 4808 4726 4789 4969 5045 4960 4859 4819 4840 4927 4985 4883 4725 4705 4762 4765 4806 4940 4980 4869 4827 4932 4986 4907 4855 4924
2075 4924 5002 4993 4954 4962 4977 4934 4878 4868 4865 4848 4860 4880 4882 4937 5007 4921 4760 4782 4907 4867 4757 4800 4879 4865 4896 4984 4954 4855 4841 4848 4820 4847 4862 4755 4687
2070 4687 4751 4744 4642 4710 4909 4931 4810 4816 4941 5002 4978 4898 4754 4617 4586 4642 4722 4811 4891 4916 4855 4723 4605 4584 4628 4675 4741 4816 4815 4770 4814 4914
2065 4914 4919 4835 4785 4789 4789 4757 4692 4636 4683 4824 4898 4821 4708 4688 4730 4732 4719 4793 4914 4898 4735 4645 4723 4806 4803 4816 4878 4893 4867 4897 4969 4998 4961 4872 4762
2060 4762 4704 4724 4754 4751 4731 4695 4662 4702 4793 4817 4764 4722 4684 4617 4589 4640 4687 4697 4730 4777 4783 4753 4712 4671 4692 4798 4862 4793 4693 4677 4717 4734 4707 4665
2055D665lN3N8K6J0J5L5O9N0l6o7k3k7o1j8L9K2J1K4l7j03m4K4j2l1L5O4K8kl4n8qM9Rm7j7
2050D658M5O3M8J4j0ql1p1m5Rmj6M1N5j9m2qj8j5N1M6o1p5M7J11K7m8mM7j9p7K1J23L0p0K4
2045D819R2l5r8J4K2r7n6Q1L5q3k5R9P0n0q0pN3K6l2k9J1L7O2M4n3j01l1Km9k7N0L4rJ6K0
2040D725J5P6M5j20j04J30J60p0j65n7nj8K7O4N6O5P0M0J8k1p6n9ol5l9N7O3m2j8Q3Nj26o5
2035D673N0L6jJl8n7%Pn7n1K2N4N3N8L0k2m9l6K4Q1L2n1j4N0k4r5l2J5k8qM1k3n7Q1J92J28
2029D985M2Mo7j11n5m0j15j00M9J34O5k8k2O6J11K8p3m4J8l7r9k7N8L2j6k1n1o9qM3J3lJ5
2025D677j8m6K1P2L0K4P8M5k6J8P6J2l1M0L3r0j18n1o3q2J5P9Jm2K2L1j8MJ3p8q7Q3J64Pj41
2020D654q4L6O5N8P4P2J2o8q7j4N9K5m2j8J7l8m9P7J38J5q2m0k1m6K6R5j4j22k9P6K1k1M7
$$ plain form
2055 4665 4662 4715 4773 4799 4809 4824 4859 4928 4978 4942 4875 4852 4825 4764 4746 4785 4807 4818 4842 4805 4702 4658 4682 4670 4639 4674 4738 4766 4764 4730 4672 4664 4713 4722 4675 4658
2050 4658 4703 4766 4814 4828 4818 4810 4779 4708 4663 4672 4668 4652 4693 4748 4729 4687 4679 4661 4646 4697 4743 4682 4607 4654 4765 4792 4744 4740 4787 4768 4691 4712 4835 4865 4795 4819
2045 4819 4911 4876 4778 4792 4814 4717 4661 4742 4777 4694 4669 4768 4838 4788 4708 4701 4754 4780 4748 4719 4730 4767 4829 4873 4820 4719 4688 4690 4641 4614 4664 4698 4689 4705 4725
2040 4725 4740 4816 4861 4741 4637 4767 4927 4857 4692 4635 4630 4612 4639 4703 4759 4824 4894 4934 4952 4931 4855 4796 4790 4755 4716 4773 4836 4794 4776 4859 4864 4738 4673
2035 4673 4723 4759 4758 4759 4721 4664 4664 4671 4614 4563 4585 4639 4692 4750 4780 4758 4709 4673 4697 4778 4810 4759 4745 4795 4771 4676 4644 4659 4631 4623 4664 4641 4584 4665 4857 4985
2029 4985 5027 5031 4964 4853 4798 4758 4643 4543 4592 4726 4791 4763 4741 4807 4918 4946 4873 4829 4847 4810 4711 4684 4742 4774 4758 4737 4686 4617 4609 4652 4665 4662 4677
2025 4677 4659 4613 4634 4706 4736 4760 4838 4883 4857 4875 4951 4963 4932 4972 5005 4915 4797 4746 4683 4601 4616 4695 4696 4654 4676 4707 4689 4693 4706 4628 4541 4624 4788 4795 4654
2020 4654 4570 4606 4671 4729 4803 4875 4887 4819 4732 4718 4777 4802 4760 4742 4759 4721 4672 4749 4887 4902 4820 4780 4759 4713 4739 4834 4820 4698 4669 4745 4766 4745 4792
2015D792O1j1m6o6j23j02K2Q5O2N8M4k6k8O6P6n0j15k7O8N2nmL5J3p5j12l9L8L2K0O0N6n3
2010D758j14j6P1j0r9k0P5M1J8O3J0r1m1L0n7q5O9J05l6k3R0l2k03o9J21K7j09j8R3L6m0%
2005D544O7N8qm5l1j6MN4L8n8n4N0K1o6K6J22Ln9P4O8j05j00K5Kk1O3M1l5L5M0j34j38M6K1
2000D532j19k4Q6j6m1J15J41L7K0Lr1r4k8l5j8O1K7l8O2J54L3j01n3M6N0k9j08n2J10J40l
1996D767o8k4n1j05l1Q4J12Q2L1k2l3k8l8kN0Ql7J2J1q9r9j5j1j6Q2J26L7k5pJ6O3R3Mr8q4
1990D695n8p7m1jl6l3L8L3J7R8Q7q3j10P1J45M6l1o1o0K6O7n1j05J5M8m1RJ20L4r8l7O3J5
1986D704o9p8l5L7O9Nj2Q9P8r4j00J09J26r9j44M9Q7o8q7L5M4k8k2ll2j1M0J3mO3P3qLP2O
1980D808q8k7K5p2j06J5O6K6Q0J32k5j99j04J17J56J6p3l7J1rj8L5M3o5j18J0J33Q2j8l3m9
$$ plain form
2015 4792 4853 4842 4796 4730 4607 4505 4527 4612 4674 4732 4776 4750 4722 4788 4864 4814 4699 4672 4740 4792 4787 4783 4818 4831 4756 4644 4605 4643 4675 4695 4755 4811 4758
2010 4758 4644 4628 4699 4689 4590 4570 4645 4686 4704 4767 4777 4686 4645 4675 4618 4533 4602 4707 4671 4648 4738 4706 4503 4434 4555 4582 4473 4455 4548 4584 4544 4544
2005 4544 4611 4669 4661 4616 4585 4569 4573 4627 4665 4607 4553 4603 4624 4558 4584 4706 4709 4650 4724 4792 4687 4587 4612 4614 4593 4656 4697 4662 4697 4737 4603 4465 4511 4532
2000 4532 4413 4389 4475 4459 4418 4533 4674 4711 4731 4734 4643 4549 4521 4486 4468 4529 4556 4518 4580 4734 4767 4666 4613 4659 4709 4680 4572 4520 4630 4770 4767
1996 4767 4699 4675 4624 4519 4488 4572 4684 4766 4797 4775 4742 4714 4676 4674 4724 4732 4695 4707 4718 4629 4530 4515 4504 4488 4570 4696 4733 4708 4701 4717 4780 4873 4877 4779 4695
1990 4695 4637 4560 4519 4518 4482 4449 4487 4520 4537 4635 4722 4639 4529 4600 4745 4791 4760 4699 4639 4665 4732 4681 4576 4591 4639 4598 4607 4727 4761 4663 4626 4689 4704
1986 4704 4635 4557 4522 4559 4628 4633 4621 4710 4788 4694 4594 4703 4829 4730 4586 4635 4722 4654 4567 4602 4646 4618 4596 4593 4561 4550 4590 4603 4599 4662 4735 4727 4730 4802 4808
1980 4808 4720 4693 4718 4646 4540 4555 4621 4647 4727 4859 4834 4635 4531 4648 4804 4820 4747 4710 4721 4712 4694 4729 4772 4707 4589 4599 4732 4814 4796 4763 4714
1976D714r4o4J0j3q5n8K5M2K7M9O1K1nK4M3kp3o3L5P0l2q8L6J20j5j27mJ13J2o7M8J28K8l4
1971D782L2L2p8j11pQ9Q1J5m3n9m1j9mJ5K3J4Mjj7m1n7n5k7K0M2K3L1P8O3l6n8N2R6m6j75
1966D617j07J1Kl5K5R6O3j1m3m5m7n9m4M1J41J06m3q7KK0l9J2J10M7q4n9M1K8j6K5M9jl3k4
1961D659l1k6J3L0K7N3L9o4j18l5M4L8L9O5Kj10j13j5K1k5k7M0M6j9j5N8L2p4m8O7L5r6p9
1956D413M0O1K5M2K8o7j28j10n5M4J31J15O1N7J3q5p3K7mj12o4Q3R8K7L0N5j3j02q6LL6qk0
1951D462O2J17L7n5l5nn2l5J04J40k0j33n5Mq5j37k6Q6P2J7K0N2M8j0o5m2K4K8LK4Jj04r5
1946D347Q1J54N8L0P8Lq9QJ21L4q9o3J2J2m4j09j19k9M6j6q8k2R2J07N1J2j9p1j04o2L0P7
1942D429P4R4J11M7m6q1q8o1K8N2m5m5J10J24n7j17j9j2m0N9P2j08j40P7J64Pp5QN2L3L3j0
$$ plain form
1976 4714 4620 4556 4566 4553 4468 4410 4435 4477 4504 4553 4614 4635 4630 4654 4697 4695 4622 4559 4594 4664 4632 4544 4580 4700 4685 4558 4554 4667 4679 4612 4660 4788 4816 4782
1971 4782 4814 4846 4768 4657 4650 4739 4820 4835 4792 4733 4692 4673 4669 4684 4707 4721 4725 4724 4707 4666 4609 4554 4527 4547 4589 4612 4643 4721 4784 4748 4690 4742 4838 4792 4617
1966 4617 4510 4521 4523 4488 4513 4609 4672 4661 4618 4573 4526 4467 4423 4464 4605 4711 4668 4581 4583 4603 4564 4576 4686 4733 4649 4590 4631 4659 4643 4668 4717 4716 4683 4659
1961 4659 4628 4602 4615 4645 4672 4725 4764 4700 4582 4547 4591 4629 4668 4733 4735 4625 4512 4497 4518 4493 4466 4506 4552 4533 4518 4576 4608 4534 4486 4553 4588 4492 4413
1956 4413 4453 4514 4539 4581 4609 4542 4414 4304 4249 4293 4424 4539 4600 4657 4670 4585 4512 4539 4535 4423 4359 4442 4540 4567 4597 4652 4639 4537 4451 4454 4490 4482 4462
1951 4462 4524 4641 4678 4623 4588 4583 4531 4496 4600 4740 4720 4587 4532 4536 4451 4314 4288 4374 4446 4463 4483 4535 4583 4573 4508 4466 4490 4518 4521 4545 4546 4442 4347
1946 4347 4428 4582 4640 4670 4748 4751 4662 4670 4791 4825 4736 4673 4685 4697 4653 4544 4425 4396 4442 4426 4338 4316 4408 4515 4566 4578 4559 4488 4384 4322 4352 4429
1942 4429 4503 4597 4708 4755 4709 4628 4540 4479 4507 4559 4514 4469 4579 4703 4646 4529 4510 4498 4458 4517 4589 4481 4341 4418 4582 4589 4514 4522 4574 4607 4640 4630
1937D630p7k9P3N3l7m2KOJ6N1J2p9p2K5M2m7o8L8J04L6m1k3J1j3m7n0qR1J28oj23%J15o2k06
1932D403J8K25L2j99j10L4K2K9O7jl6L9J7o9L0J52L8r6k6L3k8k1K7l2p8j6J2pJ9Mo8j5J20
1927D519R4l2k9L5Np4r4k0Q6P8n6o0J13J34o8j73r6m5k4P2J38J00N4K7j0j6k8r8r3L1M8n5
1922D463mJ60J32j8j7L6o2j51m8R7J09K8l2l8j3k0n4k5O4P8ro5l8j2j4J3L0l1p9lQ3K7n9k0
1917D508L9j3n9j7Mk6LO3M6OJ6On1o4k1J1L7O9O2K3jj5k4KK2j3k5L0M9j0m6k8k1j6Pnn6n2
1912D440qJpK5M9K5qj8J6Q6R2k0q7ON5r2k00p3P6N7RM2M7KPN2P4O1qj02r9kJ8m7m0L8O1L3
1906D561Pj5MM9Nq4k4R2L9q0n3%m0rR8O9n1l4N7M8Mj5o4r0j5M1j1n0%P1J22J09k6j47q9Rl3
1901D455o7M3J04On0K1J6j05j14M0J13rj11k6Q1L9k2M4J04K1n5J1O6qo3PO2Nm9k5j9n7l6M5
$$ plain form
1937 4630 4553 4524 4597 4650 4613 4571 4573 4579 4595 4646 4658 4579 4507 4532 4574 4527 4459 4497 4601 4637 4596 4573 4584 4571 4524 4474 4466 4557 4685 4679 4556 4556 4671 4609 4403
1932 4403 4421 4646 4678 4479 4369 4403 4425 4454 4521 4520 4484 4523 4540 4471 4501 4653 4691 4595 4569 4602 4574 4553 4580 4548 4470 4454 4466 4459 4478 4482 4414 4399 4519
1927 4519 4613 4581 4552 4587 4592 4518 4424 4404 4490 4568 4512 4452 4565 4699 4631 4458 4362 4317 4293 4365 4503 4603 4657 4684 4674 4658 4630 4532 4439 4470 4518 4463
1922 4463 4459 4619 4751 4733 4716 4752 4690 4539 4491 4588 4697 4725 4693 4655 4642 4622 4568 4543 4607 4685 4676 4611 4573 4561 4547 4560 4590 4559 4480 4477 4560 4587 4528 4508
1917 4508 4547 4534 4475 4458 4462 4436 4439 4502 4548 4554 4570 4576 4525 4461 4440 4451 4488 4557 4619 4642 4641 4626 4602 4604 4626 4613 4588 4618 4667 4657 4611 4583 4562 4546 4553 4548 4492 4440
1912 4440 4432 4433 4426 4451 4500 4525 4517 4499 4515 4601 4693 4673 4586 4592 4647 4555 4355 4282 4358 4415 4424 4466 4513 4515 4522 4574 4648 4709 4701 4599 4500 4498 4516 4469 4429 4467 4528 4561
1906 4561 4568 4553 4557 4606 4611 4527 4503 4595 4634 4554 4501 4501 4461 4452 4550 4619 4568 4534 4591 4639 4643 4628 4564 4474 4459 4500 4489 4439 4439 4510 4632 4741 4715 4568 4479 4488 4455
1901 4455 4388 4431 4535 4541 4491 4512 4528 4423 4309 4349 4462 4453 4342 4316 4397 4436 4414 4458 4562 4583 4528 4539 4605 4597 4534 4541 4603 4608 4559 4534 4515 4458 4422 4467
1896D467P2M9O4N3m1p3J7L2q5j14j6Ql1K0Q9O3M5N3n0j71j03K7J1l4K1N5J0RM4j4j16j09r
1891D243M2OnP6J27N6RO2L6r5p3Q1N3j04p2N5j0j09PJ31L4q4l6K6j0k0M1L7n0n7M7R2J8m7
1886D507m5l8j5M8M3o2r4j6J2j0M0Q6J2n1K7J22J01mj02j11oJ02R4J5m2o2n6l2mL4M4k9o8
1881D440M5J00o9j72l2N7j0M5J37j9j63J2J54Kp6P3R5l2j8M7l6r8k3L6O3J17N7j16j26M1P5
1876D606n3q3PL5j5m4j3N2P7Po5pR3M7j06j64n2J02J44M7m7j5O0K9o0m5M8N3k3m5MJ6m4r4
1871D452m3P7J12J8m7rjm4J1J23R0l2n6l1m8l0J0l5p8j7K7J2N6O9p2j36L3J44M5JP6K3j05
1867D595p9MqPR9R4j8p9p4n9j1M3L6J1L8N5%o8p0%P1N5k5m3lj6n9j9M9K8kN4Q5jn3L6J03%
1861D776j35j10K4Q8L2n2p1l0J6M0O0O9M3ll4n3p0n9jP0R2M5k8p2p8n3K3Q5K2p1mJ16L2j34
$$ plain form
1896 4467 4539 4588 4652 4705 4664 4591 4608 4640 4555 4441 4425 4433 4402 4422 4511 4574 4619 4672 4622 4451 4348 4375 4386 4352 4373 4428 4438 4447 4491 4477 4361 4252 4243
1891 4243 4285 4291 4286 4362 4489 4545 4554 4616 4652 4557 4484 4565 4618 4514 4442 4497 4487 4378 4385 4516 4550 4466 4430 4456 4446 4426 4467 4504 4454 4397 4444 4536 4554 4507
1886 4507 4462 4424 4409 4457 4500 4438 4344 4328 4340 4330 4370 4456 4468 4417 4444 4566 4667 4663 4561 4450 4444 4546 4640 4655 4613 4551 4495 4463 4459 4493 4537 4508 4440
1881 4440 4485 4585 4516 4344 4312 4369 4359 4404 4541 4522 4359 4371 4525 4527 4451 4524 4619 4587 4569 4616 4580 4482 4459 4495 4558 4675 4732 4616 4490 4531 4606
1876 4606 4553 4470 4477 4512 4497 4453 4440 4492 4569 4576 4511 4504 4597 4644 4538 4374 4322 4424 4568 4615 4568 4553 4613 4642 4582 4537 4585 4638 4615 4570 4574 4590 4546 4452
1871 4452 4409 4486 4598 4616 4569 4560 4559 4515 4526 4649 4739 4707 4651 4620 4572 4542 4552 4517 4439 4422 4449 4461 4517 4586 4514 4378 4411 4555 4600 4601 4677 4700 4595
1867 4595 4516 4520 4512 4519 4618 4712 4694 4615 4541 4482 4471 4514 4550 4561 4599 4654 4654 4586 4516 4516 4587 4642 4617 4574 4571 4555 4496 4477 4526 4554 4552 4606 4691 4690 4637 4673 4776 4776
1861 4776 4641 4531 4555 4643 4675 4623 4552 4522 4538 4578 4638 4707 4750 4747 4713 4660 4590 4531 4530 4600 4692 4737 4709 4637 4559 4506 4529 4614 4636 4565 4561 4677 4709 4575
1856D575q5P8P9k1m0l1k6O4J31Lj53r0O2N5l8k9L4J9m4n2jN3P6M2n3j00lJ05L3j03p0P5J02
1851D647%o2k0N4M8n3p8P9K08R6q8j04k9k0k6L5J03P8m1j17l1P5J2j22j25m8oK7L5k5l2N2
1847D522O0j6J3R3L5o2l7J8jk2qQJ5j6n3j0O5M2J1N6K7j03j01M1P9J9Nom5RR5M1p8r1l0PN
1841D587m4p4OR8K3j26j24J6R7L1o2k0J05R5n4j11k8L0L6M8J0p5q4k7J8Q0J07j9j18K3J72
1837D616N5j19q7J4Pk4j6J1Q0J42P2n8o1Qj4p8m7K2K0j1j4m9j10o6O9R4l8j29p8lJ0K1P8J36
1832D453J08k4j22m3R3O4o3p8mK5K8L1k8q9l3P3R1M5Jm6o7j2O3O8J9m3r7q1M7J60J27M3N3
1827D762M1j13j87j3J03n6j62LR1o1j00P0R6m8n3P3P8j3l4NL4J4m7n8M5J19M3o8q1k5K8M3
1822D529Ol1l1j6K4Q8N1r5j19J7M5o8p4K7L4j8%L9N7P1K5p2p3J9N0L4N3M4k1m2k6p1j17l9
$$ plain form
1856 4575 4490 4568 4647 4626 4586 4555 4529 4593 4724 4727 4574 4484 4546 4601 4563 4534 4568 4587 4543 4491 4490 4543 4619 4661 4608 4508 4505 4610 4643 4540 4470 4545 4647
1851 4647 4647 4585 4565 4619 4667 4614 4536 4615 4823 4919 4831 4727 4698 4678 4652 4687 4790 4868 4827 4710 4679 4754 4766 4644 4519 4471 4465 4492 4527 4502 4470 4522
1847 4522 4582 4566 4579 4672 4707 4645 4608 4626 4625 4603 4595 4603 4618 4602 4549 4539 4604 4646 4657 4713 4740 4637 4536 4577 4656 4675 4680 4674 4629 4638 4733 4774 4696 4605 4575 4582 4587
1841 4587 4543 4469 4475 4573 4596 4470 4346 4362 4459 4490 4428 4408 4513 4608 4554 4443 4415 4445 4481 4529 4539 4464 4380 4353 4371 4451 4558 4539 4421 4444 4616
1837 4616 4671 4552 4465 4479 4486 4462 4446 4457 4537 4679 4751 4693 4632 4640 4626 4548 4501 4523 4543 4532 4518 4469 4359 4293 4362 4456 4418 4289 4211 4208 4218 4239 4317 4453
1832 4453 4561 4537 4415 4372 4465 4529 4466 4388 4384 4409 4437 4468 4440 4351 4318 4391 4482 4527 4528 4482 4415 4403 4466 4534 4553 4510 4413 4332 4379 4539 4666 4709 4762
1827 4762 4803 4690 4503 4490 4593 4537 4375 4378 4469 4408 4308 4378 4474 4426 4373 4446 4524 4511 4477 4482 4516 4530 4483 4425 4470 4589 4632 4564 4483 4458 4486 4529
1822 4529 4535 4504 4473 4457 4481 4569 4620 4525 4406 4423 4468 4400 4326 4353 4387 4369 4369 4408 4465 4536 4561 4489 4416 4435 4485 4519 4572 4616 4595 4553 4527 4456 4339 4300
1817D300J25K11J26m5j26r0p0q6j5P5K4m7L0J05L2k2K1l9j75q8J53J57m3o1P1J8j25j8J81
1813D579J06j03j06ol3o9K3Q5L3KK6J3k5pM9O6kj12j15L7J33J7j11k2J13K0j62j17O1N8n8
1808D373jJ33R6K7Q9N6j23j05R0O1j12o4M1p3j48rL6p7l4J32J43M7Rnj7Njk0K5L2o5r4j8r
1803D420l2K4K5o6l4Q2M0o1k1M7J4j4j0k7QR1P2j0j6kn2q3o3l6K0N2n4j76j13M4J12J05O1
1798D347j4k1N2K8p8n8O4R6N7M6K3k3k3J1J9J2PJ8M4Kj00q4M9N7n4m7L1MmQ3M8p1JJ06m4j73
1793D411L2K14M7j46p4M8L1k7o4p9j4P4P3K1rm3l6P0J18j1j33q4kj4l4PM0J8J5P1R2k5j35
1788D452l5J08J8j14L1K04O2j27n7Pj15j19P4J26j9j05q4l4P1J29Pr6OQ0n6j30L9J95J13o7
1784D564j24l1O9M1n8n8J2nm3N3J34j8k09j38P0J33R1R1P3JOP8L5j12j71j08k5L8N9J4rN4
$$ plain form
1817 4300 4425 4636 4762 4717 4591 4501 4431 4345 4330 4405 4429 4382 4412 4517 4549 4527 4548 4509 4334 4246 4399 4556 4513 4452 4523 4541 4416 4398 4579
1813 4579 4685 4582 4476 4470 4437 4368 4391 4476 4509 4511 4537 4550 4525 4518 4567 4633 4631 4519 4404 4441 4574 4591 4480 4458 4571 4591 4429 4312 4373 4431 4373
1808 4373 4372 4505 4601 4628 4717 4773 4650 4545 4635 4696 4584 4520 4561 4488 4340 4331 4367 4290 4256 4388 4531 4578 4587 4582 4565 4570 4569 4549 4574 4606 4541 4447 4429 4420
1803 4420 4388 4412 4437 4371 4337 4419 4459 4398 4377 4424 4438 4424 4414 4387 4395 4486 4558 4548 4532 4530 4478 4395 4332 4296 4316 4368 4314 4138 4025 4069 4181 4286 4347
1798 4347 4333 4312 4364 4392 4314 4256 4320 4416 4473 4519 4542 4519 4496 4507 4526 4538 4545 4563 4607 4609 4509 4425 4474 4531 4477 4430 4461 4465 4461 4544 4592 4521 4522 4628 4584 4411
1793 4411 4443 4657 4704 4558 4484 4532 4563 4536 4472 4393 4379 4453 4526 4547 4538 4495 4459 4529 4647 4636 4503 4419 4417 4403 4369 4376 4416 4434 4449 4520 4612 4587 4452
1788 4452 4417 4525 4543 4429 4460 4664 4726 4599 4542 4549 4434 4315 4389 4515 4496 4391 4307 4273 4344 4473 4480 4384 4390 4470 4414 4284 4323 4518 4631 4564
1784 4564 4440 4409 4478 4519 4461 4403 4415 4410 4367 4420 4554 4536 4327 4189 4259 4392 4483 4574 4647 4648 4654 4732 4767 4655 4484 4376 4351 4389 4448 4462 4453 4507
1779D507R4N3J9J0l8p4m1j6j4J0pp8p2%NlO1N4n1m6M3Po5K4J25P2mj4k5k3Jl6q6k7N5M6K6
1774D492L9jo3n2J1P5J01L3m5mM6k0m3L8Jj26o5P0J0p1L8R3n8j47m3N9O2J8l4k4P5J05j0r2
1769D468l1N3M8k7q1m3L9N5Mk9n3n2L6J12J7j22r8K3Q9Q4Kr4l2J28R1q8q6O0Q1K7M6K1r1j00
1764D457OJ2p8n8O9R1l5j06j8N9J1j6N2L8p5n8N1J8m2Q2J53k5j36lK6j34j05J07J04o7n7N5
1759D378J9m3K0N0k1k2L3kn5J0O8ko0PO3j7j13o4P8J19L2j6M3P3L3L3M1p5j85q3R6J08K1n
1754D562j5n0l5J2J1RL8J8m8n9k3J7P4P6n9j69p7P9Q2KnK8K2%RM7P5L4n5p7j5J6k6n0lP2P8
1749D595k5j15k9J18O7q7n8N6j2j03J9R5r5k06OJ79O9j3Q8Q3r4j60q3n5j5J35J71j8j24K0
1744D409J11l2j40j1J34Q4j8J2P3Or7o9L3M9j5m9k1M5J09R0l5j35q5K9M2l8o4K0P9K1m8j0
$$ plain form
1779 4507 4601 4654 4673 4683 4645 4571 4530 4514 4500 4510 4503 4425 4353 4353 4358 4355 4416 4470 4419 4373 4416 4423 4358 4382 4507 4579 4575 4561 4536 4513 4514 4478 4392 4365 4420 4466 4492
1774 4492 4531 4530 4467 4415 4426 4501 4602 4635 4590 4586 4632 4612 4569 4607 4608 4482 4417 4487 4497 4426 4464 4557 4499 4352 4309 4368 4430 4448 4414 4390 4465 4570 4560 4468
1769 4468 4437 4490 4538 4511 4430 4387 4426 4481 4485 4456 4403 4351 4387 4499 4516 4394 4296 4319 4408 4492 4494 4400 4368 4496 4587 4499 4413 4473 4554 4581 4627 4648 4557 4457
1764 4457 4463 4475 4397 4339 4408 4499 4464 4358 4340 4399 4410 4394 4446 4484 4409 4351 4402 4420 4378 4460 4613 4588 4452 4449 4475 4341 4236 4343 4447 4380 4323 4378
1759 4378 4397 4354 4374 4424 4403 4381 4414 4412 4357 4367 4435 4433 4373 4380 4443 4426 4313 4249 4327 4446 4478 4462 4505 4578 4611 4644 4685 4610 4425 4342 4438 4546 4567 4562
1754 4562 4547 4497 4462 4474 4485 4494 4532 4550 4502 4443 4420 4437 4511 4587 4528 4359 4282 4361 4443 4445 4440 4468 4490 4490 4499 4546 4621 4655 4600 4523 4508 4524 4498 4448 4445 4517 4595
1749 4595 4570 4455 4426 4544 4611 4524 4466 4522 4510 4407 4426 4521 4426 4220 4226 4405 4474 4461 4549 4632 4538 4378 4295 4240 4225 4360 4531 4513 4389 4409
1744 4409 4520 4488 4348 4337 4471 4555 4537 4549 4622 4628 4531 4462 4495 4544 4529 4480 4459 4504 4613 4703 4668 4533 4448 4477 4519 4481 4417 4437 4516 4537 4489 4479
1740D479K5l4o6OL2j8J8J13Q0j4j4po1n1J5j6o6JL5n2m6R0R2p0j27k4P6J02N3n7r5KN5l1o8
1734D357L1Q6K7mM7R2P1k0j20j09J4Q7N0J9J8m0r9n4J4PkK2ro5l2L3L7M3Q3M2q6j45q8J3J07
1729D427J18Qp5k2Jo4j8J29R6p3j10n0m9KJ16Q5m4k2P8L8m9l4J6L3K7l4r2j2R6N4l4j7J9J2
1724D556K7J0q2q6K9N4m9r7n4PP5P8k0o0M4P6n8j14K0J27O3m2m1J6Oo0m9L1M3j8m0l0l4J1
1719D339P0K3n9l1L4M0M7N1kj9K7Ln2RO6J4L4J20Qj64p3Q9J2q5rK0m7nP7L9%Lr3j61k7R6J8
1714D412l4M7O2nrLk8j5Mm7m4M4J7r2k3J16L6r9KJ39N6n1K2R6L9j0%l1o7m1k0l5J0Q7N6l8
1709D559m9rl1p3m9K2P0O3rq5o8J4L9qm5k5J6K4j0l3J2P7P2K0J2K7j6n7MP0nr1QJ27K3j36
1703D460p6O2M9J3Q1Q6l5r0k7K0L0L7K2Mmo6j30p6ro0o7P9J54O2MK7Ll9k0j3l0mJ9JOJ4j3
$$ plain form
1740 4479 4504 4470 4404 4410 4442 4424 4442 4555 4635 4621 4607 4600 4539 4488 4503 4487 4421 4422 4457 4405 4359 4449 4541 4471 4344 4320 4396 4498 4551 4494 4399 4401 4456 4425 4357
1734 4357 4388 4474 4501 4497 4544 4636 4707 4687 4567 4458 4472 4559 4609 4628 4646 4606 4507 4453 4467 4474 4472 4494 4485 4420 4388 4421 4458 4501 4584 4626 4540 4395 4307 4320 4427
1729 4427 4545 4553 4478 4456 4457 4393 4375 4504 4600 4527 4417 4367 4318 4320 4436 4521 4477 4455 4533 4571 4522 4488 4504 4537 4564 4530 4438 4426 4522 4576 4542 4525 4544 4556
1724 4556 4583 4593 4511 4425 4454 4508 4459 4362 4308 4315 4390 4468 4448 4388 4432 4508 4450 4336 4356 4483 4546 4504 4463 4479 4485 4425 4376 4407 4450 4432 4392 4362 4328 4339
1719 4339 4409 4432 4373 4342 4376 4416 4463 4514 4512 4493 4520 4523 4471 4480 4546 4560 4594 4714 4722 4558 4485 4574 4586 4501 4492 4512 4465 4460 4537 4576 4576 4579 4486 4325 4298 4394 4412
1714 4412 4378 4425 4487 4482 4473 4476 4448 4433 4437 4390 4346 4390 4407 4315 4292 4408 4444 4345 4347 4486 4542 4491 4513 4609 4648 4638 4638 4607 4540 4499 4479 4444 4454 4541 4597 4559
1709 4559 4510 4501 4470 4397 4348 4370 4440 4503 4494 4409 4341 4355 4394 4386 4341 4316 4332 4356 4346 4313 4325 4402 4474 4494 4506 4533 4517 4460 4464 4534 4529 4438 4446 4573 4596 4460
1703 4460 4384 4446 4495 4508 4589 4675 4640 4550 4523 4543 4573 4610 4632 4636 4632 4566 4436 4360 4351 4291 4224 4303 4457 4519 4523 4550 4553 4514 4494 4481 4451 4447 4466 4467 4473 4487 4474
1698D474J8Q2Rj10m7O7lj13m2J01J13j0j39j12Q1J91P4o1n1nK3O3L2q4j06pM8K8Pj2LP1N9
1693D642p1j15k6Ol0NN5Jo1j5P9J03J4j14j04O4J55N1n5l5Mk6o1m2QM9O3N9M5kp2j11q6rO7
1688D435M7n6o1O1Q2l3m4M7K6m1J8O0k7m5N1M0m1K9J18jj47r6ol2m5K0L3k2j3N7P7K9k2m0
1683D458j6K7J6m0m4K1O0M8L5ko5m9M7O4nj6K5j3q1m9L3N5L4J6JPL3J9l2l5K2M5j8q1m1O8
1678D547R2oq9p9l5oPk3p4n7M3J23J05jq6l7P8Q6pn2m9m7J2P3%p1K4Q1o4j43PJ15M2j2L6P4
1672D607O9L3l0n4l1m5o3rPo6o8K8P3O2O2Kq7o3j0n8q2pJ7mN9R2Mj2P1L3n9K7J37N1n7nL9
1667D663l9r8o5k3j0PL9N5J7l0mK5l9o4N0R5j2l4N0j3j33l6J04Rr8NO7n3j00OL2l4j7P2J06
1662D500M5o7j15JJ10J4r4K4J55O4m6rpq6o0L8N3M5N5j8q7%P1l3r3J3K7r9q0Q7J15j0n4K6
$$ plain form
1698 4474 4492 4574 4583 4473 4426 4493 4490 4377 4335 4436 4549 4539 4400 4288 4369 4560 4634 4573 4522 4517 4540 4603 4635 4551 4445 4438 4486 4514 4521 4509 4512 4583 4642
1693 4642 4571 4456 4430 4436 4406 4411 4466 4467 4406 4391 4470 4573 4587 4473 4369 4433 4588 4639 4584 4549 4553 4527 4466 4424 4432 4481 4544 4603 4648 4646 4574 4463 4377 4368 4435
1688 4435 4482 4426 4365 4426 4508 4475 4431 4478 4504 4463 4481 4541 4514 4469 4520 4560 4519 4548 4666 4665 4518 4422 4416 4384 4339 4359 4392 4370 4357 4414 4491 4520 4498 4458
1683 4458 4442 4469 4485 4445 4401 4422 4482 4530 4565 4563 4498 4449 4496 4560 4555 4539 4564 4551 4470 4421 4454 4509 4543 4559 4560 4567 4600 4619 4587 4552 4574 4619 4601 4520 4479 4547
1678 4547 4639 4633 4544 4465 4430 4424 4431 4408 4334 4277 4320 4443 4548 4547 4461 4424 4502 4588 4581 4529 4480 4433 4445 4518 4518 4447 4471 4552 4488 4345 4352 4467 4509 4497 4533 4607
1672 4607 4676 4709 4679 4625 4594 4549 4486 4477 4484 4418 4350 4378 4451 4513 4575 4577 4490 4427 4417 4359 4277 4270 4287 4283 4342 4434 4438 4426 4497 4530 4471 4498 4635 4686 4629 4624 4663
1667 4663 4624 4526 4461 4438 4428 4435 4474 4529 4546 4516 4512 4537 4498 4434 4484 4579 4567 4533 4583 4570 4437 4401 4505 4514 4416 4421 4488 4435 4335 4341 4373 4339 4322 4394 4500
1662 4500 4545 4478 4363 4364 4474 4488 4394 4418 4573 4637 4591 4582 4575 4489 4429 4467 4520 4565 4620 4602 4515 4515 4586 4553 4460 4473 4500 4401 4321 4408 4523 4513 4459 4485
1657D485Q9O6mm2k1k0n6k1Q0O7o4j05k0K2j2j9J3K1PPK3K7jk9j8J3L1N3N6j3r7o8M3P4rr0
1652D468q2kP0O5mn2k3L7L7l5o7NO3%p6m0K7K6QJ0mj5rm1p1K3J39P7o3m6M6nr1oJ29R9j3k3
1646D561J6j7n2kK4o0j05LJ11N3p9j03oQ7J02N7Nj5j5j7j0lm1r2o3J8J0n0J8J70J34q6j76
1641D377n0M5J4J5P5O6ql8nL5J7o5r8lR0L9n3o6l4M6J68J42n9j28J8M6r7q7N4N2j7N5J08m
1636D650j17j31j21n2R8J49N2l6o3p9m0M3P3P3R8M0r8j18oM4K0L4M6mn6p7p4LJ07R0L%J6n1
1631D516q3kL8j8l1L6O3K8k0o0p0k0N3Q6M9l4q7m3K8K4rJ4M4J3m5p2m9MJ0l7j0J12J50O1Q
1626D647j7j21j55J3J27kr2O0J76N0r1n4K8J4k6J0O1Qj20j35LR1K4m0j1Nl7l3K3K3l3o0pP1
1621D400Q1K8K1N1oj02o1L9j0j05m9M8L4K1O6K1p2k3O4k2j26k6J15Q4LJ9K7n0j07q6l1M4J07
$$ plain form
1657 4485 4574 4640 4636 4594 4573 4553 4497 4476 4556 4623 4559 4454 4434 4456 4444 4425 4438 4459 4466 4473 4496 4523 4522 4493 4475 4488 4519 4572 4628 4615 4518 4450 4493 4567 4558 4468
1652 4468 4386 4384 4454 4519 4515 4463 4440 4477 4514 4479 4412 4417 4480 4480 4404 4364 4391 4417 4425 4435 4431 4416 4407 4366 4295 4318 4457 4534 4471 4425 4471 4466 4375 4369 4498 4597 4584 4561
1646 4561 4577 4560 4508 4506 4530 4470 4365 4368 4479 4532 4453 4350 4344 4431 4533 4590 4595 4580 4565 4548 4538 4535 4494 4402 4339 4357 4367 4317 4335 4505 4639 4553 4377
1641 4377 4327 4372 4386 4401 4476 4542 4534 4496 4491 4526 4543 4478 4380 4377 4467 4506 4453 4387 4353 4399 4567 4709 4650 4522 4540 4586 4489 4402 4456 4508 4491 4546 4654 4650
1636 4650 4533 4402 4281 4229 4327 4476 4528 4492 4429 4350 4310 4353 4426 4499 4597 4637 4539 4421 4415 4459 4479 4513 4559 4555 4499 4422 4348 4351 4458 4548 4551 4551 4567 4516
1631 4516 4433 4431 4469 4451 4420 4456 4519 4547 4527 4467 4397 4377 4430 4516 4565 4531 4444 4401 4429 4453 4444 4458 4502 4515 4470 4398 4349 4353 4363 4326 4316 4428 4578 4639 4647
1626 4647 4630 4509 4354 4367 4494 4492 4400 4460 4636 4686 4595 4541 4569 4583 4557 4567 4628 4636 4516 4381 4384 4475 4499 4459 4448 4453 4416 4383 4406 4429 4396 4336 4329 4400
1621 4400 4481 4509 4530 4581 4575 4473 4412 4451 4441 4336 4287 4335 4369 4390 4456 4477 4405 4382 4446 4424 4298 4272 4387 4471 4474 4493 4520 4470 4363 4277 4246 4290 4397
1616D397P3l6p5j4K6L0Q5J45Q8m3r7o8o1q8p7mP4Q1K9nJ9K5k4m9l5o2j00j7J14R8j6j8N8L6
1611D489n2o4j6jj0KK8N9O7M1K0J5k5p2m1Rk4m4M0P9j6n2O4J21Rj02r4m4k4k4k0k3l5j8N4
1606D296Q8Qn1L7J17N4K4R7L9j61j75K5R7k6o6M3R4Pp9l7N7M0o5p2J4J1n7l0L8L9K9Pr6j10
1601D236O2J33j9n2J14J01r7r8O0L7r4p4K8N1J7k4l2L5P1l5j27n6K9L1P9J42M4j02p9J5Kk6
1596D372L6J01P0k0r6r8m5j9j7K0M3J1L3J09M6j34j35M1P6n5o7Q1J25j7j37r0M1J07O0k4m1
1592D377K5P4K6n3m0O0R4Lq1l6O5O9k4o5LM5j1l4K2j2j17o1Q6J3j81j38O9J27P6Q2O1j9k8
1587D477J3j4m0%Lj7M5J10Q2K2m0j29j37k2L3l6o5MP4R4K5r1q8K8K3p3rJ20O8j6L9K4j14r2
1582D301P3R1j4l5j8l2J0R1Q3J5k7l3JL4j8q3m1Qj2L4J39Q4p4o5N0K5q7q4K2P5J1r1q4M3J16
$$ plain form
1616 4397 4470 4434 4359 4345 4371 4401 4486 4631 4719 4676 4579 4511 4450 4362 4285 4281 4355 4436 4465 4460 4479 4504 4480 4431 4396 4334 4234 4217 4331 4429 4413 4395 4453 4489
1611 4489 4437 4373 4357 4356 4346 4348 4376 4435 4502 4543 4563 4578 4553 4481 4440 4449 4425 4381 4421 4500 4484 4432 4496 4617 4626 4524 4430 4386 4362 4338 4318 4295 4260 4242 4296
1606 4296 4384 4392 4341 4378 4495 4549 4573 4670 4709 4548 4373 4398 4495 4469 4403 4446 4540 4547 4468 4431 4488 4528 4463 4391 4405 4416 4359 4329 4367 4406 4435 4442 4346 4236
1601 4236 4298 4431 4412 4360 4474 4575 4478 4380 4440 4477 4383 4309 4337 4388 4405 4381 4349 4384 4455 4420 4293 4237 4266 4297 4376 4518 4562 4460 4381 4396 4398 4372
1596 4372 4408 4509 4579 4559 4463 4365 4320 4301 4284 4304 4347 4358 4391 4500 4546 4412 4277 4318 4394 4339 4272 4353 4478 4461 4324 4234 4275 4382 4442 4418 4377
1592 4377 4402 4476 4502 4449 4409 4469 4563 4566 4485 4449 4514 4583 4559 4494 4497 4542 4531 4497 4519 4507 4390 4329 4415 4428 4247 4109 4178 4305 4381 4463 4524 4505 4477
1587 4477 4490 4476 4436 4436 4439 4422 4467 4577 4659 4681 4641 4512 4375 4353 4386 4350 4285 4289 4363 4457 4482 4391 4303 4331 4354 4281 4272 4392 4460 4444 4483 4507 4393 4301
1582 4301 4374 4465 4451 4416 4398 4366 4376 4467 4550 4565 4538 4505 4506 4540 4522 4439 4398 4406 4394 4428 4567 4651 4577 4512 4562 4587 4500 4416 4438 4513 4524 4433 4349 4392 4508
1577D508L0q2r7l8M4R9P0Nnj3q3r6K5J24O7m9p0jM8J0o1p7n1j1N2Q2j6j43j13K5R5Q2L9l6
1572D363r0k1R9J22N4ll6o2p0n4k3K2N1N6O1M0k6n2K6P8J3n8l3L6R9J07j2j59j10N2M8m7Q
1567D479O1q1j52M8J77L3p7j2J0l5%J8m6l2M8K7rN3L7q2n9O4M0m7j3jq7o4P7J02Jo4n2K8J23
1562D513P8q6r9N0O2q0j14LQ2N1m7j18o6O5J12O7J5o0j41r8L5O7K0M1Q2K8k8RM0k9q4k2M2
1557D390k4r5JJ31P7m1k6J3n8p6L0M7o0o2M2N6L3R2R3l3p2K8L3o0l1L6o6j61l2Q5jk0J27R4
1552D490j16q5J20N2j50m0J81J00r2p8j8n1k0P8Q3K5Nj8n7n3j6M5J23J04j2k6N0k6j82j22
1548D294M7L1m5M4J33K9j01p9j8k7k9K0L1rJ7J09J03j6m6L6K5q6r8k6j6KR6J14J2j3O2O3j9
1543D640n7l8qJ7mo5o5j2k6p6j4J05Q8o3j36k4J11Q5l2n4rl7q5k1O1K8j4N7J13K8p9n4N0O5
$$ plain form
1577 4508 4538 4456 4359 4321 4365 4464 4534 4539 4534 4521 4438 4342 4367 4491 4558 4509 4439 4438 4486 4496 4435 4358 4307 4296 4348 4430 4414 4271 4158 4183 4278 4360 4399 4363
1572 4363 4273 4252 4351 4473 4527 4524 4488 4426 4356 4302 4279 4301 4352 4408 4469 4509 4483 4431 4457 4535 4548 4490 4457 4493 4592 4699 4687 4528 4418 4470 4518 4471 4479
1567 4479 4540 4459 4307 4355 4532 4565 4488 4476 4486 4451 4451 4469 4423 4391 4439 4466 4457 4510 4547 4465 4406 4470 4510 4463 4450 4449 4362 4298 4375 4477 4478 4414 4362 4390 4513
1562 4513 4591 4505 4406 4456 4518 4438 4324 4327 4409 4460 4413 4295 4229 4294 4406 4473 4488 4428 4287 4189 4224 4291 4311 4352 4434 4462 4434 4443 4483 4454 4370 4348 4390
1557 4390 4366 4271 4272 4403 4480 4439 4413 4426 4368 4292 4322 4369 4309 4247 4289 4345 4378 4470 4563 4530 4458 4486 4519 4459 4428 4464 4398 4237 4205 4290 4289 4269 4396 4490
1552 4490 4374 4289 4409 4461 4311 4271 4452 4552 4460 4382 4364 4313 4293 4371 4454 4479 4484 4466 4409 4356 4340 4385 4508 4612 4600 4574 4624 4598 4416 4294
1548 4294 4341 4372 4327 4371 4504 4533 4432 4353 4335 4308 4279 4299 4330 4321 4338 4447 4550 4534 4488 4524 4549 4463 4365 4339 4323 4325 4421 4535 4547 4534 4596 4659 4640
1543 4640 4583 4545 4537 4554 4550 4485 4420 4408 4382 4306 4292 4397 4485 4422 4286 4262 4373 4458 4426 4372 4363 4326 4241 4220 4281 4309 4295 4352 4465 4493 4414 4360 4410 4475
1538D475j8o4k7qk6J4P7M8j5%J4l7m5Jj5m5J7N9LJ1R7N0q4n0P5K4j21j05K6P0K6j9m0l9k3
1533D306k1j9J0M2N3M3Rk3qJ6j7l0L3P0K9kj0m7m7K9P1M1J6k1o8j3P7J4q9KJ38Q0l3m3n8q8
1527D442k5K5n0p8J8O2L4N3M3n9p2N4J15N7Ml2o5k7K9nn6j3L4kl5kK0j7o3m9J9O7N5J9%%J4
1522D514K3jk1JQj8qJ3k4m0L0M7k5j9O0N0j7k6j9%R8J38Rr9o7o6j16m2N7j4r2J8J29O1m7m3
1517D452J3L7J7k2n8o8n3j8K6N8P9P5J8k3Jj1q5n0R1J03mJO9Lq7m9j1o8p5QM6Pl8n4j2O4O2
1511D444k9n9K1J00P9k5j09m2J14J06p9j48k0N9jk5L0K2m6n7j1PJ4N4O0pm2J1K7m9p3J0M8
1506D384LJ6P6M3m1n7k6qL6R2Q3J0m0mQ4P1j00j93j3J66M7j47q8O3L0p3m6M5O9K6k8n6n9o0
1501D305j6P8O8q6j18O7J64N0rM2j3q6L0J38L1q2o2o6q8OM9q7j24O0J51M5rK3j4l4L7L3n4
$$ plain form
1538 4475 4457 4393 4366 4358 4332 4346 4423 4471 4456 4456 4470 4433 4388 4389 4374 4329 4346 4405 4408 4419 4516 4566 4482 4432 4507 4531 4410 4305 4331 4401 4427 4408 4368 4329 4306
1533 4306 4285 4266 4276 4318 4371 4414 4423 4400 4392 4408 4391 4361 4394 4464 4493 4491 4481 4434 4387 4416 4487 4528 4544 4523 4455 4442 4519 4533 4444 4446 4584 4664 4631 4588 4530 4442
1527 4442 4417 4442 4392 4314 4332 4394 4428 4481 4524 4465 4393 4447 4562 4619 4623 4591 4526 4499 4528 4523 4467 4454 4488 4486 4451 4449 4469 4452 4389 4340 4359 4426 4481 4500 4500 4500 4514
1522 4514 4537 4536 4515 4516 4524 4506 4498 4511 4487 4447 4477 4524 4499 4480 4540 4590 4573 4547 4528 4528 4626 4764 4773 4674 4607 4541 4425 4383 4440 4426 4334 4352 4481 4542 4495 4452
1517 4452 4465 4502 4519 4497 4439 4371 4318 4300 4326 4384 4463 4538 4556 4533 4534 4523 4438 4388 4479 4582 4578 4579 4648 4651 4564 4515 4504 4436 4361 4369 4415 4422 4384 4330 4318 4382 4444
1511 4444 4415 4356 4377 4477 4556 4531 4422 4380 4494 4600 4521 4373 4353 4412 4411 4386 4416 4438 4392 4335 4324 4331 4345 4399 4459 4452 4410 4421 4448 4399 4326 4336 4384
1506 4384 4387 4403 4479 4522 4481 4424 4398 4390 4426 4518 4601 4611 4571 4567 4651 4722 4622 4429 4416 4582 4629 4482 4394 4457 4487 4414 4368 4413 4482 4508 4480 4424 4365 4305
1501 4305 4289 4367 4435 4349 4231 4298 4462 4512 4503 4545 4532 4446 4476 4614 4645 4563 4501 4435 4347 4353 4402 4315 4191 4251 4402 4447 4438 4461 4447 4413 4450 4483 4429
1497D429j9R0N0q0p4M4J10Q4J7m4n3j6K0K3j8o4n2j9l8m4L9P3l4r4%M7m4p0M9J31O9l4m8J7
1492D447L6n6r4K1R8kq0QQ3K8l6l0J2O7O1n8j32j8J05M1p8o4J6L2pk8jO1J04R0J6q7j33m3
1487D379Q0O3m8o0Nop3o5J6P2N9Ll4nL7J8l4m9j4L3M8pq1o4L8J00Q0L7j7o9n6PK7L%%j7K2
1481D428R9P7j6m5m9j06r9L3R1Qj3N3J9p9o4RJ6RJ8oRQ7N7r1r9N3Q9k8r2n8oM9P2K0k8j5L
1476D405L9J10P8q0j28MQ1J6m2p3j18o5Q8J21j3n9P0J50K6j46j46NQ1Ln8%L8j0j6N1N3oJ9
1471D478R5N0q4j12kQ9P5J4l5m9j2M9P1K7o0j39j22KQ8M7JJ4k0q6l8L8j9o4M2P5q6j49K5J49
1466D352P3l9p5n2K8Q2L0j7J2J1k2L7J00J9p5l4Mn0o2K4Q5O2no6m5M4O6j9p1l4PPJJ0Pn1j03
1460D241j6J35Q9j03j13L3L5m2M3J32L7n2k0k7o3jK4o7m5J12J36L6K1L5l1o8n4r2r8MN2J6
$$ plain form
1497 4429 4410 4500 4550 4470 4396 4440 4550 4634 4651 4607 4554 4538 4558 4581 4563 4499 4447 4428 4390 4346 4385 4458 4424 4330 4330 4377 4333 4263 4312 4443 4512 4478 4430 4447
1492 4447 4483 4427 4333 4354 4452 4450 4370 4378 4461 4489 4453 4423 4435 4502 4563 4505 4373 4355 4460 4501 4423 4359 4375 4407 4400 4372 4371 4432 4536 4626 4642 4555 4422 4379
1487 4379 4459 4522 4474 4414 4419 4413 4340 4275 4291 4363 4422 4425 4391 4386 4423 4441 4407 4358 4344 4377 4425 4418 4337 4273 4311 4411 4491 4528 4511 4442 4386 4393 4420 4423 4423 4423 4406 4428
1481 4428 4527 4604 4588 4543 4494 4388 4289 4322 4413 4421 4408 4461 4480 4401 4337 4346 4362 4371 4389 4383 4392 4479 4536 4445 4346 4399 4488 4460 4368 4310 4304 4353 4425 4445 4417 4402 4405
1476 4405 4444 4554 4632 4552 4424 4428 4509 4525 4483 4410 4292 4227 4315 4436 4423 4364 4434 4584 4610 4464 4318 4323 4404 4407 4349 4349 4387 4377 4361 4412 4465 4459 4478
1471 4478 4573 4623 4539 4427 4425 4514 4589 4603 4568 4519 4507 4556 4627 4654 4594 4455 4333 4335 4423 4470 4471 4485 4465 4379 4341 4379 4360 4296 4338 4413 4327 4178 4203 4352
1466 4352 4425 4386 4311 4259 4287 4369 4399 4382 4394 4405 4383 4420 4520 4539 4464 4430 4434 4384 4322 4346 4431 4493 4488 4422 4377 4421 4487 4468 4397 4363 4370 4377 4378 4388 4395 4344 4241
1460 4241 4225 4360 4449 4346 4233 4266 4301 4259 4302 4434 4471 4419 4399 4372 4309 4308 4332 4265 4220 4332 4468 4504 4525 4560 4529 4461 4407 4315 4217 4221 4273 4289
1456D289N5R9Nn7L7P2k3l2L0j1o8nN5J7j8oK0O0N0n2j06n0n1j16m7R8Q5j7l6l4m5L4J24N6
1451D412n0k8J6j6rN7N0k0k5K1Qn5o2J1P6O9K8MqLK8Ol9K5J32O3j15j02O7J01j5o2k0j7m3
1446D491k5ro0j01lJ59J42l7q4J1k8j35qJ81P9j02m0N8m2j14j6O9P6P5%j12o8P1P7j3l1pP
1441D461L3J7n9o7PK3m0o5k5L3O7L0nO2J10j3j21j7Q6k2j30m7O3O4O2R6N9n1j09p4k7k6m5
1436D330m3j1N5J20J03Jn4j9nk8QP3M7k6m5m7p6p5j5O7J27Q8n3j44p5L0N6L1j0m1%N2kq0n3
1431D286j7m0K2J44R8q2j19RQ6M6k4o7n6K4J06J04K1n1k4N8N1l4m4J7Ln5j6N2J6m2k2Pj6k7
1426D414J4N6N2J1k1k3m5q9o1M2Q6L6k6q2j30p5P8J35M1k2L7Q0%j09j11LJ10J16M9pk8n5r5
1421D381q6L4J52Q1j02r3J09J58k5j31n2J2JL7P9K3l9k1nl4l6j0j4j7L2P3M1kNmn7m5O3J00
$$ plain form
1456 4289 4344 4443 4448 4391 4428 4500 4477 4445 4475 4464 4396 4391 4446 4463 4445 4439 4459 4519 4569 4517 4411 4361 4310 4194 4147 4245 4330 4313 4277 4243 4198 4232 4356 4412
1451 4412 4362 4334 4350 4334 4325 4382 4432 4412 4387 4408 4416 4361 4299 4310 4386 4455 4483 4487 4479 4482 4510 4516 4477 4502 4634 4697 4582 4480 4547 4648 4633 4571 4551 4534 4491
1446 4491 4466 4457 4397 4296 4293 4452 4594 4557 4473 4484 4456 4321 4313 4494 4573 4471 4431 4489 4447 4333 4317 4386 4462 4537 4537 4425 4357 4428 4505 4492 4461 4454 4461
1441 4461 4494 4511 4452 4385 4392 4415 4375 4310 4285 4318 4385 4415 4410 4472 4582 4569 4448 4431 4517 4495 4365 4318 4381 4445 4507 4603 4662 4611 4502 4428 4401 4375 4330
1436 4330 4287 4276 4331 4451 4554 4555 4501 4482 4477 4449 4457 4530 4577 4551 4506 4459 4383 4308 4293 4360 4487 4575 4522 4378 4303 4333 4389 4420 4410 4369 4369 4421 4419 4339 4286
1431 4286 4269 4229 4251 4395 4493 4411 4292 4301 4387 4433 4409 4342 4286 4310 4416 4520 4541 4490 4466 4524 4575 4541 4497 4514 4517 4462 4446 4498 4514 4472 4450 4457 4441 4414
1426 4414 4428 4484 4536 4547 4526 4503 4458 4369 4308 4350 4436 4472 4446 4364 4234 4159 4237 4372 4413 4391 4428 4508 4508 4399 4288 4291 4401 4517 4566 4559 4531 4476 4381
1421 4381 4295 4329 4481 4562 4460 4367 4476 4634 4609 4478 4426 4438 4439 4476 4555 4578 4539 4518 4513 4479 4443 4433 4419 4402 4434 4507 4548 4546 4551 4547 4490 4445 4508 4608
1416D608%n0Qrj14q3P7J14K1mL7L5L7P2K5q6r8k3k1o3j2Q6P0m9j25r9m3oK8M9K1k7l2j4j0
1411D320LK2ol6M9J81J60k7j71j54n2J9K6nl2j0P3J33P5m3p3k3llK8rj24r7R6J31o1j18N8
1406D327Q8j20j59R4K21K9j42n3P3M5nK1Kp7o8M2J03P6L1j0o3j08j15o3L2Q8N6K8N3L6m0n3
1401D369QL7M6Q3P6Nl9n3j19j53m0Q2K9q7m6Q2Q1j5jQ9N4m7j0Q2J9r0p2k0k4PM7j4o0K4O7
1396D397k3n8K3P8O8L5n2j07k1P8N5J3K1P%L6oj01n7M7j6j26p5K4K4J5M6M2J3Jl6o3LR8J16
1391D499Q1N3K4k8q4r1l1Qm0o2J2M8pl5k7m6KJ17J09J5L5N6q9j56K3J24k6j08oJ0q4k6J34
1386D404J12o5j29m0J9lJ2O5N9Qnlj6pMk3j2N0L9k6J2P5Mp5k2K0m2o4KN4O4L8j3mM4Qk6P7
1381D595J10q0j82l5N3k8l6L6L7N3R5j6j62q8N3K9k6J5L1j0k4k9k8L7O8jj2Q2Q9j7n4j3M%
$$ plain form
1416 4608 4608 4558 4566 4557 4443 4360 4437 4551 4572 4568 4605 4640 4677 4749 4774 4688 4590 4567 4546 4483 4471 4557 4627 4578 4453 4354 4311 4305 4333 4382 4403 4376 4344 4330 4320
1411 4320 4323 4345 4339 4303 4352 4533 4693 4666 4495 4341 4289 4308 4334 4329 4297 4287 4360 4493 4568 4525 4452 4429 4426 4423 4451 4442 4318 4221 4317 4448 4387 4269 4327
1406 4327 4415 4295 4136 4230 4451 4480 4338 4285 4358 4403 4398 4419 4421 4344 4276 4318 4421 4497 4528 4518 4455 4347 4232 4169 4201 4289 4345 4373 4426 4462 4422 4369
1401 4369 4377 4414 4460 4543 4619 4624 4585 4532 4413 4260 4220 4302 4331 4244 4198 4280 4361 4346 4345 4434 4488 4441 4431 4513 4532 4442 4370 4350 4326 4333 4380 4366 4306 4330 4397
1396 4397 4374 4316 4339 4417 4485 4520 4468 4361 4340 4418 4473 4486 4507 4514 4514 4550 4544 4443 4386 4433 4417 4291 4216 4240 4264 4279 4325 4367 4380 4381 4345 4282 4285 4383 4499
1391 4499 4580 4633 4657 4629 4545 4454 4423 4431 4391 4329 4341 4389 4382 4347 4320 4274 4276 4393 4502 4517 4552 4608 4519 4363 4386 4510 4484 4376 4370 4380 4296 4270 4404
1386 4404 4516 4451 4322 4282 4301 4298 4310 4375 4434 4442 4437 4434 4418 4411 4415 4392 4380 4430 4469 4443 4455 4530 4534 4459 4437 4457 4415 4351 4353 4407 4471 4509 4496 4492 4536 4544 4518 4595
1381 4595 4705 4625 4443 4408 4461 4433 4397 4433 4470 4523 4618 4602 4440 4352 4405 4434 4408 4423 4454 4444 4420 4391 4363 4400 4468 4467 4455 4537 4626 4609 4555 4542 4546 4546
1376D546k0o4l2P6O5q6j37k5M7J7J3M3Mo7p2k9oJ7N8M6j8k9K7M5K3J9RnM8J16M4j05j20%Q2
1370D530M4l9n6J9M7n8j10J7J28N9n5p4k1O7J20N5k7j2j7j10j10LJ4n9l1N7O7M1L3Oj3j2m5
1366D458n4K4P8L5rk9p5o3K6M7j1oL3Rj5j4n8p0M5J45J01Ql3l1JJ3m4o5J7N1k8m7L7O3K9M6
1360D614P4L0k6k7rQM2O6L5m1r4o7LK4j5k5L2N7k8j26q2L0lj03lJ76Q8j38j22K0j7r3rO6L3
1355D370K3Qo1oJ58J30n3q5mk4n1L1N8j9l3J4j5r0q9%R6J08K0o2n3j4J5M8M4j7l1Qj6p0k1
1350D317L8j4n1M2J14L1r0j06k2Q2J21N3l3j6O0M4n8r5l0J9jrJ0nk6OL5J0JL5J2n3j0Q9M8
1345D548q2q7pk3m8O7J30k9j48LJ53M7p5mN9mpO1J5p1j7L9n2r5M7J38K5r5p2l3o3l8Q0J16
1340D478nr5l8Pm6l4P6O6p5p5Q2J21pr5o6j3L1N9M0nj7ML8P3P1Oo5p8l7J3L4K2L0O3K0j04
$$ plain form
1376 4546 4526 4462 4430 4506 4571 4485 4348 4323 4370 4387 4400 4443 4447 4380 4308 4279 4273 4290 4348 4394 4376 4347 4374 4419 4442 4461 4470 4465 4513 4629 4673 4568 4448 4448 4530
1370 4530 4574 4535 4479 4498 4545 4487 4377 4394 4522 4581 4526 4452 4431 4498 4618 4673 4646 4634 4617 4507 4397 4400 4414 4355 4324 4381 4448 4489 4522 4528 4515 4503 4458
1366 4458 4404 4428 4506 4541 4532 4503 4428 4365 4391 4438 4427 4421 4454 4463 4448 4434 4376 4306 4351 4496 4597 4605 4572 4541 4542 4555 4511 4446 4463 4514 4486 4439 4476 4539 4568 4614
1360 4614 4688 4718 4692 4665 4656 4664 4706 4772 4807 4766 4672 4605 4608 4632 4617 4592 4624 4681 4653 4527 4445 4475 4472 4369 4366 4542 4630 4492 4370 4390 4373 4280 4271 4337 4370
1355 4370 4393 4401 4340 4334 4492 4622 4569 4484 4480 4456 4405 4436 4494 4475 4442 4456 4441 4351 4262 4262 4358 4466 4486 4424 4371 4357 4372 4420 4464 4447 4416 4424 4408 4338 4317
1350 4317 4355 4341 4290 4332 4446 4477 4387 4281 4259 4341 4462 4515 4482 4466 4526 4570 4512 4417 4387 4406 4405 4396 4406 4401 4375 4381 4416 4426 4427 4462 4474 4421 4411 4500 4548
1345 4548 4466 4379 4372 4349 4301 4368 4498 4469 4321 4324 4477 4524 4449 4445 4504 4500 4493 4554 4569 4498 4481 4520 4468 4373 4420 4558 4583 4488 4416 4383 4320 4282 4362 4478
1340 4478 4473 4378 4340 4347 4301 4267 4343 4409 4334 4259 4341 4462 4455 4360 4294 4281 4312 4371 4411 4406 4389 4393 4431 4504 4575 4581 4516 4438 4401 4414 4448 4470 4500 4563 4583 4479
1335D479j41k2O5Mn7kN5L9O3J30P0r6j22J4M5q5j28%P9Lo8k3N1M7mj3K2K7j4m8m4k0OQj2M
1329D312P5R0mj00r5rJ07J69R1n7r8m3l3n5k0L6O0Q4J04O5k4j05j32n6N2N0k3JO1J0n0J1O3
1325D537Ol4JJ3nqm2q9o4jJ0J8N4M3omJ3l2o3j0M9N0J3l8n7J5Q7L7o2m7M0O2L3M8P4K4p8j04
1319D483k0N0J9k6oL1M5P0M6q2j51k3J00K7q5o2JOK8N9K7l3n5n0k7RJl5%O4M2j5lJ0m1o2r
1314D333L5M0N4M8l3j13o2R1J47J8j26j08lL4L6N3J7p7j09l1O8Q1j1q1%J14P1j9K0K8j12j46
1309D257L3R8m9q6O9J51Q8J5o1j19m7M9m2j73n0J80J43j08j93l3J03Q9N4M7lo4l8L2N9N9M1
1304D501j5n2j0J4n3q8J1J16Q0k7l1N9N6o8r8L6R8pp0l4n5r2j2N1k4l3J15J51j7r9QN0n7q7
1299D317K5O5l8q3J5P7J5m0k1J8O6J02L9o6n5J7Lk7PPk6J9N5k3l3Q9R4n8r7j4l9j05oJ44J28
$$ plain form
1335 4479 4338 4316 4381 4385 4328 4326 4381 4420 4483 4613 4683 4587 4465 4479 4524 4439 4311 4311 4390 4393 4325 4302 4353 4400 4396 4383 4405 4432 4418 4370 4326 4306 4312 4320 4308 4312
1329 4312 4387 4477 4473 4373 4278 4269 4376 4545 4636 4579 4481 4438 4405 4350 4330 4366 4426 4510 4614 4679 4655 4550 4418 4362 4414 4464 4441 4442 4503 4513 4463 4474 4537
1325 4537 4543 4509 4510 4523 4518 4510 4468 4379 4315 4314 4324 4342 4396 4439 4433 4429 4442 4410 4347 4337 4386 4436 4449 4411 4354 4369 4456 4493 4431 4384 4424 4486 4519 4567 4641 4665 4587 4483
1319 4483 4463 4513 4532 4506 4500 4531 4576 4646 4692 4610 4459 4436 4536 4563 4478 4416 4417 4423 4451 4510 4537 4504 4449 4399 4372 4381 4382 4347 4347 4411 4453 4438 4435 4445 4404 4342 4333
1314 4333 4368 4408 4462 4510 4477 4364 4302 4393 4540 4558 4432 4324 4321 4355 4391 4444 4461 4384 4275 4244 4312 4393 4382 4301 4301 4415 4486 4467 4487 4515 4403 4257
1309 4257 4290 4388 4339 4253 4322 4473 4561 4576 4515 4396 4349 4398 4356 4183 4133 4313 4456 4348 4155 4122 4225 4314 4368 4415 4412 4348 4310 4342 4401 4460 4501
1304 4501 4486 4434 4424 4438 4385 4297 4308 4424 4504 4477 4446 4505 4561 4493 4395 4431 4529 4522 4452 4418 4363 4271 4259 4310 4286 4253 4368 4519 4502 4403 4411 4461 4404 4317
1299 4317 4342 4407 4369 4286 4301 4378 4393 4353 4332 4350 4416 4518 4557 4491 4436 4453 4456 4429 4436 4443 4417 4436 4491 4468 4435 4524 4618 4560 4463 4449 4410 4305 4299 4443 4571
1294D571Qm2k7l3n9o9o1k5M6R6N4lK0L9l0m5L8Oj41j16P3J20J6j2L3M0Mn5r7k5Q0O3Qjq0j41
1289D253L3K12P6j22r2l3o3mO5KlR3M7l8O9J03j04j65L4P6n3kJ15M3k6M2L8n3l5Jn9n7M5M8
1284D486l7l1Rm1p1J1P5L2j6KL3N2Q2M7j22k48j16J46K13N6r5j16m5O0J07O0K0L6J4k1L6O9
1279D687o2j60l0J14M2p6k5O0J4n5j9K0m8j13l7R7J17L4j9j2k6m2K1R6K3j35j44J1Q6J7k9
1275D407l1r7j20K0J21Kj11KJ62J38Qn1k1J9L2L3M8M6k0r9r0K7J34Q3r6j50L9J85L9j66j21
1270D372L8M3n0n1Pj0n7J4J56J27p3j28L4Q9l9n1P6N1r7q5N0Q8L2pj9l8o8p4RJ17J04K1km2
1265D537j31q3P7Q7k4k9Kl3JJ03P3l1k2J8j6l1k1n8n1L3N9J0j3l3p0k3P1N6k5n2l7kN8L9q6
1260D353j24j3O6L8J7L7L9J4oRN3N8%k2Kj5o5p0o3n5K5J15P5k9l5J1Kj4J7L7Nl6m1KP6J12
$$ plain form
1294 4571 4579 4537 4510 4477 4418 4349 4288 4263 4309 4405 4459 4456 4476 4515 4485 4440 4478 4484 4343 4227 4300 4420 4436 4424 4457 4497 4501 4446 4349 4324 4404 4467 4475 4474 4394 4253
1289 4253 4286 4498 4574 4452 4360 4327 4264 4260 4325 4327 4324 4417 4464 4426 4495 4598 4494 4329 4363 4439 4386 4384 4499 4542 4516 4558 4596 4543 4508 4509 4450 4393 4438 4486
1284 4486 4449 4418 4427 4386 4315 4326 4401 4433 4417 4419 4452 4504 4586 4633 4511 4263 4147 4293 4506 4562 4467 4351 4306 4366 4473 4533 4553 4589 4603 4582 4618 4687
1279 4687 4625 4465 4435 4549 4591 4515 4490 4550 4564 4509 4490 4510 4462 4349 4312 4409 4526 4560 4541 4529 4503 4461 4482 4578 4601 4466 4322 4333 4419 4436 4407
1275 4407 4376 4279 4159 4179 4300 4302 4191 4193 4355 4493 4501 4450 4429 4448 4480 4513 4561 4607 4587 4488 4398 4425 4559 4642 4546 4396 4435 4620 4659 4493 4372
1270 4372 4410 4453 4403 4352 4359 4349 4292 4306 4462 4589 4516 4388 4422 4511 4472 4421 4497 4548 4451 4366 4416 4504 4536 4529 4510 4472 4404 4330 4339 4456 4560 4581 4579 4537
1265 4537 4406 4323 4400 4487 4463 4434 4436 4403 4404 4507 4580 4549 4527 4545 4529 4498 4477 4419 4368 4401 4460 4470 4457 4424 4354 4331 4402 4458 4433 4381 4344 4342 4400 4439 4353
1260 4353 4229 4216 4282 4320 4337 4374 4413 4427 4421 4430 4483 4541 4541 4519 4521 4506 4441 4371 4308 4253 4278 4393 4468 4439 4404 4415 4417 4403 4420 4457 4462 4426 4385 4387 4463 4575
1255D575O5k1p4p9n1%O8R2K5o3o7OQ4J42J04n8j58k4J38P9m9j6P0N2L5R5J08K3j6O6J32L8
1250E321j17j42o6n8j02p9m3p3p1lJ4MO9J15L0o2m4J9P0R1K3q2q6k2pNN8K5j21j57mJ23O9
1245D697k3nM0Lk6L4O2k9j06o8MM4O0K8k4k2j1l3mO8L3n9m4Jl9k7Q4J03%o5p9p3MP2K3j8K3
1240D628j4j04m9N0ro2L5P7pRJ13M9j28j14P5J17n7j51nJ29L9p9k0N7J1k8LK2M9R8M4p9p7
1235D622K4M4ol2k6J7N1k0q9JQ1j9j01m1j8l6O0J12l1j09K3Q5j9n9J3N9O7N4ol2K1L2l2o8
1230D622p0o4j4K4KM1J23M9r4m7O5K9J6J26P8j34j43L6O7l2k8J3j6k6K5O4Q2O7OJ1R4O2j01
1225D933j42j6N4K1%j9n6m0J1J7J5L3J4LP2J11K1o7o2o2j07j06l2L7L2j5oP1O7m7o9M8O9m2
1220D741l9R0R0l2p1k3lOK9K1L3J09J24Oo3K3Q6j7j06OJ67J33j9o5m5q9j07j2M6RK7R3M6n7
$$ plain form
1255 4575 4640 4619 4545 4466 4415 4415 4483 4575 4600 4537 4470 4476 4560 4702 4806 4748 4590 4566 4704 4783 4734 4718 4788 4840 4875 4970 5078 5101 5085 5151 5283 5321
1250 5321 5204 5062 4996 4938 4836 4757 4714 4641 4570 4567 4581 4585 4654 4769 4799 4737 4693 4712 4782 4873 4896 4814 4728 4706 4699 4704 4762 4787 4666 4509 4505 4628 4697
1245 4697 4674 4669 4709 4712 4686 4720 4782 4753 4647 4579 4583 4627 4687 4715 4691 4669 4658 4625 4621 4689 4722 4663 4619 4620 4581 4554 4638 4741 4741 4676 4597 4524 4528 4600 4623 4605 4628
1240 4628 4614 4510 4461 4511 4502 4440 4475 4552 4545 4554 4667 4716 4588 4474 4549 4666 4609 4458 4453 4582 4621 4542 4522 4579 4590 4562 4565 4587 4636 4734 4778 4699 4622
1235 4622 4646 4690 4684 4652 4626 4643 4694 4674 4585 4586 4667 4648 4547 4506 4488 4452 4512 4624 4593 4484 4507 4592 4573 4514 4527 4586 4653 4707 4701 4669 4690 4722 4690 4622
1230 4622 4552 4488 4474 4498 4500 4541 4664 4713 4619 4572 4637 4666 4682 4808 4886 4752 4609 4645 4712 4680 4652 4665 4649 4623 4648 4712 4794 4861 4867 4878 4972 5034 4933
1225 4933 4791 4775 4829 4850 4850 4831 4775 4735 4746 4763 4778 4811 4825 4828 4900 5011 5032 4965 4903 4841 4734 4628 4596 4633 4665 4650 4644 4715 4782 4735 4666 4714 4783 4741
1220 4741 4702 4792 4882 4850 4779 4756 4753 4759 4788 4809 4842 4951 5075 5081 5018 5041 5127 5110 5004 5010 5177 5310 5291 5226 5181 5092 4985 4973 5019 5028 5055 5148 5194 5137
1215E137m9K5M5K9J1j9k5k0n7n8M3R1j2j12r2k3N7J14O3k3PO9Pl8M2O2k9j7J00Q7l4o6j9P
1210E303L1M7lm2J7Q4Q3P1M4l8p7J5Q9K5m4NO1M4L6N3J1l4K7R2K1o7qJ00Q8K0J2J0n0o4K8
1205E990R6M4n0p1j1O6Q2oj01p3L4P9M3j7o5m1M0Jj57j38J12K28Q1k8Jk5p6qN0l7j05l2M8
1200E954L2OM3R7Q0ml3J6J1l0N0J39M5l9Q6J81O3j5P8J14L6J7P3J08Q3j3p5L5J62P2n9L1J51
1195G495P9%O1J07M1j8K3J47K27J19m3j2J10P8MO2J17Q1J07J82J56J11J57J75J18J59L16L82
1191A0541K84K06L01M60N00M63N21O18N85N03N47O49O56N92N40N41O22P39Q30R21J001J017
1188B3637J084J297J448J386J295J241J050Q12P94R93J350J931K582L110L701M359M485L741
1185F0296K571J434M22l68q63j168j303j254j225j297j240j085j114j212j042o70l46q3R1
$$ plain form
1215 5137 5088 5113 5158 5187 5198 5179 5154 5134 5077 5019 5062 5153 5141 5029 4937 4914 4971 5085 5148 5125 5132 5201 5208 5170 5212 5274 5245 5228 5328 5415 5381 5315 5296 5303
1210 5303 5334 5381 5378 5336 5353 5437 5520 5591 5635 5597 5520 5535 5624 5649 5605 5610 5671 5715 5751 5804 5815 5781 5808 5900 5921 5854 5846 5946 6034 6054 6066 6076 6026 5962 5990
1205 5990 6086 6130 6080 6009 5998 6064 6146 6140 6039 5966 6000 6079 6122 6105 6040 5999 6039 6040 5883 5745 5857 6085 6166 6138 6139 6114 6038 6030 6080 6043 5938 5906 5954
1200 5954 5986 5992 6035 6132 6212 6208 6175 6191 6202 6172 6222 6361 6406 6367 6453 6634 6697 6682 6760 6874 6910 6927 7000 7108 7191 7178 7103 7138 7300 7372 7313 7344 7495
1195 7495 7574 7574 7635 7742 7783 7765 7788 7935 8162 8281 8238 8226 8336 8414 8418 8480 8597 8678 8785 8967 9123 9234 9391 9566 9684 9843 10159 10541
1191 10541 10825 11031 11332 11792 12292 12755 13276 13894 14479 14982 15529 16178 16834 17426 17966 18507 19129 19868 20698 21619 22620 23637
1188 23637 24721 26018 27466 28852 30147 31388 32438 33250 34044 35037 36387 38318 40900 44010 47711 52070 56555 60296
1185 60296 62867 64301 64723 64355 63492 62324 61021 59767 58542 57245 56005 54920 53806 52594 51552 50882 50536 50453 50544
1182E0544M8j83n10r57j445j778j961k106k168k104k009j942j863j769j664j504j294j104
1180B4231j021j059j111j045r01q00o89m91l47l73m15l10j93k55m82p22q87r68r58q71p64
1177I569o60n22l71k78k26j78j98k66k12n5l0j11n9M2m3j70r2K5m5j67j39k0O0O3qo5k2J9
1173E841n8j23k3Q7K8p0l1L9Lm3ON9K2o6j19r8KQ0L7n9p6l4l2p0q8l7O1R5Pm3M3P8m1r4J3
1168E296N2m9q9k0K4M0N6J1m6MP2Lj27j45n9J7K9k5q5o9kJ9j6m5o3j01j24o5K7K4o6j15p8
1163D285l3pK6M1K0MK1O2R3N5m6r5n7k5JN9N8j5JP3Rq5k1M5J3O8J54K2j39m9M3o7q5N7L6r2
1157D430j9J01J5n6P4J63Q0J0L7L7k6p2m9NK0j8n2n3j4P3J37P1o8j25p1L0R7K7j14j02L9O5
1153D672KL8P9Nm5k0o0r6PR7M1j4kopJ9MoN7N4o3q8QL3o%j3m8QP7K3l1J5K2k7J2Q0L0n4n7
$$ plain form
1182 50544 50592 50409 49899 48942 47497 45719 43758 41652 39484 37380 35371 33429 31566 29797 28133 26629 25335 24231
1180 24231 23210 22151 21040 19995 19094 18294 17605 17114 16767 16394 15979 15669 15476 15221 14739 14017 13130 12162 11204 10333 9569
1177 9569 8909 8387 8016 7738 7512 7334 7136 6870 6658 6603 6573 6462 6403 6445 6402 6232 6140 6165 6120 5953 5814 5794 5854 5917 5909 5844 5822 5841
1173 5841 5783 5660 5637 5724 5752 5682 5651 5690 5693 5650 5656 5715 5737 5671 5552 5454 5456 5536 5573 5514 5438 5404 5372 5302 5214 5177 5238 5333 5340 5297 5340 5418 5377 5283 5296
1168 5296 5348 5299 5210 5190 5214 5254 5310 5321 5275 5279 5351 5354 5227 5082 5023 5040 5069 5044 4959 4890 4888 4907 4891 4846 4783 4682 4558 4493 4520 4544 4478 4363 4285
1163 4285 4252 4245 4271 4312 4332 4336 4357 4419 4512 4567 4521 4426 4369 4344 4345 4404 4462 4447 4448 4521 4530 4445 4424 4469 4482 4550 4704 4726 4587 4538 4581 4514 4429 4486 4522 4430
1157 4430 4411 4512 4527 4471 4545 4708 4788 4798 4835 4872 4846 4774 4725 4730 4750 4732 4680 4627 4613 4686 4823 4894 4826 4701 4630 4660 4757 4784 4670 4568 4607 4672
1153 4672 4674 4712 4791 4796 4751 4731 4671 4575 4582 4679 4720 4706 4704 4698 4691 4710 4714 4708 4765 4819 4756 4668 4676 4709 4703 4703 4690 4642 4650 4727 4750 4719 4734 4756 4729 4741 4821 4851 4797 4740
1147D740n6r7r7j3O6N0n9j21k7Q5M9l4J9J13N4r8j28k0M1j0l2L1N3qj2P1J00N6K9Pk9k7nk2
1142D669j1N0L1l9PP0l6j28pQ9j9p0O0Q7l3j9Q3j4j76r3Q9P3o0r8n6QP1M6l7qJ02Q4k2m2k8
1137D623p6q4j0K5Nj5m3m0N8J31O6RN2M0p7j32o8L3J31J45k9k17j25J47K12Qj40m9P5J8j11
1132D562j11KR7J11J3j24j07L9M0r8o9J00J12j1n9o0l9Q1J61M6o2l1n4j41p9M6M4M0J10P1
1128D630m3k9K1l6n2J6j2q3j0Q2Rq1m2Km0o0oM9O4M9K0j4o2j02n5P2J28L2o7rJ10J17N0K6
1123D674Mo2o2K0K5o5q1j5K5N1P4K6j8L2L9p2r8J8N8j7m2n9j33r6Q4J49J6q0m0j6n0j1Q5N1
1118D414p5l1J55J25r3r6Q9O5p9LJ51Q4k5l7r9j06R6K01j2j49J8J22j1q3j1jo1n0J7M4K4J5
1113D604M9N7k4r7n7KkLK2k5m4N0R3oq8n3kK7M7Kq1o4N1P7l9j26m9J03J71J34N0n2j11n1K1
$$ plain form
1147 4740 4684 4587 4490 4477 4543 4593 4534 4413 4386 4471 4520 4486 4505 4618 4672 4574 4446 4426 4467 4457 4425 4456 4509 4501 4489 4560 4660 4716 4745 4752 4723 4696 4691 4669
1142 4669 4658 4708 4739 4700 4707 4777 4741 4613 4606 4695 4676 4606 4666 4753 4720 4701 4784 4770 4594 4501 4590 4663 4603 4505 4449 4457 4528 4574 4537 4529 4631 4715 4693 4651 4623
1137 4623 4547 4463 4453 4478 4483 4468 4425 4385 4443 4574 4640 4649 4701 4741 4664 4532 4464 4497 4628 4773 4744 4527 4402 4549 4761 4769 4629 4580 4655 4673 4562
1132 4562 4451 4453 4550 4661 4674 4550 4443 4482 4522 4424 4355 4455 4567 4556 4497 4437 4398 4479 4640 4686 4624 4593 4539 4398 4319 4365 4409 4449 4559 4630
1128 4630 4587 4558 4579 4543 4491 4507 4495 4412 4402 4484 4493 4412 4370 4372 4332 4272 4266 4315 4379 4428 4448 4434 4372 4270 4215 4287 4415 4447 4380 4371 4481 4598 4648 4674
1123 4674 4678 4616 4554 4574 4599 4534 4453 4438 4463 4514 4588 4614 4596 4628 4667 4595 4497 4515 4573 4556 4514 4455 4322 4226 4310 4459 4475 4395 4355 4339 4289 4278 4363 4414
1118 4414 4339 4308 4463 4588 4495 4399 4488 4553 4474 4477 4628 4712 4687 4650 4551 4445 4541 4742 4730 4581 4599 4721 4710 4627 4616 4615 4554 4504 4521 4565 4589 4604
1113 4604 4653 4710 4686 4589 4532 4534 4532 4535 4557 4532 4488 4538 4631 4625 4537 4484 4482 4509 4556 4558 4477 4413 4464 4541 4502 4376 4327 4430 4601 4735 4785 4733 4622 4571 4592
1108D592l6j02k8O0M0K5L5m8j23k7R7O6kK1M3Nj3Nqn0l3O7J11%j13m6O3K6l9jK6j4j2K3Lj8
1103D595rj7nM8L6l9l9J8K8L3M2mk6N0P6j2p3p6p8j6P8L9n1J6J15K6j30j30JJ18J21J8m6k
1098D705J4m3n2l0n1j5P5K2j14q7J9J0L0J73J77k6j32n6j5m8k2M4M8Jl9l5L2Q2J4j07j04J5
1093D485O9J2l9o1j01p8P1J52K5r9l2P0L1k7J5P3L8o7j22l6Q5P1j1J9P6Mq7m4J7k7q7n5K7
1088D367O0L7N2J13N9j12j33M3J06j5n5K7M2rk8k6kM3nj04o2M9M3M2J32Q7r6q3J09J16o4j13
1083D620J2J04R7N1l5j34j46l8O2N0NLk3o9k0N9K8j0L1nr0OJ46N9o9j4K8k6KM0l9m4L3p4j90
1078D410MK02N2j53j20j7O0J27O6n5j8M0o0r2M8Q9PQJ9m4k1N4J5l0Ql1j02j6Q0M3M6R9K0p1
1073D667j3K0l4qL0m3m0P2L2j17r0K3J9jL5J7k1NK7Lj6n4p5J3R0J2n2K3O3K0M0P0Qk9Jl6j02
$$ plain form
1108 4592 4556 4454 4426 4486 4526 4551 4586 4538 4415 4388 4485 4551 4549 4570 4613 4618 4605 4610 4602 4552 4519 4586 4697 4697 4584 4538 4601 4627 4588 4587 4613 4599 4587 4610 4613 4595
1103 4595 4586 4569 4564 4612 4648 4609 4570 4588 4616 4649 4691 4687 4661 4711 4787 4775 4702 4626 4548 4532 4610 4649 4598 4614 4729 4755 4625 4495 4496 4614 4735 4753 4707 4705
1098 4705 4719 4676 4624 4594 4543 4528 4603 4625 4511 4424 4443 4453 4483 4656 4833 4807 4675 4619 4604 4556 4534 4578 4626 4627 4588 4553 4585 4667 4681 4574 4470 4485
1093 4485 4554 4566 4527 4466 4365 4287 4358 4510 4535 4436 4404 4474 4505 4478 4493 4566 4604 4537 4415 4379 4464 4535 4524 4543 4619 4623 4536 4492 4509 4482 4395 4340 4367
1088 4367 4427 4464 4516 4629 4688 4576 4443 4486 4592 4577 4522 4549 4591 4582 4554 4528 4526 4569 4564 4460 4398 4447 4490 4532 4664 4751 4655 4572 4681 4797 4733 4620
1083 4620 4632 4736 4833 4884 4849 4715 4569 4531 4593 4643 4648 4651 4628 4559 4539 4598 4626 4616 4647 4642 4552 4558 4704 4763 4694 4680 4708 4682 4684 4724 4685 4641 4674 4600 4410
1078 4410 4414 4616 4668 4515 4395 4378 4438 4565 4631 4576 4558 4598 4538 4446 4494 4583 4590 4598 4617 4573 4552 4606 4621 4591 4599 4568 4466 4450 4530 4573 4619 4718 4738 4667
1073 4667 4654 4674 4640 4632 4662 4619 4579 4651 4683 4566 4476 4499 4518 4517 4552 4569 4548 4553 4580 4583 4567 4513 4438 4451 4541 4553 4501 4524 4587 4607 4647 4717 4725 4696 4697 4661 4559
1068D559p2l1k9M3J04qj29o1L2pn7l7j5L6J34J46K5p5o1J0P5P9K2k8m4p5p4K7Q6k1j23n1M7
1063D427Qo6m1L6R8J06J2r3l7J03Q0o3o3P1R8ko1m9l9l5k6j4QK7Mj2J6j3j18j15L5J01Jm0
1058D344M7Q3L5K3L5QRL8k0r8m8L0j1m0L3L9n4n4M1M9rk3k3l7k2k1o2m9K5M8L8O7Q9R5J11
1053D716L4j47j89l6M0k6l2K4K9L6N6qp6l9nn1n8nM9J29J57Jj56n6J32J21j8p5j3R5J13l9
1048D703j67q1M1rq1k4N7O9M3JLP6R4Ml3J4j0p9l6N2M0rNK7l2j39j62m6O2N4L5N5j6j32j05
1043D274j0ON0J61J34LlN0J3KM9nr2l9L3PK7Q3qj26n2P2L1m7j2N5P3P4L1o9j00K1J23M6o9
1038D786n1j2o8o9K8Qj11p1O0N6J2N1J3q0j5J00M8j6J3l6j19l1J00J04R1L8j49j98N3K01J2
1033D748j41m5P6Q5L2n6p2K7N1k0L2J18J0r8QP4m6q2K3L6k2KJ6l0j3L1j1l5M2O5j1k5J9j3
$$ plain form
1068 4559 4487 4456 4427 4470 4574 4566 4437 4376 4408 4401 4344 4307 4292 4328 4462 4608 4633 4558 4497 4507 4582 4661 4683 4655 4611 4536 4462 4489 4575 4554 4431 4380 4427
1063 4427 4435 4369 4328 4364 4462 4568 4580 4487 4450 4553 4633 4570 4507 4578 4676 4674 4613 4564 4525 4490 4464 4450 4458 4485 4489 4477 4493 4480 4362 4247 4282 4383 4384 4344
1058 4344 4391 4474 4509 4532 4567 4575 4584 4622 4602 4504 4456 4486 4475 4435 4468 4507 4453 4399 4440 4489 4480 4457 4434 4397 4375 4354 4292 4243 4268 4316 4354 4421 4510 4605 4716
1053 4716 4750 4603 4414 4378 4418 4392 4360 4384 4413 4449 4505 4497 4421 4382 4377 4326 4268 4263 4312 4441 4598 4599 4443 4387 4519 4640 4622 4547 4534 4629 4742 4703
1048 4703 4536 4455 4496 4487 4406 4382 4439 4508 4551 4552 4555 4631 4725 4729 4696 4710 4700 4621 4585 4637 4677 4668 4673 4700 4668 4529 4367 4321 4383 4437 4472 4527 4511 4379 4274
1043 4274 4264 4270 4320 4481 4615 4618 4615 4665 4678 4680 4729 4724 4632 4593 4626 4633 4660 4743 4735 4609 4557 4629 4660 4613 4601 4656 4729 4803 4834 4765 4665 4686 4809 4855 4786
1038 4786 4735 4723 4655 4586 4614 4622 4511 4440 4500 4556 4568 4619 4632 4552 4537 4637 4685 4669 4682 4646 4527 4496 4596 4700 4791 4829 4680 4482 4535 4736 4748
1033 4748 4607 4562 4638 4723 4755 4699 4627 4654 4705 4685 4717 4835 4845 4747 4755 4829 4783 4701 4724 4760 4738 4740 4756 4726 4713 4744 4733 4698 4740 4805 4794 4769 4788 4775
1028D775o7mQ9O7j9n5n4l5M9J31Q2l2n9m7r5j08k3K5J0N8J01jj16o9K8O0R5J14J7q7l7O7O9
1024D929L1J8l1p6pQ8M0n0jO5j1o8M2J05k1j49j52j15l9Q7J04Kk5J6mkP5N2n4k8N6J5m3k6
1019D823n5q6mM1l0j9R0P9k1l0QK1O6R4K4n8o9m1K6R7P5kk4j8j4M4P5rq7o6k9K3Q0kj44p1
1013D787J10R8JM6R2Kj04j40q3O6J13l8j00M1O4n2nJ14L0r3p8p0o4N5J06k2r5l9QQ7J72M8
1009E057j66j50l0m6l1R1P3n4j4P7np5L1R7j5j00qJ25J00o1j33%J47J10lnM8j2j09m5Q5J6
1004D995j48p7R1pj51L7K41P7j13k7K8n0J9J10l5j39K3J08k9q0nk9p5pM8J6mj1k5K8R9Q7M9
999E044K7n9j41o8O5P9L2K3np1o5L0R0M9l4q2o8J0J09J30L5n3m0j9o0n7J8K9n4q9k1O4R2O2
994E002Rk9m5l4J6M2j4o7m6l4m0M1J27O7l9l2%k0OP4N3l8q6n3J9N7J7j4L9M7o1j08J5J54J39
$$ plain form
1028 4775 4708 4704 4793 4860 4841 4786 4732 4697 4746 4877 4959 4927 4868 4821 4726 4618 4595 4620 4630 4688 4789 4788 4672 4603 4631 4691 4786 4900 4917 4830 4793 4860 4929
1024 4929 4960 4978 4947 4871 4864 4952 4992 4942 4941 5006 4995 4927 4969 5074 5053 4904 4752 4637 4598 4685 4789 4791 4766 4782 4778 4776 4851 4903 4849 4821 4877 4892 4849 4823
1019 4823 4768 4682 4678 4719 4689 4670 4760 4839 4818 4788 4796 4817 4883 4977 5001 4943 4874 4833 4859 4956 5031 5029 5005 4987 4973 5017 5092 5083 4996 4930 4901 4924 5004 5002 4858 4787
1013 4787 4897 4995 4996 5042 5134 5136 5032 4892 4809 4875 4988 4950 4850 4891 4955 4903 4898 5012 5042 4949 4871 4801 4737 4792 4898 4876 4781 4742 4750 4837 5009 5057
1009 5057 4891 4741 4711 4665 4634 4725 4798 4744 4730 4807 4802 4727 4758 4855 4840 4740 4732 4857 4957 4896 4763 4763 4910 5020 5017 5012 5060 5048 4939 4894 4979 4995
1004 4995 4847 4770 4861 4854 4703 4740 4981 5058 4945 4918 4946 4896 4915 5025 4990 4851 4874 4982 4953 4873 4868 4839 4764 4757 4805 4821 4817 4806 4781 4809 4908 4995 5044
999 5044 5071 5012 4871 4803 4868 4947 4979 5002 4997 4926 4861 4891 4981 5030 4996 4914 4846 4856 4965 5095 5130 5077 5037 5018 4958 4901 4919 4948 4894 4805 4784 4848 4940 5002
994 5002 5011 4982 4937 4903 4919 4961 4947 4880 4834 4800 4760 4801 4928 4995 4956 4924 4924 4904 4910 4984 5037 4999 4913 4860 4879 4936 4953 4939 4978 5025 4964 4856 4871 5025 5164
989E164pj50j47l0L2ll6m9l2O8J52P7j7lj0n4LM0n5o9L0j4r5N3J76J9j25q3p4o6Q8J37mKJ31
984E049O4n9K3P3n9r0L3M5n6p6j4L7L1j7mR6Q9o1j07nK8j3LJ7pJ5L0m5p7j0J7J2P6J02Jn5
979E086J9O0m1j73j94m8J85L09K35J08O9N8k4j14j10q3j52k04r4L2L8Q5K02J15j24j39J2j3
974E100p7N7J41K7QJ23L3j88j79j4K7mJ8K1k9n5p7q3J7J34R2PQ5J63L8p0J9L3j21p3J82J52
970E507j17r9J13O0q9J2J18J7k3N4L8j1qr2j70p0m8j99j21J58J19j12k1J98J33j6l0p5r6N8
965E188J29j4m7R8J01j1J3O4k5p6L4J03J3p2k3N2L0l6l7OJ8J2K0L5N3M9J7N3J70J73J0j16
961E984j55k02j15J60L22K41J80J79Q9L4J08Q6n4l3J28K09K76M21M98M97N83P67R56J084J081
957A3324R62Q31O20K58j12m23q08j149j210j107j036r17p33n92m29k52k46k99j55Ol9n8O6
$$ plain form
989 5164 5157 5007 4860 4830 4862 4859 4823 4774 4742 4810 4962 5039 5022 5019 5009 4955 4958 4998 4943 4874 4904 4890 4795 4848 5024 5043 4918 4835 4761 4695 4783 4920 4916 4918 5049
984 5049 5113 5054 5077 5150 5091 5001 5034 5079 5023 4947 4933 4970 5001 4984 4980 5076 5165 5104 4997 4992 5020 5007 5010 5027 5020 5035 5065 5020 4943 4933 4950 4962 5038 5140 5141 5086
979 5086 5105 5165 5124 4951 4757 4709 4894 5203 5438 5546 5615 5673 5649 5535 5425 5342 5190 4986 4892 4924 4962 5047 5249 5364 5240 5101 5113 5100
974 5100 5023 5080 5221 5248 5256 5379 5412 5224 5045 5031 5058 5054 5072 5093 5064 5009 4932 4849 4866 5000 5092 5099 5184 5347 5385 5315 5334 5367 5246 5173 5355 5507
970 5507 5390 5291 5404 5464 5375 5387 5505 5522 5499 5553 5591 5580 5572 5480 5310 5240 5192 4993 4872 5030 5149 5037 5016 5214 5347 5331 5301 5226 5130 5188
965 5188 5317 5303 5256 5354 5455 5444 5457 5521 5496 5420 5454 5557 5570 5498 5475 5527 5557 5521 5484 5490 5508 5520 5540 5575 5628 5677 5694 5747 5917 6090 6100 5984
961 5984 5829 5627 5512 5672 5994 6235 6415 6594 6683 6717 6825 6911 6857 6824 6952 7161 7437 7858 8356 8853 9436 10203 11159 12243 13324
957 13324 14286 15117 15737 15995 15883 15460 14652 13503 12293 11186 10150 9233 8500 7908 7479 7227 6981 6682 6527 6533 6494 6436 6502
954F502O9o1q3l3o4j30j56j10K1J02M0K3J23J24L3J0m6j50o9R2K0j20r8r6j25%M9j41j52J25
949E699K10P1O3O3r7j31J2L0j1P4Q4k6%J00N6jK3j0k9O2O1p8r3L4P7M3J9j9k6J3jk3L4K7p7
944F233m9O2K6k0Q6J08j0J6J37P6l4J4O9N8J21J83J14O9J50K13K40L21L66L18L55N22O19O14
940A0977P31J000J149J034Q35P02M82J9n44r53j121j138j122j105r87p26m80l87l76l39k61
937G390j94k57m81o12m94m03m62k29N49J370J670J467J041N43J1m90q54j006r78q14n36l30
934E901l53l74j58N4Om7J62M61O27O62O19N23L64J10j04q8Q7K54M43N84M62J89L8j07m38p54
930I123q52p55m64o2J52J12N7N7L7N2R8P3J2l4j10j12L4Q7l8m6R9J24L1k4q4q7O2J09r2j87
925G372j8R1O2J03J79J57R0K3nQ0J25Mk8J18R6r3o9Q7M5m0Jpm4P6J62L7m2O0J31R6O3M2L9
$$ plain form
954 6502 6571 6510 6427 6394 6330 6200 6044 5934 5955 6057 6097 6120 6243 6367 6400 6410 6364 6214 6145 6237 6257 6137 6039 5943 5818 5818 5867 5726 5574 5699
949 5699 5909 5980 6043 6106 6009 5878 5890 5920 5909 5983 6067 6041 6041 6141 6197 6196 6219 6209 6180 6242 6303 6225 6132 6166 6243 6286 6305 6286 6260 6273 6272 6249 6283 6310 6233
944 6233 6184 6246 6272 6252 6338 6446 6436 6452 6589 6665 6631 6645 6714 6772 6893 7076 7190 7259 7409 7622 7862 8183 8549 8867 9222 9744 10363 10977
940 10977 11708 12708 13857 14891 15726 16428 16910 16929 16385 15432 14311 13173 12051 10946 9959 9233 8753 8366 7990 7651 7390
937 7390 7196 6939 6458 5846 5352 4949 4487 4258 4807 6177 7847 9314 10355 10898 10909 10419 9565 8559 7581 6767 6231 5901
934 5901 5548 5174 5016 5070 5076 5029 5191 5652 6279 6941 7560 8083 8447 8557 8453 8365 8452 8706 9149 9733 10195 10384 10422 10315 9877 9123
930 9123 8271 7516 7052 6990 7142 7254 7311 7368 7405 7457 7555 7628 7640 7606 7496 7384 7418 7505 7467 7421 7520 7644 7675 7651 7567 7480 7542 7651 7559 7372
925 7372 7354 7445 7507 7610 7789 7946 8036 8059 8054 8134 8259 8263 8235 8353 8449 8356 8287 8374 8419 8379 8380 8373 8329 8405 8567 8604 8562 8622 8753 8849 8912 8954 8993
921H993N6L6L4J19J14m6j00%k0j71k80l49l78l16k61j17M83J390J909J783J338Q12K81j75
917A5135n76q73q43n23k22l6Q8J01R8K39L94M50N82P73Q12P71O99K78n21j104j030m61J92
914A4423O53R01R65O52m9o01p25q73j222j258q74n10k79q0lQ5L90N37K03j42r3L4j7p0l1L3
910A2049R7J10O7Q4J38J16P0O7P8J49K60K16Q0R4J61J27J44K35K06J39J85K07J91K49K33J34
906A5886K40L75J97P5L24M59K87K87M49M16L78M81M48L63M67M81L24L83N49M94N26P86Q03
903B5478O02O22P12O73P69R07Q34Q54J039R69Q64J102J167Q51Q82J282J364J333J599J743
900D5646J709J981K275K230K358K735K817K884L352L679L696L985M412M646N157N912O295
897A05769O688P485P981Q411J0000J2217J3983J6228J9510K2575K5702L0549L6632M3026N0801
$$ plain form
921 8993 9049 9085 9119 9238 9352 9306 9206 9206 9186 9015 8735 8386 8008 7692 7431 7314 7797 9187 11096 12879 14217 15029 15310 15135
917 15135 14559 13686 12843 12320 12098 12062 12150 12251 12349 12588 12982 13432 14014 14787 15599 16370 17069 17347 16826 15722 14692 14231 14423
914 14423 15076 15977 16942 17594 17545 16944 16219 15346 14124 12866 11992 11482 11203 11123 11120 11205 11595 12132 12335 12193 12100 12134 12117 12047 12016 12049
910 12049 12146 12256 12323 12407 12545 12661 12731 12798 12876 13025 13285 13501 13581 13675 13836 13963 14107 14342 14548 14687 14872 15079 15270 15519 15752 15886
906 15886 16126 16501 16698 16773 17097 17556 17843 18130 18579 18995 19373 19854 20302 20665 21132 21613 21937 22320 22869 23363 23889 24675 25478
903 25478 26080 26702 27414 28087 28856 29763 30597 31451 32490 33459 34323 35425 36592 37443 38325 39607 40971 42304 43903 45646
900 45646 47355 49336 51611 53841 56199 58934 61751 64635 67987 71666 75362 79347 83759 88405 93562 99474 105769
897 105769 112457 119942 127923 136334 146334 158551 172534 188762 208272 230847 256549 287098 323730 366756 417557
895D17557O0278P1474Q8013J13335J45963J83587K20513K36747K10649J49186Q0744J3818
893A991864o5657j51902k10956k24572k11200j94069j74763j46813j13934q5106o3736m8147
892C01009l6608k8487k3133j9397j6289j3645j1556r616p638o330o246o810p034o622n976
889I5622n479n041m469l924l549l144k718k562k518k220j836j612j393j206j255j282j083
887E0331r64r44p31n44o28o16m03l37k95r6j17l28j98P8N8J06M02M86M29N82O23M51M92N64
883D8401L87M60P96P92Q35J402J689J476J686K078J826J661K153K396K301K649L022L050L494
881H2554M155M292M669N639O099O378P572Q743R341J0742J2625J3761J5640J9093K2046K4988
878B58337L0478L7053M2960N0671O0538P0848Q6443J12619J45462J81244K17912K36396K11168
$$ plain form
895 417557 477835 549309 637322 750657 896620 1080207 1300720 1537467 1748116 1897302 1978046 1991864
893 1991864 1926207 1774305 1563349 1338777 1127577 933508 758745 611932 497998 412892 349156 301009
892 301009 264401 235914 212781 193384 177095 163450 151894 142278 134640 128310 122064 115254 108220 101598 95622
889 95622 90143 85102 80633 76709 73160 70016 67298 64736 62218 59998 58162 56550 55157 53951 52696 51414 50331
887 50331 49367 48423 47692 47148 46520 45904 45501 45164 44869 44773 44656 44328 44130 44208 44266 44372 44774 45260 45689 46271 46894 47345 47837 48401
883 48401 48788 49248 50044 50836 51671 53073 54762 56238 57924 60002 61828 63489 65642 68038 70339 72988 76010 79060 82554
881 82554 86709 91001 95670 101309 107408 113786 121358 130101 139442 150184 162809 176570 192210 211303 233349 258337
878 258337 288815 325868 368828 419499 480037 550885 637328 749947 895409 1076653 1294565 1530961 1742129
876A742129J49543Q3802K0683n8366j46929k08782k25714k14782j97333j76959j49377j16926
875E00989q7793o6482n0656l7618k8110k2214j7930j4765j3285j2506j1532j0653r547p994
872A09904p003o514n379m191l931l594k740k624l035k625j959j990j959j462j255j317j260
870E7066j495j977k095k121k447k549k259k060j873j488j254j199j023r50j050q97o17o35
867B9077p00o12o65p07m39k43l09k37p5j41k03j20j25n9J91J78k5J76N09M32L53O38R06J139
864B8939J616K002K020J958J767J131K70n64j424k037k170k194k239j964j555j383j143o46
861B2384l05k24j77k24k79r0N5j14j65L8L8q0Q5K31R5R8L74N43N59M59m4r06j673k127k101
857A6450j426o48n55r14q37m4J106K169K772K719K022P07j075k891m150m245k993j171R8O12
$$ plain form
876 1742129 1891672 1975474 1996157 1937791 1790862 1582080 1356366 1141584 944251 767292 617915 500989
875 500989 413196 346714 296058 258440 230330 208116 190186 175421 162136 149630 138098 127445 117898 109904
872 109904 102901 96387 91008 86817 82886 79292 76552 73928 70893 68268 66309 64319 62360 60898 59643 58326 57066
870 57066 55571 53594 51499 49378 46931 44382 42123 40063 38190 36702 35448 34249 33226 32276 31226 30329 29712 29077
867 29077 28377 27765 27100 26393 25954 25711 25402 25165 25090 24949 24746 24626 24501 24442 24633 24811 24786 24962 25471 25903 26256 26894 27800 28939
864 28939 30555 32557 34577 36535 38302 39433 39703 39139 37715 35678 33508 31314 29075 27111 25556 24173 23030 22384
861 22384 22079 21855 21678 21454 21175 21085 21140 21026 20861 20899 20937 20857 20942 21173 21268 21366 21740 22283 22842 23301 23257 22351 20678 18551 16450
857 16450 15024 14376 13821 12907 12070 12026 13132 15301 18073 20792 22814 23521 22446 19555 15405 11160 8167 6996 7094 7706
855G706Q71J077J169J086O80Q3k00j55j94k31q8j71m92m06L8K04J80K88K49Jq8j62m96o89
851A0260m88l12l24l16l06l09j81k5J54O59J279J396J113Q98N90j4n51p85q53p74o29n82m40
848I460r1J9k41l26j10MP2L74O59O39M88L78K73J77R8O6J90L88M11L25L31K59o3m06n87p50
844A2037r27j000r89r91r58p55k47N15J271J880K390K592K128J154J70o35j282j616j596j455
841A1686j290j003o66m61l46j87n6k8J21O02J173J423J359J230J004N69J73J30L66N89O66
838A7054O47N99M74J27m50j047j450j591j473j171p88m05j46n8J34O29J087J164J097J112
835A5545R56N17Q8j90m08o16q54j068r83n76k61k02j27P1K84M90O33P00Q89J128R68M58K07
832A7649L26M27M43N02N38O13Q57J006P92M20J37LJ65N84Q57R01J088J425J460J031M07j60
$$ plain form
855 7706 8577 9654 10823 11909 12589 12672 12472 12317 12123 11892 11804 11633 11141 10735 10773 10977 11157 11445 11694 11695 11607 11445 10949 10260
851 10260 9772 9460 9136 8820 8514 8205 8024 7999 8153 8812 10091 11487 12600 13498 14088 14074 13523 12738 11885 11111 10482 9900 9460
848 9460 9369 9388 9147 8821 8711 8715 8787 9161 9820 10459 10947 11325 11598 11775 11873 11939 12129 12517 12928 13253 13584 13843 13780 13374 12787 12037
844 12037 11110 10110 9121 8130 7172 6417 6170 6685 7956 9836 12226 14818 16946 18100 18270 17635 16353 14737 13141 11686
841 11686 10396 9393 8727 8266 7920 7733 7677 7649 7770 8372 9545 10968 12327 13557 14561 15130 15303 15433 15799 16388 17054
838 17054 17701 18300 18774 18901 18451 17404 15954 14363 12890 11719 10931 10526 10380 10322 10456 11085 12172 13336 14433 15545
835 15545 16501 17018 17106 16916 16508 15892 15038 13970 12987 12411 12150 11948 11821 11892 12176 12666 13299 13999 14888 16016 16984 17442 17649
832 17649 17975 18402 18845 19347 19885 20498 21355 22361 23153 23573 23710 23713 23878 24462 25319 26220 27308 28733 30193 31224 31631 31471
828C1471n99r56j258j319j002o25n90p94q89q26p38o38m96l44k35j77j37p4L5J89L32L72L16
825B1018K79K98L16L38M03M58M67M83N49O66P68P41O52P08Q50Q25P06P31P85O70M85K82o3
822C3415m85q34j184j424j096j36P54R48O04K41l5m20p75o97k80j6K6J15K10K04L13N62O36
818C0646N43N75O67O19N39N55O25P60R20R34Q40Q82J065J188J211J228J277J323J331J347
815D9075J414J457J467J550J558J217P61O54Q65J206J719K194K300K324K629K901K863K841
813H0995L065L441L974M611N187N782O502P204P894Q669R376J0001J0715J1461J2428J4178
810B05483J6613J9348K2842K7354L2283L7805M4580N2351O1990P6165R5822J20524J50182
808I63342J78931J93688J87789J65463J26819O6659o732p3430j24940j64603j89054j90991
$$ plain form
828 31471 30872 29916 28658 27339 26337 25712 25122 24328 23439 22613 21875 21237 20741 20397 20162 19985 19848 19774 19809 19998 20330 20702 21018
825 21018 21297 21595 21911 22249 22652 23110 23577 24060 24609 25275 26043 26784 27436 28144 28994 29819 30525 31256 32041 32711 33196 33478 33415
822 33415 32930 32096 30912 29488 28392 28256 29010 29958 30562 30803 30768 30348 29573 28876 28596 28580 28606 28721 28931 29135 29448 30010 30646
818 30646 31189 31764 32431 33050 33589 34144 34769 35529 36449 37383 38223 39105 40170 41358 42569 43797 45074 46397 47728 49075
815 49075 50489 51946 53413 54963 56521 57738 58499 59153 60018 61224 62943 65137 67437 69761 72390 75291 78154 80995
813 80995 84060 87501 91475 96086 101273 107055 113557 120761 128655 137324 146700 156701 167416 178877 191305 205483
810 205483 222096 241444 264286 291640 323923 361728 406308 458659 520649 596814 692636 813160 963342
808 963342 1142273 1335961 1523750 1689213 1816032 1882691 1875959 1802529 1677589 1512986 1323932 1132941
807A132941j74716j51815j27795j02844p8296n6837m0534k9384k1190j4669j0298p141l682
805C13740p50J194L611O169P627R430J2385J4850J7675K2795K8214L2892M0008M9478N8327
802F17645O8676Q2748R7416J14367J41257J78633K24235K81770L42355L76983L69830L30478
801C226393K59735J45406K001j31042k35387l17408l72252l84399l57590l13553k66674k18393
799A036837j69667j26216r3181p0241n3600m1170l2779k6948k1854j7580j4310j1483r460
797C48348q405p107n391m047k059J458M970Q031J2342J7595K2322K7704L4771M2099N0428
795E43059O3048Q0459J02095J29682J59954J80762J83001J67811J36130Q4091J5706n3001
793A792797j09474j52911j83047j93761j83728j62328j39038j15314r0625o8209n1169l8920
$$ plain form
807 1132941 958225 806410 678615 575771 497475 440638 400104 370720 349530 334861 324563 317422 313740
805 313740 312990 314184 317795 323964 331591 341021 353406 368256 385931 408726 436940 469832 509840 559318 617645
802 617645 686321 769069 866485 980852 1122109 1300742 1524977 1806747 2149102 2526085 2895915 3226393
801 3226393 3486128 3631534 3633535 3502493 3267106 2949698 2577446 2193047 1835457 1521904 1255230 1036837
799 1036837 867170 740954 647773 577532 523932 482762 449983 423035 401181 383601 369291 357808 348348
797 348348 339943 332836 327445 323398 321339 322797 327767 335798 348140 365735 388057 415761 450532 492631 543059
795 543059 606107 686566 788661 918343 1078297 1259059 1442060 1609871 1746001 1830092 1845798 1792797
793 1792797 1683323 1530412 1347365 1153604 969876 807548 668510 553196 462571 394362 343193 304273
791C04273k9887k3529j9206j6038j3651j1788j0171q961q330q066q074q355q545q357p931
789A13384p354o582n796n175m710m343l813k844j820j339j272j379j964k949l590l652l425
787E1377k787j674o88j44L41Q03Q28M92J88p6l89n60n19m79n21m97l78l10l32k93j24K6N8
783D4342Q0J31N2l38j153k263l145l375l184k982k739k413k227k047j359j59R95J783K093
780B2092J559J0j986l606m430m322l197j333N65J959K810L191L045K472J779J123N08L7k00
778B2076k59j86m0l0j89k42q6M5Q0J65K56J91N3p5l69r04j375j517j483j492j430j159r28
774A1102r41q22k19N40R84J108R38K49q36j772k212k141j607p59J34Q91J409J567J405J114
771A0132Q17N54L29J23qJj0j69k48j32j13k38j85JJ0m5O3J42L3r4j58k15j81n4PK9R8P0p6
$$ plain form
791 304273 274386 250857 231651 215613 201962 190174 180003 171042 162712 154646 146572 138217 129672 121315 113384
789 113384 106030 99448 93652 88477 83767 79424 75611 72767 70947 69608 68336 66957 64993 62044 58454 54802 51377
787 51377 48590 46916 46228 46084 46425 47228 48056 48548 48736 48660 48271 47711 47192 46713 46192 45695 45317 45007 44675 44382 44258 44284 44342
783 44342 44422 44553 44605 44267 43114 40851 37706 34331 31147 28165 25426 23013 20786 18739 17380 17221 18216 19999 22092
780 22092 23651 23661 21675 18069 13639 9317 6120 4787 5352 7311 10121 13312 16357 18829 20608 21731 22239 22276 22076
778 22076 21817 21631 21591 21561 21372 21130 21044 21089 21169 21334 21590 21781 21834 21759 21390 20486 19111 17594 16111 14619 13189 12030 11102
774 11102 10161 9339 9120 9660 10644 11752 12690 12939 12103 10331 8119 5978 4371 3612 3746 4637 6046 7613 9018 10132
771 10132 10949 11503 11832 11955 11947 11948 11938 11769 11521 11389 11276 11038 10853 10854 10864 10819 10882 11024 11057 10963 10805 10590 10409 10355 10362 10391 10489 10559 10483
767A0483j16n3p7j13J0J89K80K87K21Q4p3k40l73l72k73j84o1P6K8j53j40R7K82L47L57K55
763A0768N0j00j59j85j74j42j32p5P5K07K19J21n9k63l79l60k62j47o6%J00J43J4j45j16M
759H937M8J51M19O07M94K02r2l79o32p05n31k70j18o5K9J60K03J37Q3J37K31K15P0m0n4j03
756I134j77j24nJ0K0J02O2j10j37m8j13k68k79j98j27l0O2J15J82J84Qj35l6J17J84K97M01
752I091K60m8k45l00l21l04k07l2J40J71N4j9J1J6j9l4o8j09p0lj1k2K1M8M8M9K7J8N3J1j16
747H090j36o8j39k68j90M4K41L73M04K82J50J43J67J43J49K04K67L20L45L71M86O51P58Q76
744A3663J059J141J057R03N84Qn17p15q21j064j226j126r34p88o25m47l29k43j38p2q6r5l7
740I152kp8j90k38k03o5J37K55K86L87M64K97P8J03J86J12J51M43O45O22O48Q20J028J315
$$ plain form
767 10483 10367 10314 10237 10124 10134 10323 10603 10890 11111 11195 11122 10882 10509 10137 9864 9680 9619 9695 9723 9570 9430 9527 9809 10156 10513 10768
763 10768 10818 10718 10559 10374 10200 10058 9926 9851 9926 10133 10352 10473 10414 10151 9772 9412 9150 9003 8937 8937 9037 9180 9194 9049 8933 8937
759 8937 8985 9136 9555 10162 10656 10858 10766 10387 9755 9050 8519 8249 8131 8066 8095 8255 8458 8595 8678 8815 9046 9261 9331 9291 9237 9134
756 9134 8957 8833 8828 8838 8858 8960 9022 8912 8775 8727 8614 8346 8067 7869 7742 7712 7774 7889 8071 8255 8263 8128 8092 8209 8393 8690 9091
752 9091 9351 9303 9058 8758 8437 8133 7926 7894 8034 8205 8259 8240 8251 8267 8248 8214 8146 8037 7967 7964 7953 7931 7952 8000 8048 8097 8124 8142 8195 8206 8090
747 8090 7954 7886 7747 7479 7289 7333 7574 7947 8351 8633 8783 8926 9093 9236 9385 9589 9856 10176 10521 10892 11378 12029 12787 13663
744 13663 14722 15863 16920 17823 18407 18415 17898 17183 16362 15298 14072 12946 12012 11224 10599 10152 9823 9580 9442 9370 9284 9189 9152
740 9152 9150 9072 8882 8644 8441 8376 8513 8768 9054 9441 9905 10202 10280 10383 10569 10681 10832 11275 11920 12542 13190 14010 15038 16353
737A6353J687J991K165K184J876J200L73m37j150j662j980k148k076j814j608j434j084p31
734A1705o09m83k18j33k75k58o0l1j83k53j97j04JO9P2Q2J09P2%l4m2m6QJ51K96L14K24K54
730A0431N05P40P87Q24R71J040R12O82L47j17n33p67r34j083j094r57q06o66m88l25k62k75
727H932k81k41j80j15n0k5o1r0n4m4j18j44k7Q7M6p6j21o1Lj8j06j46o0P2J01J3o2n8n4r5
722F967j03o3k5L9J25Q6p3q3P7P6j40k08KJ82J32Nk4Pj5o7jJ45J35l1o5N4O5m1n7mj1l3l1
718G022n9p3l2j6k8OK6k1qQ0P8nl9n2r3q1l3l9m8j5mK3J23J38Pm8K8J6p0m7J4k5o2k5J3O3
712F714J24M1j28r2J25J99Q1QL2L1k6o5l9J6or8j00PK7p1j07o0l9j8N1J06J08M5j01j99r9
708F467L4nl3Q8R0j07j44O3J43Kq2k3L3L9op2n8J1k0r0j6R4M7m2k7J5K6N5O1km6l1j0RL4O
$$ plain form
737 16353 18040 20031 22196 24380 26256 27456 27829 27392 26242 24580 22600 20452 18376 16562 14954 13520 12436 11705
734 11705 11096 10613 10395 10262 9987 9729 9669 9638 9455 9202 9005 8901 8902 8971 9043 9125 9234 9306 9306 9272 9230 9184 9192 9343 9639 9953 10177 10431
730 10431 10936 11676 12463 13287 14258 15298 16210 16892 17239 17122 16589 15822 14888 13805 12711 11754 10948 10282 9794 9469 9207 8932
727 8932 8651 8410 8230 8115 8065 8040 7979 7889 7835 7791 7673 7529 7502 7589 7635 7559 7438 7377 7380 7362 7256 7110 7050 7122 7223 7236 7174 7116 7062 6967
722 6967 6864 6801 6776 6815 6940 7026 6953 6870 6947 7023 6883 6675 6677 6859 6991 6996 6972 6979 6964 6897 6896 7041 7176 7145 7080 7134 7199 7158 7101 7097 7086 7053 7022
718 7022 6963 6890 6858 6842 6814 6820 6846 6825 6817 6897 6975 6970 6931 6879 6786 6705 6672 6633 6585 6570 6566 6589 6712 6850 6857 6809 6837 6853 6783 6736 6750 6725 6663 6638 6651 6714
712 6714 6838 6879 6751 6659 6784 6983 7064 7072 7104 7135 7109 7044 7005 7021 7015 6917 6817 6824 6851 6780 6673 6613 6574 6556 6607 6713 6821 6866 6765 6566 6467
708 6467 6501 6496 6463 6551 6641 6534 6390 6453 6596 6598 6516 6493 6526 6565 6559 6487 6429 6440 6420 6330 6314 6408 6455 6413 6386 6401 6427 6482 6543 6541 6495 6464 6454 6463 6497 6503
702F503m5m6l6n2l0K3K3OL9M2m2j13p0L7R2Oj55j78j2J09L3p4j9J29J59K1q7MJ26O0o8l6M4
698F393jn4%L6j8n8l8mK7K7k5p1p0o0m2J8O0L3J7N5Q0N8Kq2j25l2J07R7n1j34p6K6O2Jr2q3
692E983O2J60Q1l1j5N2M2j5n8p5k7O5N7l1j0O3j1j20o2Rn8p4M0Q5L0Nl5j20q8M8Q1%n3m9j5
687E916J4m1q7M9K02J13k8L2J03J3n4j6%LM0K8J5R9J33K8j5L8k0j35q8J5j5q3n6MJ2l6q5l2
682F066Q8R6on1k0qpj6n0j1J01R7jK7R2kr4j7L4k2RN9o8j81n9O1m1j08N4J90J05k8m3j9k8
677F199j3K6Qo0p8k3L2L2j6n4j2O0L9k1K8J07M8m4mL8m1p9J9P3J2%O5O6mrM9M2k0KP0j1j61
672F365j07P6O1p8l9N7k5q2L7L0j75j75O0R1r8j23K5Q1P2J07P1l5l4L4l6j62r7J10K04J05
667F320l7p3LN9Mo8l0O0P5M1K4L3Q7J58J15k2k1J22J13q3j69n4L5Kn4p8q2p3p1o7l6l9r9j17
$$ plain form
702 6503 6458 6412 6376 6324 6294 6317 6340 6346 6385 6427 6385 6272 6202 6239 6331 6337 6182 6004 5992 6101 6134 6060 6041 6170 6329 6350 6263 6267 6393 6453 6385 6349 6393
698 6393 6392 6338 6338 6374 6356 6298 6260 6256 6283 6310 6285 6214 6144 6084 6042 6060 6120 6153 6170 6225 6305 6363 6365 6283 6158 6126 6233 6330 6279 6145 6069 6095 6157 6158 6066 5983
692 5983 6045 6205 6286 6255 6240 6292 6334 6319 6261 6186 6159 6224 6281 6250 6240 6303 6292 6172 6110 6119 6061 5987 6027 6112 6142 6147 6112 5992 5904 5952 6033 6033 5980 5931 5916
687 5916 5930 5889 5802 5851 6053 6166 6138 6170 6273 6286 6232 6216 6216 6219 6259 6287 6302 6401 6534 6562 6547 6585 6565 6430 6342 6357 6342 6259 6203 6207 6219 6183 6098 6066
682 6066 6154 6250 6244 6193 6173 6165 6158 6142 6092 6081 6182 6279 6278 6305 6397 6395 6301 6284 6318 6296 6305 6364 6296 6115 6056 6117 6076 5968 6022 6212 6317 6289 6246 6227 6199
677 6199 6186 6212 6220 6160 6082 6059 6091 6123 6107 6053 6041 6101 6140 6119 6147 6254 6302 6258 6254 6292 6251 6172 6191 6264 6276 6276 6341 6407 6403 6394 6443 6485 6465 6467 6537 6526 6365
672 6365 6258 6334 6395 6317 6278 6335 6310 6228 6265 6295 6120 5945 6005 6096 5998 5875 5900 5981 6053 6160 6231 6196 6162 6196 6160 5998 5901 6011 6215 6320
667 6320 6283 6210 6213 6272 6276 6208 6178 6238 6313 6354 6378 6411 6498 6656 6771 6749 6728 6850 6963 6880 6711 6657 6692 6694 6640 6562 6480 6407 6336 6269 6233 6194 6095 5978
662E978l7L9M8K4l5r6o8Rlp1m3O9J14J0j37j46k0N3K7N7J06M1l2J0L3RR3J58Pj12M1J69N1
657F346o1l3l3o5l6l8q4l5M4mj00j07p2n8o4o7J1J32Q5j14j35P2J86J14M3Om8o5l4l4l2kj1
653E707l7lK3rOP3O9RORl4l2M5P4K0j6mj2n3p7n4J0P9Q5J8k2J1Rm5j6O0Jj23r6j6n6p0M6R3
647E678K3K5O1J2J2J12R0o3j23p8m0M2J42J17j6j29j70q3Q7J09OM4J37J4j30j9J18M6p0j04
642E850p6M9J62P0o9l2J5m2j3O5Mo0nl4j25l7Q1Mn6L9M6n2k1O4K1m1qN2J06J06j3j06k4P0
637E990L0k9m3n3j0O6M1l0k5l4p5j5O4K0J2J04L8j70j74oL4k6j3%j7L1P3Jo4k3J7j1l9k3J8
632E659M0Ql3rK5J4M3J16Q1n0n5O7R1j5o3k5l0n6j4J8m5p5K1J07Q4L4k2j02q9L7O5l5m2K4
627E774l0j04j3J04Q6K6j8m3L4J38N0j37j26K0O4L6J9l0o8k9k9r3n4Q9J53R5Jp9o9L2N6l1
$$ plain form
662 5978 5941 5980 6028 6052 6017 5921 5853 5862 5859 5788 5745 5814 5928 5938 5801 5655 5635 5688 5715 5772 5878 5919 5887 5897 5930 5939 6032 6190 6197 6085 6126 6295 6346
657 6346 6285 6252 6219 6154 6118 6080 5996 5961 6005 6001 5901 5794 5722 5664 5600 5533 5544 5676 5761 5647 5512 5584 5770 5884 5927 5933 5885 5820 5786 5752 5720 5718 5707
653 5707 5670 5667 5690 5681 5687 5760 5829 5838 5844 5853 5819 5787 5832 5906 5926 5910 5906 5894 5841 5764 5710 5720 5799 5884 5902 5880 5891 5900 5855 5839 5899 5900 5777 5681 5665 5609 5539 5585 5678
647 5678 5701 5726 5787 5799 5811 5923 6013 5950 5827 5749 5709 5751 5893 6010 5994 5865 5695 5612 5699 5808 5814 5858 5995 6009 5879 5860 5978 6024 5954 5850
642 5850 5774 5823 5985 6055 5986 5954 5969 5927 5914 5979 5983 5923 5918 5884 5759 5722 5803 5807 5751 5790 5836 5784 5763 5827 5848 5807 5799 5851 5957 6063 6050 5944 5920 5990
637 5990 6020 5991 5948 5895 5885 5951 5992 5962 5937 5903 5828 5813 5877 5897 5909 6013 6051 5881 5707 5701 5735 5709 5696 5696 5679 5710 5783 5784 5720 5697 5714 5703 5664 5641 5659
632 5659 5699 5707 5674 5665 5690 5704 5747 5863 5944 5894 5839 5906 5997 5982 5919 5894 5864 5808 5794 5812 5767 5692 5713 5820 5904 5938 5916 5814 5725 5762 5827 5792 5750 5774
627 5774 5744 5640 5627 5731 5817 5843 5825 5782 5816 5954 6004 5867 5741 5761 5825 5861 5880 5850 5782 5753 5724 5631 5577 5666 5819 5914 5915 5836 5767 5799 5855 5824
623E824l7N6M7o6q5PM5qk5M6P4ok8Q5J03n8j30k5J6k6K3P2k3j03q3j00j02L9J46N2p6r8o0
618E496J9J03P2k5l9j5k3RM1oRJ22Q7q7r5K5J3l1M6N9n4n6M6L5m7m2q%K4J5m2j4O5Nj17o0
612E530O6J7r3m7M6J6j8N4P5o2j67q0O0O0k4n0j0ll7k1O1R2K7j0L3Rq2l5R9L9j42j05R6J29
607E523K2QK1n7q3J9Q0M8K4k3j25j15O4J57K8j12j09o5j7R8J64Lk29k20pJ16Q1M9M9K3K5R3
603E533Q5n3j33l6Q0O1k4n0k9oJ4K1RM%j9l4k5k7m4k2K4K6L%rk8kJ1o2j17m2N5O1N8R7R3J0
597E483r6j62r7R2J84M2j11n8P2Q5K0j1OK8Om7o0n1r8r5O1J46k3j62j9J29L9n4K1L3q4o4J17
592E272J38n8j52oJ38R7j8o4l5M4J42J27o0k14j57l5k4j2Q5R6l5r1k0Pk0K8Q3M4KJ1j8m9L4
588E280J23P4nj0k5o3l5j7p7p5K7K9p7n4Q3Q8k3m5J4K7j5m5l6J6O6O7M9K0n1r7k0O2Oq2n4
$$ plain form
623 5824 5787 5843 5890 5824 5739 5746 5791 5783 5758 5804 5878 5872 5844 5929 6032 5974 5844 5819 5835 5809 5832 5904 5881 5778 5695 5595 5493 5532 5678 5730 5654 5556 5496
618 5496 5515 5618 5690 5665 5626 5611 5588 5597 5638 5632 5641 5763 5850 5763 5668 5693 5706 5675 5721 5780 5726 5670 5716 5751 5704 5662 5654 5654 5678 5693 5651 5637 5702 5707 5590 5530
612 5530 5596 5613 5520 5473 5519 5535 5517 5571 5646 5584 5417 5337 5397 5457 5433 5383 5373 5370 5333 5312 5373 5465 5492 5482 5515 5524 5442 5407 5506 5545 5403 5298 5394 5523
607 5523 5545 5553 5574 5517 5434 5453 5533 5581 5605 5582 5457 5342 5406 5563 5591 5479 5370 5305 5288 5386 5550 5553 5324 5104 5097 5213 5294 5343 5392 5415 5440 5533
603 5533 5618 5565 5432 5396 5476 5537 5513 5463 5434 5428 5442 5463 5472 5476 5476 5457 5423 5398 5371 5327 5305 5329 5355 5358 5358 5349 5321 5319 5330 5268 5151 5109 5164 5225 5283 5380 5473 5483
597 5483 5387 5225 5128 5220 5404 5446 5335 5277 5349 5434 5454 5443 5449 5477 5483 5436 5376 5325 5227 5132 5193 5339 5316 5154 5135 5264 5303 5249 5270 5303 5219 5155 5272
592 5272 5410 5352 5200 5194 5332 5429 5411 5347 5312 5356 5498 5625 5565 5351 5194 5159 5135 5123 5208 5304 5269 5178 5158 5165 5145 5173 5256 5300 5302 5313 5295 5246 5280
588 5280 5403 5477 5472 5462 5437 5374 5339 5322 5245 5170 5197 5226 5149 5095 5178 5266 5243 5198 5212 5239 5224 5179 5143 5159 5225 5292 5341 5361 5310 5213 5193 5255 5261 5179 5125
582E125RJ9M1Q3N6l0p8l7M2P7N6Q3J54P4j58k07K5J84R7J2M2J5p8q3l7l7l5k4r5j63p9O3P0
578E186k9q7l3R3J42j2j61l5J71J05o8oJ25M7n8j1Ro3m5L7K4j1Ll4o9J7O5m7q2O9J37J5p7
573E317k5P0J02Oj32j00P2J05OJ9P9qj08n6K4J9j7o1q9k0P4M6k4nL1QKJ0j7m5l5j0M3P3pq6
567E261j7P1L5RM6lr7o5%l7n0K4N2L2M5J1p8n0P8Q9pl7j%j2lRJ1l1q8o3K6L3j6J0K7m4l6R3
562E227Q8p1q2M4J5j24q8M1M4J5Q4Q4n1q6L1N5n3o2N0R0N6P6R7Oj10j30p0J4P9P7L5L0L2k7
557E416q5p3m8n3n6o4o9mP7M8j1L8P3l3j00J0Q4j8j10m4O2P9L3lK2P1M2n8r1n0m2m3L5J04
552E139O5J8N9P4Jk8K9M6QK6O9K6m6l3Nj7l2ol1p5k8K3l2m8O1P2p0p8P7Q2o7q5qm8j00j1Q1
546E118O5N2N0l8j30r0J6O8O1J9j7RN9N3K2L0M1J5KJ6Ln5q9k7Q1P4o5j09K7R0l2p4N5P2o8
$$ plain form
582 5125 5134 5153 5194 5277 5333 5303 5225 5188 5230 5307 5363 5446 5600 5674 5516 5309 5334 5518 5615 5627 5669 5684 5606 5523 5486 5449 5414 5390 5295 5132 5053 5116 5186
578 5186 5157 5070 5037 5130 5272 5260 5099 5064 5235 5340 5272 5266 5391 5438 5380 5369 5378 5315 5270 5307 5331 5320 5323 5289 5220 5237 5302 5255 5173 5242 5379 5394 5317
573 5317 5292 5362 5464 5470 5338 5238 5310 5415 5421 5440 5519 5511 5403 5347 5371 5390 5373 5312 5223 5203 5277 5323 5299 5294 5325 5333 5335 5345 5328 5283 5248 5238 5281 5354 5347 5261
567 5261 5244 5315 5350 5359 5405 5402 5305 5240 5240 5203 5153 5177 5229 5261 5306 5317 5239 5189 5267 5356 5349 5312 5311 5311 5299 5296 5305 5316 5285 5197 5134 5160 5193 5177 5187 5214 5170 5134 5227
562 5227 5315 5244 5162 5206 5221 5097 5009 5050 5094 5109 5193 5277 5226 5140 5171 5226 5173 5111 5161 5251 5307 5383 5480 5486 5376 5246 5176 5190 5269 5346 5381 5411 5443 5416
557 5416 5331 5258 5210 5157 5101 5037 4968 4964 5041 5089 5078 5116 5189 5156 5056 5066 5150 5132 5022 4978 5040 5119 5152 5149 5171 5242 5284 5226 5135 5085 5043 5000 5035 5139
552 5139 5204 5222 5281 5355 5356 5328 5357 5403 5411 5437 5506 5532 5486 5453 5458 5441 5409 5403 5372 5297 5269 5292 5260 5212 5273 5345 5275 5197 5274 5356 5289 5204 5196 5148 5048 5037 5118
546 5118 5183 5235 5285 5247 5117 5027 5043 5111 5172 5191 5174 5183 5242 5295 5317 5347 5388 5403 5405 5421 5424 5369 5280 5253 5334 5408 5343 5234 5261 5351 5319 5245 5300 5372 5304
541E304n5J06P3j13q1J05N8j42r1J28J23m5n2K1l6o6O1J14j6j09r6j02o9O1J01J0j1L7k3r5
537E100kJ21Q9k2p1k0Q3Q4n6j18lN0o1j05NR3Q6K5q3j13K4R8n2j36L1J43K0p8k2Qj6K4N2k7
532E151p0K5R3K1n6k8J7rm8j6M4M1rnN3M1p0j01J0M2r3j18P2J57Kp5O1J34L7j5L5L5l2p6q3
527E167o9m3j8L7Q7J8r5m1R1L8q9m1M9j5o5L1R3K9j4Nrm9p4q4l6O2Q9Nn1nO1O7J9l5n5l6j
521E023J7RJ1O8J17N3o2p9j7Oj1j0NL1N7K6k8JO4L4m6q6r5n2N9Q8k3n6N0O4n7q7j5k2n8PO2
516E048Ko0k5K4K7J9Lm1o1J4J32J52M0q6j20p6qL3J0k7L1J19O2r1j08QM2oM1J37R5k8l8K4
511E288j1q4m8L2L3nl4p5o6L2P3Jj6M7Qq3l3M8j6p0JK9j3K5N2m6p4M6M9q2p2L7jn5O0J20k0
505E077r6QP7M9M5K4o1o7J5lr5m9R2J13Nq5r1l0L3J6o1o9NO8R5O9j8n2M3P9n1j13J5R1J7j3
$$ plain form
541 5304 5249 5355 5428 5315 5234 5339 5397 5255 5164 5292 5415 5370 5318 5339 5303 5237 5298 5412 5396 5287 5191 5089 5020 5081 5182 5192 5181 5218 5195 5100
537 5100 5098 5219 5308 5286 5215 5195 5278 5362 5306 5188 5185 5235 5174 5069 5074 5167 5253 5278 5195 5082 5106 5204 5152 5016 5047 5190 5210 5132 5110 5118 5102 5126 5178 5151
532 5151 5081 5106 5199 5220 5164 5136 5153 5144 5096 5080 5124 5165 5156 5151 5204 5245 5175 5074 5084 5126 5033 4915 4987 5144 5146 5071 5132 5266 5303 5288 5323 5358 5326 5250 5167
527 5167 5098 5055 5037 5074 5161 5179 5084 5043 5134 5172 5083 5042 5091 5076 5011 5042 5135 5164 5150 5155 5146 5097 5023 4939 4903 4965 5054 5059 5008 5003 5064 5131 5150 5115 5060 5024 5023
521 5023 5040 5049 5060 5128 5245 5298 5236 5157 5140 5146 5135 5125 5130 5161 5218 5244 5216 5217 5281 5315 5269 5183 5088 5036 5095 5183 5160 5104 5154 5218 5161 5074 5059 5037 4979 4986 5048
516 5048 5050 4990 4965 4989 5016 5035 5038 4997 4936 4950 5082 5234 5274 5188 5068 4992 4984 5017 5027 5000 5031 5150 5212 5121 5013 5021 5063 5057 5098 5235 5330 5302 5264 5288
511 5288 5277 5193 5145 5177 5210 5205 5171 5096 5030 5062 5135 5136 5120 5167 5175 5092 5059 5107 5091 5021 5022 5051 5038 5063 5115 5069 4995 5041 5090 5008 4936 4973 4972 4917 4977 5097 5077
505 5077 4981 4989 5066 5115 5160 5184 5123 5056 5071 5068 4973 4924 5016 5129 5134 5049 4958 4928 4961 4977 4916 4847 4852 4920 5015 5084 5066 5014 5057 5136 5085 4972 4987 5078 5095 5082
500E082K5j1m9RK5n9q2%N2L9oo6n7O1J48J17M2l8r1m9Qm5p7M0J01mo6l6q3r9N7J49K2o9oK6
495E010mNPKO5P9l4o3L6J1j30j14L6J00Q4M2n9j20n2om2NJ13J02M4O3L1p0m3O4Rj14q2Jk0
490D956k1N7O0j7k8J3J0j5j8pN2J45J29l6j75j70p9J3M8J4lN1O8j1n9j5J2LK1L0NL0O0k4j11
485D988k9R9R3L0no4j11l3P1L1q2r4MR6J25J25J00%j24r3O2P8o5r6J4L3l8l1Jj0L4Q9kj25
480E071q9NJ2J3N8O5L7J9l2q1l8L2L3K0M7O4M8j3j33j79l4J15N9o6o2J0O8J26Q9q8j85o1P6
475E006M3k7k8l4n3J9J32J07m8j11J0J11J4j27r0L1kj15p9O5J05L6j7m4l7N9J38M4j14j23
470D871k0L0J2lNN0P0j2o9M3J19k1j23RR5m8j54p7KL3Q4N3n7o6J8M0M7R6N4o7o2M3O5J0l0
465E040m2lN8K4n5l4J5k4l0L6K4k7L1Q3J7j4K2n3j65j15rQPJ5lM9J21J5j28l0J00rq6N6P6
$$ plain form
500 5082 5107 5096 5047 5056 5081 5022 4940 4940 4992 5031 5025 4959 4902 4963 5111 5228 5270 5232 5141 5092 5100 5055 4978 5018 5119 5115 5049 5013 4930 4831 4888 5037 5059 4990 4984 5010
495 5010 5006 5011 5018 5020 5085 5164 5130 5067 5103 5114 4984 4870 4906 5006 5090 5132 5073 4953 4901 4895 4853 4858 4971 5073 5117 5180 5211 5141 5098 5162 5171 5057 4975 4976 4956
490 4956 4935 4992 5052 5035 5007 5020 5030 5015 4997 4990 5042 5187 5316 5280 5105 4935 4856 4869 4917 4931 4928 4979 5047 5036 4977 4962 4974 4977 4998 5028 5033 5063 5123 5099 4988
485 4988 4959 5058 5151 5181 5176 5112 5001 4968 5039 5070 4988 4894 4898 4994 5119 5244 5344 5344 5220 5127 5189 5267 5202 5106 5120 5153 5115 5084 5085 5075 5109 5198 5196 5071
480 5071 4982 4987 4999 5012 5070 5135 5172 5191 5159 5078 5040 5072 5105 5125 5172 5236 5284 5271 5138 4959 4925 5040 5099 5033 4971 4981 5049 5175 5264 5176 4991 4930 5006
475 5006 5049 5022 4994 4960 4907 4926 5058 5165 5117 5006 5016 5127 5141 5014 4924 4955 4953 4838 4759 4824 4929 4965 4948 4904 4867 4926 5064 5108 4994 4871
470 4871 4851 4881 4893 4890 4895 4945 5015 5003 4934 4977 5096 5075 4952 4961 5056 5008 4854 4777 4779 4812 4896 4949 4892 4826 4844 4884 4931 5027 5081 5014 4952 4995 5060 5070 5040
465 5040 4998 4995 5053 5077 5022 4988 5003 4979 4949 4985 5009 4982 5013 5096 5113 5099 5121 5068 4903 4788 4779 4787 4794 4809 4806 4855 4976 4991 4863 4833 4933 4924 4838 4894 4970
460D970r6q1J02Q0p4n6M3N2M2Lj19j26M5J17J8j7J6m7p2N8J17rq0QR5R9N2n3j23o2K0Nj2K9
455D944L3K6Q0O5j00j90l2J50Q1j56k52r6Q5Q3MPOo2l8R5J28P0Q8Q4p1j51j2J00L7j6Kk5o3
450D904k0L0L4M3L0m7r0l3K3J1mRJn0p1JO7j0j17l8J07O4m5L6J58P1o9l5L8k6j10o3N4J07
445D960O8ml9m5n6m3J4O3Q7R7N4k2j3N2Oq2k2N7n1j51j7J26M1p0KO5j2n1L5O3k8p6l7k1n7
440D893n1K6Q9O5j7o1l0nj2J4N2J3m3lN9J2n6k7M8Q4P2Pp1o8J3N8M2J5j2j3L1M0k2m9j6l2
435E045m4O0J33K4p6PP8l9j53n7J22J12r2k12q6Q0Q6M1O7M4o0p3RJ8m4o3l7J0O5K7o4j6J22
430E034Q1o9m2O2j6j23j6J29P9l1l2j0n0o0j6nl1j7J6KJ1Q5Q5o6j62k9J49J18n3j27l5P1O3
425D995lJ1N9Pq4o2kj9k9K0Np7o5K2O4P6P8Lq9n8M1P1N1M6K3k2m5m0j1J9Mm6m3J1J3l5k5O8
$$ plain form
460 4970 4874 4793 4895 4975 4901 4845 4888 4940 4982 4985 4866 4740 4785 4902 4920 4903 4919 4872 4800 4858 4975 4966 4886 4894 4989 5088 5140 5087 4964 4902 4922 4927 4915 4944
455 4944 4977 5003 5083 5148 5048 4858 4826 4976 5057 4901 4649 4553 4638 4721 4725 4732 4738 4676 4638 4733 4861 4931 5019 5103 5032 4881 4869 4969 5006 4990 4992 4967 4904
450 4904 4884 4914 4948 4991 5021 4974 4884 4851 4874 4885 4881 4890 4891 4841 4770 4771 4838 4828 4711 4673 4780 4844 4799 4835 4993 5064 4995 4960 4998 4972 4862 4799 4853 4960
445 4960 5028 5024 4985 4940 4884 4841 4855 4918 5005 5102 5156 5134 5121 5173 5179 5097 5075 5132 5081 4930 4913 5039 5080 5010 5012 5077 5065 5014 5049 5112 5084 5008 4971 4950 4893
440 4893 4842 4868 4957 5022 5005 4944 4914 4909 4897 4911 4963 4976 4933 4930 4989 5001 4945 4918 4966 5050 5122 5129 5058 4990 5003 5061 5103 5118 5106 5093 5124 5164 5142 5093 5077 5045
435 5045 5001 5061 5194 5218 5142 5149 5227 5188 5035 4978 5100 5212 5120 4908 4822 4902 4988 5029 5096 5140 5080 5007 5016 5034 4990 4927 4890 4900 4965 4992 4928 4912 5034
430 5034 5115 5046 5004 5066 5050 4927 4911 5040 5119 5088 5056 5046 4996 4936 4920 4915 4884 4867 4883 4885 4896 4981 5066 5000 4838 4809 4958 5076 5023 4896 4861 4932 4995
425 4995 4992 5003 5062 5069 4985 4923 4921 4902 4873 4893 4898 4821 4756 4778 4842 4918 4996 4999 4910 4852 4893 4964 5015 5061 5084 5062 5017 4977 4966 4985 4989 4943 4900 4911 4924 4889 4864 4932
420D932J28M4r2p2Q1J16J1j6J5o4j21QJ24P2L6O6j0j24q7j3m4m0N2P8J1j8J9P8R2pj30r0M2
415E077M4l8l3qo9j06m6K6L6nn8l2Q6J37N2m4n3oN8P2j7q9j5R2O6l1n9oO3O1k6o8PN8Ok3k
409E107k5l6L3M1n7p8j8m5r4j1O0k4q2nN2J4J4N7M1pRO6Q4L4l9m6K4N5on0k7k2m9l4kjK7Q5
404E045P6L0M5L9p2j18NJ13O8j8p2r8l8P6P4qJ3P6K1n3l3l9j04q7j9m9r4j0J03J08L7l5p8
399D904n8J5R0J04J0j34j43K0J25M9m2l8j3pkj7j5N9J26Q4j6p4m6M3O4l3o9J5Or7j7J33J6
394E042j79p8R6K5p2PM7j6J4P3Jo1L2J31J03%q7p2N8J19J0q0k3K4k4m9j2nk0qPlj0poOJ0j6
388D977k3M1J10O7p4j35m8L2RQO2K8o9l0Q7O3l7mP2K0q3j07p1nN8L5m4l8K1Nj2N2M5q7r1P5
383D909Q9j11j67K0J41P2OOp%N1M2j1OL4j5l4L5L9n5p3j0j5m8MO5L2j4nRj0l3m2k6J6L6ro4
$$ plain form
420 4932 5060 5104 5012 4940 5021 5137 5148 5132 5147 5083 4962 4970 5094 5166 5202 5268 5258 5134 5047 5034 4990 4950 5002 5080 5091 5073 5092 5170 5262 5255 5125 5035 5077
415 5077 5121 5083 5050 5042 4973 4867 4821 4847 4883 4878 4820 4788 4874 5011 5063 5019 4966 4960 5018 5090 5073 4984 4969 5061 5127 5096 5037 5031 5094 5155 5129 5061 5068 5126 5132 5109 5107
409 5107 5082 5046 5079 5120 5063 4985 4967 4922 4828 4817 4877 4853 4771 4766 4818 4832 4846 4903 4944 4937 4946 5012 5096 5130 5091 5045 5069 5124 5118 5068 5041 5019 4970 4936 4934 4933 4960 5045
404 5045 5121 5151 5196 5235 5163 5045 5050 5163 5231 5213 5141 5043 5005 5081 5155 5147 5160 5236 5257 5204 5171 5132 5028 4941 4922 4873 4779 4769 4872 4980 5017 4982 4904
399 4904 4846 4861 4951 5055 5065 4931 4788 4808 4933 4982 4940 4902 4889 4882 4880 4863 4848 4907 5033 5117 5101 5027 4981 5024 5088 5055 4986 5001 5007 4910 4893 5026 5042
394 5042 4863 4785 4881 4906 4834 4841 4888 4872 4886 4959 4960 4899 4931 5062 5165 5165 5078 5006 5064 5183 5193 5113 5090 5114 5090 5041 5029 5024 5004 4996 5003 5000 4990 4983 4977 4983 4993 4977
388 4977 4954 4995 5105 5172 5098 4963 4915 4947 4956 4964 5026 5054 4985 4955 5042 5105 5068 5064 5136 5156 5073 4966 4895 4890 4948 4983 4939 4901 4922 4927 4915 4967 5012 4925 4834 4909
383 4909 4998 4887 4720 4740 4881 4953 4959 4965 4958 4958 5009 5051 5040 5046 5080 5065 5031 5066 5105 5050 4977 4967 4952 4904 4908 4973 5005 4991 4986 4995 4985 4952 4910 4884 4900 4936 4927 4863
378D863l4L9Lj17j00Q3J51K9qJ04R4o6j18n6l3LO5J0p7J8J51R1ML5Pq9l8P9L7l8J7L9m2l4
373E072N7K9q1r2k3K0L9K7l8r9q5j4N0M5l6p1J3Q0K3l0J6M5lk6LJ7J4nn0m1N9R5on7J8M6j0
367E001oM5L1K0P4R1L1k8p0j15j10p2m5J9R5M9o3k4J21J32qj30j40k4R8N3r3j13l6l8l1Q9
362D803J49N5k5m5p2m2P3J00%o5k7N1R0K4q6q4rl2o3M7J22lj27p1M4P4J5m9%J12Q6l8m6j3
357D948r2r1P5J14l2n7M0L2j2L0L7jL0N1%J5O8Ro8n7p9r7M9J70O1m7K2K6j01q6N5L4j23j29
352D794K1Q6qp5j2N3K5J7P0M7l5j6L6j7p4m4l4m4J3L3l1rJ04Q6n6j01lJ06J15Np1J0P4k4p7
347D964K5N1l2j1O1K7PM8k2j35q6K2K8OPJM5R0j9j39o4L6j6m5J8J6j0M5N9oj2Ln7o3K3L2j3
342D884J4K5j5N4J55N7j15r4N1J07L5r5j64q7J6OLR8J19Nl7L8M5m3n3M7Q6k9j48r3L0K6m7
$$ plain form
378 4863 4829 4868 4871 4754 4654 4737 4888 4917 4909 5013 5107 5041 4923 4867 4834 4837 4902 4912 4835 4853 5004 5095 5099 5134 5141 5052 5014 5093 5130 5092 5109 5148 5106 5072
373 5072 5129 5158 5077 4985 4962 4982 5021 5048 5010 4911 4826 4812 4862 4907 4871 4800 4813 4893 4916 4886 4902 4947 4944 4918 4921 4938 4952 4947 4897 4856 4915 5010 5004 4947 4965 5011 5001
367 5001 4995 5040 5071 5091 5165 5256 5287 5259 5189 5074 4964 4892 4847 4866 4961 5010 4947 4923 5044 5176 5168 5038 4898 4874 4972 5025 4932 4819 4783 4745 4714 4803
362 4803 4952 5007 4982 4937 4865 4823 4896 4996 4996 4931 4904 4955 5045 5069 4983 4899 4890 4858 4795 4842 4964 4961 4834 4763 4807 4881 4896 4847 4847 4959 5045 5007 4961 4948
357 4948 4856 4765 4840 4954 4922 4865 4905 4937 4925 4955 4992 4991 5021 5072 5072 5087 5155 5164 5096 5039 4960 4863 4912 5082 5143 5096 5118 5144 5043 4957 5012 5046 4923 4794
352 4794 4815 4901 4893 4818 4806 4859 4884 4901 4971 5018 4983 4967 5003 4986 4912 4868 4834 4790 4803 4836 4805 4796 4900 4986 4930 4829 4826 4932 5047 5052 4981 4991 5065 5041 4964
347 4964 4989 5040 5008 4997 5058 5085 5092 5140 5118 4983 4897 4919 4947 4953 4960 4961 5006 5096 5077 4938 4874 4910 4894 4849 4867 4883 4873 4918 4977 4971 4959 4962 4905 4842 4865 4897 4884
342 4884 4898 4923 4908 4962 5117 5174 5059 4965 5016 5123 5158 5063 4899 4812 4828 4834 4837 4935 5054 5059 5022 5060 5105 5062 5009 5056 5142 5113 4965 4872 4902 4928 4881
337D881l9l1r1o7N3O8rMO6N8N2P4J3q9q8mO4R0N9j5m8l0m0m8OL6j5m8k1j2k6lM8Q8P7Jo6l6
332D912K0nm5j0K6PnJ2J5K1M5K0o5r2j5O4N9L1L4%r5j06K8J09J8l9M6L9j53k17lJ84J31nn3
326D913j5O8J05J3r5n1J7n6j06J3J01Qq6o8l4kO6Q0nn9l1j3k9k5MM7N9rp5oR8P4j1m3l2L3
321D848J29Q8o8p0O1J8j28q6L9kr9p3J5R1J23M6n3k2K8n1q6M2J27M5k9LL8J7l0n6k0J3l8r5
316D765k9P3P5Rk0QL8mq1o5K8N0J9L5K2o5r8m4JO3J50J26%n9n3l7K5L3j07j32R9K23O1o2k5
311E022l6n3K7K3r8q8M3P5N2Q2Q6L0l0r2r3K7Q6m0j66j75j32kJ58J09m3L9J83M4j22kJ12l
306E023q3j6kk3L0M2l3o1l8o0q5l7N8J32J04k7r2rO0J7k1ML7O5P9M4Pjk7l3K9K2j03j27K6
301D901J19N5jNj6n9o7m9j5K3L7M1L7j5p2l6M6N8J7k9p6m0R4J30l3j58o6O8N3mM1J07O4l7
$$ plain form
337 4881 4842 4811 4720 4653 4706 4774 4765 4769 4835 4893 4945 5019 5032 4943 4855 4851 4915 5005 5064 5049 5001 4971 4931 4883 4889 4925 4910 4862 4841 4829 4803 4800 4848 4936 5013 5014 4948 4912
332 4912 4932 4927 4882 4872 4898 4905 4900 4912 4927 4948 4993 5013 4948 4856 4841 4905 4964 4995 5029 5029 4934 4828 4856 4965 4983 4944 4990 5029 4876 4659 4656 4840 4971 4966 4913
326 4913 4898 4966 5071 5084 4989 4938 4955 4899 4793 4806 4907 4915 4829 4761 4727 4725 4791 4871 4866 4807 4776 4763 4734 4709 4713 4760 4819 4810 4735 4729 4827 4901 4890 4847 4815 4848
321 4848 4977 5065 4997 4927 4988 5006 4878 4792 4831 4829 4730 4657 4672 4763 4886 4932 4879 4857 4885 4834 4748 4790 4917 4962 4933 4936 4974 4991 4961 4905 4885 4898 4860 4765
316 4765 4736 4809 4884 4893 4873 4881 4919 4915 4834 4769 4797 4847 4866 4901 4923 4858 4760 4716 4717 4780 4930 5056 5056 4997 4944 4907 4932 4965 4858 4726 4825 5048 5109 5047 5022
311 5022 4986 4933 4960 4983 4885 4797 4840 4915 4967 5049 5135 5165 5135 5043 4950 4977 5063 5023 4857 4682 4550 4548 4706 4815 4772 4811 4994 5038 4916 4914 5026 5023
306 5023 4940 4924 4922 4899 4929 4971 4938 4877 4839 4779 4694 4657 4715 4847 4951 4924 4832 4823 4883 4900 4879 4883 4920 4985 5064 5108 5115 5114 5087 5054 5083 5105 5002 4875 4901
301 4901 5020 5075 5074 5079 5063 5004 4937 4888 4873 4896 4933 4974 5011 4996 4924 4888 4934 4992 5009 4980 4904 4864 4958 5088 5055 4897 4831 4899 4952 4948 4989 5096 5160 5123
296E123p0l7j3k3o5j11o3Q4J43J8r5m5M0M0Oj1qRnn8m9L6O2jm3k9%J4j6n4MJ06Q7PJ3J3m9
291D960k1Q1N0o6p9m7o4n0k1l8j1Q9J15N0J3j1l2K3O0o1j72p7O7O8J2PK7N0N8J0m9m7QM4N
286D951o8m4M6K5l3N4Q2j32k19L6J93M5j4P3kj04K8J24j4j06k9K5N0O9j7j07k1O8J8%K0p3
281D924j04M8O9j40j83L8J48M7j6J1no2n4L5Q7J8l5N3J05k0j08l5Km3jO1J3qO1M5l5j6K4k4
276D900k9M8L3p5j03j3P0K4j16j17J00K22N6r5j8N9Pk4l7r7n8J07J44J9j1Q9Q9o0j63j02J9
271D868J8p1l2J19J15m6r6j2K6K9P2M3p7r2L5J11M3o5j11o4J8K8l3l8M7R4K0o5l4O1M8p3r7
267D789K6J00L6j8NJ9K1O1O2m2j17o4PLj1pk8k9M4P2jj9M5j9j59o4J67J28r0o5J12P0q1o0
262D893pq9j24j0P0M7M1P4Q7N6om7j4K5k0o9m0j4l1l7k6j2M9Q6j1j16n2Q1J11O9K8pk6l7o4
$$ plain form
296 5123 5053 5016 5003 4980 4915 4804 4741 4825 4968 4986 4891 4846 4886 4926 4932 4921 4913 4922 4917 4859 4810 4846 4908 4907 4864 4835 4835 4849 4833 4779 4783 4889 4976 4983 4996 5009 4960
291 4960 4939 5020 5070 5004 4925 4878 4814 4764 4743 4705 4694 4783 4898 4948 4961 4950 4918 4941 5001 4940 4768 4691 4758 4826 4838 4845 4872 4922 4980 4990 4941 4894 4902 4946 4951
286 4951 4883 4839 4885 4910 4877 4931 5013 4881 4662 4698 4891 4936 4922 4995 4993 4889 4917 5041 5027 4921 4892 4917 4967 5036 5019 4912 4891 4959 4977 4977 4997 4924
281 4924 4820 4868 4937 4797 4614 4652 4800 4847 4831 4842 4837 4775 4721 4756 4843 4861 4826 4879 4984 4964 4856 4821 4823 4780 4779 4840 4853 4845 4906 4951 4916 4900 4924 4900
276 4900 4871 4919 4952 4877 4774 4761 4831 4855 4739 4622 4722 4944 5000 4905 4887 4946 4953 4929 4892 4795 4737 4844 4988 5007 4996 5085 5174 5114 4951 4849 4868
271 4868 4886 4815 4783 4902 5017 4971 4875 4863 4889 4918 4990 5033 4956 4864 4899 5010 5053 4988 4877 4813 4831 4859 4826 4788 4835 4929 4949 4884 4850 4911 4959 4886 4789
267 4789 4815 4915 4951 4933 4938 4957 4978 5039 5101 5059 4942 4878 4885 4888 4877 4870 4842 4813 4857 4929 4928 4909 4954 4935 4776 4712 4879 5007 4917 4852 4964 5034 4953 4893
262 4893 4886 4797 4673 4663 4733 4780 4821 4895 4982 5038 5032 4985 4971 4996 4976 4907 4867 4853 4822 4785 4759 4747 4796 4882 4871 4755 4703 4784 4895 4964 4992 4985 4959 4922 4858
256D858l2O5M6j02r7R0J18p5j44J7J27M1o7n5K1O6O1J7n0r6o1K0M3MnL1K9k6o8o0qL6J7mN8
251D815J02pj26n9Q8J02K6lnl7m2K1N8j8j21r6L2Q5J8l1pJ6K0L8N5M3J6k9o7m1K3L4K6N3N2
246E034j0m4k7pK0L1n5j40n5R7J00oo5p8n8L6R6J7k9J03J86J1j74r8M9j0j15rJ26K3j23l0
241D796J10M5n3PL8o5q8L1P1j6n0nJ3lOK3Ol3m3j0Lj3K2J01R4Km5m4m2QN9j5q2L8J39Nj38
236D872q9j5k7j3L2N2R0Q8m9j25PJ12M3mMp4j27l5jq5l3J22R0m8l8K5j6m8qpk8J1L1pRR4R8
231D903nq2n8NJ5k4k0N1Q2K9k0n6r4l1J37J48p8k00k2J57J04KJ0oj03j26l5K0jj4K2P5J06
226D891O9k7j03j17p0M2J33R2qJM0m2j25o0Mm8n0N5P1m4q4K5J07M1o8m7R6J38lr5KQ5Pp4m5
221D789pj7nL0J9l2m8LM4J6NP0P3n9j17MR2O3N2K7r4j15M5J03k4o7K7N5Jn2j18j07N9J69O9
$$ plain form
256 4858 4826 4891 4937 4835 4738 4828 4946 4871 4727 4744 4871 4912 4845 4790 4811 4877 4938 4955 4905 4809 4748 4768 4811 4815 4810 4841 4870 4844 4776 4716 4708 4744 4761 4757 4815
251 4815 4917 4910 4784 4725 4813 4915 4941 4938 4933 4896 4854 4875 4933 4915 4794 4698 4730 4815 4833 4802 4795 4811 4831 4869 4924 4967 4983 4954 4887 4846 4869 4903 4929 4982 5034
246 5034 5024 4980 4953 4946 4966 4997 4942 4802 4747 4844 4944 4938 4873 4795 4737 4773 4869 4886 4857 4960 5146 5157 4983 4885 4934 4924 4809 4800 4926 4949 4826 4796
241 4796 4906 4951 4898 4905 4943 4878 4790 4821 4892 4876 4826 4821 4834 4831 4837 4860 4866 4833 4790 4780 4783 4770 4792 4893 4987 4989 4944 4900 4858 4866 4925 4910 4828 4866 5005 5010 4872
236 4872 4783 4768 4741 4728 4760 4812 4902 4990 4941 4816 4823 4935 4978 4974 4978 4904 4777 4742 4741 4656 4623 4745 4835 4787 4749 4774 4758 4710 4702 4695 4667 4678 4709 4702 4711 4805 4903
231 4903 4898 4816 4758 4763 4778 4754 4734 4785 4867 4896 4876 4820 4726 4695 4832 4980 4902 4702 4680 4837 4941 4943 4953 4947 4844 4718 4683 4703 4702 4688 4710 4785 4891
226 4891 4960 4933 4830 4713 4643 4685 4818 4910 4902 4903 4943 4901 4776 4716 4720 4672 4622 4677 4748 4704 4620 4645 4752 4793 4725 4678 4774 4912 4909 4814 4816 4901 4908 4834 4789
221 4789 4782 4765 4760 4790 4809 4777 4729 4732 4776 4792 4797 4867 4940 4881 4764 4768 4860 4923 4975 5002 4908 4793 4838 4941 4917 4850 4877 4932 4933 4881 4763 4656 4715 4884 4953
215D953k9ok0o4k1po8NJ56Q7r9p0O3L6j9N3N9q3j32pQ5O3K9%o1q2pP3N9pl2k1k5j4O1J21M6
210E075q7r9k5k4l7O4J23rr4M5J34j8j32l5M7J9Ml5j28p4J03J11rK5Q8m6j62m9O7K8LL8On2
205D865m2j4KL8O5M5Kp5j37n5R0P9k0K1J16P1k5k4nl2k1L5L0l4o1j7M2M4k1q0p2l0jJ1J6J3
200D819K8O1N0k6r3o6J5K1n6p3L0J32J19K9m7n3QN1Kp5q6o0n0k7K5N2J2m7oJ33J70qj67r0
195D727N8O6J9K1J0qJ9J9j5J4L4n9j14k6M3M2R3R5p4j79m3J01P4J5jj8j1jn4p5K3O3n5r8M5
190D750J38N8qL5M3n8j39r2LL1J0K1N1M5j0p0o5L5J21O1n7q9p0m1N1J02Ln8O5J21j4m9P3L2
185E029j31q4Q9Q5j7k0kpM2O3n6j51j01k5K6J11J21m4j79j18qL3P3Q1k8r7OQ6j5q8J3Q7J0
180D784m2K6Q3N4K2K7J7m3j18j20l4L7L1K8O3M7k5o0n0n2n3rO1R7M0n9n7M0M7l2k2L6Kj1P9
$$ plain form
215 4953 4924 4918 4898 4834 4813 4806 4738 4743 4899 4986 4887 4817 4880 4916 4897 4950 5009 4926 4794 4787 4872 4935 4964 4964 4903 4821 4814 4887 4946 4939 4907 4886 4861 4847 4908 5029 5075
210 5075 4988 4889 4864 4840 4803 4867 4990 4981 4887 4932 5066 5048 4916 4881 4928 4947 4951 4916 4788 4714 4817 4928 4919 4944 5032 4986 4824 4775 4842 4870 4873 4911 4917 4865
205 4865 4823 4809 4811 4849 4914 4959 4961 4886 4749 4694 4784 4863 4843 4864 4980 5051 5026 5002 4997 4965 4944 4979 5009 4975 4914 4897 4939 4983 4962 4882 4810 4780 4779 4790 4806 4819
200 4819 4847 4908 4958 4932 4839 4773 4788 4809 4753 4680 4710 4842 4961 4990 4943 4890 4898 4949 4951 4876 4790 4730 4680 4653 4678 4730 4742 4695 4689 4822 4992 4984 4817 4727
195 4727 4785 4851 4870 4891 4901 4893 4912 4931 4916 4930 4964 4905 4791 4765 4808 4850 4943 5038 4964 4785 4742 4843 4917 4932 4931 4913 4902 4901 4847 4772 4795 4858 4803 4705 4750
190 4750 4888 4946 4938 4973 5016 4958 4819 4727 4730 4761 4771 4792 4843 4888 4878 4808 4743 4778 4899 4960 4903 4814 4744 4703 4754 4856 4859 4801 4866 4987 4973 4924 4997 5029
185 5029 4898 4814 4903 4988 4971 4951 4949 4942 4984 5047 4991 4840 4739 4714 4740 4851 4972 4928 4749 4631 4623 4656 4729 4810 4782 4685 4691 4777 4762 4674 4687 4774 4784
180 4784 4742 4768 4851 4905 4927 4954 4971 4928 4810 4690 4656 4693 4724 4752 4815 4862 4837 4777 4727 4675 4622 4613 4674 4771 4811 4752 4695 4735 4782 4750 4728 4764 4766 4755 4834
175D834P6m7l6P4K5r6m3O0J4p0o7l5pO0J08O4k1l2M6Q0l9j55o8Q2P4K9Q3O6q6j26jM7k8m9
170D816K3P1M6j7m4MM6Ql8k5QJ5k7q3m1Q2P7n5m9O6L3n4L2J16j9j47q1J1J3J2M0N6N0J5j0
165D950K5L1o3j07k4K3oJ4L9j4k9L5N2K1Jl7n2J3oj36r5J08J27k1n2l9q1K9K19J30j01p6N6
160D934Jo5OL4%N1P8j4m4K1j5j05m6N4j1j19p3M5M8l6o8m0l1qQ8J48P0k3j5l1r9m8Q9P0n4
155D792j6J26J10j0k6Ln1q9oP4L1n4q6j00r4j8N3On6PQ3K3m4QN0%k7J1QpM1O9mp5m6L9P8J9
149D822p6m8J05J55K6p7n5l9n3J1P9K4n9m4J2L5M4L0j0k4rl2n4j5J8ljL0Ql7j0L8Qn2n9k2
144D666MJ5M3P2L2n4m5M4K5o4%J08Pj27j0J28L1n4N7J10Lo1m5l8L4J04j9j80r9N4J5o2k3N
139D676MP9J06rp5J1O9J0m3m0j9J1K5kl2k4QM8O4K6j7k9l3j7M6O0l4p4J5O4Mm3l8k5L7R2J2
$$ plain form
175 4834 4910 4863 4827 4901 4926 4830 4787 4847 4861 4791 4724 4689 4682 4742 4850 4914 4893 4861 4907 4987 4948 4793 4725 4807 4881 4910 4993 5059 4973 4847 4846 4893 4865 4816
170 4816 4839 4910 4956 4939 4895 4899 4945 4953 4915 4890 4898 4913 4886 4803 4762 4844 4921 4866 4817 4883 4916 4862 4894 5010 4991 4844 4763 4774 4787 4799 4839 4895 4945 4960 4950
165 4950 4975 5006 4943 4836 4812 4835 4829 4843 4882 4868 4839 4874 4926 4947 4948 4911 4859 4872 4866 4730 4635 4743 4870 4849 4797 4758 4677 4706 4925 5055 4954 4878 4934
160 4934 4935 4870 4876 4910 4910 4961 5039 5025 4981 5002 4987 4882 4836 4890 4879 4760 4687 4732 4780 4744 4676 4636 4605 4597 4685 4833 4903 4880 4865 4834 4735 4687 4776 4846 4792
155 4792 4776 4902 5012 5002 4976 4979 4928 4839 4833 4907 4938 4884 4798 4698 4604 4586 4639 4645 4589 4596 4679 4702 4658 4666 4716 4716 4689 4700 4708 4701 4742 4811 4807 4732 4686 4725 4803 4822
149 4822 4746 4698 4803 4958 4984 4907 4852 4813 4760 4771 4850 4874 4815 4771 4783 4818 4862 4892 4882 4858 4849 4817 4763 4748 4766 4763 4762 4792 4800 4763 4753 4791 4799 4747 4688 4666
144 4666 4670 4685 4728 4800 4832 4778 4733 4777 4802 4738 4738 4846 4853 4726 4716 4844 4875 4821 4878 4988 4991 4930 4885 4847 4881 4985 4966 4786 4687 4741 4756 4694 4671 4676
139 4676 4680 4759 4865 4856 4781 4792 4861 4871 4828 4788 4769 4780 4805 4803 4771 4747 4755 4803 4867 4893 4876 4847 4814 4797 4843 4903 4869 4795 4810 4874 4878 4835 4797 4772 4809 4901 4913
133D913r5m6K8j5j1J11J20k4p6%J8l4m2k8m3n4l6J4R2J09J8n5m7l5rQ7Q4r3j46N4J64K4o9
128D878k0l3p5J6J12O8j4o2q9j2J10L9j32r2M6%q0nN5J3L9J00N2qj0m7o5L7Q1k3p6k3j7NJ01
123D869O0j32j30Q8J51j2j09l8J8j7l2L4P4Nm0N8J33K8j04j13r1o8K6J01N2k0l4m9m3K1M0
119D726JJJ0j6J6P5J1p1j7L2k2KJ01N8o3l6Q2J15O8mp4q1m9o0p9m2j1jM8Q3L3j2QK7J6k2q1
113D772o2Q2J60N3n1l6k4l3K6O8op0k0L4rj06j30j6J27J09j7l3L9Pj04j06J1J01O1n3q6J9
109D707Q6pr0oR0K9o5rJ01P7m3p0J6O7K8k4o0p4j5P8P8j6p8n1K8Q4M1o2p3K1P8N7J7k9l7L2
103D906M2q7j50n6j8p7l2Q3Q5L7O5P3j4p5m4QK9L2K6jl5LQ0Mj82j51P6J10J1J02J51j05k26
99D670M5J81k6j04K1jp4J7N4m2kJ40J12k9r0p2j9Rn2o9N7R1m5p8K9L1j8M9J12P6L5k3p8rM6
$$ plain form
133 4913 4818 4772 4800 4785 4774 4885 5005 4981 4905 4905 4923 4889 4847 4819 4776 4722 4686 4700 4792 4901 4919 4864 4817 4782 4773 4860 4944 4851 4705 4759 4923 4947 4878
128 4878 4858 4825 4750 4766 4878 4946 4932 4870 4781 4769 4879 4918 4786 4694 4740 4740 4660 4655 4710 4723 4762 4862 4914 4906 4896 4849 4784 4821 4902 4879 4803 4780 4763 4768 4869
123 4869 4929 4797 4667 4755 4906 4894 4785 4747 4765 4748 4716 4750 4824 4829 4789 4847 4980 5008 4904 4791 4700 4632 4658 4759 4811 4791 4757 4708 4665 4686 4726
119 4726 4727 4728 4738 4722 4738 4813 4824 4753 4736 4768 4746 4748 4849 4907 4844 4808 4890 5005 5073 5069 4995 4914 4865 4805 4726 4684 4673 4672 4720 4803 4836 4824 4832 4859 4875 4853 4772
113 4772 4710 4792 4952 5005 4954 4918 4894 4861 4887 4955 4949 4879 4859 4893 4884 4778 4648 4632 4759 4868 4851 4818 4857 4864 4760 4654 4665 4766 4827 4774 4688 4707
109 4707 4793 4786 4696 4690 4780 4809 4744 4735 4836 4913 4870 4800 4816 4883 4911 4887 4827 4753 4738 4816 4894 4878 4800 4749 4777 4861 4902 4840 4767 4788 4866 4923 4940 4911 4874 4906
103 4906 4948 4861 4711 4655 4637 4560 4528 4611 4696 4733 4798 4871 4857 4782 4738 4746 4775 4807 4833 4832 4797 4800 4880 4884 4702 4551 4627 4737 4748 4850 5001 4896 4670
99 4670 4715 4896 4870 4766 4787 4786 4712 4729 4783 4741 4739 4879 4991 4962 4872 4800 4781 4790 4738 4669 4726 4817 4772 4694 4723 4754 4736 4785 4897 4973 5008 4985 4907 4898 4944
93D944p1j00Q9J28m0l3R6J8j21r8m3%R7P4p7n0P1k9j36RR2l9l8J03O7o7o3k7l9ON3L5M0M1
88D892n7r0L7J16N6K7K7m7j21j14o0L7J22M2j26j20L2P9jm3pN0Q6P6J8m3m5L3J09O0n8p6M
84D895M7J8n0j22p4R3J34j8r4qK0m3k7L2K8J4L4L0J8L4j0j34j90o9J18J55Rq8JQ6J9k8J9j5
79D834j00k0J39J34J7o3j11j16m1J6J5O1J14N5k1j0kk8%K6l6o4JK8j7k9k4n1j6Q8R5j7m1R4
74D910J72L4j54j49RR4N9J1l5j02q6L5Q1rl7M9L5j06r9J10J74k3j25L1J12k3q6lj8r6jJ28
69D892M9q9q2j2K4K9k7o1N3J37j2j42%J35L9l7L7M7m4l5M7L9m7j03p3L2R5L0m4pL0j8m8nL3
64D862M3L4rn7p1o1JJ27J57Kj12m7J0l3j4O3M3J2Q2R7k9q0N1J63J34P3P8J06P0m1q8JN5n4
59E568j55j30j33j69n5R2Qj32l9R7J8q8MJ35J03n6j77j18N2P6o4o3J12J32k7q4k0j0j7J0O
$$ plain form
93 4944 4873 4773 4862 4990 4950 4917 5013 5031 4910 4812 4769 4769 4866 4940 4863 4813 4884 4855 4719 4728 4820 4781 4743 4846 4913 4846 4783 4756 4717 4723 4776 4811 4851 4892
88 4892 4835 4745 4782 4898 4954 4981 5008 4961 4840 4726 4666 4703 4825 4867 4741 4621 4653 4732 4731 4688 4681 4731 4817 4893 4911 4868 4823 4856 4965 5025 4967 4891 4895
84 4895 4942 4960 4910 4788 4714 4807 4941 4923 4829 4821 4841 4798 4771 4803 4831 4845 4879 4909 4927 4961 4951 4817 4627 4558 4676 4831 4840 4752 4753 4839 4858 4830 4849 4834
79 4834 4734 4714 4853 4987 5004 4941 4830 4714 4673 4689 4704 4765 4879 4934 4913 4903 4901 4873 4873 4899 4863 4799 4800 4828 4811 4782 4758 4707 4691 4779 4874 4857 4816 4910
74 4910 5082 5116 4962 4813 4822 4916 4975 4986 4951 4849 4763 4798 4879 4870 4833 4882 4917 4811 4712 4822 4996 4973 4848 4879 4991 4968 4882 4879 4861 4765 4764 4892
69 4892 4941 4852 4770 4758 4782 4811 4784 4723 4776 4913 4901 4759 4759 4894 4933 4896 4933 4980 4936 4901 4948 4987 4940 4837 4764 4796 4891 4921 4877 4870 4900 4882 4834 4829 4862
64 4862 4905 4939 4930 4873 4802 4741 4742 4869 5026 5028 4916 4869 4879 4846 4832 4895 4938 4950 5032 5129 5100 5020 5071 5234 5368 5441 5519 5625 5695 5654 5566 5567 5622 5568
59 5568 5413 5283 5150 4981 4926 5018 5026 4894 4855 4952 4970 4882 4886 5021 5124 5068 4891 4773 4825 4901 4837 4774 4886 5018 4991 4907 4887 4877 4860 4870 4876
54D876lK7j7j08n0P5M2m5j3J7m7o5QQ1J25Q8n9j22j0N4qkO0Mn2J8M0m4k7O7M5l5k9J3O5J59
49E128J52k6j37l6P2M7mk0m3m4K6P7Rj08j14mN3j0m6J9L9m0p1j7J0ML4L2l3l0M7L8n0m3J2
44D923m1r7J8J55J17M6J04J17k2j01l4k5j23j12L3J03Mj35j70p4K7K8J4O0N0j4N5J79R2j08
39E069j18OM0K2L1J6L2J08P9p4j03K3O1k8r7j00m9L5L6n3o8%J0QO2K8r3n9J12J17n5j21j5
35D862P5Nj55j72L6J90Q4m7J3N9m6r4jN2K8K0OqM9Q0qm4P0J08j5p5k8m4q2%O7j6p4JL9k8k7
29D880N5O0rj9J2MrOjl9m6QP4Q5K9k8j6J8jk1NOm7m4M4R9R4Q9M2p5r9N7J68O2n9kO7kk0J24
23E551K13J04nlk8j23j37p6r8j75j27J7Q3N5O8J04N2m4n8k9n0m4L4M0n6p0J8K1l7J4R1K0j09
18E216j09pO7N8j3m5OM1J9K9L2n8r1N1J32Oo4M2P5k7k0J10J05o3j47l0R9L1j09n3J25J32j
$$ plain form
54 4876 4873 4900 4883 4775 4725 4800 4842 4797 4784 4801 4754 4689 4697 4778 4903 4991 4932 4810 4800 4854 4846 4844 4904 4908 4856 4874 4914 4870 4843 4910 4955 4920 4891 4904 4969 5128
49 5128 5280 5254 5117 5081 5153 5200 5196 5176 5133 5089 5115 5192 5201 5093 4979 4975 5028 5018 4972 4991 5030 4990 4919 4902 4912 4916 4950 4982 4949 4919 4966 5004 4954 4911 4923
44 4923 4882 4785 4803 4958 5075 5121 5225 5342 5320 5219 5185 5160 5037 4925 4958 5061 5065 4930 4760 4686 4713 4741 4755 4815 4865 4851 4906 5085 5177 5069
39 5069 4951 4957 4997 5019 5050 5066 5098 5206 5285 5211 5108 5131 5192 5164 5067 4967 4918 4953 4989 4936 4868 4868 4878 4886 4948 4976 4883 4824 4936 5053 4998 4877 4862
35 4862 4937 4942 4787 4615 4651 4841 4925 4878 4891 4950 4904 4810 4809 4861 4889 4909 4915 4907 4956 5036 5028 4984 5054 5162 5147 5072 5044 5000 4918 4918 4985 4969 4895 4896 4935 4907 4880
29 4880 4935 4995 4986 4967 4979 4983 4974 4980 4979 4940 4894 4902 4976 5061 5090 5062 5046 5064 5063 5042 5047 5053 5006 4962 5006 5105 5199 5288 5330 5255 5156 5213 5381 5443 5384 5382 5449 5447 5427 5551
23 5551 5764 5868 5863 5860 5832 5709 5572 5496 5398 5223 5096 5113 5196 5251 5319 5423 5475 5431 5373 5344 5294 5250 5284 5324 5268 5198 5216 5237 5200 5214 5305 5325 5216
18 5216 5107 5100 5167 5225 5212 5167 5173 5214 5233 5262 5294 5236 5145 5196 5328 5334 5270 5312 5387 5360 5340 5450 5555 5492 5345 5315 5414 5445 5336 5283 5408 5540 5539
14E539l7KpJ4R2Q1jk4k8m3M2J64J18k0l7M1R3J09O2n6j02j7O9R9J46J70Q6NO2J53J11JrN8
9F936P1O9J49J93P5k4P9K35K46J82J82K49L04K56J48J95M23N59N01M53N27O53Q00R37J022
5A5420J082J069R23Q46R54R67Q40R56J307J602K065K845L481L941M732N697O663Q502J1662
2G5554J5353J9025K1656K0471J4759Q410L831k168j1329j8884k0649j8938j7438j6086j3673
0E9894j0633p821n600m196l367k583j866j444j130p93n77m41k96l04m93o84q71j038j037r26
-3A3794q81q03o36n75n79m10k14k67l88k95j07m9r6j48j85k06j88j28q4j23j92j81j19o8R
-7F881N4n1j40l0O8n7j75j14m8l1M3N8o8j01RNj30j55p5l0J8P8N1j9k7qlK7L7j9m1j1m7j07
-12E842n0M4L8rj4k6l0J8L6oJ6R6P8k3o0n9q6o1L2O3Nn2p3m7N5J38Q5j6l9k5j6J2Pl9rL8q6
$$ plain form
14 5539 5502 5504 5497 5511 5603 5684 5683 5659 5631 5588 5630 5794 5912 5892 5855 5896 5989 6098 6160 6104 6002 5985 6054 6153 6299 6469 6555 6560 6622 6775 6886 6887 6878 6936
9 6936 7007 7076 7225 7418 7493 7469 7548 7783 8029 8211 8393 8642 8946 9202 9350 9545 9968 10527 11028 11481 12008 12661 13461 14398 15420
5 15420 16502 17571 18494 19340 20294 21261 22101 23057 24364 25966 28031 30876 34357 38298 43030 48727 55390 63892 75554
2 75554 90907 109932 131588 152059 166818 175228 179059 176891 165562 146678 126029 107091 89653 73567 59894
0 59894 49261 41440 35840 31644 28277 25694 23828 22384 21254 20461 19884 19443 19147 18843 18350 17666 16795 15757 14720 13794
-3 13794 12913 12110 11474 10899 10320 9910 9696 9429 9041 8746 8639 8590 8494 8346 8161 7955 7767 7639 7555 7432 7240 7059 6940 6872 6881
-7 6881 6935 6884 6744 6714 6782 6725 6550 6436 6388 6357 6400 6458 6390 6289 6298 6303 6173 6018 5943 5913 5931 6009 6060 6041 6014 6006 6003 6030 6067 6048 6007 5996 5949 5842
-12 5842 5792 5836 5874 5865 5851 5825 5795 5813 5849 5843 5859 5955 6033 6010 5950 5891 5805 5744 5776 5839 5844 5792 5719 5672 5727 5865 5950 5934 5895 5870 5854 5866 5873 5834 5825 5863 5777
-17E777k79k60j08q1j47j35p6k6O3J69K07J57M3q7j72k31k90k44p4L6M0J03K10K09J53J31
-21E088O7j3J6N0l8r4l1ol3K1P5L0J0L8k9j38j23m7qN0J05N5l1l6j9k9j5mm0m4N2J43J09l7
-26E094j52j04M2R9N6M7L5o4j37p5kj0kN3O5K5kqoK0M1J8k9l8mNk8j3P3P2p9j47k8O4J8J9
-31D918P7J6j07r1oRL5J01N4p1q4mJ4%K3J9qM6J07%j61j20O9J33M0m3n1k4L7O6k8j30o5N6
-36D827L5j6O4J14Lp8j4K0l5j8O1M0l7l4j1m4o4m5k3L6J16P4o1o9N3P9j3m2K6Q1O9rj20j55
-41D810p0J6J0l1l1L2J37J71L6j39j24M2J23N5j1kj6j06j56n3P9N4m7pJ04O3p6q1M6J02K7
-46D957o5p2k8k3m0K8J37R0q5j32kO6k0q2j6O0M4j1k4j0qkK8M7L0K7O6J04P9j3j05r1MK7m3
-51D922o0OL5L0N4M7l5q3o8o1m2K2M6J3K4N1lp3m8J3L6M7O1M9Ln3p7n2l8m6K0J35J17k8n5
$$ plain form
-17 5777 5498 5238 5130 5049 4902 4767 4691 4665 4728 4897 5104 5261 5304 5217 5045 4814 4524 4280 4206 4242 4282 4385 4595 4804 4957 5088
-21 5088 5155 5142 5158 5208 5170 5076 5045 5039 5006 5027 5102 5132 5142 5180 5151 5013 4890 4843 4835 4885 4990 5045 5014 4978 4959 4930 4915 4911 4871 4827 4879 5022 5131 5094
-26 5094 4942 4838 4880 4979 5035 5082 5117 5053 4916 4841 4839 4829 4827 4880 4945 4970 4968 4960 4954 4974 5015 5033 5004 4966 4962 4967 4939 4926 4999 5071 4992 4845 4817 4881 4899 4918
-31 4918 4995 5011 4904 4813 4807 4816 4851 4952 5006 4935 4851 4847 4861 4861 4884 4903 4895 4941 5048 5048 4887 4767 4836 4969 5009 4966 4915 4891 4928 4994 4966 4836 4771 4827
-36 4827 4862 4846 4910 5024 5027 4949 4935 4955 4920 4902 4963 5003 4966 4932 4921 4877 4813 4768 4745 4781 4897 4971 4910 4841 4894 4973 4960 4918 4944 5025 5094 5085 4965 4810
-41 4810 4740 4756 4766 4735 4704 4736 4873 5044 5080 4941 4817 4859 4982 5037 5026 5024 5008 4902 4746 4693 4772 4826 4779 4772 4876 4939 4863 4782 4828 4930 4957
-46 4957 4892 4820 4792 4769 4729 4757 4894 4984 4899 4767 4765 4831 4811 4729 4713 4773 4817 4806 4782 4772 4764 4762 4790 4837 4867 4894 4960 5064 5143 5130 5025 4934 4938 4965 4922
-51 4922 4862 4868 4903 4933 4987 5034 4999 4916 4848 4787 4745 4767 4813 4826 4850 4901 4898 4825 4777 4790 4826 4873 4934 4983 4986 4933 4856 4804 4766 4720 4740 4875 4992 4964 4909
-56D909R3K04J49j5j52j32J3O9k0p4lP3J03J01N3%K9Q6P9M7K8l4j05q5qj2r4j18k4O0mj23
-61E093j16j7K8K9M8K9k7l3j6n3p3k1L4O5O1j4p4pM7m4j06k6K2mL5N5o1j20rP0M0L3L8mNN6
-66D963Pp9n2J7Ll6l2pJ4K2J7L9L3o6j18jJ03M0j6K8jq5k5Q3Mj24n1P9K7n6N8J73K3j62m8
-71D774J64J00p7l6R0N6j9j6n1r4j1N9k2p4jjj06j03K4J08J12P8k0j20q8K5L9n7q6MN7nk0
-76D683O9P1p6j22L2J28K3q4l9O9Q8jr9r3j0M6N2J5n9o1O0J13Rl2O0M6q1q4J3J5j3K0M4M6
-81D848O6kj25q4Q4J17J1l8rK0L5J4k1j0Lk5RO1l6j39j5J21L2n5Mk0j12l0J01N5j1J9j4n4
-86D800N7J06n9j56l4O0K9OjnO3J13J6q4m2Pk9n3m6l6K7R5L4o7m4K8J4k0J3O0L6l8o5oJ3j04
-91D688j55J1J53O7l6J9P5O3Q2P3k2l7M1pj31q6L3Jo7k3kn2rR6O1o8r5k2L6M8L6J7L5P1L7
$$ plain form
-56 4909 5002 5206 5355 5340 5188 5056 5069 5138 5118 5044 5041 5114 5217 5318 5371 5371 5400 5486 5565 5612 5640 5606 5501 5416 5408 5396 5302 5184 5160 5220 5216 5093
-61 5093 4977 4960 4988 5017 5065 5094 5067 5034 5018 4965 4892 4871 4905 4970 5031 5017 4943 4936 4983 4939 4833 4807 4829 4825 4860 4915 4854 4734 4725 4795 4835 4868 4906 4902 4907 4963
-66 4963 4970 4891 4839 4856 4859 4823 4791 4784 4798 4820 4837 4876 4909 4843 4725 4724 4827 4867 4851 4879 4878 4793 4768 4851 4855 4731 4680 4759 4786 4730 4788 4961 4984 4822 4774
-71 4774 4938 5038 4961 4925 5015 5071 5052 5036 4985 4891 4880 4939 4917 4843 4842 4841 4735 4632 4656 4764 4876 4954 4934 4814 4726 4751 4790 4733 4647 4651 4708 4703 4683
-76 4683 4752 4823 4747 4625 4657 4785 4808 4724 4685 4754 4842 4841 4742 4649 4639 4685 4737 4752 4693 4632 4692 4805 4814 4782 4842 4888 4807 4723 4736 4751 4738 4758 4802 4848
-81 4848 4914 4912 4787 4703 4787 4904 4915 4877 4868 4888 4923 4937 4916 4906 4909 4884 4893 4954 4918 4779 4764 4885 4917 4862 4866 4846 4734 4704 4805 4860 4849 4868 4854 4800
-86 4800 4857 4963 4904 4748 4714 4774 4803 4809 4808 4803 4866 4979 4995 4911 4869 4876 4847 4794 4748 4712 4739 4834 4868 4801 4757 4785 4799 4779 4792 4852 4888 4850 4785 4779 4792 4688
-91 4688 4533 4544 4697 4764 4728 4747 4822 4885 4967 5040 5018 4981 5022 5015 4884 4798 4831 4832 4765 4742 4740 4688 4679 4775 4836 4768 4673 4651 4687 4735 4771 4788 4823 4894 4931
-96D931n0p1k0Mj1JK1J0MK6K1mJ2L8Lm5m3l9o2n5k0L2J24J72M4j15p6L2k7q9K6R4l7r7K5P4
-102D833MK9R1k2j74j06Q5J42N2l9n2rJ0m9r0jR5J6j06k1J37O3j22r4N4L4n5RQ7K6j6L5J4
-106D860n3nO1Lm3J4Or8r4M1J02K2p3j09q8NJ50K00N0j56j61J8J25Q5No9j06j9R4L2r1n8K7
-111D677QQO6K9m8J5R0J0p0kP1L5k1j0M9O0n1j53o0R3N6m7K3J32N4q7r0j6K0J9L4P1P4lp0
-116D966m6j9n9m9L3J0j05q8M7P6LJ3Q6P3j8o0m2l9m9%N5Qp5l2R5J00k2r6o5j3K8O1L6m5p1
-122D697pL5k%P7R2Ol4k6q9j20K0J38M7m2N3J37N6n4o4NO7%j18m0J24Mk17o4K32J32j50j41
-126D754J2K5J3L9j0l4O6J06Jj01j41j31j6J06P3j1oll3J4O2j0o8j5Ko2m6O1R1K2oM8N9n4
-131D807j48q7J5L9Q9J50M1r6oJ13jj01j6rr0J7J66N9j00n8K6L1N4P4L9J9m2j65j21Q6J04
$$ plain form
-96 4931 4881 4810 4790 4794 4783 4784 4805 4815 4819 4845 4866 4862 4874 4912 4915 4870 4827 4788 4726 4671 4651 4683 4807 4979 5023 4908 4832 4864 4837 4748 4774 4868 4831 4734 4759 4833
-102 4833 4837 4866 4957 4935 4761 4655 4740 4882 4934 4895 4843 4834 4844 4795 4705 4704 4799 4815 4709 4688 4825 4888 4766 4672 4726 4760 4705 4714 4801 4827 4811 4846 4860
-106 4860 4807 4802 4863 4866 4823 4837 4843 4745 4651 4692 4794 4816 4743 4634 4546 4551 4701 4901 4951 4795 4634 4652 4777 4862 4867 4798 4692 4673 4767 4799 4708 4650 4677
-111 4677 4685 4693 4759 4788 4740 4755 4845 4855 4785 4783 4854 4889 4868 4858 4907 4967 4916 4763 4703 4796 4852 4805 4828 4960 5014 4927 4837 4821 4841 4860 4894 4965 5039 5036 4966
-116 4966 4920 4901 4842 4793 4826 4836 4731 4643 4690 4766 4769 4782 4868 4941 4923 4863 4821 4782 4733 4733 4788 4796 4721 4689 4784 4884 4862 4766 4701 4688 4716 4777 4813 4768 4697
-122 4697 4690 4725 4723 4723 4800 4892 4898 4864 4838 4749 4629 4649 4787 4834 4792 4845 4982 5038 4984 4920 4925 4992 4992 4874 4834 4958 4962 4745 4681 4913 5045 4895 4754
-126 4754 4766 4791 4804 4843 4833 4799 4865 4971 4972 4871 4730 4599 4583 4689 4762 4751 4745 4742 4709 4723 4785 4775 4707 4692 4694 4632 4586 4647 4738 4760 4754 4802 4861 4807
-131 4807 4659 4572 4587 4626 4715 4865 4906 4810 4804 4917 4916 4815 4799 4790 4700 4717 4883 4942 4842 4784 4810 4841 4895 4969 5008 5027 4985 4820 4699 4785 4889
-136D889m0j1O2n9j10N0O1r5k8J60R5o4m2k0j14r7J5rn5P9J98R6m2l7pk4RM4m2j24k0J00J
-141D819j30j4J64J06n2n0K3oo5m4J6N9P2L1k9l5j2k2m0j0L6M6K0pl8p4p2J9J14P4m7o6L1
-146D817P6J4n8o4nN2L1l7l5%m0q6nJ10R7Ok1K1L6l1j08o4P7J26K6o3o4o8q5j6Q9Q4k6j09
-151D677r6jJ21J54N2n1j9N7K9m8k6N9N6m6j20q0K4N4m2j21n4N0N6O3J32R1q1j38qR2O6J7
-155D919j4j1N9Q9k0j15m3N0K5m1q7r8j2P3m0j74kK49J56o2j2P9q3j85jJ32M5M1J30L0j29
-160D948o4K7o7r1N6N5r6m0J42P4j09o3N7j4q4L5J34O3jJ7j3m8M9J45L6j50j41qJ8m9l7L8
-165D819P3O6K1p4j08j1P2K3m9m6k8k7k6l5k8L6Q7N5Rrl7m2RJ8m6n6J4O1O1K7m6q6l3K7L0
-170D721L0Oo2m8P0J05K9qK9P5J07N9n8o3J2o3j82q8L6k4m2O5L5o1M3J29l3j50m2L6L9J23
$$ plain form
-136 4889 4849 4838 4900 4841 4731 4781 4842 4747 4719 4879 4974 4910 4868 4848 4734 4637 4652 4643 4588 4667 4865 4961 4919 4882 4875 4851 4860 4904 4862 4738 4718 4818 4819
-141 4819 4689 4675 4839 4945 4893 4843 4866 4860 4795 4751 4767 4826 4898 4929 4900 4865 4853 4831 4791 4781 4817 4863 4883 4876 4838 4764 4692 4711 4825 4899 4852 4786 4817
-146 4817 4893 4907 4849 4785 4780 4832 4863 4826 4791 4791 4751 4665 4660 4770 4867 4873 4852 4873 4909 4878 4770 4706 4783 4909 4935 4872 4808 4740 4655 4639 4728 4812 4786 4677
-151 4677 4581 4580 4701 4855 4907 4856 4837 4894 4923 4875 4849 4908 4964 4918 4798 4718 4742 4796 4754 4633 4579 4629 4685 4748 4880 4971 4890 4752 4744 4836 4902 4919
-155 4919 4905 4894 4953 5042 5022 4907 4864 4914 4939 4898 4811 4713 4701 4774 4734 4560 4558 4807 4963 4901 4889 4968 4885 4700 4699 4831 4876 4917 5047 5077 4948
-160 4948 4884 4911 4844 4753 4809 4864 4768 4728 4870 4944 4835 4772 4829 4815 4731 4766 4900 4963 4962 4979 4966 4918 4967 5112 5148 4998 4857 4849 4867 4818 4781 4819
-165 4819 4892 4958 4979 4905 4797 4786 4858 4881 4832 4786 4758 4731 4705 4670 4642 4678 4765 4820 4829 4820 4783 4741 4750 4768 4722 4666 4680 4741 4802 4829 4783 4697 4664 4691 4721
-170 4721 4751 4757 4695 4647 4717 4822 4851 4843 4872 4947 5054 5113 5055 4992 5004 4941 4759 4671 4707 4683 4641 4706 4741 4680 4723 4852 4819 4669 4627 4663 4702 4825
-174D825J25m9j22j4L6K7Q2P3n3r9k3L3M5L8j2m0j9m4p5MJ04J03N6j4j04q6K1J3m9J7M5r6
-179D748j36J7P3J1K6K1q7o0Q2N2m7K9J10M0M7J36L1j83j81l3NlN8Q1Om2rJ7RK7M2j0n0K4
-184D851O4o6j61k9R2J3m5L1K4p6o4Nj2j6L0NpJ06J31k2q4oj5m6M6O7o7n5J17J04o1n8N7O2
-189D915N4Q1l3j93r1J48J41o0j25n8m7n4onn0kR2O5k2j5No1r4j4M0mk4J8K0k4jQ5J08K5n1
-194D763k5L8M2J6Km1r2l8P3O3m2l0O7N3k9KO5j6j29p7K7j5p3N2J92Q6j02o7J00J17Mk7Nm2
-199D922j06o0L1K9k4j7J6mj8K9L8k9m4Pj1n8lM8k0n3K7M2kO7J42L4p7k5J3m7l0L4j0n0K5
-204D816M6m2m7L2J8o0m3N3R3Qj32j39MM3r4j10Q4J66M3k0J7j4m2M2O4m5m6J01J25qo7k0j3
-209D813l2j1k0p4o2J1L5L8P0M0o8p2N0Q0j7n1OPj4L4N5k5n3K5L5n9n2Q5J27Rp2m2m6j18j01
$$ plain form
-174 4825 4950 4901 4779 4765 4801 4828 4910 4983 4930 4831 4808 4841 4886 4924 4912 4872 4853 4809 4734 4738 4842 4945 5001 4987 4883 4797 4818 4831 4782 4799 4844 4748
-179 4748 4612 4629 4702 4713 4739 4760 4673 4613 4695 4747 4700 4729 4839 4879 4926 5062 5093 4910 4729 4696 4701 4698 4756 4837 4843 4801 4792 4809 4818 4845 4887 4877 4827 4851
-184 4851 4915 4849 4688 4659 4751 4764 4719 4750 4774 4698 4634 4639 4627 4611 4641 4646 4639 4745 4876 4854 4770 4764 4749 4703 4749 4816 4749 4694 4811 4915 4854 4796 4853 4915
-189 4915 4969 5050 5017 4824 4733 4881 5022 4962 4837 4779 4732 4678 4672 4667 4617 4615 4707 4772 4750 4735 4740 4679 4585 4571 4611 4607 4583 4601 4621 4597 4596 4681 4789 4814 4763
-194 4763 4738 4776 4818 4834 4836 4795 4703 4665 4738 4801 4759 4729 4796 4849 4820 4822 4887 4871 4742 4665 4692 4677 4604 4656 4848 4934 4832 4765 4865 4982 4986 4959 4964 4922
-199 4922 4816 4756 4787 4816 4792 4775 4791 4787 4769 4798 4836 4807 4763 4770 4759 4701 4698 4746 4726 4673 4700 4742 4740 4807 4949 4983 4906 4881 4894 4847 4817 4851 4841 4791 4816
-204 4816 4862 4820 4773 4805 4823 4763 4720 4773 4866 4874 4742 4603 4607 4650 4556 4446 4530 4696 4739 4719 4736 4722 4680 4722 4786 4741 4695 4796 4921 4913 4846 4826 4813
-209 4813 4781 4770 4750 4676 4614 4625 4660 4698 4768 4808 4740 4668 4718 4798 4781 4730 4736 4743 4729 4763 4818 4793 4740 4765 4800 4741 4689 4774 4901 4910 4838 4796 4750 4632 4531
-214D531M6J59J28K3m5m1PL6J0l6m8j0M3K9n1o4K8O5JJ2J05Q6l8q9q0p5mQ9M7m7k6L3L7N6
-219D917K1j41j91NJ39M0k7L8K6o7o8nK2L6L2j3l8k1j0RM4L5RL9N8Qm1n9o7j6P9J00L0m5j08
-224D770j12j1N7K3M0Q5l3j62m0J41J12K0j2o4o5M1L7o5K5J78M6j61j01J3n6j09pJ05J26O8
-229D889k0k5K5l4j01NR2l4j25k2M7J0J2Rk7L9J16L1l1O8N3j04p5P1j6j91j07R8J57J01mj43
-234D764j41O1J79L1j64j65m1L3J9oL1J11J40M7r5j25j9N0%m3j0J1J5O1N6l9n9M3R0K8k0j7
-238D826QK5m0j50r0J22J69nj22p1PK3k7r1l1J25J29l3r0J4Q3O1L3Rnkk1k5M4P9qq2n7j8J7
-243D806O3Nj23j00M4N9j7J2P0J4o5o4l1j1K5O2O1K1jJ1j4q9o0P6Q6l0lP4o2j85j1J40nj10
-248D648J2O3j6KN1j9o1nL7P2O4p6j35R0K37J3j92r8nl1M4J02m3j23J9P3m2k8J01P6n7p8J2
$$ plain form
-214 4531 4577 4736 4864 4887 4842 4801 4808 4844 4854 4818 4770 4760 4803 4832 4781 4717 4745 4810 4811 4823 4928 5014 4976 4887 4807 4732 4728 4817 4864 4817 4791 4824 4861 4917
-219 4917 4938 4797 4606 4611 4750 4790 4763 4801 4827 4760 4692 4687 4709 4745 4777 4764 4726 4705 4695 4704 4748 4783 4792 4831 4889 4897 4856 4797 4730 4714 4793 4893 4923 4878 4770
-224 4770 4658 4647 4704 4727 4767 4852 4819 4657 4617 4758 4870 4890 4878 4814 4749 4790 4827 4762 4787 4965 5011 4850 4749 4762 4706 4597 4590 4695 4821 4889
-229 4889 4869 4844 4869 4835 4734 4739 4831 4797 4672 4650 4697 4707 4719 4728 4701 4740 4856 4887 4856 4924 4977 4873 4798 4869 4853 4662 4555 4653 4810 4911 4907 4764
-234 4764 4623 4684 4863 4894 4730 4565 4524 4557 4576 4570 4601 4712 4852 4899 4804 4679 4660 4710 4710 4667 4657 4668 4683 4744 4800 4761 4702 4745 4835 4863 4843 4826
-238 4826 4834 4859 4819 4669 4579 4701 4870 4865 4743 4672 4679 4702 4675 4584 4553 4678 4807 4774 4684 4698 4781 4842 4875 4884 4879 4877 4856 4831 4875 4954 4946 4864 4807 4789 4806
-243 4806 4869 4874 4751 4651 4695 4754 4737 4749 4819 4833 4768 4704 4673 4662 4687 4749 4810 4831 4830 4841 4827 4738 4678 4754 4840 4810 4807 4881 4819 4634 4623 4763 4758 4648
-248 4648 4660 4723 4707 4709 4760 4741 4680 4675 4712 4784 4848 4772 4637 4727 4964 4977 4785 4687 4682 4651 4695 4797 4754 4631 4650 4723 4681 4653 4754 4830 4773 4695 4707
-253D707Q7P0l9r1LQ8M4PK4k8p2L8J13k3j16J0Q6m3j01J5L3q7p9M4L4m9J7R6Kn9O4J02p7j61
-258D659j1R1J4o0m4KN4O2LpO3M2q7j16m5m4o8jO0M5N9R9N1k7l2k3m0MQ5P8Pj7%kj9k9k6O
-264D786N1M6LnJ0l2r8p6J5N1J2qJ0nm5m5j0JpPM7N9J6l2rL9J7l6rN2N1Qk8o6o5kK3k3k1L5
-270D717L1j8l3o3q2K1J39P4n8m1L5K4mJ7J3j8k2j2J2O2N0m3o9K2P0Qn3l7J0M1J8l6k8O1Q5
-275D893rn8PL5m0o8%Pn6k2P0J3j04l9J09R7K1L8L1l2J0R8L1p6n8m9r5j2J19N1q2m5J7m1l8
-280D723P2P0l6k3P1N0l6l0L2J5n5n2L4O6k3j01o0J4Jm7k1P1J14O2OJ8Rq9j36j1J24R0m5r6
-285D781j3Q8N0p7n8J20J52l1j11ML3r1j21mP6O0K7j0n1m9K2J08J21K4j13j66r0K8P0J3k1
-289D771N0J18P1j6p0j18j06K8J22N5j8j1o1j38o5O4P3M3N2J4n6o6o3o0J9R1L7j5K9Oj06r3
$$ plain form
-253 4707 4794 4864 4825 4734 4737 4825 4869 4876 4900 4872 4800 4838 4951 4928 4812 4822 4908 4865 4764 4779 4812 4725 4646 4690 4724 4675 4692 4788 4790 4731 4795 4897 4820 4659
-258 4659 4648 4739 4753 4693 4649 4651 4705 4767 4770 4763 4826 4868 4781 4665 4620 4576 4508 4507 4567 4612 4671 4770 4821 4794 4762 4739 4699 4703 4788 4866 4873 4856 4856 4854 4835 4806 4780 4786
-264 4786 4837 4883 4886 4881 4891 4859 4761 4685 4700 4751 4763 4755 4765 4760 4715 4670 4660 4661 4654 4661 4708 4767 4783 4751 4742 4781 4798 4762 4753 4805 4856 4864 4836 4770 4705 4703 4726 4703 4682 4717
-270 4717 4748 4730 4697 4634 4552 4573 4712 4786 4728 4687 4722 4746 4742 4759 4772 4754 4732 4720 4732 4794 4844 4801 4732 4754 4824 4832 4779 4742 4752 4793 4811 4775 4747 4808 4893
-275 4893 4884 4826 4833 4868 4828 4760 4760 4767 4711 4689 4759 4772 4668 4629 4738 4835 4856 4894 4925 4893 4903 5001 5032 4956 4898 4849 4754 4742 4861 4912 4830 4785 4802 4761 4723
-280 4723 4795 4865 4829 4806 4877 4927 4891 4861 4893 4908 4853 4801 4835 4901 4878 4777 4717 4731 4732 4685 4664 4735 4849 4911 4917 4935 4944 4855 4719 4708 4832 4922 4877 4781
-285 4781 4768 4856 4906 4829 4771 4891 5043 5012 4901 4905 4938 4847 4726 4722 4798 4858 4885 4875 4824 4775 4797 4905 5026 5050 4937 4771 4681 4709 4779 4792 4771
-289 4771 4821 4939 5010 4994 4924 4806 4700 4728 4850 4905 4887 4876 4815 4677 4612 4676 4749 4792 4844 4858 4802 4736 4673 4613 4632 4723 4760 4745 4774 4780 4674 4581
-294D581L9Q3K8mmkJk4o9o6qO8J23Q9k3o7PO9N9J8m4q4l1L1J8K8N6l8j27jJ39N2n5mJ7o0p0
-300D725m6p4j3J39J23m2q2QL9Rkj0k0j7k5l9k4j0J3Q5J09%q7l1K1j7j3N7M6k1j2K3l5j08
-305D669o3N2R8O8N0N9J3q2j05rP3L9k6l6k3k3KJ3o4j22QJ92J51n2j19n1o8j20j1J55J37k3
-309D782j01m6N5J35J46O1o6j18n3K2Rj0M8O4n1j41q1mJ7P7J39O6m6m4l7j18j23L1J45P7m1
-314D794o9k9JOJ7L9L6J1NJ6Qpnkj6qN1R4J1j42j37N9J26m5j10Q5J69l0j55k6R5N6kj8l3n1
-319D794p8q5J9J32L0j80j70L8J47Q2j5n0kQ4Q0l0p0K1R4O1j2o0o9o4o9m2N1J04J7p7k5N7
-324D713J1n8j3M3K7L5R7Q0k6q1o3m5oM1Jp4l3M8J8k7J1J6l2LL6n9r0O2J28j8j02j9K6kJ3
-329D661M6N8P6M6l7l4L5J0l9K8O9j9m4M3M2m2k4L7k2r1k1O0j1j30p5J03J35k3j10k0N4K3
$$ plain form
-294 4581 4620 4703 4731 4727 4723 4721 4722 4698 4629 4563 4555 4623 4746 4835 4812 4745 4752 4821 4880 4898 4854 4770 4739 4770 4788 4816 4872 4834 4707 4706 4845 4897 4842 4838 4855 4795 4725
-300 4725 4679 4605 4592 4731 4854 4812 4730 4738 4777 4786 4784 4774 4754 4737 4712 4673 4649 4639 4652 4737 4846 4846 4759 4728 4749 4732 4719 4776 4822 4801 4789 4812 4777 4669
-305 4669 4606 4658 4756 4824 4874 4933 4946 4864 4759 4750 4823 4862 4836 4800 4777 4754 4756 4769 4705 4583 4591 4783 4934 4882 4763 4712 4644 4524 4513 4668 4805 4782
-309 4782 4681 4635 4690 4825 4971 5032 4966 4848 4795 4817 4826 4816 4864 4928 4877 4736 4655 4651 4668 4745 4884 4950 4904 4860 4823 4705 4582 4613 4758 4835 4794
-314 4794 4725 4696 4697 4703 4720 4759 4795 4806 4811 4827 4835 4828 4823 4821 4805 4797 4848 4942 4953 4811 4674 4733 4859 4814 4704 4789 4958 4928 4773 4747 4842 4898 4896 4878 4845 4794
-319 4794 4716 4631 4650 4782 4812 4632 4462 4500 4647 4729 4714 4664 4662 4746 4826 4796 4726 4747 4841 4902 4890 4830 4761 4697 4628 4586 4637 4741 4758 4681 4656 4713
-324 4713 4724 4666 4653 4696 4723 4758 4855 4935 4909 4828 4765 4720 4714 4755 4756 4682 4649 4697 4715 4688 4699 4715 4683 4686 4722 4663 4573 4635 4763 4745 4643 4624 4650 4648 4661
-329 4661 4707 4765 4841 4887 4850 4816 4851 4861 4822 4850 4919 4900 4856 4899 4941 4899 4875 4912 4890 4799 4778 4838 4827 4697 4622 4725 4860 4837 4727 4707 4761 4784
-334D784lMnJ7L8m1j04j1P6J2l2K3L0J0Q1J08m7j81j15K0Q8R7M7n0r0m7j9k7%N7N3k3p5m1
-339D634L1P6R7O6m4j02QJ13K5j06o5N0N9NkJ7Rk1l7k9k2mM8P1J9NN0l1j85j18P0K9q4M0J17
-344D789p7j19J34J75n7p7P3Pr1L0Q4n4n7Q7O6n4m9j9n6k8M0Mm9j4L3N3R3R0Jm7rj1o9p7k9
-349D716mnJ5N3N5qq4r3l6K5M9L4J5L0M2j2o3jQ1L7m3l6k8p7p9j1K6M4R4Q1l2r4l5J4qk0K
-354D644%j3j1lJ7M6L6J8N9P8l0j20k6Q5J1j08p5RJ7K4N2K3j4J3J5n1o9lN8Q4O7j7p1qN6K8
-360D821J5J5p0j31l9K6m0k9Q9P9k6nN9Kn4k2o%P3R8J2l2rn0r9m3K6J8J0M5P4Q2L0r3j16M6
-365D756J43kj32k3J03K2j04p8kk5n7J8R4N7J9N7J1j56j67M3J38kq6%N0J1J6M9L2Rk0r3r1
-370D590N3J45O0m3o0m7JP0K7o8KJ29L0j35o2O2m0j27L9J76N0q0k0K7l2k7N3J8j21j42PJ22
$$ plain form
-334 4784 4781 4785 4780 4797 4835 4794 4690 4679 4755 4767 4735 4758 4788 4798 4879 4987 4940 4759 4644 4664 4752 4849 4896 4846 4756 4709 4690 4663 4663 4720 4773 4750 4675 4634
-339 4634 4665 4741 4838 4904 4860 4758 4766 4879 4904 4798 4733 4783 4842 4847 4845 4862 4871 4850 4813 4784 4762 4758 4806 4877 4896 4901 4951 4920 4735 4617 4687 4716 4632 4672 4789
-344 4789 4712 4593 4727 4902 4845 4768 4841 4848 4757 4787 4871 4817 4760 4847 4913 4859 4810 4791 4735 4707 4747 4751 4702 4688 4721 4774 4867 4957 4958 4911 4902 4891 4822 4745 4716
-349 4716 4712 4707 4722 4775 4830 4822 4738 4645 4609 4634 4683 4717 4732 4762 4804 4792 4729 4728 4809 4846 4803 4767 4739 4662 4583 4572 4598 4642 4736 4817 4785 4691 4656 4670 4662 4642 4644
-354 4644 4644 4631 4620 4617 4634 4680 4716 4734 4793 4871 4841 4721 4695 4780 4791 4683 4608 4617 4634 4658 4710 4733 4719 4732 4747 4696 4627 4624 4682 4766 4833 4816 4745 4737 4793 4821
-360 4821 4836 4851 4781 4650 4611 4637 4597 4568 4657 4736 4710 4705 4764 4766 4712 4690 4684 4684 4757 4855 4867 4835 4826 4776 4677 4634 4660 4678 4688 4733 4807 4889 4919 4826 4710 4756
-365 4756 4899 4897 4765 4742 4845 4867 4763 4685 4683 4658 4601 4619 4713 4770 4789 4846 4857 4701 4534 4577 4715 4713 4627 4627 4677 4688 4704 4753 4785 4794 4774 4681 4590
-370 4590 4643 4788 4848 4805 4745 4698 4699 4769 4796 4728 4730 4859 4889 4754 4692 4754 4714 4587 4626 4802 4852 4772 4752 4779 4747 4720 4773 4791 4670 4528 4535 4657
-374D657P1pM0R6J1p6j2N0k1p2k3ROL1Jp5k6J00R0lj5j3m6j5K8j8l5J4k3p6L2J14nq0J2Pj10
-380D618q1N7J01R8P1n5j20J4R9rm4N9L6r1p2L5K3n0m7J9O1L0m5m5M0N3l3l1Q7J06l4j31n5
-385D664N7L8o5j05o8j4O9J37P1n5m1M8K4k9ol5r2K4J70P8o2kM0p1p0R4J22Ok6J0j0k4nk1
-390D851j9N3P3nn3n3q8j08OJ53J15r2j92l9J60J43j3p4j9Rk6l0M2R9J8j15p3R8Q7j10j69
-394D629l3M6L3O3Q9K8k0j4k1k6PK3L0N9J8j00j26n4k6JQ2M6r9m9J55J19r5j00N1O3K1N8l
-399D855j60j19P8R7k3j4O6M3mJ8J1n6q0m1%L1L1ql0nK5N2P6M7k4m2k0m1n9k2pl8k1M4O9O3
-404D792M8k5q7qJ09P9j8m1o8j32p7P3Q7j1mQ2N8k8l3lLK8L8j3j6P6O9p0q5N7P2p0r6K4P7
-409D887K1l5p3p5j2N6N5J7j9m5j0N2K9m5m2RRj6k2KO4P8m8j59p2N0J0o9n5j0N3J22O8n6m7
$$ plain form
-374 4657 4728 4721 4761 4857 4868 4792 4780 4830 4809 4737 4714 4723 4729 4760 4761 4686 4660 4760 4850 4847 4832 4819 4773 4758 4786 4768 4733 4747 4724 4648 4680 4794 4789 4709 4721 4728 4618
-380 4618 4537 4594 4695 4793 4864 4809 4689 4703 4802 4793 4749 4808 4844 4753 4681 4716 4739 4689 4642 4661 4722 4752 4707 4662 4702 4755 4722 4691 4778 4884 4850 4719 4664
-385 4664 4721 4759 4694 4589 4521 4507 4576 4713 4784 4729 4688 4736 4760 4731 4725 4690 4598 4622 4792 4870 4808 4806 4846 4775 4705 4799 4921 4927 4901 4911 4901 4877 4872 4851
-390 4851 4832 4885 4958 4953 4900 4847 4759 4651 4657 4810 4925 4833 4641 4602 4762 4905 4892 4818 4799 4808 4782 4752 4794 4893 4911 4796 4723 4821 4908 4798 4629
-394 4629 4596 4642 4675 4738 4827 4855 4835 4821 4800 4774 4781 4804 4834 4893 4911 4811 4685 4631 4605 4606 4688 4734 4635 4586 4741 4860 4765 4665 4716 4779 4800 4858 4855
-399 4855 4695 4576 4654 4751 4728 4714 4780 4823 4819 4837 4848 4792 4712 4671 4671 4702 4733 4725 4695 4690 4715 4767 4843 4890 4866 4824 4804 4763 4704 4682 4675 4637 4616 4660 4729 4792
-404 4792 4840 4815 4728 4720 4829 4908 4890 4849 4781 4649 4572 4645 4732 4721 4717 4799 4857 4829 4796 4793 4796 4824 4862 4849 4833 4909 4978 4908 4823 4880 4952 4882 4786 4810 4887
-409 4887 4908 4873 4800 4725 4713 4769 4824 4841 4822 4777 4767 4819 4848 4803 4761 4770 4779 4763 4741 4743 4807 4885 4837 4678 4606 4656 4666 4597 4542 4532 4585 4707 4775 4719 4672
-415D672J4jP8K25Q9k19k09J7Nj07J6J45J1j39o7O6P8J3oO7R7l6j73q8Q5R9J1j5K1M4Lp5n6
-419D665M8K9r3k0J81J37j02j57qO5J3k2NK4k2p4k1P9Q2M1O8M1q8j24m0l9p7L7J56O8p2n5
-424D725J4j1n1QQ2J4j42j66k3J04J70K04R5j24j70l1K0J5J21J23q4j47J6M3q0n4O6Q7P8M3
-428D945p7j06J7L6q0j03n0k7N7J25J1q5J5M6p6q2Jk9j4J00L4j06J4J51j2j25K1L7j11j8J69
-433D678L7j69p0J13J01K6km0l1N2N1j4L5J22J7j68j38N3R0n3j14k3K9lK9J01O0l9m7kK0N7
-438D758Q3%r3l2O5K2o2m3j0m0k1N7M0m7l5M4L6pL4Q1M2j0k3m3l9L0N9k1p7k6Qn0r5m3K4J0
-443D576lJ10K26R5j50j31Q3P7j17j25K9O7L6O9L1r9j09rJ9J0O0M8o5j01k1K2jlJ6K8N2M7
-448D767l2j01n4M4N1j7k7M2P0Nn0k6K7M5Mo1m0Q2J21k2j49q3L6L0l3k2L3L8pqO3Q3l8j35
$$ plain form
-415 4672 4686 4685 4763 4988 5077 4858 4649 4666 4671 4564 4580 4725 4736 4597 4530 4596 4674 4687 4681 4748 4845 4809 4636 4548 4633 4732 4743 4728 4749 4793 4796 4721 4665
-419 4665 4713 4742 4649 4629 4810 4947 4845 4688 4680 4745 4758 4736 4741 4765 4743 4669 4648 4727 4809 4850 4918 4959 4871 4747 4707 4668 4591 4628 4784 4852 4780 4725
-424 4725 4739 4728 4677 4685 4767 4781 4639 4473 4450 4554 4724 4928 5023 4899 4729 4698 4718 4733 4854 4977 4893 4746 4762 4805 4725 4671 4737 4824 4902 4945
-428 4945 4868 4762 4779 4815 4735 4632 4582 4555 4612 4737 4748 4663 4678 4724 4648 4566 4567 4538 4524 4624 4658 4552 4566 4717 4705 4580 4601 4638 4527 4509 4678
-433 4678 4715 4546 4476 4589 4690 4716 4714 4674 4643 4695 4746 4732 4767 4889 4906 4738 4600 4653 4743 4690 4576 4553 4582 4579 4608 4709 4769 4730 4683 4681 4701 4758
-438 4758 4841 4841 4748 4716 4781 4803 4741 4698 4688 4648 4627 4684 4724 4677 4642 4686 4722 4715 4749 4830 4872 4862 4839 4796 4757 4787 4846 4825 4748 4722 4730 4680 4585 4542 4566 4576
-443 4576 4573 4683 4909 5004 4854 4723 4806 4883 4766 4641 4670 4737 4773 4842 4873 4774 4665 4656 4675 4685 4745 4793 4728 4627 4606 4628 4627 4624 4640 4668 4720 4767
-448 4767 4735 4634 4580 4624 4675 4658 4631 4673 4743 4748 4698 4672 4699 4744 4748 4687 4647 4729 4850 4828 4679 4596 4632 4662 4629 4607 4640 4678 4671 4663 4726 4809 4771 4636
-453D636m5P6N6J5N5K6r0o7R3J02o9j38k8L5j1j0O8O9k5q7o2j0K7M2L9N0P0L3m0l5K8L4K9
-458D866R2R6k3r1m5p3j63q0J03R9m4m8M0J4n3K0J21N3p9n9O1P0m3j06n3J2%l3J8J19J28J5
-462D934o9m4rk5k6j2l7m5J6O7N4L2Ll7l4Jk1l7O1J36M7n2m0l6n5K3P6l4j00L8J25pj20o0
-467D713J4K9O1N6l6o7J7L3p2j10oR5Q5J1k5PK4m8j00k1M6j6l6P0P8o5q3O3J00Kk3%m7n8M9
-472D740R7j3j15p8QJ5j0M5J23O4o9m3Q5O4n4m3K9kn2m1m4l5K7J4q3o9N2P4Qj7k8j2Q9J24
-477D850j5j01QQ3Oo1m2MN8P8pr7o7J5L4Jk7J8J09N9j39j68M1J11m8p0R5R6p2q5O0Q9k0n8
-482D738K7Q0Jr5n0N6M6l8n0k3j0M5J10O8l6p0n7n7k6N4J04P9rj00j06l7OJ8N1M9j0mP2M9
-487D875o6r1k1L4O3N7l4j05m5K3k1m5L3P7K4j0J4M8O5J3r4r4L6N7o9p0O2L1j18p6P1M3l7
$$ plain form
-453 4636 4591 4667 4723 4738 4793 4819 4729 4662 4755 4857 4788 4650 4622 4657 4646 4636 4704 4773 4748 4661 4599 4589 4616 4658 4697 4747 4817 4850 4810 4775 4803 4837 4866
-458 4866 4958 5054 5031 4940 4895 4822 4659 4579 4682 4781 4737 4689 4729 4743 4690 4710 4831 4884 4805 4746 4807 4877 4834 4728 4675 4687 4687 4654 4672 4791 4919 4934
-462 4934 4865 4821 4812 4787 4761 4749 4712 4667 4683 4750 4804 4836 4839 4802 4768 4769 4748 4711 4772 4908 4955 4903 4863 4827 4772 4795 4871 4837 4737 4775 4900 4893 4773 4713
-467 4713 4727 4756 4817 4873 4837 4770 4787 4820 4748 4638 4632 4727 4812 4823 4798 4805 4829 4781 4681 4660 4706 4690 4654 4724 4802 4737 4654 4717 4817 4819 4796 4796 4749 4691 4740
-472 4740 4837 4824 4709 4631 4639 4654 4644 4689 4812 4876 4807 4764 4849 4913 4859 4816 4845 4843 4791 4750 4706 4671 4698 4712 4629 4560 4612 4686 4694 4677 4649 4637 4726 4850
-477 4850 4835 4734 4742 4825 4831 4770 4728 4732 4790 4868 4861 4764 4697 4712 4746 4747 4720 4738 4847 4906 4767 4599 4640 4751 4703 4633 4728 4824 4752 4667 4727 4816 4796 4738
-482 4738 4765 4845 4846 4751 4701 4757 4803 4765 4715 4692 4682 4727 4837 4905 4869 4799 4742 4685 4659 4713 4817 4896 4887 4787 4681 4644 4650 4668 4719 4768 4758 4754 4826 4875
-487 4875 4809 4718 4697 4731 4794 4851 4817 4712 4667 4690 4669 4624 4657 4734 4758 4748 4762 4810 4875 4888 4794 4700 4736 4793 4724 4654 4716 4747 4629 4553 4624 4667 4630
-492D630O6J62L3j14m3R6R1k1r1p8n6o8l8P8J22j0j24n1M9J9j0M9O6rl2M1Q3K8m9n9j5Rj6
-497D738l8k6%L2O3L9l1n3LO4O3j0j02j01KO0J3j7J8K4j2j5rk5JN8N4Krjk7n4l3Jj1o5m4J04
-503D656J95N7j15q4J2k3o2J2L8k1JO9K8l1J8O1L9L3Jr7j02L0R0N6O9N6q0j22K0P6l1n3J5
-507D811k1o1M5R1o5j57j6J25O3p4r2LO7K5k6qOk1K3J21J02k2n3J4L1l3p4l3O5J15M9m8p8
-512D874q5p0K0Q1mo0L2M5r1p9J05J16n1p0N9Q2j4q0q5m4K3L1j7kP7Q8K7j6m1o3k4N2L1j05
-517D742j64m6P8M0m9j5P0N3j6j8L0O0O1M3J2j0k9m9o1n8k5P6J37L5q4k8K5r8j38N8J51j3
-522D770r4J1K7n6mR7M6m8l2ok1J7P5K9p4q2RO4K0m8p1n1QQ8P6n4j07J1J01M8RM7L0n5r2o8
-527D620k7J6Jo2k8Q8Q1m3n1P5J25M6m0o3l5%pl6k1L5P3P7L5k7k1M8M1m7o1J6N0kn6n2kK1
$$ plain form
-492 4630 4696 4858 4891 4777 4734 4830 4921 4900 4809 4731 4675 4607 4569 4647 4769 4759 4635 4584 4633 4652 4642 4691 4757 4748 4716 4757 4840 4868 4819 4760 4745 4754 4738
-497 4738 4700 4674 4674 4706 4769 4808 4777 4724 4727 4791 4854 4844 4742 4641 4643 4703 4716 4699 4717 4741 4729 4714 4705 4680 4681 4739 4793 4795 4786 4785 4758 4704 4671 4672 4661 4596 4552 4656
-503 4656 4851 4908 4793 4709 4721 4698 4636 4648 4686 4665 4666 4735 4763 4732 4750 4811 4850 4883 4884 4787 4685 4715 4805 4861 4930 4986 4906 4784 4804 4880 4849 4796 4811
-507 4811 4790 4729 4774 4865 4800 4643 4627 4752 4815 4741 4649 4652 4719 4744 4718 4710 4716 4695 4718 4839 4941 4919 4866 4880 4911 4878 4804 4771 4836 4951 5000 4952 4874
-512 4874 4789 4719 4739 4820 4816 4756 4788 4833 4742 4663 4768 4884 4833 4763 4822 4904 4890 4810 4725 4681 4704 4735 4718 4716 4793 4881 4908 4892 4851 4788 4764 4816 4847 4742
-517 4742 4578 4532 4610 4650 4601 4586 4656 4709 4693 4675 4705 4765 4826 4869 4881 4871 4842 4793 4732 4674 4649 4725 4862 4897 4813 4785 4810 4712 4574 4632 4783 4770
-522 4770 4676 4687 4714 4658 4654 4751 4797 4749 4717 4711 4690 4707 4782 4811 4737 4655 4664 4728 4748 4700 4629 4578 4586 4674 4750 4696 4589 4600 4701 4749 4758 4805 4835 4780 4688 4620
-527 4620 4593 4609 4610 4548 4520 4608 4689 4646 4595 4670 4795 4841 4801 4738 4703 4703 4696 4660 4639 4674 4747 4824 4859 4832 4811 4859 4900 4853 4792 4808 4858 4856 4800 4748 4746 4767
-533D767k8l8N4O1r0j32M5J34J9n4k1m8o0O4J31J5p2nM7J4j9n1n8K4Q0k4j20l3N9mm2N2R3
-537D760J1oP4O6m4p1nj4o8J5J57J01r2j36n5n1m9O3J06Kk0O6K2q5j4J07M9n4l1Rmj3l5p0
-542D691pR2M3q1q4kL2K9J1k5k5J9K4ML4O0J4j1K7Jr6p0R0J14o6j41K1J03n0j26QP5QK7O5
-547D808m5j18k5Pl7N1J32pj17k5K6qO0Q2q9j52K8J36O8K0j5n7J7J01Qp6K9P8o3j56q9%O4
-552D636Q9N5L3L7k8p4LK1p2k2J26L9j56j00N0J1m8N0J11J0r2p2jlo0J0J96J77r5j88K7J31
-557D801l6j61q0O7J39O7p3n4J09J18n0r8ON7J7l3o5n3jK1M7J09R5k0p7n4n8o6n1n0KJ17J05
-562D797k4k6L3q2j75j1J49Q4jNj6l5j2n5j04pJ14R6L2k9j12o8J21J67K0l1M5L0m8n3l2rO2
-567D825P0m0q6rK6QM1M2p2j31k3Q0K3o9k8Q2Q5j0m9j0kj7J8M3pn8m6j6MKm6q7m1L2N8O9N1
$$ plain form
-533 4767 4739 4701 4755 4816 4726 4594 4639 4773 4792 4738 4717 4669 4609 4673 4804 4819 4747 4742 4789 4803 4784 4733 4675 4699 4779 4755 4635 4602 4661 4657 4615 4667 4760
-537 4760 4771 4765 4839 4905 4861 4790 4785 4771 4703 4718 4875 4976 4884 4748 4693 4642 4593 4656 4762 4764 4744 4810 4832 4747 4733 4840 4889 4835 4804 4813 4809 4796 4761 4691
-542 4691 4684 4776 4819 4738 4654 4652 4684 4713 4724 4699 4674 4693 4717 4721 4755 4815 4829 4818 4845 4846 4750 4680 4770 4884 4818 4677 4698 4801 4751 4625 4633 4708 4716 4743 4808
-547 4808 4763 4645 4620 4627 4590 4641 4773 4766 4649 4624 4650 4642 4702 4784 4695 4543 4571 4707 4775 4795 4780 4723 4740 4841 4849 4773 4802 4880 4817 4661 4572 4572 4636
-552 4636 4725 4780 4813 4850 4822 4748 4751 4772 4700 4678 4804 4843 4687 4587 4637 4648 4600 4650 4761 4771 4679 4607 4606 4603 4543 4553 4749 4926 4831 4643 4670 4801
-557 4801 4765 4604 4524 4591 4730 4797 4724 4670 4779 4897 4847 4749 4755 4812 4829 4796 4731 4678 4677 4698 4745 4854 4949 4929 4852 4798 4740 4674 4623 4573 4575 4692 4797
-562 4797 4773 4747 4780 4698 4523 4512 4661 4745 4744 4749 4733 4698 4686 4631 4527 4520 4634 4730 4762 4733 4621 4553 4674 4841 4861 4830 4875 4905 4857 4804 4772 4763 4825
-567 4825 4895 4855 4769 4760 4786 4794 4835 4877 4805 4674 4651 4731 4754 4685 4657 4739 4824 4814 4765 4755 4753 4736 4754 4797 4790 4732 4686 4670 4674 4676 4630 4543 4502 4534 4592 4661 4712
-572D712l5o9M3J22K5p5m7PL5O2J5r5q0O3J12K7k7l5n4qR6R3j9o4k5pJ5O0L0n1m8j9q1j06
-577D572RP0l7p5Q3J76N1p0l2lp3o5O5J09Mn3%J8pM0P4ml1Q4J16l4j19l9K0PKk3o6lJ00N3
-582D919o2n5J1Rqj0o3j14l9Q7Q2m4j05k2N9Pn3K2R9K1o2J3J18J02L1rk3l0n0q9n8M9Q5J2
-587D830m1k3j5j1J3Kl7LR3P1p0j32k0Q5K8o5l8K1J7K5K9o4j14J6R6nl1P7M4q0m2L8J0N7J66
-593D933O0j29j02j8q1p8O7J07L8L8K4q8j23k4M2Ol4%R2J00m1j05L0J05mm9J7j0n7J8L8n2
-597D720j1J17O0q3o4J5K3M1P3L6j4k3k7j3J2k0m8j0rl3P2J52j2j74n7R0K2p6q6j00n3R2J31
-602D743L0j3j0p0n9O8Q8k6m5L6L6m2o3kQ5J14M3l1l1m1q8l8Q5Q8l3r7m9M2J22J25J8q6o6
-607D833M%o9j12p5K4J14J32O4m1r3m7L8P0M6op1r3k2N4L7J1K7k9j53j37L8J44R8L9L2K6%
$$ plain form
-572 4712 4677 4608 4651 4773 4798 4723 4676 4683 4718 4780 4795 4700 4620 4683 4795 4822 4795 4760 4706 4698 4794 4887 4868 4804 4779 4772 4787 4847 4877 4826 4778 4759 4678 4572
-577 4572 4581 4651 4614 4539 4622 4798 4849 4779 4747 4744 4671 4606 4671 4780 4784 4731 4731 4749 4742 4782 4856 4852 4821 4905 5021 4987 4868 4829 4849 4856 4858 4835 4769 4766 4866 4919
-582 4919 4857 4802 4813 4822 4814 4804 4741 4627 4588 4675 4757 4713 4608 4586 4645 4652 4599 4621 4720 4741 4679 4692 4810 4912 4943 4934 4911 4881 4831 4742 4684 4733 4818 4830
-587 4830 4789 4766 4751 4740 4753 4755 4718 4721 4814 4885 4815 4683 4663 4748 4776 4711 4673 4694 4711 4736 4765 4701 4587 4603 4699 4694 4663 4740 4784 4704 4662 4700 4710 4767 4933
-593 4933 4993 4864 4762 4744 4663 4585 4652 4759 4797 4835 4859 4771 4648 4624 4666 4672 4638 4638 4730 4830 4789 4684 4714 4819 4815 4766 4783 4773 4716 4734 4772 4720
-597 4720 4709 4826 4886 4803 4739 4754 4777 4818 4891 4927 4913 4890 4863 4850 4862 4842 4794 4784 4775 4742 4814 4966 4954 4780 4723 4813 4835 4759 4673 4573 4520 4612 4743
-602 4743 4773 4760 4750 4680 4621 4689 4777 4751 4706 4742 4778 4736 4673 4671 4756 4870 4913 4882 4851 4810 4722 4684 4769 4857 4824 4727 4678 4720 4842 4967 4985 4899 4833
-607 4833 4837 4837 4768 4656 4581 4605 4719 4851 4915 4874 4781 4734 4772 4842 4888 4882 4811 4718 4696 4750 4787 4798 4825 4796 4643 4506 4544 4688 4786 4825 4857 4883 4883
-612D883m4q8p4NN0L5J8%k5%M2Mn1JO3K6j7Jj0m1j1K8J3Mon6l4Q6R5m5q1K3L0o8n6M7O3Jk2
-617D789j3k7m9k8K8L6k1m8j7j0rN9R1J3k0M0Nj08p1N0K8m6j2J4l0rN4L6J3N0L7l2l7l1p5
-623D650l8Q2O6p2q8J1M0lk6n5n4M2J16N2k8nJ3l3j2P1N9l9n8j4k2m0K6P8J3n6LR4O1l0j9
-628D785M6qj07l9Q0j0j52l1J75J08p3m8N5K8k5l3p8o9N3O2r5j01J12J93K9r5m7J0j7m6RQ6
-632D757N2r9j82r3N3J10N2m4n9M9J32P2j7j8L1P9R0j8j54q1J20J17p4j31oO2j3j07r7L0J29
-637D742N8p6n0P9P1o6j05lN1j4n8OP2O1M9P6N6k7r4j05m8O7J17J0j09r1oM7O6J3q3m9R4J01
-642D852l4p7lK0j4m1o2n1oJpO3J35P4m3p6k0O0R4K1p7p2j8j5lM3L9RK5J2m1k6J5l0n7L1P6
-647D797Nl8l8r2r6L8J34R5M7K1q1j33J9J78P7j19j00M4L6q1p3L2M7k4n5j6L9O4M3J2K2K1
$$ plain form
-612 4883 4839 4751 4677 4682 4732 4767 4785 4785 4760 4760 4802 4806 4755 4756 4819 4845 4828 4829 4819 4778 4767 4795 4808 4812 4806 4750 4716 4802 4897 4852 4771 4794 4824 4756 4700 4747 4810 4811 4789
-617 4789 4776 4749 4700 4672 4700 4736 4715 4667 4650 4640 4631 4690 4781 4794 4774 4814 4819 4711 4640 4690 4718 4672 4660 4674 4644 4635 4689 4725 4738 4788 4825 4793 4756 4725 4650
-623 4650 4612 4694 4760 4688 4600 4611 4651 4648 4622 4567 4513 4555 4671 4723 4695 4690 4703 4670 4658 4729 4788 4749 4691 4677 4655 4615 4641 4719 4732 4676 4679 4773 4834 4804 4785
-628 4785 4831 4823 4716 4677 4757 4747 4595 4564 4739 4847 4774 4726 4781 4809 4784 4751 4673 4604 4657 4719 4624 4523 4635 4828 4857 4762 4715 4725 4708 4662 4671 4757
-632 4757 4809 4710 4528 4435 4488 4598 4650 4606 4547 4596 4728 4800 4783 4765 4796 4875 4965 4947 4793 4712 4832 4949 4875 4744 4738 4800 4787 4680 4583 4613 4742
-637 4742 4800 4724 4674 4753 4824 4758 4653 4650 4701 4687 4629 4635 4707 4768 4817 4893 4949 4922 4828 4723 4675 4742 4859 4869 4760 4669 4663 4710 4776 4789 4706 4657 4751 4852
-642 4852 4818 4741 4738 4758 4744 4703 4641 4590 4584 4585 4578 4641 4776 4850 4807 4731 4711 4771 4865 4886 4809 4737 4719 4704 4701 4744 4783 4792 4817 4829 4788 4762 4777 4747 4690 4721 4797
-647 4797 4802 4764 4726 4634 4538 4576 4710 4805 4852 4873 4792 4659 4678 4856 4933 4814 4714 4758 4794 4713 4640 4672 4719 4695 4640 4624 4663 4727 4770 4782 4804 4825
-652D825m5r6m4L9N4J7LL9M7n0j29j0J44N0j41q2R2O8m3k7jm9k0P4L4j00r7L8J19R3N3K8l2
-657D851q9m4L9K2l1J6O1j0l3P5J03j2o4%J9n1j06p4M4J27O2l0JL5k7n2k6p1q6K8P7j1j6O2
-662D789J8l8P7J83R3o4j23q8m5p7j11NJ38M7o7M8J18o4j51J0O7m4l2O8L7l5k4pk0k7o5q4
-667D532PQ6M8J7L6Ml2J4J1r2r7N7J52O7n1n5QJ1j6L2P4j1q2KO9qn0RK3J4M7Op1JR6lj01m
-672D750Q3K0k8j5k2j7rn2k5J18J32l3j13n6l1nR0Q6m3r1k7LNK8K1k4k3K4M2Om5n5k1j2oO6
-677D721J08J4n2K0M0n1k0J18N9j37j27O4J26J8q1q6k1N2K7q1r7K3Q7Np1l6QpjM9N6J0j7j2
-682D708nJ7K8j3m8jN6L3j1kK6J4l0n9m9l4m3j6R3J61R2nl6o7q7j6P1L1p0o7J8O0K1k9l2l
-688D706K6L9J1m8l1P3P1m6j9J12L6j26l6R9j7p7J07J20j15j30O6L7j05k7P7J4J9R6j4j79
$$ plain form
-652 4825 4780 4684 4640 4679 4733 4750 4753 4792 4839 4789 4660 4650 4794 4844 4703 4621 4713 4781 4738 4711 4710 4661 4641 4715 4749 4649 4552 4590 4709 4802 4855 4883 4851
-657 4851 4762 4718 4757 4779 4748 4764 4825 4815 4782 4857 4960 4948 4884 4884 4903 4852 4746 4672 4716 4843 4905 4875 4876 4911 4884 4832 4806 4735 4649 4677 4754 4743 4727 4789
-662 4789 4807 4769 4846 5029 5122 5058 4935 4847 4802 4725 4614 4619 4757 4804 4737 4785 4903 4839 4688 4698 4765 4721 4689 4757 4794 4759 4735 4728 4708 4681 4616 4532
-667 4532 4539 4625 4673 4690 4726 4730 4698 4712 4723 4631 4534 4591 4743 4810 4759 4704 4712 4723 4707 4739 4813 4802 4720 4722 4791 4783 4733 4742 4765 4779 4826 4832 4761 4762 4858 4855 4754 4750
-672 4750 4833 4853 4825 4810 4788 4771 4762 4710 4685 4803 4935 4902 4789 4733 4702 4697 4787 4873 4830 4739 4712 4715 4720 4748 4769 4745 4722 4746 4788 4794 4749 4694 4673 4661 4655 4721
-677 4721 4829 4843 4791 4811 4851 4800 4780 4898 4957 4820 4693 4757 4883 4901 4820 4734 4713 4765 4792 4711 4614 4637 4724 4729 4658 4622 4630 4623 4622 4671 4727 4737 4720 4708
-682 4708 4703 4720 4748 4735 4687 4686 4742 4775 4764 4762 4788 4802 4772 4713 4664 4630 4587 4571 4664 4825 4917 4912 4876 4809 4722 4706 4777 4808 4738 4671 4689 4749 4770 4741 4709 4706
-688 4706 4732 4771 4782 4734 4703 4776 4847 4801 4782 4894 4930 4804 4768 4867 4850 4773 4880 5000 4885 4755 4821 4858 4753 4726 4803 4817 4836 4932 4918 4739
$$ [...]
##END=	
##END=	
