##TITLE=	1H: Tris(2-chloroethyl)amine; S.1.A.06; CAS 555-77-1

##JCAMP-DX=	6.0	$$ MestReNova 14.1.2-25024
##DATA TYPE=	LINK
##BLOCK_ID=	1
##BLOCKS=	2    
##ORIGIN=	Mestrelab Research S.L.
##OWNER=	HGL
##$MNOVA/LINK_BLOCK_TYPE=	ITEM	$$ NMR Spectrum
##$MNOVA/ITEM/POLYGON=	(XY..XY)
5835,6226
8208,6226
8208,8722
5835,8722
5835,6226
##$MNOVA/ITEM/Z=	0
##$MNOVA/ITEM/ANGLE=	0
##TITLE=	1H: Tris(2-chloroethyl)amine; S.1.A.06; CAS 555-77-1
##JCAMP-DX=	6.0	$$ MestReNova 14.1.2-25024
##BLOCK_ID=	2
##DATA TYPE=	NMR SPECTRUM
##DATA CLASS=	XYDATA
##NUMDIM=	1
##ORIGIN=	UXNMR, Bruker Analytische Messtechnik GmbH
##OWNER=	cwdrx
##.OBSERVE FREQUENCY=	400.13228420109800254
##.OBSERVE NUCLEUS=	^1H
##.SOLVENT NAME=	CDCl3
##.PULSE SEQUENCE=	zg45
##LONGDATE=	1998/01/08 00:23:04.000
##.ACQUISITIONMODE=	SIMULTANEOUS
##$ORIGINAL FORMAT=	JCAMP-DX NMR
##$MNOVA/SCALES_VERSION=	9
##$PARAMETER FILE=	(datafile, ASCII, h:/OPCW/OCAD_2025_v27/NMR%20DXFiles/05-3-0090.dx, 0)
$$ 
##$PARAMETER FILE=	(format.temp, ASCII, format.temp, 0)
$$ EDIT_PAR COMMAND FILE
$$ 
$$ DI_MODE         LONG
$$ ED_ENTRY        ACQU
$$ ORDER           FILE
$$ 
$$ 
$$ HEADER		"F2 - Acquisition Parameters"
$$ T_NAME		Date_
$$ TYPE	R64
$$ CLASS	ACQU
$$ SUBRANGE 0.0 100000000
$$ REL	"Date_=itodate(DATE)"
$$ INV_REL	"DATE=datetoi(Date_,DATE)"
$$ FORMAT	"%14.0f"
$$ TEXT	" "
$$ END
$$ T_NAME		Time
$$ TYPE	R64
$$ CLASS	ACQU
$$ SUBRANGE 0.0 100000000
$$ REL	"Time=itotime(DATE)"
$$ INV_REL	"DATE=timetoi(Time,DATE)"
$$ FORMAT	"%14.2f"
$$ TEXT	" "
$$ END
$$ NAME		INSTRUM
$$ TEXT	" "
$$ END
$$ NAME		PROBHD
$$ TEXT	" "
$$ END
$$ NAME		PULPROG
$$ TEXT	" "
$$ END
$$ NAME		TD
$$ TEXT	" "
$$ END
$$ NAME		SOLVENT
$$ TEXT	" "
$$ END
$$ NAME		NS
$$ TEXT	" "
$$ END
$$ NAME		DS
$$ TEXT	" "
$$ END
$$ T_NAME		SWH
$$ TYPE	R32
$$ CLASS	ACQU
$$ SUBRANGE 0.0 1e8
$$ REL	"SWH=SW*SFO1"
$$ INV_REL "SW=SWH/SFO1"
$$ UNIT	"Hz"
$$ FORMAT	"%14.3f Hz"
$$ TEXT	" "
$$ END
$$ T_NAME          FIDRES
$$ TYPE    R32
$$ CLASS   ACQU
$$ SUBRANGE 0.0 100000
$$ REL     "FIDRES=SW*SFO1/TD"
$$ INV_REL "TD = nextpow(SW*SFO1/FIDRES)"
$$ UNIT	"Hz"
$$ FORMAT	"%14.6f Hz"
$$ TEXT	" "
$$ END
$$ T_NAME          AQ
$$ TYPE	R32
$$ CLASS	ACQU
$$ SUBRANGE 0.0 1000
$$ REL	"AQ=aqcalc(SW,SFO1,TD,DIGTYP)"
$$ INV_REL	"TD=tdcalc(SW,SFO1,1.0e6*AQ,DIGTYP)"
$$ UNIT	"sec"
$$ FORMAT	"%14.7f sec"
$$ TEXT	" "
$$ END
$$ NAME		RG
$$ TEXT	" "
$$ END
$$ T_NAME          DW
$$ TYPE	R32
$$ CLASS	ACQU
$$ SUBRANGE 0.0 1000000
$$ REL	"DW=1/(2*SW*SFO1)"
$$ INV_REL	"SW=1000000/(2*(0.005+DW)*SFO1)"
$$ UNIT	"usec"
$$ FORMAT	"%14.3lf usec"
$$ TEXT	" "
$$ END
$$ NAME		DE
$$ FORMAT	"%14.2f usec"
$$ TEXT	" "
$$ END
$$ NAME		TE
$$ FORMAT	"%14.1f K"
$$ TEXT	" "
$$ END
$$ NAME		HL1
$$ FORMAT	"%14d dB"
$$ TEXT	" "
$$ END
$$ T_NAME		D1
$$ TYPE	R32
$$ CLASS	ACQU
$$ SUBRANGE 0.0 1000000
$$ REL	"D1=D[1]"
$$ INV_REL	"D[1]=D1"
$$ UNIT	"sec"
$$ FORMAT	"%14.8f sec"
$$ TEXT	" "
$$ END
$$ T_NAME		P1
$$ TYPE	R32
$$ CLASS	ACQU
$$ SUBRANGE 0.0 1.0e10
$$ REL	"P1=P[1]"
$$ INV_REL	"P[1]=P1"
$$ UNIT	"usec"
$$ [...]
$$ ##$ZL2= 120
$$ ##$ZL3= 120
$$ ##$ZL4= 120
$$ ##$ABSF1= 2.441487
$$ ##$ABSF2= -0.6564608
$$ ##$ABSG= 3
$$ ##$ABSL= 3
$$ ##$ALPHA= 0
$$ ##$AQORDER= 0
$$ ##$ASSFAC= 0
$$ ##$ASSFACI= 0
$$ ##$ASSFACX= 0
$$ ##$ASSWID= 0
$$ ##$AUNMP= <proc_no>
$$ ##$AXLEFT= 0
$$ ##$AXNAME= <>
$$ ##$AXNUC= <off>
$$ ##$AXRIGHT= 0
$$ ##$AXTYPE= 0
$$ ##$AXUNIT= <>
$$ ##$AZFE= 0.1
$$ ##$AZFW= 0.1
$$ ##$BCFW= 0
$$ ##$BC_mod= 2
$$ ##$BYTORDP= 0
$$ ##$COROFFS= 0
$$ ##$CY= 15
$$ ##$DATMOD= 1
$$ ##$DC= 0
$$ ##$DFILT= <>
$$ ##$DTYPP= 0
$$ ##$ERETIC= no
$$ ##$F1P= 12.0441102981567
$$ ##$F2P= -0.706944453261334
$$ ##$FCOR= 0.5
$$ ##$FTSIZE= 131072
$$ ##$FT_mod= 7
$$ ##$GAMMA= 0
$$ ##$GB= 0
$$ ##$INTBC= 1
$$ ##$INTSCL= 1
$$ ##$ISEN= 128
$$ ##$LB= 0.1
$$ ##$LEV0= 0
$$ ##$LPBIN= 0
$$ ##$MAXI= 54.82754
$$ ##$MC2= 0
$$ ##$MEAN= 0
$$ ##$ME_mod= 0
$$ ##$MI= 1
$$ ##$NCOEF= 0
$$ ##$NC_proc= -1
$$ ##$NLEV= 6
$$ ##$NOISF1= 6.5
$$ ##$NOISF2= 6
$$ ##$NSP= 0
$$ ##$NTH_PI= 1576400
$$ ##$NZP= 0
$$ ##$OFFSET= 12.04411
$$ ##$PC= 0.8
$$ ##$PHC0= 204.0706
$$ ##$PHC1= 36.82354
$$ ##$PH_mod= 1
$$ ##$PKNL= yes
$$ ##$PPARMOD= 0
$$ ##$PPDIAG= 0
$$ ##$PPIPTYP= 0
$$ ##$PPMPNUM= 100
$$ ##$PPRESOL= 1
$$ ##$PSCAL= 1
$$ ##$PSIGN= 0
$$ ##$PYNMP= <proc.py>
$$ ##$REVERSE= no
$$ ##$SF= 400.130016031686
$$ ##$SI= 131072
$$ ##$SIGF1= 1
$$ ##$SIGF2= 0.8
$$ ##$SINO= 400
$$ ##$SIOLD= 1024
$$ ##$SPECTYP= <>
$$ ##$SREGLST= <1H.CDCl3>
$$ ##$SSB= 0
$$ ##$STSI= 131072
$$ ##$STSR= 0
$$ ##$SW_p= 5102.07974210582
$$ ##$SYMM= 0
$$ ##$S_DEV= 0
$$ ##$TDeff= 65536
$$ ##$TDoff= 0
$$ ##$TI= <>
$$ ##$TILT= no
$$ ##$TM1= 0
$$ ##$TM2= 0
$$ ##$TOPLEV= 0
$$ ##$USERP1= <user>
$$ ##$USERP2= <user>
$$ ##$USERP3= <user>
$$ ##$USERP4= <user>
$$ ##$USERP5= <user>
$$ ##$WDW= 1
$$ ##$XDIM= 131072
$$ ##$YMAX_p= 439691430
$$ ##$YMIN_p= -604578
$$ ##$CURPLOT= <LaserJet 5/5M PostScript>
$$ ##$CURPRIN= <$LaserJet 5/5M PostScript>
$$ ##$DFORMAT= <normdp>
$$ ##$LAYOUT= <+/1D_H.xwp>
$$ ##$LFORMAT= <normlp>
$$ ##$PFORMAT= <normpl>
$$ $$ End of Bruker specific parameters
$$ $$ ---------------------------------
$$ ##NTUPLES= NMR SPECTRUM
$$ ##VAR_NAME=  FREQUENCY,     SPECTRUM/REAL,   SPECTRUM/IMAG
$$ ##SYMBOL=    X,             R,               I
$$ ##VAR_TYPE=  INDEPENDENT,   DEPENDENT,       DEPENDENT
$$ ##VAR_FORM=  AFFN,          ASDF,            ASDF
$$ ##VAR_DIM=   131072,        131072,          131072
$$ ##UNITS=     HZ,            ARBITRARY UNITS, ARBITRARY UNITS
$$ ##FACTOR=    0.0389257792824236, 1,          1
$$ ##FIRST=     5102.04081632654, -34651,       -28178
$$ ##LAST=      0,             -594657,         -1351665
$$ ##MIN=       0,             -604578,         0
$$ ##MAX=       5102.04081632654, 439691430,    0
$$ $$ Real data points
$$ ##PAGE= N=1
$$ 
##XUNITS=	HZ
##YUNITS=	ARBITRARY UNITS
##FIRSTX=	4819.2092830439478348
##LASTX=	-282.83153328258958936
##DELTAX=	-0.038925779282423550454
##XFACTOR=	1
##YFACTOR=	80.695593942454877379
##FIRSTY=	-38344.1875
##MINY=	-605739.3125
##MAXY=	439691584
##NPOINTS=	131072
##XYDATA=	(X++(Y..Y))
$$ [...]
2081 123 122 120 119 118 121 123 126 129 88 48 -26 -39 14 68 161 191 148 104 57 9 23 36 50 63 19 -24 -67 -111 -107 -102 -93 -85 -79 -10 57 63 44 25 2 -20 14 50
2080 50 17 -78 -148 -218 -230 -242 -192 -143 -120 -161 -176 -191 -148 -105 -85 -65 -46 -26 -4 17 38 60 49 38 28 17 50 84 53 -40 -85 -67 -25 15 17 19
2078 19 21 23 7 -8 -24 -40 -61 -81 -39 2 5 8 7 6 36 3 -56 -116 -141 -166 -226 -224 -152 -81 -10 61 58 -7 -95 -184 -138 -29 20 8 -29 -5 41 89 98
2077 98 106 115 124 114 105 37 -30 -14 64 108 152 138 125 11 -101 -164 -165 -138 -111 -96 -80 -65 -50 -45 -39 -34 -28 -59 -90 -117 -145 -122 -36 48 71 18 -35 -24 49
2075 49 72 96 61 26 0 -24 -50 -76 -94 -113 -68 -24 10 45 76 107 55 -58 -173 -225 -197 -168 -136 -103 -78 -53 -28 -3 6 15 24 34 24 15 6 -3 13
2074 13 29 46 63 67 72 77 82 84 87 148 208 270 270 242 214 164 114 67 21 -19 2 -11 -24 -95 -166 -172 -115 -30 -7 -50 -92 -38 15 11 6 -2 51 105 97 87 77
2072 77 64 50 36 22 8 -5 6 18 30 42 45 47 50 53 106 159 189 157 91 87 107 127 112 97 85 74 93 174 255 274 215 157 99 41 8 37 93 150
2071 150 176 203 129 55 28 62 61 61 60 60 98 74 25 38 117 195 192 188 164 77 4 35 146 256 300 282 299 316 258 200 200 201 179 95 -11 -119 -119
2069 -119 -57 5 5 -6 -18 28 74 27 -20 -5 9 -18 -46 -47 13 21 28 -64 -157 -141 -125 -109 -93 -72 -52 -32 -12 -28 -45 -61 -77 -49 -20 8 37 17 -1
2068 -1 41 146 230 209 104 0 45 91 136 181 166 150 134 119 68 17 28 40 25 11 -7 -26 -8 -52 -124 -92 3 37 -32 -102 -98 -94 -90 -86 -55 -24
2067 -24 -56 -88 -31 25 82 138 65 -8 21 51 108 164 116 68 51 33 16 -1 3 7 -50 -108 -73 -39 -109 -178 -161 -144 -126 -109 -49 10 8 5 -18 -43 -68
2065 -68 -92 -76 -61 -45 -29 18 67 115 163 140 117 31 -54 -68 -82 -96 -110 -102 -95 -87 -80 -92 -103 -53 -2 -56 -109 -159 -209 -162 -53 20 -9 -43 -15 -24 -33 -45
2064 -45 4 82 160 152 145 137 129 126 122 118 114 94 74 54 34 2 -28 -60 -92 -88 -84 -22 39 113 124 71 17 56 157 254 289 276 200 93 -13 -28 -44 -55 -66
2062 -66 -18 92 140 126 70 14 -39 -93 -103 -10 59 66 17 -31 -80 -129 -122 -53 15 22 -35 -93 -86 -17 40 98 97 96 86 77 67 58 35 12 52 92 91 90 89 88 91
2061 91 94 96 99 64 30 -4 -39 -17 5 27 49 34 19 4 -10 -19 -27 -32 -37 -83 -67 13 94 178 199 152 104 99 93 87 82 76 71 65 59 5 -48 -1 44 85 63 -19 -101
2059 -101 -174 -121 -34 51 119 188 152 116 64 13 65 117 85 53 21 -11 -62 -114 -61 -8 -18 -28 -38 -48 -21 4 -31 -66 -102 -138 -112 -85 -109 -133 -157
2058 -157 -180 -108 -36 -26 -16 -13 -11 -8 -6 -19 -32 -45 -58 -63 -67 -9 48 61 75 69 1 -65 -8 79 167 118 69 83 97 31 -33 -98 -164 -161 -159 -94 -30 -1 26
2056 26 54 83 75 66 58 50 93 137 117 98 32 -33 -37 -40 -11 18 47 77 147 217 182 148 93 37 45 52 73 95 116 138 78 18 61 166 274 257 169 80
2055 80 17 -44 -45 -45 -32 -19 -7 5 41 76 112 147 146 145 144 144 120 96 72 48 61 73 125 114 56 61 89 117 105 93 81 69 -19 -109 -94 -79 -93 -107 -97
2053 -97 -25 38 40 -19 -78 -117 -93 -46 1 23 -16 -84 -151 -95 -39 16 72 61 50 39 28 78 128 112 35 -63 -99 -70 -41 -41 -41 21 83 66 50 33 16
2052 16 70 123 150 113 41 -30 0 92 99 43 -7 3 7 11 -43 -97 -32 32 70 45 -43 -132 -156 -118 -85 -51 -14 22 -27 -77 -103 -67 -66 -128 -150 -173 -194
2050 -194 -215 -271 -265 -184 -104 -82 -60 1 63 62 62 73 84 95 106 103 100 39 -22 -40 3 70 137 156 112 104 95 83 71 58 46 95 144 165 124 100 76 48
2049 48 20 9 -1 49 100 111 121 70 18 -32 -84 -70 5 116 165 107 49 25 2 -17 -36 -15 67 115 163 191 220 221 159 111 63 17 -28 -71 -10
2047 -10 30 9 -37 -22 58 138 110 81 53 24 -26 -78 -65 10 124 175 120 3 -47 5 34 1 -85 -109 14 138 145 152 217 283 318 291 198 106
2046 106 28 12 24 36 38 40 43 45 58 70 83 96 26 -43 -47 10 74 76 54 33 118 203 219 173 111 49 87 125 146 167 188 209 207 204 179 90 6 -15 27
2044 27 70 90 109 105 39 -23 -23 0 21 13 5 -3 -11 -44 -77 -48 -18 -65 -112 -76 -9 6 -40 -86 -71 -68 -96 -121 -114 -95 -76 -55 -34 14 63 126 157 106 -7
2043 -7 -86 -61 7 45 40 36 25 -46 -119 -129 -73 -17 -17 -18 32 114 153 130 88 77 64 20 -6 -2 -17 -33 -31 -29 -27 -25 -16 -7 1 10 19 28 36 45 52 59 67 74 69 64 1 -61 -83
2041 -83 -42 0 -20 -36 -21 -9 -29 -82 -136 -129 -121 -103 -84 -65 -46 -41 -35 -29 -24 -38 -52 -3 44 42 40 38 36 38 40 42 44 41 38 35 33 80 128 114 99 101 102 106 109 65 52 61 7
2039 7 -51 -48 -1 12 -19 -19 22 64 41 17 56 95 138 181 163 146 134 154 192 166 117 68 78 87 69 51 92 132 134 73 11 10 0 -41 -62 -82 -70 -58
2038 -58 -68 -46 0 -15 -54 -93 -76 -27 38 42 40 38 32 26 11 -3 -18 -33 -99 -165 -164 -101 -50 -31 -12 37 105 111 54 -3 -43 -21 27 77 83 89 33 -22 -39 -56
2036 -56 -71 -86 -98 -79 -40 -64 -82 -69 -60 -81 -97 -113 -72 -32 -13 -57 -101 -82 -61 -40 -15 8 18 27 36 45 44 43 41 40 42 45 47 50 35 20 68 116 142 168 112
2035 112 24 -32 -27 1 29 20 -20 -79 -75 -6 62 70 15 -47 -49 -27 -4 -52 -99 -84 -69 -69 -70 -70 -71 -66 -62 -57 -52 32 118 140 163 39 -84 -121 -54 40 134 166
2033 166 198 209 115 -16 -86 -22 40 46 51 44 37 30 23 70 116 100 84 95 106 54 3 37 72 43 -46 -93 -36 -2 -31 -69 -44 3 51 49 47 46 44 -34 -112
2032 -112 -87 -61 -94 -127 -97 -67 -41 -14 12 39 55 71 87 103 107 112 116 120 63 7 12 18 7 -3 47 98 126 154 119 84 91 98 43 -12 -62 -112 -99 -87 -6
2030 -6 74 10 -53 -68 -83 -98 -113 -122 -130 -139 -147 -101 -56 -10 35 -34 -104 -70 -35 -24 -12 0 10 -55 -121 -107 10 129 145 79 14 3 -7 -18 -28 -30 -32 -96
2029 -96 -160 -140 -119 -37 45 -10 -67 -82 6 99 129 62 -4 0 109 195 219 166 113 56 -1 4 9 14 19 -47 -113 -117 -121 -101 -82 -62 -42 -19 4 28 51 11
2027 11 -27 -67 -107 -100 -93 -86 -79 -61 -43 -26 -8 0 8 80 151 107 64 20 -22 5 33 61 89 84 79 74 69 74 78 20 -38 -22 -6 9 25 -1 -28 6 42 73 103
2026 103 72 40 76 112 86 60 70 81 29 -85 -180 -170 -120 -69 -73 -76 -80 -84 -81 -79 -76 -73 -71 -68 -66 -63 -55 -47 -98 -149 -91 28 109 86 26 -32 -98 -164 -118 -73 -27
2024 -27 18 21 24 -34 -94 -89 -84 -79 -74 -22 29 81 132 125 118 48 -84 -172 -156 -98 -41 -38 -35 -32 -29 -56 -83 -110 -137 -118 -100 -81 -62 -21 18 59 100 101 101 81 -1 -63
2022 -63 -21 93 146 86 -35 -122 -105 -4 95 98 100 104 108 53 -1 -27 9 12 -87 -178 -164 -77 -52 -67 -82 -39 3 12 21 31 40 -102 -245 -243 -240 -208 -177 -83
2021 -83 11 98 186 211 236 169 102 35 -31 10 52 32 12 -23 -58 -93 -128 -103 -79 -54 -29 25 80 73 66 61 56 52 47 23 0 37 75 56 37 18 0 -31
2019 -31 -62 -30 0 3 6 9 12 -90 -193 -227 -198 -124 -50 -41 -94 -172 -250 -231 -213 -237 -324 -407 -428 -384 -277 -103 132 261 202 48 0 31 63 1
2018 1 -60 -11 99 171 140 119 98 70 42 -26 -95 -137 -116 -42 32 10 -11 -5 62 130 136 60 -14 -31 -48 -84 -121 -153 -186 -146 -43 58 98 74 51
2017 51 85 120 109 97 86 74 40 5 32 122 227 228 146 64 37 11 -14 -41 -62 -82 -99 -116 -69 40 149 196 153 110 122 134 144 93 17 -57
2015 -57 -31 56 144 170 143 115 84 53 35 18 1 -16 -33 -51 -68 -85 -41 3 43 84 71 -3 -82 -99 -113 -190 -286 -383 -353 -261 -203 -146 -142 -138 -134 -131 -80
2014 -80 -29 21 71 53 34 16 -2 -20 -39 -93 -84 -13 56 68 80 105 130 96 62 50 100 151 138 114 91 63 35 34 33 32 31 34 37 40 43 -4 -53 -38 -24 12
2012 12 48 84 121 114 108 101 94 79 63 47 32 -17 -67 -17 33 60 24 24 23 7 -7 -58 -47 2 53 7 -38 -51 -2 10 24 109 195 253 248 228 208 160 50
2011 50 -41 -70 -76 -82 -46 -10 2 -47 -93 -76 -37 2 21 41 60 79 76 73 70 67 32 -2 -36 -71 -58 -46 -34 -22 -12 -3 5 14 4 -5 -15 -26 42 110 155 138
2009 138 122 168 210 190 92 -6 -39 -10 -7 -4 2 8 -19 -48 -72 -97 -79 1 46 92 64 35 7 -20 -13 -7 -62 -118 -82 -46 -10 24 84 143 175 144 140 135 104
2008 104 9 -53 -53 -89 -124 -101 -15 70 94 72 50 24 -1 -26 -51 -13 24 42 60 78 96 87 77 67 57 36 14 -2 -20 -39 3 74 144 147 150 149 148 162
2006 162 114 61 72 129 123 94 65 43 21 3 -14 -70 -64 -30 3 -4 -11 -18 -26 -30 -33 -37 -40 -31 -23 -14 -5 18 42 67 91 92 92 89 86 127 105 56 8 0 -7 -14 -22 -1 19 40
2004 40 61 77 92 49 6 -36 -17 6 -32 -85 -76 -43 -10 -60 -109 -131 -90 -40 9 1 -7 7 22 37 52 61 70 80 89 65 42 19 -3 -35 -67 -40 -13 23
2003 23 -1 -27 10 90 170 113 56 15 37 63 26 9 54 99 82 38 57 76 33 -8 13 34 -6 -125 -182 -132 -82 -55 -27 0 27 23 19 15 12 -11 -35
2002 -35 41 118 132 83 8 -67 -86 -105 -61 -18 18 55 92 129 141 154 139 62 -12 -87 -61 -36 -73 -111 -86 0 55 6 -77 -99 -13 72 93 52 54 55
2000 55 53 51 11 -28 -68 -108 -101 -95 -88 -81 -41 -1 38 77 81 84 87 91 86 82 77 73 42 12 -18 -48 -26 -4 18 40 11 -16 17 51 39 26 14 2 3 3 0 -2 38 16
1998 16 -70 -157 -192 -164 -109 -54 -56 -58 -60 -62 -60 -58 -56 -54 -64 -73 -83 -92 -90 -88 -23 40 62 83 100 117 85 -9 -104 -136 -77 -18 -18 -18 13 44 75 107 122 137 90 43
1997 43 -4 -51 -36 -21 -48 -75 -103 -130 -75 -21 -25 -29 8 109 174 135 58 42 83 61 -45 -153 -154 -92 -87 -81 -72 -62 -31 0 31 62 32 2 37 135 199
1995 199 200 139 79 32 48 67 24 -66 -94 -57 -21 -38 -56 -74 -92 -52 -11 28 68 72 76 79 83 99 115 131 147 158 170 182 194 192 189 124 59 30 0 -29
1994 -29 -59 -65 -70 -76 -82 -62 -41 -21 -1 -7 -14 -20 -26 -45 -63 -83 -103 -106 -140 -134 -65 33 69 -1 -72 -50 -27 -5 16 -6 -29 -53 -76 -41 -7 27 62 60 58 56 54 78
1992 78 102 125 149 136 123 110 97 72 47 22 -2 -2 -1 0 0 -40 -81 -122 -163 -136 -110 -83 -56 -38 -20 -1 16 60 104 149 193 137 82 26 -28 0 29
1991 29 58 87 83 79 17 -45 -36 35 71 108 150 191 151 79 46 75 85 64 29 -4 -41 -77 -126 -174 -118 -62 -50 -37 -25 -12 32 77 122 167 157 147 137
1989 137 126 170 213 229 182 117 52 84 115 128 79 7 -65 -90 -52 -15 -39 -118 -196 -174 -152 -125 -99 -96 -155 -232 -246 -198 -151 -133 -176 -220 -202 -140 -79
1988 -79 -76 -73 -10 52 49 -14 -60 -43 -2 38 7 -23 -53 -84 -68 -52 -32 -12 -53 -31 58 148 148 147 146 145 164 183 202 221 182 144 105 67 62 58 53 49 12 -24 42
1986 42 109 104 98 93 88 14 -59 -71 -82 -99 -115 -69 39 90 37 -52 -143 -149 -92 -12 67 101 73 41 72 105 76 85 95 81 67 54 40 52 64 14 -35 -72
1985 -72 -109 -46 16 55 32 -14 42 158 274 286 235 196 156 113 69 74 79 84 88 71 55 38 21 41 60 80 100 104 109 114 119 97 76 55 33 11 -10 -67
1983 -67 -61 -40 -19 0 21 67 50 -30 -112 -90 -5 78 101 51 1 -86 -113 -98 -84 -101 -56 6 70 33 -2 -17 -31 -46 -60 -83 -105 -128 -150 -84 -18 47
1982 47 113 87 60 33 7 -41 -90 -111 -70 -6 56 23 -8 -17 35 88 79 52 25 -5 -36 -10 15 41 67 33 0 -34 -68 -66 -63 -61 -59 -57 -56 -59 -61 -34 -69 -108
1980 -108 -84 -8 6 -79 -165 -209 -149 -50 -13 -47 -80 -94 -45 14 12 -51 -114 -120 -63 -41 -19 -26 -33 -39 -46 -52 -59 -61 -63 -54 17 54 91 64 36 9 -17 -8 0 44 26
1979 26 -16 -60 -45 -30 -28 -26 -24 -22 42 107 144 119 97 75 48 22 -4 -31 -57 -84 -36 12 -1 -15 57 129 137 82 -3 -26 -27 -27 -7 12 -29 -72 -112 -152 -188
1977 -188 -224 -195 -104 -13 15 57 98 136 174 138 102 70 37 9 43 105 166 165 163 99 35 14 -6 -23 -40 -65 -27 73 111 92 73 108 144 136 66 31
1976 31 -3 -2 -2 -60 -119 -120 -59 -33 -7 6 20 -27 -75 -88 -100 -112 -124 -80 -35 -13 -54 -125 -133 -117 -102 -122 -141 -161 -181 -144 -106 -33 -23 -91 -159 -227 -191
1975 -191 -74 41 95 87 67 47 23 -1 -24 -47 -70 -94 -95 -96 -97 -98 -78 -58 -100 -142 -92 -42 -15 -51 -48 16 77 75 41 7 -26 -60 -51 19 90 98 68 37
1973 37 7 -23 -62 -38 -15 -54 -113 -172 -130 -88 -86 -83 -81 -78 -89 -99 -48 3 -5 -15 -24 -34 -2 29 41 -9 -84 -54 17 88 50 12 -60 -70 -20 30 119 146
1972 146 92 38 -18 -76 -99 -122 -118 -51 35 123 145 105 85 65 45 25 0 37 75 50 -1 -53 -46 -39 -21 -2 15 34 39 45 51 56 85 114 81 48 -39 -127
1970 -127 -153 -178 -175 -172 -69 33 93 91 62 32 -26 -86 -145 -205 -188 -171 -154 -137 -125 -114 -137 -98 26 150 196 137 16 -42 -38 -34 21 77 168 197 162
1969 162 127 92 57 17 40 90 139 111 83 55 27 26 26 25 25 19 13 -27 -5 52 109 29 -50 -74 -36 -54 -134 -169 -100 -31 37 62 87 88 27 -4 26 79
1967 79 133 105 77 49 21 8 -3 -16 -28 -18 -9 62 134 135 135 136 136 110 85 59 33 -30 -94 -54 -14 -10 -6 55 117 152 125 132 140 129 117 105 93 110 127 82
1966 82 36 48 60 71 83 126 168 184 137 92 48 0 -48 -86 -125 -163 -201 -151 -101 -51 -1 -20 -38 -57 -76 -55 -35 -73 -111 -143 -112 -53 4 50 95
1964 95 140 186 232 278 297 254 192 130 64 0 8 17 26 35 -5 -47 -89 -130 -73 -16 17 -11 -17 37 93 87 37 49 122 196 182 106 65 24 27 29 32 35 59 84
1963 84 9 -66 -80 -32 -20 -7 37 83 128 69 -32 -71 -48 -25 -41 -56 -72 -88 -111 -133 -132 -68 -9 -12 -38 -64 -35 -6 -4 -64 -132 -200 -169 -137 -140 -144 -182
1961 -182 -158 -133 -108 -79 -50 -13 23 -5 -95 -143 -128 -90 -51 -24 2 -32 -130 -163 -91 -43 -58 -94 -67 -18 31 34 37 40 43 40 37 74 47 -10 -7 61 130 120
1960 120 110 100 90 30 -30 -90 -151 -140 -129 -118 -107 -70 -33 3 40 66 92 117 143 110 78 49 20 -53 -65 28 123 122 58 56 117 158 199 140 81 48
1958 48 16 -16 -49 -52 -55 -58 -61 -45 -28 -12 4 -23 -51 -17 17 62 107 83 -2 -99 -196 -193 -189 -131 -74 -39 -67 -91 -53 -15 -39 -118 -134 -9 116 128 37
1957 37 5 76 175 211 185 159 137 115 31 -52 -114 -176 -234 -292 -328 -301 -167 -34 43 58 8 -41 -97 -91 -20 50 91 70 84 98 102 106 47 -11 -116
1956 -116 -221 -264 -308 -267 -226 -185 -144 -115 -86 -57 -28 -56 -84 -111 -139 -131 -122 -113 -105 -95 -86 -76 -67 -61 -56 -54 -52 -3 -15 -51 -87 -45 58 47 -67 -171 -169 -129
1954 -129 -89 -92 -95 -36 23 55 88 57 27 36 45 54 63 77 92 142 130 60 -9 -20 -31 -23 -16 -8 0 14 30 45 61 36 12 49 87 70 54 37 20 87 153 216
1953 216 175 76 -21 -22 -23 -70 -117 -64 -11 12 -25 -63 -38 -39 -40 -37 -34 -15 2 21 39 12 -15 -42 -70 -119 -169 -118 -68 -34 -62 -56 -49 -75 -101 -103 -43 20 21 0
1951 0 -21 -34 -46 -59 -72 -70 -68 -105 -79 -45 -73 -124 -175 -152 -128 -104 -80 -34 11 57 103 88 73 57 42 60 77 -5 -88 -77 -4 68 79 75 72 68 64 59 115
1950 115 172 167 115 64 13 -37 -66 -33 27 87 39 -9 -30 10 30 50 74 99 86 74 58 42 57 10 -63 -137 -108 -80 -51 -22 -37 -51 -3 44 70
1948 70 96 60 23 -19 -63 -44 -25 -16 -7 59 126 161 134 80 25 -2 -31 2 36 28 20 12 5 16 28 39 51 60 69 78 87 80 74 67 60 79 98 113 129 115 39 -36
1947 -36 -49 -68 -86 -101 -115 -97 -79 -61 -43 -13 16 -15 -47 -48 -49 -50 -52 -24 2 7 -51 -129 -144 -94 -45 -39 -33 30 95 102 47 -8 -1 16 33 15 59 179 237
1945 237 188 139 191 243 230 154 124 157 150 144 138 132 68 3 -24 10 44 16 -29 -75 -62 -49 26 103 117 131 44 -42 -24 -7 46 100 91 82 19 -42 -1 40
1944 40 86 133 117 101 100 98 34 -30 -28 -26 -86 -146 -79 -11 55 122 151 179 103 -34 -131 -123 -74 -26 8 43 77 112 80 47 15 -16 23 62 39 16 -47
1942 -47 -111 -171 -231 -138 17 92 64 15 -32 -84 -135 -104 -11 49 6 -75 -53 7 68 80 92 103 115 56 -2 42 87 95 104 113 121 103 86 5 -74 -62 -50
1941 -50 -37 -25 -10 5 20 36 -49 -135 -75 -15 6 29 -10 -50 -65 -80 -32 14 23 32 41 50 26 3 -20 -43 -17 9 36 63 88 114 77 40 60 80 100
1939 100 119 135 151 167 183 136 90 43 -3 17 38 58 79 38 -1 -42 -82 -62 -41 -83 -125 -100 -75 -49 -24 2 28 -6 -42 -5 30 46 0 -77 -51
1938 -51 9 8 10 11 9 7 -6 -21 -35 -49 -47 -46 -45 -44 -39 -34 -28 -23 -22 -20 43 107 58 8 -40 -89 -97 -106 -114 -123 -80 -38 3 46 86 127 102 15 -60 -72 -24 23 85 85 58
1936 58 30 44 58 49 -21 -93 -102 -8 85 99 51 -19 -90 -116 -79 -43 -69 -94 -120 -88 -55 -57 -58 -60 -62 -53 -44 -36 -27 -97 -168 -192 -113 -14 84 120 94 73 51 88
1935 88 125 125 124 123 123 92 62 94 126 97 69 40 11 51 91 131 172 176 179 79 -20 -33 -46 2 51 16 -18 -53 -89 -117 -145 -115 -85 -72 -121 -138 -51 29
1933 29 5 -51 -45 16 78 40 2 5 9 12 15 -14 -44 -75 -105 -153 -200 -167 -29 154 234 151 67 39 12 -15 -42 31 105 75 45 22 0 -21 -43 30 104
1932 104 116 127 121 115 109 104 33 -37 -46 -54 -29 -4 20 45 94 142 128 114 91 68 45 22 56 91 62 34 46 57 69 81 56 31 6 -18 -57 -97 -74 -51
1930 -51 -31 -10 9 29 58 87 54 21 -42 -105 -64 -23 36 95 51 7 2 -2 -7 -12 -5 1 8 15 42 68 95 121 166 211 191 108 6 -33 -8 17 41 65 66
1929 66 4 -110 -162 -150 -137 -98 -59 -20 19 28 37 46 56 86 117 147 177 169 160 116 135 177 218 159 101 35 -29 -32 -34 5 46 24 2 -6 -15 -24 -33 -71 -109 -148
1927 -148 -186 -188 -189 -191 -193 -157 -120 -84 -48 -58 -69 -79 -90 -11 68 147 226 196 166 136 106 84 62 40 19 23 27 31 35 28 21 14 7 26 45 63 82 71 60 48 37
1925 37 17 -1 -20 -39 -56 -72 -89 -105 -64 -24 12 49 25 -61 -113 -164 -159 -153 -187 -158 -113 -131 -111 -90 -14 60 32 3 -56 -116 -172 -228 -220 -150 -80 -72 -72 -72
1924 -72 -76 -79 -9 61 27 -6 -3 -1 1 3 13 24 13 -59 -149 -136 -43 49 100 89 55 20 4 51 157 200 158 54 -76 -104 -38 27 30 -28 -41 -53 -69
1923 -69 -85 -90 -95 -100 -105 -74 -43 -11 19 17 14 -22 2 1 0 2 109 219 267 210 154 116 78 63 111 175 177 114 51 80 108 38 -30 -63 7 55 40 -44 -129
1921 -129 -114 -99 -61 -23 10 44 42 -22 -52 -82 -117 -152 -187 -222 -175 -128 -81 -34 29 94 58 22 32 105 177 187 135 84 29 -25 -55 -84 -109 -135 -108
1920 -108 -19 34 88 89 90 90 91 94 97 101 104 119 134 149 164 170 176 119 62 -32 -128 -154 -119 -51 16 25 35 45 56 43 -31 -107 -121 -73 -25 -65 -167 -265 -300 -228
1918 -228 -93 3 100 140 75 7 -60 -19 21 0 -20 -30 -39 -49 -59 -33 -7 -40 -73 -90 -45 -35 -24 7 39 71 104 120 137 154 170 128 86 44 2
1917 2 -13 -29 -45 -61 -63 -65 -66 -68 -40 -12 16 44 49 54 117 181 176 110 78 47 69 91 113 135 189 244 271 236 145 54 65 140 202 202 237 272 274 213 125 38
1915 38 -13 -65 -89 -51 -14 22 63 104 137 170 141 112 95 78 61 44 59 75 90 106 77 49 20 -7 -55 -103 -124 -82 4 91 119 148 148 147 147 147 122
1914 122 96 36 38 40 42 -14 -71 -85 -99 -109 -119 -132 -82 -67 -53 -66 -79 -89 -99 -113 -66 46 159 148 75 37 -1 0 0 1 2 -6 -14 -27 -40 -60 -143 -225
1912 -225 -246 -209 -172 -135 -98 -31 -27 -91 -156 -202 -249 -295 -237 -99 -23 -51 -79 -50 -20 -50 -79 -63 15 58 -1 -32 -1 23 -14 -35 -57 -21 15 39 62
1911 62 86 109 88 66 5 6 50 31 -48 -128 -146 -101 -56 -74 -71 -68 -69 -70 -49 -28 -30 -95 -144 -131 -52 25 41 57 69 81 96 49 -21 -92 -124 -94 -36 21
1909 21 49 76 69 124 214 304 273 138 17 -39 -72 -105 -121 -75 -1 72 59 45 32 19 57 94 70 45 72 99 99 37 14 -7 -33 -59 -51 -43 -34 -26 -40
1908 -40 -54 -68 -82 -148 -213 -216 -220 -155 -91 -50 -71 -125 -116 -83 -51 -51 -51 -16 -43 -104 -165 -126 -87 -38 9 57 106 69 32 -4 -41 -94 -146 -176 -142 -137 -194 -213
1907 -213 -231 -171 -111 -55 0 -8 -80 -116 -152 -149 -145 -176 -145 -79 -13 -48 -82 -99 -115 -127 -140 -100 2 42 19 -31 -82 -74 -67 -50 -33 -21 -8 -3 -61 -118 -113 -58
1905 -58 -3 -6 -10 -25 -40 -55 -70 -69 -69 -68 -67 -47 -26 -68 -110 -92 -74 -57 -39 -28 -18 -8 1 33 64 73 18 0 43 47 51 60 68 76 85 32 -20 -69 -118 -173 -167 -91 -15
1903 -15 17 49 78 107 139 108 15 -14 21 57 31 -56 -102 -86 -109 -132 -158 -184 -209 -235 -192 -148 -105 -61 -106 -151 -169 -124 -80 -37 6 50 49 -13 -75 -76
1902 -76 20 116 107 34 22 9 -6 -23 1 25 85 82 49 16 42 68 67 67 8 -50 -104 -96 -64 -32 -54 -139 -188 -237 -202 -167 -132 -97 -82 -68 -116 -164 -155 -146 -137
1900 -137 -127 -93 -58 -82 -106 -108 -47 12 10 -35 -80 -126 -172 -150 -66 -17 32 85 138 126 52 -45 -81 -93 -105 -88 -71 -54 -37 -16 5 7 -54 -138 -118 -56
1899 -56 5 -36 -77 -18 40 98 93 61 28 18 8 95 182 213 140 64 -12 -48 -83 -118 -153 -166 -180 -92 -5 48 40 -36 -112 -107 -101 -96 -91 -17 55 24 -6 -27
1898 -27 -48 -66 -83 -74 -3 33 69 67 66 64 63 10 -41 -31 -21 -25 -29 -68 -44 4 54 44 35 74 113 90 66 62 58 54 51 29 8 48 89 65 41 17 -6 10 27
1896 27 -14 -56 -117 -116 -87 -58 -80 -102 -124 -146 -137 -129 -121 -113 -82 -51 -20 10 29 48 5 -38 -82 -126 -166 -206 -221 -174 -124 -135 -139 -81 -26 -34 -54 -74 -35 3 -7
1894 -7 -19 -30 -42 -85 -127 -108 -88 -99 -110 -118 -125 -158 -129 -35 58 77 33 -51 -105 -85 -3 22 -14 -38 0 17 5 -29 -32 -35 -69 -142 -183 -160 -105 -52 -30 -10
1893 -10 40 93 83 30 8 26 43 61 79 84 58 12 28 127 194 134 12 -72 -95 -135 -207 -227 -186 -160 -165 -153 -78 -25 -2 -38 -105 -170 -204 -222 -178 -130
1892 -130 -144 -161 -146 -90 -34 27 88 87 86 35 -14 -61 -108 -129 -89 -46 -66 -99 -101 -62 -23 -46 -69 -89 -110 -146 -150 -107 -2 94 128 139 149 168 187 240
1890 240 232 203 173 140 107 90 73 55 38 2 -33 -68 -104 -132 -159 -125 -90 -87 -83 -142 -201 -245 -288 -269 -250 -198 -145 -156 -166 -159 -152 -142 -131 -127 -60 33 127 167
1889 167 208 186 165 138 111 85 58 43 28 13 -1 -1 -1 -1 -1 -1 -1 -1 -1 4 10 17 23 26 28 30 33 45 56 8 -40 -24 22 27 -28 -39 13 86 56 -53 -131 -129 -127 -139
1887 -139 -151 -60 31 31 31 72 144 171 137 39 -58 -128 -136 -57 52 114 72 26 -19 -46 -105 -181 -195 -121 -48 -33 -18 20 58 34 10 22 33 44 55 37
1886 37 18 0 -18 -47 -75 -104 -133 -98 -62 -27 7 28 48 7 -34 -75 -117 -96 -75 -46 -17 46 48 -13 -75 -78 -82 -50 -17 14 46 57 69 80 92 152 212
1884 212 127 42 43 43 44 45 36 26 80 133 101 68 36 3 63 122 119 116 50 -16 -20 -25 48 122 91 61 15 -30 -76 -122 -100 -77 -54 -32 -9 12 35 58 59 61
1883 61 63 65 95 125 93 61 -1 -64 18 100 88 76 63 51 -17 -87 -52 -18 63 144 226 307 295 282 208 133 172 210 186 162 174 187 145 102 54 130
1881 130 206 157 74 -8 -36 -64 -43 -22 -1 19 80 141 218 169 78 112 213 314 217 120 86 52 94 136 171 205 166 1 -100 -78 21 120 82
1880 82 43 -34 -112 -44 22 60 98 73 48 32 16 -34 -23 45 113 65 16 -18 8 36 1 -2 -6 -14 -22 -12 -2 7 18 -18 -55 -88 -121 -122 -61 -36 -10 15
1878 15 41 66 92 75 57 19 -81 -219 -253 -142 -30 -18 -5 7 20 -1 -24 74 173 212 189 138 87 64 41 -17 -13 2 19 39 59 43 27 11
1877 11 -4 -26 -47 -69 -90 -85 -81 -76 -71 -64 -56 -48 -40 -6 27 61 95 86 78 69 61 37 13 -10 -34 -14 6 27 48 32 17 1 -14 -5 3 12 21 10 0 -11 -21 -1 17
1875 17 -20 -59 -83 -45 78 201 256 249 214 179 182 185 125 65 49 33 17 1 8 14 20 26 26 27 28 28 6 -16 -39 -62 -6 49 -15 -80 -98 -54 -10 -28 -23 -19 -18
1874 -18 -17 -1 15 31 47 48 48 48 49 49 50 50 51 39 28 20 13 38 126 178 231 228 225 261 235 205 237 265 231 173 115 53 -8 -23 -38 -53 -69 -29 10 46 82 74
1872 74 3 -90 -81 30 142 171 137 75 12 -26 -2 17 38 0 -37 -36 -35 -34 -33 -38 -43 -48 -53 -32 -11 10 31 18 5 -6 -19 -32 -45 -53 -62 -40 44 93 143 171
1871 171 200 166 132 36 -59 -65 -9 29 68 48 29 20 10 0 -8 -22 -35 -49 -62 -72 -82 -92 -101 -111 -121 -131 -141 -152 -162 -173 -183 -163 -142 -184 -226 -159 -92
1869 -92 -88 -83 -91 -98 -105 -113 -92 -71 11 95 140 186 86 -13 -26 -39 10 59 36 13 52 91 155 220 139 58 64 70 13 -104 -167 -126 -85 -44 -3 37 16 -67
1868 -67 -162 -154 -105 -55 -48 -41 -34 -27 -68 -109 -149 -190 -94 1 55 6 -47 -38 32 103 49 -3 -57 -111 -144 -178 -149 -120 -78 -36 4 46 143 240 191 142 93 44
1866 44 57 71 20 -29 -79 -130 -88 -46 -4 38 56 75 94 113 6 -101 -104 -107 -100 -93 -86 -79 -45 -12 -41 -71 -83 -95 -108 -120 -75 -30 -47 -65 -30 5 40
1865 40 75 49 23 60 96 35 -24 -23 -21 20 62 42 21 0 -23 -45 -67 -47 -26 -6 14 -20 -55 -89 -124 -116 -108 -100 -91 -34 23 18 13 86 160 187 111 6 -98
1863 -98 -105 -112 -151 -189 -165 -141 -79 -18 -102 -186 -158 -130 -102 -74 -41 -7 25 59 158 258 236 109 -30 -66 -105 -144 -109 -75 -41 -7 -39 -71 -41 -11 30
1862 30 72 115 157 153 150 147 144 141 138 134 131 89 47 5 -36 37 111 80 50 19 -12 -43 -74 -103 -132 -56 18 46 74 105 137 152 229 271 209 65 -16 5 27
1860 27 -27 -82 -199 -316 -330 -343 -252 -162 -118 -74 -30 13 -6 -26 -46 -66 -70 -75 -79 -83 -45 -7 30 68 20 -27 -12 2 28 54 18 -17 -80 -144 -103 0
1859 0 38 -26 -92 -157 -138 -118 -99 -80 -77 -75 -73 -70 -84 -97 -48 0 -40 -82 -61 -41 -77 -114 -150 -187 -168 -149 -130 -111 -33 43 17 -9 -12 -15 -18 -21 -67 -113 -55 2
1857 2 34 66 35 5 12 19 26 34 73 112 89 66 31 -3 -38 -73 -74 -75 -76 -77 -43 -9 -37 -66 -38 -9 18 47 74 101 65 30 22 15 70 125 32 -60 -154 -247 -229
1856 -229 -211 -193 -176 -158 -140 -122 -104 -64 -24 16 56 116 176 173 170 154 137 120 104 47 -9 -60 -110 -114 -13 86 83 35 -12 -66 -121 -104 -87 -71 -54 -60 -65
1854 -65 -71 -76 -13 48 85 -2 -125 -124 -54 14 -36 -87 -75 -64 -42 -20 1 23 37 52 66 80 37 -5 13 32 -13 -59 -43 -27 14 56 36 15 -15 -47
1853 -47 25 98 47 -3 7 19 -32 -84 -135 -187 -142 -98 -53 -9 83 176 235 169 72 -25 15 56 94 131 169 207 210 212 152 93 -29 -151 -127 -104 -126
1852 -126 -148 -66 15 30 44 59 74 48 23 -2 -28 -35 -43 -51 -59 -13 32 77 123 135 147 97 47 -6 -60 -52 -44 -22 -1 -42 -83 -101 -118 -136 -154 -132 -111 -89
1850 -89 -67 -39 -11 16 44 -24 -92 -57 -21 43 109 112 115 137 160 158 95 51 69 49 28 1 -25 10 46 81 117 94 71 52 95 142 127 29 -6 -19 -32
1849 -32 -109 -186 -157 -65 -19 -35 -12 10 47 84 59 34 22 10 -1 -13 -41 -69 -35 0 -2 -4 16 100 152 141 65 -9 -23 -36 -84 -70 -20 30 85 139
1847 139 106 72 38 4 -34 -73 -113 -152 -151 -150 -149 -148 -153 -158 -100 -43 -22 -1 -42 -83 -92 -101 -110 -119 -106 -93 -80 -67 -54 -42 -30 -17 -5 7 19 32 4 -22 -49 -76
1846 -76 -104 -131 -158 -185 -127 -68 25 56 9 -37 -25 -13 -1 10 22 35 28 22 16 10 -44 -100 -93 -86 -15 55 98 79 41 2 -39 -82 -61 -39 -18 2 -49 -101
1844 -101 -188 -213 -185 -156 -124 -92 -99 -107 -115 -122 -144 -167 -126 -23 67 54 0 -54 -3 46 70 31 32 33 29 26 6 -13 29 71 100 129 95 61 34 7 -78 -164
1843 -164 -176 -127 -77 -89 -86 -84 -84 -85 -38 9 -1 -12 -22 30 110 190 176 163 149 136 129 122 150 116 2 -110 -158 -144 -139 -134 -125 -116 -64 -11 13 -23 -47 -71 -99
1841 -99 -127 -107 -88 -33 -41 -72 -103 -34 34 24 14 4 -5 -5 -4 -4 -4 -4 -4 53 112 144 114 56 0 -73 -145 -148 -89 -52 -15 -37 -59 -75 -91 -45 0 33 66 99
1840 99 132 105 77 50 23 -37 -98 -34 29 44 59 74 89 80 70 21 35 81 65 49 95 112 66 58 51 48 44 36 28 30 -31 -92 -90 -40 10 2 -5 55 116 52 -11
1838 -11 -16 -21 -25 -30 -17 -3 9 23 47 71 96 120 118 116 115 113 107 101 95 89 119 150 180 211 191 172 152 133 114 94 71 48 70 29 27 26 39 114 189 202 156 109
1836 109 59 9 71 134 107 18 -31 -82 -132 -182 -247 -249 -162 -74 -93 -112 -127 -142 -148 -92 -71 -49 -69 -88 -108 -127 -131 -134 -138 -142 -127 -112 -97 -82 -67 -52 -37 -22
1835 -22 -28 -33 -39 -45 -51 -57 -62 -68 -116 -163 -210 -258 -206 -155 -103 -52 -45 -38 -31 -24 5 36 66 96 26 -44 9 63 83 104 124 144 104 64 23 -16 0 17 34 51 43 35
1833 35 27 19 26 33 41 48 57 66 75 83 77 70 63 56 15 -26 -67 -109 -93 -77 -62 -46 -3 38 80 123 129 135 141 147 154 162 169 176 88 0 35 71 33 -3 -41 -78 -19 38 97 156
1832 156 128 100 72 44 52 61 69 78 59 40 21 2 20 38 55 73 56 40 23 7 6 5 5 4 -13 -31 -48 -66 -58 -49 -41 -33 -46 -59 -72 -86 -66 -47 -28 -8 19
1830 19 47 13 -20 -120 -221 -117 -13 24 0 -29 4 0 -65 -128 -128 -105 -82 -117 -153 -138 -122 -107 -92 -73 -54 -35 -16 2 20 74 66 0 -66 -77 -89
1829 -89 -101 -175 -214 -253 -216 -179 -141 -104 -47 8 6 5 28 113 199 222 213 204 190 177 129 80 32 -15 28 72 88 43 16 -10 20 52 71 89 108 127 69
1827 69 11 -46 -104 -167 -230 -265 -239 -223 -207 -188 -168 -125 -82 -43 -4 63 68 5 -58 -82 -107 -131 -156 -142 -128 -110 -92 -119 -83 -20 43 18 -5 -30 -54 -122
1826 -122 -189 -229 -207 -157 -108 -54 0 3 7 11 15 37 60 -17 -95 -155 -152 -122 -92 -82 -71 1 74 38 1 -34 -70 -57 -44 -31 -18 21 60 99 138 91 45
1824 45 -36 -56 5 66 131 196 195 193 129 65 20 -23 -64 -104 -144 -122 -130 -139 -190 -178 -100 -23 30 22 -89 -201 -259 -212 -127 -104 -91 -78 -69 -61 -59 -58 -57 -56 -97 -137
1823 -137 -115 -93 -97 -101 -5 91 73 -6 -86 -104 -93 -82 -67 -52 -109 -165 -199 -170 -87 -67 -71 -74 -23 27 15 4 -22 -50 -77 -104 -113 -123 -132 -142 -151 -161 -170 -180 -147
1821 -147 -115 -82 -50 25 100 71 43 -1 -46 -91 -136 -82 -28 24 78 87 95 45 -4 -53 -40 0 41 36 30 25 19 -46 -113 -117 -121 -65 -8 24 -5 -73 -79 -20 38
1820 38 55 72 65 -3 -109 -153 -53 46 87 65 74 83 61 -22 -106 -128 -143 -158 -208 -196 -147 -161 -171 -118 -50 16 25 34 21 8 -4 -17 6 30 54 78 111
1818 111 144 114 85 109 133 154 174 141 46 -49 -82 -81 -80 -79 -78 -42 -68 -94 -58 -38 -17 -55 -94 -100 -107 -114 -121 -79 -37 -57 -77 -89 -100 -111 -122 -146 -170 -193 -217
1817 -217 -211 -204 -198 -192 -172 -152 -70 11 94 176 192 208 189 108 27 8 31 55 -18 -91 -112 -70 -64 -58 -58 -58 -58 -58 -46 -33 -79 -125 -114 -41 -2 36 19 2 -14 -31
1815 -31 21 74 62 -11 -12 49 72 94 89 83 81 79 46 76 106 73 57 42 26 10 -31 -12 35 82 98 113 125 137 109 18 -72 -100 -54 -8 36 82 95 44
1814 44 -70 -185 -209 -171 -168 -164 -53 57 127 92 64 99 185 209 136 0 -138 -215 -173 -130 -83 -37 29 95 97 36 34 94 154 151 99 109 142 176 96
1812 96 16 0 -17 -31 -45 -58 -72 -46 -21 -54 -87 -82 -15 52 56 18 -19 -60 -102 -98 -95 -91 -87 -115 -144 -169 -194 -201 -145 -63 19 9 0 -10 -19 -21 -23 -84 -145 -156 -104
1811 -104 8 60 13 -33 -79 -126 -188 -188 -118 -49 0 48 34 21 10 0 47 95 112 66 -2 -71 -110 -87 1 89 65 -21 -107 -131 -124 -117 -106 -95 -75 -54
1809 -54 -95 -137 -142 -148 -91 -33 -4 24 54 83 69 56 42 28 25 21 18 14 10 7 3 0 0 -1 -1 -2 42 86 89 -10 -112 -152 -91 -30 -62 -156 -250 -282 -207 -133 -55 23
1808 23 73 122 110 97 57 17 39 62 26 -10 -18 34 101 168 177 185 133 82 31 -20 -26 -33 -40 -46 -68 -90 -113 -135 -120 -106 -91 -76 -46 -16 72 161 222 221 151
1806 151 80 34 -12 2 18 6 -5 -17 -28 0 28 56 85 57 30 3 -23 -18 -12 -7 -1 40 83 63 43 12 -18 12 43 11 -19 -26 27 48 7 -34 -13
1805 -13 61 73 24 -24 -13 59 93 128 162 134 41 -50 -77 -41 -40 -40 -20 0 18 38 42 46 11 38 109 117 101 86 163 240 313 386 419 390 295 201 163 187
1803 187 176 165 88 10 -66 -144 -164 -184 -141 -99 -21 55 29 3 -32 -67 -103 -138 -101 -63 -49 -97 -149 -138 -105 -71 -25 21 39 -3 -40 -77 -60 -42 4
1802 4 -10 -91 -171 -188 -142 -131 -121 -105 -89 -11 66 41 16 -7 -32 -7 17 43 68 17 -34 -23 50 105 55 -35 -126 -97 -69 -40 -12 34 80 64 -14 -50
1801 -50 17 121 162 149 135 118 101 75 48 85 121 177 234 232 230 232 297 361 363 347 330 367 405 390 312 269 226 202 179 178 241 281 258 177 159 159 159 160 160
1799 160 155 87 55 23 14 6 -1 -9 35 80 121 162 207 189 143 98 105 113 21 -70 -76 -19 2 24 62 101 77 54 53 53 56 59 23 50 77 41 -14 -70 -68 -66 -72 -79 -86
1797 -86 -93 -106 -119 -132 -145 -146 -147 -148 -150 -89 -28 -29 -31 -30 -29 -28 -27 -60 -92 -63 -33 -38 -44 -49 -54 -43 -32 -21 -10 -28 -47 -3 102 192 179 41 -97 -118 -139 -161 -182
1796 -182 -165 -148 -189 -231 -246 -199 -187 -175 -108 -40 26 94 100 107 113 119 172 225 250 213 147 81 12 -57 -80 -103 -126 -149 -146 -143 -141 -138 -127 -117 -103 -89 -110 -69 -28
1794 -28 -49 -62 -75 -29 15 61 106 89 72 91 109 127 145 134 122 110 99 86 73 95 54 -22 -98 -117 -135 -126 -117 -104 -91 -106 -60 -13 -28 -65 -101 -41
1793 -41 18 55 29 0 33 54 14 -49 -114 -100 -86 -72 -58 -33 -9 15 39 9 -20 11 44 98 153 145 137 139 141 85 29 -16 0 43 87 66 45 23 2
1791 2 -61 -125 -85 -46 0 44 85 126 138 88 14 -59 -52 17 86 93 55 17 -24 -66 14 94 106 55 24 -6 -37 -68 -77 -24 29 20 -17 -56 -98 -140 -125 -109
1790 -109 -94 -79 -100 -120 -175 -168 -81 6 32 -3 -44 -23 55 72 52 31 69 107 56 6 -44 -94 -153 -211 -165 -120 -101 -82 -63 -44 -2 38 79 120 107
1789 107 93 80 66 53 40 26 13 32 52 106 98 58 18 -26 -70 -72 -73 -79 -85 -91 -161 -195 -229 -200 -171 -103 -98 -112 -64 -19 -37 -66 -95 -128 -161 -196 -230 -195
1787 -195 -98 -24 49 100 88 55 21 -16 -53 -60 -67 -74 -81 -55 -30 30 28 20 13 1 -9 -5 -1 2 6 0 -6 -12 -19 17 53 125 134 66 -1 -74 -146 -140 -134 -128 -122 -121 -119 -118 -116 -110 -103 3
1785 3 109 190 209 200 191 131 71 39 69 68 66 69 72 42 12 -16 -46 -54 -62 -70 -78 -58 -37 -79 -121 -69 -18 -32 -109 -181 -191 -178 -164 -152 -141 -129 -117 -86 -55 -23
1784 -23 7 12 17 58 36 33 31 24 18 22 26 30 35 39 43 48 52 59 67 74 81 52 23 -5 -34 -39 -43 -48 -53 -31 -10 10 32 2 -27 -56 -86 -58 -31 -3 23 50 76 103 130 85
1782 85 40 -4 -49 -5 38 19 0 -41 -82 -24 33 50 4 -5 -15 16 49 81 114 48 -17 -55 -31 17 66 18 -28 -36 17 71 63 68 73 74 75 92 109 102 33
1780 33 -58 -88 -53 -18 -1 14 65 54 -30 -115 -135 -93 -39 15 49 22 -22 -4 71 148 146 40 -41 -61 -23 13 -7 -28 -48 -68 -88 -108 -69 -30 -92
1779 -92 -153 -184 -152 -92 -33 -23 -14 -4 5 -20 -45 -12 19 41 0 -68 -137 -113 -89 -65 -42 -4 34 9 -77 -105 -30 17 2 -13 -29 -48 -68 -42 -15 10
1778 10 37 41 45 49 54 29 4 38 72 114 95 48 1 1 0 0 0 -4 -8 -9 -9 -16 39 59 80 71 63 55 47 88 129 105 19 -32 -21 48 55 34 13 -11 -35 -82 -129 -172
1776 -172 -215 -181 -84 11 46 50 55 28 -60 -174 -288 -260 -233 -213 -192 -172 -152 -151 -150 -184 -155 -59 36 109 119 84 49 73 97 101 105 109 113 170 227 179 132 92
1774 92 52 13 -26 -89 -152 -111 -70 1 72 -2 -76 -119 -163 -101 -40 -13 13 -98 -210 -278 -241 -118 5 12 18 25 31 62 92 19 -54 -43 -32 -21 -10
1773 -10 -33 -57 -80 -104 -70 -37 -3 30 12 -5 -23 -41 -5 31 5 -20 -40 -60 -18 23 27 30 33 37 17 -1 -20 -39 -1 36 12 -12 -5 1 -54 -110 -43 22
1772 22 8 -109 -151 -88 -56 -86 -98 -111 -128 -145 -114 -83 -52 -21 -68 -115 -162 -209 -216 -223 -230 -237 -244 -251 -259 -266 -208 -150 -92 -35 10 57 103 149 75 1 -9 -20 0
1770 0 22 43 64 57 50 82 52 17 45 69 31 2 -25 -54 -82 -137 -129 -52 24 15 6 37 4 -72 -88 -38 11 -14 -39 0 102 116 67 57 47 23 0 -25
1769 -25 -49 -96 -142 -161 -118 -18 81 115 88 28 -31 -92 -152 -191 -168 -180 -192 -215 -239 -263 -286 -227 -168 -113 -58 -4 -13 12 39 53 68 82 96 64 31
1767 31 3 -25 -23 41 70 99 38 -23 -120 -154 -170 -186 -197 -209 -164 -118 -76 -35 -40 -108 -199 -186 -151 -116 -78 -40 27 33 12 -8 23 55 -12 -80 -92 -41 9
1766 9 -2 -34 -66 -138 -147 -126 -105 -81 -56 -47 -38 -29 -21 -24 -27 -31 -34 -22 -10 1 13 5 -3 -11 -20 -13 -6 0 7 5 2 0 -2 -4 -6 -9 -11 -6 -2 2 7 -13 -35 -56 -77 -68 -59 -50 -41 -16 7 32
1764 32 56 57 57 58 59 125 192 176 56 -63 -121 -115 -110 -122 -134 -83 -33 16 65 10 -43 -23 -2 -44 -85 -150 -214 -216 -218 -223 -227 -170 -112 -164 -217 -207 -198 -168 -139 -110
1762 -110 -81 -36 8 -50 -109 -84 -58 -33 -8 5 19 33 47 -6 -59 -106 -154 -145 -32 21 75 27 -21 -63 -105 -146 -84 -45 -68 -76 -84 -96 -107 -78 -49 -21
1761 -21 7 0 -7 -14 -22 -41 -61 -80 -99 -119 -138 -158 -177 -158 -139 -120 -100 -138 -176 -214 -252 -242 -231 -221 -210 -215 -220 -225 -231 -218 -206 -194 -182 -265 -348 -365 -321 -239 -220
1759 -220 -225 -229 -200 -170 -141 -111 -70 -30 -51 -73 -85 -98 -110 -123 -94 -65 -36 -7 -45 -84 -122 -161 -148 -136 -123 -111 -100 -89 -140 -191 -175 -159 -142 -126 -114 -101
1758 -101 -89 -77 -34 8 50 93 103 113 61 8 15 21 28 34 42 50 -3 -58 -30 -2 2 -55 -108 -98 -123 -149 -139 -66 -29 8 13 18 0 -81 -134 -125 -116 -170 -214 -196
1756 -196 -113 -30 -13 3 21 38 -4 -48 -92 -135 -86 -36 13 63 87 111 38 -35 -64 11 148 182 95 8 -23 -54 -71 -88 -104 -121 -134 -147 -156 -164 -165 -103
1755 -103 -41 -41 -67 -94 -61 -29 -14 0 -42 -85 -118 -89 -94 -100 -142 -184 -122 -59 0 61 59 58 94 129 103 76 54 33 12 -9 -2 3 10 17 8 0 -9 -18 -27 -36 -40 -45 -82
1753 -82 -57 -32 -69 -119 -169 -119 -69 -51 -34 -16 1 -29 -59 -89 -119 -138 -156 -116 -76 -67 -121 -175 -167 -146 -126 -102 -78 -68 -59 -49 -40 -30 -21 -11 -1 -30 -59 -87
1752 -87 -116 -97 -79 -61 -42 -14 13 42 70 97 124 89 54 9 -35 -75 -116 -153 -128 -75 -22 -25 -28 -31 -34 -66 -97 -25 46 68 89 106 124 120 55 -10 -14 68
1750 68 150 130 47 -14 -13 10 34 29 24 20 15 5 -3 48 101 138 175 208 241 200 97 28 -39 -86 -133 -238 -344 -369 -331 -266 -201 -143 -85 -89 -94 -120 -147 -111
1749 -111 -75 -74 -74 -73 -73 -69 -64 -60 -56 -75 -93 -108 -123 -168 -150 -68 14 43 10 -45 -102 -125 -85 -45 -68 -107 -146 -47 51 101 90 51 12 33 55 77 98 83 69
1747 69 54 39 20 1 6 72 206 276 234 129 62 -4 -70 -137 -181 -162 -80 -61 -71 -81 -95 -109 -58 -7 44 95 81 66 115 163 161 158 156 153 127 101 76
1746 76 50 67 84 101 118 103 87 13 -59 -66 -9 46 40 -3 -47 -32 -17 -2 12 -30 -74 -74 -11 51 51 5 -41 -29 -17 -39 -61 -118 -113 -27 58 79 37 33
1744 33 30 23 15 11 6 1 -2 43 90 98 1 -102 -102 -22 58 68 79 124 107 10 -87 -78 -6 13 34 59 84 36 -12 2 16 27 38 49 60 -16 -92 -99 -44 -3
1743 -3 38 79 121 126 68 46 24 17 10 2 -4 -54 -104 -89 -12 29 8 -35 -79 -110 -142 -146 -87 41 169 215 156 79 2 25 111 172 171 104 38 23 9 -5
1741 -5 -19 -37 -54 -10 34 28 23 17 11 29 48 66 85 141 198 226 193 91 -9 -46 -20 31 83 77 70 84 99 113 127 122 116 111 106 105 104 103 103 102 101 100 99 91 82 73 64 74
1740 74 85 96 106 75 44 71 99 83 5 -72 -87 -72 -57 -38 -19 34 88 80 71 69 66 63 61 113 165 117 68 21 36 16 -4 -15 -26 25 76 139 203 301
1738 301 337 297 256 211 167 116 66 78 90 102 114 126 138 52 -32 -36 62 141 116 30 49 109 106 40 -24 -3 16 -25 -67 -43 -20 2 26 54 83 53
1737 53 23 16 71 91 110 63 15 -32 -80 -64 -48 -32 -16 21 59 -6 -73 -92 -111 -130 -150 -139 -128 -118 -107 -123 -139 -152 -164 -189 -152 -88 -23 8 41 73
1735 73 106 99 93 86 80 41 3 27 51 56 60 65 69 58 46 31 16 45 11 -49 -109 -114 -119 -124 -128 -59 9 -24 -121 -135 -46 16 16 68 120 145 108 40 34 56 78 48
1734 48 80 140 199 216 234 189 143 47 -47 -74 -39 32 103 72 -21 -97 -111 -102 -93 -58 -24 10 45 64 84 138 130 117 105 88 72 55 39 23 6 19 32
1732 32 45 57 31 5 41 78 131 185 177 168 131 94 61 27 9 52 96 78 16 -45 -48 -51 4 60 112 164 156 85 50 15 9 4 0 -6 14 35 55 76 88 100
1731 100 112 123 120 116 112 108 106 104 102 100 133 166 137 107 117 126 136 146 163 180 98 15 -30 -13 3 -42 -129 -216 -239 -199 -138 -77 -74 -72 -28 16 60 104 124 145
1729 145 166 186 125 64 3 -58 -121 -184 -147 -110 -61 -75 -116 -157 -149 -142 -134 -127 -108 -88 -69 -50 -38 -27 -15 -3 -17 -32 -50 -68 -86 -167 -244 -258 -213 -105
1728 -105 30 61 27 -5 -42 -78 -144 -148 -86 -25 11 -13 -65 -118 -33 52 54 -47 -164 -219 -169 -119 -89 -59 -29 0 33 66 99 133 113 93 37 45 73
1726 73 102 134 167 152 138 123 109 109 109 144 117 80 44 42 -21 -86 -89 -27 34 19 4 -10 -25 -31 -37 -20 58 125 129 68 7 22 37 52 68 40 12 -15 -42
1725 -42 -18 6 30 55 0 -56 -147 -176 -99 -21 -5 -51 -74 -34 28 91 85 78 72 65 85 104 159 151 141 131 118 104 128 152 152 90 -1 -31 3 39 41 44 47 50
1723 50 51 53 54 56 80 103 162 159 141 123 101 79 21 -36 -94 -153 -118 -84 -49 -15 -6 1 10 18 8 -2 -9 -15 -46 -13 18 -11 -21 -32 -46 -60 -74 -88 -102 -116 -84
1722 -84 -53 13 18 -20 -58 -97 -135 -142 -87 -66 -46 -37 -28 -20 -11 1 14 27 40 46 52 59 65 127 188 208 123 40 20 62 103 60 17 37 56 47 38 29 19 28 37 46 55 64
1720 64 73 82 91 80 69 58 47 1 -44 -28 -12 3 18 33 48 10 -27 -65 -103 -102 -100 -99 -97 -154 -211 -203 -133 -65 -59 -77 -96 -56 -17 21 60 15 -29 -12 5 9
1718 9 13 18 22 60 97 72 47 -9 -67 -124 -181 -150 -118 -87 -55 -25 5 -22 -51 -52 9 70 69 42 14 46 77 56 35 13 -7 46 100 127 92 32 -27 -28 -29
1717 -29 12 53 37 20 15 72 130 125 53 -17 -23 32 37 43 52 61 51 41 31 21 56 92 163 171 129 87 103 119 70 21 38 116 175 172 145 119 96 74 51 29
1715 29 -12 -54 -132 -146 -92 -38 -42 -47 -59 -71 -83 -95 -153 -211 -241 -209 -173 -137 -97 -57 22 101 119 136 83 30 39 111 146 76 -28 -71 22 116 110 104 146
1714 146 188 231 273 272 271 267 262 236 147 63 41 106 233 302 308 254 200 142 83 97 110 65 20 -19 2 48 94 114 71 1 -67 -17 33 21 9 -7 -24
1712 -24 -38 -51 -89 -64 -36 -70 -135 -138 -73 53 111 105 77 48 95 141 119 34 -39 -114 -88 -63 -17 27 72 117 135 154 109 65 21 -22 -3 14 50 85
1711 85 121 156 163 170 119 67 45 86 92 98 131 164 134 42 -57 -53 29 112 91 7 -13 28 41 54 71 89 94 99 105 110 104 98 91 85 57 28 -34 -35 -34 -32 -23 -14 16 110
1709 110 165 219 207 133 58 46 131 216 301 387 398 347 233 182 228 275 260 183 143 165 187 147 96 108 185 262 287 311 232 152 101 50 0 -51
1708 -51 -57 -62 -67 -73 -25 22 109 133 143 214 282 288 269 249 191 195 192 189 189 190 175 160 145 130 150 169 189 209 229 249 268 288 270 251 233 214 195 177 158 140
1706 140 149 158 202 184 175 166 153 140 125 110 95 80 65 50 42 34 28 126 201 214 180 145 111 77 87 159 196 232 237 241 246 250 197 144 91 38 125 212 258 200
1705 200 158 179 159 138 162 185 209 232 273 314 355 395 375 355 334 314 247 181 218 256 292 328 302 276 301 325 288 250 266 282 298 314 252 189 231
1703 231 273 245 216 292 368 342 316 290 264 271 277 284 291 281 271 262 252 206 160 114 68 98 129 159 189 163 136 109 82 87 92 97 102 91 81 70 59 80 102
1702 102 123 144 129 113 98 83 123 163 203 243 236 229 223 216 254 293 332 370 342 313 284 255 291 328 361 394 380 303 203 208 256 305 361 416 404 391 379
1701 379 367 377 386 396 406 432 457 482 508 463 419 374 330 349 368 387 406 442 477 450 423 440 458 448 375 315 256 255 253 298 342 286 231 204 240 280
1699 280 257 261 327 451 513 449 386 322 258 206 216 258 300 307 376 446 453 415 376 438 500 484 468 517 629 686 680 610 539 445 350 324 361 382 404 429
1698 429 454 419 385 413 504 581 555 486 418 423 428 432 437 471 506 537 567 498 367 239 174 186 260 299 338 329 257 221 185 139 94 75 119 125 130 140 149 126
1696 126 103 79 56 63 70 77 84 88 91 94 97 164 231 271 248 176 104 90 77 43 9 -1 50 96 80 100 119 141 102 58 77 147 156 57 -40 -21 -1 18 38
1695 38 107 176 180 121 60 61 85 110 154 198 241 285 322 358 395 431 445 460 412 363 374 384 394 404 384 365 407 450 517 584 546 509 467 424 382 339
1693 339 362 384 407 429 467 505 481 457 507 557 544 531 510 488 466 445 483 521 497 473 482 492 478 402 354 368 406 444 447 450 453 455 443 430 417 404 414
1692 414 425 377 329 280 293 334 375 380 386 392 397 368 339 275 274 319 364 307 187 111 97 106 116 100 85 70 55 45 35 26 16 -4 -26 -106 -186 -212 -175 -135
1690 -135 -157 -180 -141 -37 66 29 -6 -43 -80 -98 -117 -135 -154 -81 -8 1 11 -8 -28 14 57 43 28 77 187 238 185 97 71 105 139 177 215 233
1689 233 251 270 288 265 241 218 195 214 234 253 273 275 278 218 159 133 107 18 -69 -54 -39 -25 -10 -65 -120 -172 -119 21 163 124 85 81 77 17 -42 -66
1688 -66 14 71 66 66 66 62 58 47 36 87 139 191 244 297 349 352 354 356 358 348 339 329 319 291 262 296 330 334 338 280 222 264 306 285 265 260 255 312 370 387 403 316
1686 316 228 229 230 231 232 246 259 272 285 214 142 175 208 207 207 206 206 104 2 46 90 138 186 235 283 246 208 171 133 96 58 82 107 132 156 119 81 52
1685 52 24 -4 -32 -7 17 42 67 72 77 83 88 103 117 132 146 178 209 136 64 14 -34 -21 -7 4 17 30 43 53 64 11 -102 -197 -187 -135 -84 -126 -169
1683 -169 -169 -66 39 83 22 -37 -64 -90 -55 -19 -2 14 31 48 88 128 106 84 97 111 124 138 120 103 85 67 8 -51 35 121 149 176 142 107
1682 107 138 169 256 342 379 311 204 159 201 243 289 334 342 351 213 75 12 -50 -51 -52 36 125 152 179 167 155 143 131 151 170 127 84 68 52 36
1680 36 20 58 97 136 174 236 297 252 145 70 57 110 162 232 302 307 250 207 226 206 187 214 242 242 180 116 53 -10 -73 -139 -143 -78 -12 19 52 85
1679 85 118 156 194 204 153 53 -46 -39 29 66 104 83 61 61 61 95 68 -20 -109 -133 -95 -74 -54 -88 -123 -133 -81 -1 77 83 88 54 83 155 165 110 55
1678 55 54 52 27 -60 -139 -155 -149 -142 -96 -50 -5 40 94 148 139 131 131 132 133 133 128 123 117 112 72 31 53 75 73 70 68 65 67 68 70 71 63 54 46 38 35 31 91 150 122 93 88 146 184 159
1676 159 70 -19 -25 -32 -38 -44 13 72 69 65 103 141 175 209 154 38 -43 -125 -114 -102 -91 -80 -42 -5 27 61 64 4 -54 -51 5 63 20 -84 -111 -35 37 5
1674 5 -55 -116 -122 -127 -157 -186 -150 -52 65 120 111 101 80 60 39 19 47 74 39 -57 -91 -21 25 9 9 71 129 125 82 38 53 68 40 13 -70 -154 -195 -131
1673 -131 -64 2 14 25 95 165 212 197 155 112 89 66 43 20 19 19 22 25 36 110 184 195 155 114 74 34 1 31 85 138 138 75 12 12 62 113 104 96 159
1671 159 222 219 155 124 155 183 148 48 -50 -43 26 50 74 102 130 202 274 277 218 167 116 123 130 124 118 54 -9 -6 59 125 128 92 56 20 -15 -1 73 149 163
1670 163 155 147 134 122 148 174 176 116 53 52 152 189 122 55 53 114 157 201 249 296 227 157 150 143 137 132 126 120 103 85 68 51 24 -1 -27 -53 -82 -111 -81 -51
1668 -51 -3 -17 -58 -100 -167 -234 -233 -169 -89 -9 -30 -50 -60 -70 -41 -75 -142 -146 -85 -25 -50 -75 -38 -1 -10 -19 30 79 133 124 150 177 153 128 104 80 56 32
1667 32 -30 -31 0 -32 -87 -143 -93 -42 42 65 64 64 59 55 59 64 68 73 -29 -132 -151 -67 61 127 89 51 67 82 98 113 104 95 86 77 87 97 108 118 164 209
1665 209 228 183 148 113 137 160 144 129 113 98 76 55 33 12 16 21 26 30 29 28 27 26 55 84 113 142 108 74 68 124 228 332 298 264 257 313 369 362 339
1664 339 315 327 276 195 177 183 188 199 209 255 238 157 76 57 38 55 134 212 229 202 175 148 121 57 55 80 105 53 2 15 91 97 40 -12 -2 49 102
1662 102 96 90 52 13 -24 -63 -80 -97 -114 -131 -80 -30 20 71 67 62 58 54 124 194 199 142 73 66 83 99 152 205 231 195 113 32 16 62 103 144 126 108 76
1661 76 43 11 -21 -35 -50 -2 45 102 158 211 264 305 283 197 110 66 84 66 49 67 85 103 120 185 249 232 112 -8 -24 39 103 76 48 -14
1659 -14 -15 19 54 33 13 23 95 168 177 138 98 58 18 -8 25 87 149 132 116 100 83 88 93 98 103 79 54 29 4 33 61 32 2 -58 -57 -32 -7 -48 -150
1658 -150 -191 -169 -64 40 80 58 17 -24 -69 -115 -78 -41 -5 31 19 6 -5 -17 -13 -10 -6 -3 -17 -31 -45 -59 -6 47 73 37 1 -34 -69 -105 -147 -127
1656 -127 -76 -24 7 103 221 236 139 42 7 35 86 138 131 125 125 124 187 249 227 205 183 161 123 85 110 135 85 35 -15 -65 -23 18 60 103 84 66
1655 66 47 29 20 11 -60 -132 -102 -72 -42 -13 0 12 88 163 159 155 89 22 -24 -71 -55 -40 -34 -29 -24 -19 -35 -52 -69 -86 -56 -27 2 32 -6 -44 -82 -120 -109
1653 -109 -98 -87 -76 -96 -116 -74 -32 -27 -23 44 111 62 14 69 187 264 236 167 98 59 19 43 66 50 34 81 127 142 156 107 59 113 167 221 275
1652 275 293 311 266 221 203 185 167 149 154 160 102 -16 -119 -118 -33 50 110 170 229 289 249 210 170 130 252 373 449 421 373 325 270 215 176 137
1651 137 161 184 223 263 303 342 318 294 270 246 267 288 309 330 340 349 359 368 357 346 397 448 479 511 539 566 558 487 416 407 393 380 335 352 444 535 527
1649 527 518 513 509 560 611 634 552 432 374 443 513 559 543 523 504 481 458 453 448 443 438 464 490 454 417 416 415 414 413 377 342 307 271 304 336 345 291 249 269 254
1648 254 239 207 238 296 354 399 445 463 419 361 304 308 374 386 335 223 111 44 38 60 82 80 77 12 -52 -67 -81 -95 -110 -36 36 82 66 48 31 72
1646 72 112 92 72 17 24 88 152 217 281 255 167 78 53 137 222 241 199 153 108 124 202 310 355 332 309 261 151 45 1 42 146 155 165 210
1645 210 256 301 347 373 399 425 451 461 472 483 494 517 539 597 592 565 537 510 482 419 417 485 552 601 650 659 731 853 912 906 900 903 906 908 911 939 968 997 1025
1643 1025 1027 1029 1008 924 919 975 1028 1019 1017 1015 1048 1019 928 898 934 970 988 1005 960 915 912 909 905 902 890 879 867 855 821 787 753 720 694 668 705 742 791 839 860
1642 860 819 760 702 639 576 568 560 490 357 278 303 328 353 343 333 322 312 323 334 380 363 310 257 262 268 249 229 175 183 228 273 259 245 254 262 213 163 163
1640 163 225 252 279 289 299 281 202 104 6 -68 -80 -25 30 89 149 172 195 253 249 200 151 103 54 76 160 244 265 232 198 160 123 136 149 162 175
1639 175 155 135 177 219 189 160 130 100 92 83 39 58 119 181 184 187 261 335 382 366 366 366 338 248 171 157 207 257 240 222 268 313 343 373 403 433 463 493
1638 493 523 553 579 605 569 532 454 376 363 412 482 489 435 381 376 432 489 484 466 448 426 404 462 521 515 446 440 497 550 540 522 505 519 470 425 380 332
1636 332 283 285 287 293 299 274 311 372 433 430 365 299 297 324 351 319 288 280 272 263 255 207 159 174 188 235 282 325 368 349 269 223 178 161 144 127 110 125 140 92
1635 92 44 110 175 217 197 159 183 207 169 112 117 145 173 239 304 373 443 565 750 935 1058 1123 1189 1246 1304 1338 1310 1210 1048 890 794 722
1633 722 650 522 394 270 146 115 146 178 147 129 111 89 67 45 23 6 -11 -11 51 114 115 112 109 102 95 84 73 62 51 113 175 210 182 142 103 122
1632 122 141 162 184 205 227 217 207 259 312 315 319 322 325 329 332 335 339 325 312 240 168 60 16 77 139 131 60 24 -11 14 40 67 93 105 118 130 142 138 135 131
1630 131 128 97 67 1 -1 21 44 8 -26 -14 -1 45 30 -26 -84 -42 0 -22 -45 -68 -91 -71 -51 -31 -10 -21 -31 -41 -51 -33 -14 39 30 -27 -84 -46
1629 -46 -7 7 -39 -86 -71 -41 -10 -39 -67 -96 -126 -156 -185 -149 -114 -78 -42 -12 16 45 75 106 137 103 7 -84 -114 -79 -43 -81 -118 -93 -68 -56 -44
1628 -44 -32 -20 -31 -41 -52 -62 -73 -83 -129 -112 -66 -21 -34 -47 10 67 62 57 66 74 118 100 55 11 25 39 18 -2 -23 59 170 218 166 113 106 160 180
1626 180 199 248 298 282 204 170 198 164 68 6 7 8 -52 -131 -147 -98 -49 -29 -9 11 31 1 -29 -59 -89 -10 68 43 18 -18 -55 -29 -3 77 159 183
1625 183 62 -71 -102 -54 -6 72 151 230 309 297 284 209 134 14 -104 -36 31 66 101 136 171 140 108 77 46 3 -38 -81 -123 -137 -151 -102 -53
1624 -53 -62 -70 18 107 171 131 87 44 36 28 82 137 126 116 105 95 134 173 212 252 257 262 170 78 78 183 228 170 14 -78 -68 -57 -50 -42 26 96 52 7 -37
1622 -37 -81 -60 -39 -18 2 -17 -36 -153 -270 -251 -129 -6 11 -58 -128 -159 -86 24 135 148 162 131 100 69 38 8 -22 -52 -82 -36 10 -5
1621 -5 -84 -117 -46 97 179 184 126 100 73 108 143 178 213 191 169 147 125 144 163 183 202 222 241 260 280 303 325 348 371 394 417 440 462 496 530 564
1619 564 598 608 619 649 741 891 916 859 864 969 1136 1271 1407 1570 1733 1932 2193 2556 3043 3537 4156 5012 6160 7724 9995
1618 9995 13086 16386 18587 18582 16546 13552 10684 8356 6442 4986 3978 3344 2884 2549 2305 2185 2030 1874 1727 1579
1618 1579 1521 1464 1407 1349 1328 1307 1286 1266 1342 1418 1494 1570 1681 1793 1974 2156 2389 2746 3185 3748 4417 5294 6363 7807 9921 12909
1617 12909 16209 18552 18752 16829 13833 10900 8505 6651 5251 4226 3510 2919 2503 2212 1999 1787 1582 1377 1279 1181
1616 1181 1083 985 909 833 757 681 683 685 687 689 626 563 499 436 451 465 480 495 481 468 455 442 450 459 468 477 458 438 361 283 324 427 432 334 201 130 143 155
1614 155 145 134 123 112 81 49 80 111 207 303 274 245 191 138 148 157 189 220 189 158 118 78 100 123 167 212 194 176 153 131 108 86 75 64 60 56
1613 56 55 158 261 260 148 37 43 50 44 39 96 153 139 126 112 99 107 115 144 235 317 295 176 119 140 162 125 88 94 100 106 112 151 189 228 266 166 65
1611 65 27 93 194 233 228 161 110 122 95 68 108 149 189 229 254 279 304 328 338 348 358 368 387 406 424 443 432 421 306 191 175 159 149 139
1610 139 141 246 391 473 438 403 426 450 408 367 326 285 307 330 405 481 500 373 207 145 243 341 341 341 294 246 198 151 160 170 242 314 265 216 167
1609 167 118 78 38 102 166 209 252 232 212 212 211 149 86 91 96 101 106 129 152 175 198 224 250 214 178 157 136 178 220 219 219 218 217 201 185 169 153 175 197 156
1607 156 116 120 124 65 6 43 79 115 152 137 123 109 94 130 167 203 240 268 297 263 229 213 196 243 289 296 303 310 317 290 263 236 209 260 311 223 135 143
1606 143 255 305 250 174 97 77 56 92 128 164 199 209 219 229 238 230 221 150 78 149 219 227 236 199 163 189 215 260 306 247 189 205 222 239 256 260 264 268
1604 268 272 284 297 248 137 38 63 154 182 133 84 23 87 195 303 310 192 110 154 265 377 402 427 453 478 472 467 461 455 414 373 395 416 398 379
1603 379 361 343 344 345 346 347 392 437 482 526 497 467 438 409 354 299 307 314 291 267 244 220 187 154 183 212 212 213 213 214 191 169 251 333 330 327 324 322 318 314 310 307 273 239
1601 239 206 172 237 302 305 308 288 269 249 230 197 164 132 99 109 119 192 265 260 256 252 248 248 248 247 247 264 281 298 315 241 167 197 227 284 341 294 247 192 138
1600 138 145 153 243 333 301 165 30 0 49 99 102 105 107 110 174 239 241 243 228 214 230 247 201 154 170 186 239 292 241 190 151 111 134 157 181 205 230 254
1598 254 233 213 255 360 427 390 276 162 82 107 177 247 226 204 214 224 269 314 256 197 187 177 229 282 291 301 248 195 168 141 114 87 120 153
1597 153 186 219 160 100 145 190 194 197 200 203 287 370 308 245 243 240 237 235 187 140 155 170 259 348 333 319 275 231 250 269 348 427 360 293 243 193 206 219 238
1595 238 257 276 295 352 408 360 312 276 240 204 168 195 223 250 278 224 170 148 125 99 73 110 146 184 222 198 174 185 196 208 219 154 90 88 86 81
1594 81 75 70 65 47 30 13 -3 43 91 134 177 142 44 -45 -30 36 104 115 127 177 226 237 144 74 107 180 252 235 218 232 246 245 245 276 307 287 268 249
1592 249 230 216 201 218 236 238 240 179 119 172 225 174 123 149 175 201 227 234 241 185 130 94 58 53 49 55 61 98 135 131 127 185 243 235 228 116 4 -11 -28 17
1591 17 63 110 157 204 251 245 239 232 226 233 240 247 254 246 237 228 220 190 161 132 102 57 12 9 -56 -116 -71 130 332 413 349 268 251 272 293 317 342 341 340 276 212 188
1589 188 164 140 116 57 -1 1 4 -13 -31 13 57 110 162 152 142 123 104 148 191 200 208 217 225 162 99 98 98 175 253 268 283 237 192 147 102 99 97 95 92 117 141
1588 141 165 190 192 194 196 199 138 77 78 80 111 142 111 80 83 86 151 216 231 245 197 149 146 142 138 134 222 309 292 276 293 310 327 344 358 373 248 123 86 153
1586 153 197 178 145 112 79 46 42 101 187 169 83 59 99 138 146 154 163 171 81 -9 -72 -73 -3 66 40 13 14 77 141 142 78 15 -24 -1 34 71 112 153 156
1585 156 159 103 48 22 59 61 62 37 12 49 86 85 83 81 79 115 151 125 98 60 22 -11 -46 -35 37 115 129 113 159 224 290 238 125 50 -24 -50 -14 24
1583 24 2 -40 -20 102 225 297 307 289 272 202 132 124 117 121 125 67 8 8 8 8 8 0 -6 -14 -22 6 34 0 -32 -9 13 13 -48 -113 -115 -52 10 21 32 43 54
1582 54 -12 -78 -76 -11 27 66 109 151 152 153 155 156 95 35 38 103 155 103 -21 -83 -31 82 162 241 275 246 190 133 180 227 231 132 47 24 26 28 11 56 128
1580 128 200 206 211 216 221 230 240 249 258 248 238 267 233 188 205 284 362 362 300 273 247 207 167 127 87 133 180 223 265 242 155 69 46 84 123 65 8 0 54
1578 54 73 92 106 120 135 149 148 146 145 144 154 164 174 185 195 205 216 226 215 204 193 182 130 77 87 97 159 221 182 144 133 184 200 216 265 313 421
1577 421 424 387 349 306 262 261 260 259 258 215 171 227 284 309 271 234 259 326 393 395 334 289 243 257 270 240 210 204 260 319 314 245 176 191 206 221 237 275 314
1576 314 353 392 477 563 648 734 735 737 735 733 719 642 605 568 601 697 757 818 860 903 1045 1188 1301 1351 1437 1523 1611 1699 1746 1855 1969 1980 1955 1993
1574 1993 2099 2204 2209 2215 2262 2309 2356 2403 2512 2620 2625 2629 2697 2766 2769 2710 2642 2636 2630 2562 2525 2551 2534 2517 2408 2238 2106 1975 1850 1788 1691 1594 1500
1573 1500 1407 1314 1221 1192 1163 1139 1114 1066 1080 1095 1047 1010 974 933 893 878 864 850 835 811 786 762 737 710 683 621 621 647 673 603 532 511 553 559 566 576
1572 576 586 596 606 569 532 495 459 455 451 486 459 399 402 469 537 555 574 593 611 593 575 558 540 512 484 519 553 581 609 575 541 599 658 653 587 509 534
1570 534 602 669 639 609 579 549 590 631 610 589 684 778 769 759 762 764 746 665 612 663 749 773 763 752 843 933 998 1063 1066 1069 1105 1140 1238 1336 1421 1505 1590
1569 1590 1675 1737 1800 1862 1925 1973 2022 2071 2120 2291 2462 2696 2929 3083 3237 3335 3433 3656 3983 4310 4533 4696 4858 5014 5170 5377 5583
1568 5583 5790 5997 6143 6290 6332 6375 6377 6379 6444 6508 6506 6504 6397 6291 6200 6109 6018 5927 5736 5544 5353 5161 4916 4671 4426 4182 3911 3640
1566 3640 3431 3223 3002 2780 2621 2462 2312 2162 2012 1862 1846 1830 1814 1798 1751 1704 1657 1610 1561 1513 1402 1291 1249 1206 1164 1121 1113 1104 1096 1087
1565 1087 1072 1057 938 756 686 721 734 685 673 764 852 835 747 659 669 679 649 620 590 561 585 608 632 656 613 570 528 485 551 618 684 751 707
1564 707 664 620 577 626 675 661 648 641 634 627 620 642 664 582 500 493 486 479 473 489 506 522 539 575 611 549 488 508 632 761 785 771 819 861 840 777 713 708
1563 708 703 767 830 893 957 928 899 932 966 1036 1106 1114 1121 1168 1215 1262 1308 1364 1419 1475 1530 1653 1776 1899 2022 2128 2234 2339 2445 2515 2585 2718
1561 2718 2851 2964 3077 3189 3302 3466 3629 3793 3957 3999 4041 4083 4126 4125 4124 4061 3998 3920 3842 3729 3679 3659 3640 3521 3401 3274 3146 2961
1560 2961 2775 2633 2554 2416 2216 2038 1923 1831 1738 1606 1474 1441 1409 1374 1276 1150 1025 964 902 841 779 771 763 756 748 683 618 615 612 637 662 617
1559 617 511 417 323 295 329 392 456 461 466 495 523 493 463 423 445 494 543 504 465 426 387 378 370 420 470 504 476 383 290 241 255 296 337 304 270 241
1558 241 212 201 253 305 294 218 142 170 259 324 327 365 404 410 355 334 314 337 361 322 283 263 244 224 205 206 207 209 210 196 181 167 153 180 208 236 263 275
1556 275 287 299 311 312 313 314 315 259 203 174 207 205 203 205 207 273 339 259 179 144 108 136 163 231 298 262 225 248 271 294 317 314 311 307 304 337 369 340 310 320 331
1555 331 287 242 241 365 426 363 276 189 240 291 308 326 281 237 287 337 325 313 329 345 361 377 342 308 273 238 262 285 308 331 324 318 311 304 285 265 191
1553 191 117 34 76 151 227 178 129 185 240 280 319 359 399 368 338 308 277 262 247 233 218 167 115 64 13 36 59 144 229 204 178 153 128 178 227
1552 227 215 203 237 272 307 341 363 385 302 220 219 219 218 217 245 273 239 204 191 179 166 153 208 263 256 248 275 302 328 355 300 244 189 134 130 126 122 118 175 233
1550 233 227 222 187 152 116 81 120 159 198 237 268 300 332 363 317 271 224 178 173 167 162 157 184 211 238 266 293 321 290 259 289 381 400 314 221 232 324 416
1549 416 469 521 470 419 410 402 394 385 392 400 407 414 455 496 474 452 407 362 421 480 435 389 344 299 257 214 171 129 193 256 258 259 298 337 313 290 271 253 297 341
1547 341 344 348 295 243 210 282 334 323 258 256 276 297 246 196 207 219 219 219 219 219 201 183 227 272 321 371 317 200 109 122 218 314 370 426 419 413 327 240 300
1546 300 359 324 288 315 342 324 306 287 269 270 271 273 274 265 257 248 240 303 366 425 380 307 233 257 281 310 339 369 398 370 341 313 284 358 431 400 369 363 357 455
1544 455 553 545 536 430 324 233 247 347 448 466 485 504 522 513 503 493 483 474 464 454 445 451 457 463 469 475 482 488 494 504 515 525 536 487 439 495 551 548 544 541 538
1542 538 544 549 493 436 401 366 394 422 374 326 278 230 251 272 292 313 312 311 309 308 308 307 369 431 443 454 466 477 458 438 419 399 301 202 186 275 371 404 416
1541 416 428 414 400 386 372 467 562 511 460 444 428 413 397 381 365 349 333 344 354 364 374 374 373 372 372 300 228 218 208 202 195 188 182 242 303 323 238 118
1539 118 60 113 228 299 370 341 312 278 243 272 300 282 265 247 230 248 266 221 176 179 181 245 310 319 327 336 345 351 357 363 369 482 595 603 612 549 486 423 360
1538 360 324 288 294 237 232 332 427 419 370 320 327 334 281 228 321 413 437 460 483 506 502 497 493 489 440 390 341 291 334 377 420 463 391 318 308 298 279 260 241
1536 241 222 235 249 262 275 295 315 335 355 292 228 268 309 313 317 321 325 364 403 415 365 293 222 216 272 278 284 294 304 294 285 275 266 293 320 347 374 372 371 334
1535 334 360 403 445 392 338 272 268 328 389 463 475 459 443 480 516 487 396 286 238 256 273 252 230 232 296 375 392 385 378 408 438 367 297 282 330 378
1533 378 364 356 348 371 332 275 218 220 221 245 269 293 317 348 380 411 443 415 387 300 213 165 179 220 261 287 313 338 364 313 262 238 277 292 307 323 338
1532 338 342 283 201 224 330 437 446 455 442 428 418 409 421 496 536 471 372 335 402 469 532 596 596 597 631 666 673 617 569 522 535 611 657 640 599 559 603
1531 603 648 692 736 708 680 616 615 695 775 754 734 716 699 686 672 674 739 768 798 817 837 857 876 964 1051 1115 1117 1153 1251 1346 1378 1357 1335 1414 1493 1529
1529 1529 1565 1539 1513 1512 1512 1551 1527 1486 1508 1553 1598 1565 1532 1499 1466 1406 1346 1287 1227 1183 1139 1095 1051 1058 1065 1037 1071 1172 1273 1313 1290 1282 1336 1391 1383 1357
1528 1357 1393 1453 1513 1476 1438 1428 1480 1544 1608 1649 1627 1565 1503 1437 1371 1356 1342 1352 1424 1525 1565 1491 1355 1291 1228 1160 1093 1025 957 893 829 740 714
1526 714 752 791 854 855 752 649 573 601 633 665 669 674 678 682 653 625 597 568 594 619 645 670 724 778 728 678 633 588 646 705 724 744 764 783 796 808
1525 808 821 833 889 944 896 847 864 881 897 914 928 943 963 984 995 1111 1265 1357 1350 1343 1332 1322 1352 1383 1476 1569 1642 1715 1789 1862 1880 1898 1916 1934 2068
1524 2068 2202 2336 2469 2450 2431 2350 2268 2310 2352 2394 2436 2438 2441 2443 2445 2467 2488 2510 2532 2645 2758 2829 2797 2774 2814 2876 2937 3036 3136 3236 3336 3405
1522 3405 3473 3604 3736 3831 3927 4023 4118 4177 4237 4192 4147 4171 4194 4218 4241 4340 4439 4538 4637 4744 4851 4912 4869 4757 4646 4527 4409 4295 4182
1521 4182 4006 3830 3565 3301 3099 2897 2771 2646 2521 2395 2272 2150 1971 1792 1682 1677 1675 1569 1415 1323 1294 1264 1235 1206 1181 1155 1134
1520 1134 1175 1216 1194 1178 1162 1141 1121 1050 979 970 962 926 891 856 821 850 880 910 940 1003 1066 1065 1000 934 929 948 967 971 976 980 984 955 927 902 878 850 884 923
1519 923 899 863 889 939 989 957 924 954 984 1036 1088 1175 1200 1165 1130 1091 1052 1066 1081 1158 1235 1287 1340 1393 1446 1477 1507 1538 1569 1655 1741 1827 1914 2067
1517 2067 2221 2375 2529 2685 2842 2998 3155 3261 3366 3468 3570 3706 3779 3825 3871 3953 4035 4090 4083 4029 3976 3919 3861 3800 3739 3678 3617 3628 3638
1516 3638 3649 3660 3697 3733 3770 3807 3819 3831 3843 3855 3862 3869 3834 3695 3532 3431 3324 3154 3017 2880 2739 2598 2457 2316 2178 2041 1863 1748
1515 1748 1660 1572 1423 1274 1187 1100 994 888 844 800 784 768 752 736 688 641 656 671 650 628 607 585 557 529 564 598 487 375 347 422 462
1514 462 439 418 460 536 550 499 448 467 486 481 414 376 399 419 376 349 322 353 384 390 395 397 398 392 323 289 256 280 304 328 352 361 370 378 387 353 319 285 251 306
1513 306 360 414 469 438 406 375 343 328 312 296 280 310 340 366 392 393 331 247 162 136 172 232 291 308 262 193 124 130 198 230 263 253 243 233 223 291
1511 291 360 363 304 303 365 387 410 408 405 438 409 303 198 200 264 338 412 386 360 327 294 266 237 308 443 523 458 337 279 315 289 191 93 60 89
1510 89 110 130 189 186 123 60 55 51 65 80 33 -14 -71 -129 -125 -120 -181 -241 -302 -362 -334 -306 -278 -250 -238 -226 -209 -193 -195 -134 -108 -82 -79 -75 -72 -68 -55 -42 5 -8
1508 -8 -72 -135 -96 5 75 83 31 -21 -20 43 108 109 120 130 198 267 264 262 259 256 221 185 150 115 108 101 157 212 237 262 225 187 140 94 116 200 265 329 290 189
1507 189 95 63 133 204 202 137 107 77 17 -41 -32 38 114 190 201 150 116 83 108 133 122 111 99 88 109 130 214 298 239 180 182 247 281 190 137 147
1505 147 165 182 203 224 182 139 96 54 105 157 105 52 85 117 149 181 157 134 110 86 74 61 112 162 228 295 362 428 480 532 522 512 514 517 582 646
1504 646 660 675 689 703 670 637 667 697 637 577 579 581 651 720 727 734 760 786 813 839 814 789 867 946 1005 1064 1061 1058 1089 1119 1212 1305 1344 1382 1421 1459 1564
1502 1564 1669 1774 1879 2048 2217 2386 2555 2747 2939 3169 3524 3953 4445 4978 5574 6217 6860 7611 8362 9199 10036 10753 11179
1501 11179 11305 11223 10952 10556 10090 9562 8998 8560 8308 8181 8158 8343 8759 9382 10177 11098 12057 12892 13315 13198 12612 11652 10439
1501 10439 9226 8042 6984 6021 5184 4459 3860 3398 3061 2794 2527 2275 2023 1831 1764 1730 1697 1607 1516 1426 1335 1273 1211 1212 1212 1198
1500 1198 1185 1171 1157 1076 994 913 831 801 771 845 919 857 794 731 669 677 686 695 703 630 557 546 535 547 558 570 581 612 643 674 706 709 712 716 719 719 718 718 717 722 727
1498 727 670 613 664 716 768 820 846 872 836 799 834 869 905 940 963 987 1010 1033 1079 1124 1170 1215 1312 1409 1443 1478 1597 1716 1842 1844 1841 1838 1930 2023 2146
1497 2146 2269 2496 2723 2972 3221 3469 3718 4011 4304 4598 4891 5350 5808 6192 6451 6779 7108 7429 7750 8044 8338 8569 8800
1496 8800 8970 9140 9247 9355 9449 9543 9782 10022 10191 10360 10592 10824 11018 11212 11302 11392 11486 11580 11641 11576 11465 11354 11235 11116 10836 10556
1495 10556 10276 9996 9815 9634 9557 9480 9455 9430 9551 9672 9843 10014 10171 10329 10345 10153 9787 9296 8703 7985 7198 6474 5837 5325
1494 5325 4850 4376 3987 3599 3356 3113 2976 2840 2704 2568 2533 2499 2465 2431 2318 2206 2094 1981 2000 2019 2039 2058 1978 1898 1818 1738 1815
1493 1815 1892 1970 2047 2168 2289 2473 2657 2796 2935 2929 2923 2910 2898 2947 2997 3034 3071 3107 3144 3332 3520 3707 3895 4106 4317 4633 4948 5293
1492 5293 5638 6129 6620 7203 7787 8449 9237 10147 11120 12134 13210 14347 15483 16452 17295 17975 18447 18538 18256 17723 16982 16051
1491 16051 14996 13877 12757 11707 10719 9834 9073 8407 7803 7244 6810 6469 6252 6109 5966 5727 5487 5236 4985 4838 4692
1490 4692 4537 4382 4227 4073 3971 3870 3768 3667 3652 3637 3622 3607 3566 3525 3484 3443 3495 3546 3598 3650 3701 3753 3805 3857 3934 4012 4090 4168 4334 4501
1489 4501 4667 4833 5061 5289 5517 5745 5853 5961 6069 6177 6113 6050 5986 5923 5879 5835 5791 5747 5685 5624 5458 5292 5118 4943 4768 4594
1488 4594 4396 4199 4001 3804 3685 3566 3446 3327 3194 3061 2928 2795 2730 2665 2599 2534 2501 2468 2435 2401 2353 2304 2255 2206 2211 2216 2221 2226 2231 2236 2241 2246
1487 2246 2217 2188 2159 2130 2137 2145 2156 2167 2154 2202 2290 2253 2181 2171 2222 2274 2364 2455 2546 2636 2683 2729 2783 2838 2903 3094 3318 3542 3648 3754 3860 3966
1485 3966 4230 4494 4758 5022 5184 5347 5696 6046 6433 6819 7268 7717 8307 8896 9639 10382 11212 12166 13295 14632 16099 17691
1484 17691 19504 21526 23668 25810 27825 29631 31193 32298 32902 32966 32593 31763 30624 29359 28059 26760 25348 23936
1484 23936 22475 21014 19553 18092 16755 15417 14192 12966 11866 10890 10044 9324 8655 7986 7471 6956 6488 6020 5615 5210
1483 5210 4929 4649 4376 4104 3871 3764 3586 3409 3307 3204 3102 3000 2954 2908 2861 2815 2683 2551 2411 2396 2435 2475 2412 2225 2023 1945
1482 1945 1977 2008 2006 2003 1939 1874 1882 1890 1898 1906 1848 1791 1733 1675 1668 1661 1654 1647 1692 1737 1844 1952 1925 1899 1976 2054 2077 2100 2061 2021 2035 2049 2063 2077 2107 2136 2103 2070
1480 2070 2009 1949 1992 2036 2116 2196 2213 2231 2163 2096 2029 1962 1898 1834 1832 1830 1728 1626 1592 1682 1757 1707 1630 1554 1580 1606 1633 1659 1707 1754 1739 1724 1756 1788
1479 1788 1759 1667 1607 1671 1759 1785 1753 1721 1790 1858 1925 1991 2058 2124 2136 2148 2222 2296 2377 2458 2539 2620 2670 2720 2832 2944 3041 3137 3233 3330 3587 3845
1478 3845 4165 4485 4851 5217 5586 5956 6430 6966 7588 8335 9218 10163 11161 12283 13540 14860 16106 17227 18266 19096 19583
1477 19583 19695 19488 18990 18226 17253 16071 14826 13611 12397 11255 10238 9234 8355 7618 7006 6477 5948 5516 5083 4755
1476 4755 4426 4217 4008 3736 3464 3171 2879 2732 2585 2454 2322 2254 2185 2127 2068 2010 1952 1884 1817 1749 1681 1613 1546 1443 1402 1419 1436 1394
1475 1394 1352 1270 1188 1169 1149 1124 1099 1015 931 961 1052 1082 1049 1001 953 901 849 865 881 897 913 882 851 882 913 925 937 887 836 856 876 837 798 799 861
1474 861 928 932 929 987 1046 1043 1027 1074 1145 1111 1013 977 999 1022 926 767 671 638 673 708 747 786 772 757 743 729 741 753 765 777 735 693 715 800 814 766
1472 766 757 748 753 758 763 768 799 829 797 766 769 772 776 779 765 751 737 723 701 680 596 511 521 531 440 349 301 314 355 396 407 418 428 439 476 513 450 387 388 451
1471 451 515 516 478 440 398 356 274 192 210 228 203 116 91 128 176 224 213 202 246 290 272 253 326 398 443 425 417 408 396 384 398 413 427 442 450 458 466 474
1469 474 531 588 583 515 505 598 727 793 734 676 640 668 705 743 719 633 529 487 510 533 510 488 465 443 446 450 453 456 460 463 467 470 447 424 401 378 340 301
1468 301 263 224 263 301 340 378 391 403 416 428 386 344 301 259 284 309 334 359 303 247 191 135 79 23 -33 -89 -108 -128 -147 -166 -170 -174 -178 -182 -168 -153 -139
1466 -139 -125 -85 -45 -5 34 91 147 204 261 318 374 427 480 525 507 525 542 589 635 581 527 508 551 559 567 540 513 451 452 451 451 454 457 487 516 546 575 624
1465 624 673 722 771 742 713 684 655 606 557 508 459 467 475 483 491 524 556 588 620 684 747 704 599 551 566 581 533 528 584 602 619 621 624 661 636 599 562 522
1464 522 481 504 527 550 573 592 611 669 664 653 704 751 736 682 628 574 519 473 489 504 458 424 390 356 323 366 472 578 621 544 466 453 503 489
1462 489 475 492 571 622 673 665 657 653 648 644 639 631 622 614 605 589 572 520 531 591 651 646 579 498 418 364 373 470 628 728 766 811 856 870 821 733 645 658 670 615
1461 615 560 505 450 376 302 231 160 129 160 156 152 111 70 53 98 152 144 33 -77 -126 -112 -134 -155 -175 -195 -211 -227 -248 -207 -200 -194 -229 -264 -271 -216 -95
1459 -95 25 86 83 89 157 279 339 333 264 227 190 196 203 210 217 197 178 159 140 170 199 229 259 325 392 458 524 544 563 586 610 627 706 785 802 744 686 728
1458 728 770 811 852 892 933 984 1034 1085 1135 1225 1314 1335 1293 1275 1258 1236 1215 1203 1190 1178 1166 1141 1116 1091 1067 1110 1153 1196 1239 1233 1227 1224 1222 1201 1242 1247 1253 1217
1456 1217 1181 1144 1108 1068 1028 992 955 946 1000 1014 925 823 722 718 714 730 745 698 651 616 580 545 510 471 432 498 563 564 566 509 452 472 555 598 538 437
1455 437 336 291 246 281 315 349 384 422 460 499 537 522 507 492 477 498 519 541 562 534 506 478 450 422 394 366 338 316 293 271 248 262 276 290
1454 290 304 257 210 162 115 104 93 82 71 41 10 -19 -50 -99 -149 -199 -249 -277 -305 -229 -153 -55 42 36 31 113 195 215 235 359 482 523 460 386 375
1452 375 322 269 330 392 453 515 527 540 552 565 558 551 543 536 586 635 788 941 1017 1092 1063 1034 1093 1151 1210 1268 1314 1360 1405 1451 1507 1562 1555 1486 1439 1496
1451 1496 1588 1617 1655 1692 1726 1759 1742 1725 1770 1815 1835 1855 1812 1769 1707 1645 1687 1729 1734 1740 1745 1750 1847 1943 1953 1858 1724 1589 1594 1598 1652 1707 1657 1607 1603 1600 1492
1449 1492 1384 1316 1247 1241 1235 1201 1167 1077 988 934 985 1074 1101 1061 1021 915 808 710 611 575 538 555 572 651 730 703 675 710 745 759 772 724 675 691
1448 691 708 787 866 810 755 762 769 751 732 817 902 999 1096 1131 1165 1149 1133 1012 892 864 835 806 777 779 780 781 782 789 796 803 810 823 836 849 863 877 891 1009
1447 1009 1127 1226 1325 1278 1231 1088 946 865 785 784 784 783 782 823 863 800 736 696 656 679 701 704 706 709 712 688 665 641 618 654 690 664 637 646 655 663 672 706 740
1445 740 773 807 854 901 889 877 874 934 919 800 684 671 740 808 800 791 783 774 739 705 733 760 789 818 846 875 815 755 758 761 799 838 877 916 909 902 833 763
1444 763 813 862 849 773 764 858 988 1056 1103 1150 1131 1112 1094 1077 1059 1041 956 871 932 993 987 982 1039 1095 1102 1109 1178 1247 1360 1472 1480 1488 1431 1375 1318 1262 1245
1442 1245 1229 1213 1197 1195 1194 1192 1190 1260 1330 1338 1345 1362 1379 1396 1413 1426 1439 1451 1464 1411 1358 1304 1251 1197 1144 1095 1045 1024 1065 1106 1085 1000 915 853 854 847 841 779 718
1441 718 672 689 768 785 740 695 708 722 719 717 715 713 767 822 877 932 926 920 973 1025 1033 978 924 932 916 901 889 878 953 1028 1041 1054 1072 1090 1143 1134 1128 1123 1148 1111
1439 1111 1051 991 1031 1070 1095 1120 1145 1170 1233 1295 1330 1303 1314 1325 1332 1338 1249 1160 1098 1098 1178 1258 1315 1309 1330 1352 1369 1387 1410 1433 1456 1480 1500 1521 1600 1679
1438 1679 1757 1772 1760 1748 1746 1743 1705 1729 1787 1845 1845 1844 1861 1877 1835 1793 1785 1840 1922 2004 2062 2121 2076 2030 1999 1968 1973 1914 1833 1751 1701 1588 1427 1266 1212 1220
1436 1220 1231 1241 1256 1271 1302 1334 1365 1397 1400 1403 1510 1617 1728 1839 1887 1873 1872 1975 2120 2265 2342 2419 2558 2698 2778 2859 2940 3021 3115 3210 3242
1435 3242 3274 3259 3244 3126 3007 2942 2876 2811 2746 2717 2689 2722 2756 2687 2617 2548 2478 2418 2358 2402 2445 2430 2415 2337 2259 2171 2083 2092 2102 2018 1830 1719 1754
1434 1754 1847 1878 1808 1737 1806 1876 1841 1806 1779 1752 1787 1823 1890 1958 1963 1906 1910 2018 2161 2241 2233 2224 2274 2324 2296 2268 2240 2212 2244 2277 2309 2341 2408 2475 2480 2485
1432 2485 2527 2569 2611 2653 2644 2635 2626 2618 2631 2644 2657 2670 2702 2735 2767 2800 2774 2749 2786 2823 2906 2988 2967 2945 2875 2805 2838 2872 2957 3041 3026 3010 3074 3200 3330
1431 3330 3397 3419 3504 3650 3795 3864 3871 3912 3954 4045 4136 4227 4318 4414 4510 4606 4702 4772 4842 4912 4982 5031 5079 5128 5176 5195 5213 5267 5259 5166 5073 5011 4887 4761
1430 4761 4635 4506 4377 4304 4231 4158 4085 3997 3908 3824 3739 3684 3691 3699 3644 3601 3559 3517 3475 3483 3553 3589 3624 3599 3575 3578 3643 3737 3831 3864 3835 3821 3870 3942 4014
1428 4014 4004 3994 4042 4091 4128 4102 4053 4109 4234 4359 4386 4414 4457 4500 4485 4470 4454 4500 4518 4536 4587 4743 4899 4950 4976 5001 5059 5055 5001 5009 5120 5232
1427 5232 5331 5368 5381 5394 5429 5525 5622 5656 5675 5695 5772 5850 5831 5811 5895 5980 6054 6127 6139 6150 6168 6187 6267 6347 6434 6521 6608 6695 6739 6783 6827 6871 6933 6996
1426 6996 7058 7121 7220 7318 7452 7524 7518 7512 7565 7618 7648 7679 7775 7933 8056 8118 8218 8318 8384 8451 8517 8584 8596 8608 8616 8624 8645 8604 8562 8583 8627 8671 8719 8767
1424 8767 8897 9026 9121 9278 9445 9612 9783 9953 10050 10147 10208 10332 10507 10682 10864 11047 11210 11435 11625 11816 11984 12153 12321 12489
1423 12489 12628 12767 12901 13036 13233 13368 13475 13582 13758 13935 14049 14100 14130 14265 14479 14693 14806 14857 14909 15022 15129 15235 15346 15456
1423 15456 15544 15633 15686 15802 15983 16165 16351 16537 16689 16841 17032 17160 17253 17408 17628 17849 18044 18240 18458 18740 18998 19194 19433 19775
1422 19775 20136 20497 20765 21032 21291 21613 22004 22395 22813 23231 23650 24068 24560 25053 25545 26038 26637 27236 27773 28310 28938 29566 30256
1421 30256 30946 31651 32355 33122 33889 34739 35590 36440 37290 38193 39097 40105 41112 42114 43116 44263 45410 46640 47869 49099
1420 49099 50328 51746 53165 54687 56210 57926 59642 61471 63299 65263 67352 69446 71540 73749 76166 78666 81166
1419 81166 83847 86735 89832 92929 96143 99565 103208 107059 111144 115520 120250 125272 130569 136241 142386 148989 156041
1419 156041 163550 171663 180484 189945 200113 211088 222854 235420 248695 262749 277595 293286 309852 327338
1418 327338 345949 366017 387710 411197 436808 465023 496277 530887 569202 611688 658878 711407 769806 834795
1418 834795 907151 987527 1076603 1174876 1282765 1400337 1527360 1662937 1805632 1953203 2102730 2250598
1417 2250598 2392514 2523616 2639025 2734291 2805788 2851001 2868366 2857460 2818706 2753190 2662906 2550923 2421248
1417 2421248 2278554 2127659 1973206 1819461 1670066 1527790 1394471 1271185 1158498 1056426 964610
1416 964610 882409 809101 743911 685975 634574 588881 548225 511998 479643 450711 424818 401553 380661 361809
1416 361809 344746 329336 315382 302703 291148 280501 270729 261611 253036 244913 237248 230057 223324 216940 210846
1415 210846 205034 199430 194025 188829 183892 179247 174818 170514 166490 162758 159394 156321 153560 151091 148918 147037 145426
1414 145426 144023 142866 141917 141275 140924 140818 140920 141292 142040 143096 144444 145989 147909 150209 152966 156114 159720 163739 168215
1414 168215 173159 178478 184167 190064 196059 201930 207590 212875 217656 221728 225060 227684 229626 230860 231413 231342 230833 230033
1413 230033 228919 227596 226151 224705 223389 222196 221231 220556 220186 220191 220545 221356 222607 224317 226505 229235 232518 236343 240730
1412 240730 245741 251352 257588 264475 272069 280428 289577 299503 310302 322072 334882 348712 363666 379798 397222
1412 397222 416065 436449 458328 481663 506498 532872 560922 590762 622527 656498 693009 732475 775314 822023
1411 822023 873192 929315 990990 1058867 1133765 1216531 1308096 1409526 1521957 1646502 1784196 1936168 2103475
1411 2103475 2286891 2486975 2703834 2937022 3185404 3446831 3718208 3995135 4271687 4540102 4790824
1410 4790824 5013289 5197082 5333683 5417959 5448768 5428832 5363568 5259715 5124512 4964707 4786194 4593653
1410 4593653 4390615 4179627 3962581 3741082 3517001 3292546 3070380 2853168 2643366 2442929 2253264
1409 2253264 2075297 1909573 1756129 1614851 1485438 1367493 1260496 1163896 1076996 999134 929555 867413
1409 867413 811972 762558 718513 679141 643807 612068 583535 557692 534139 512488 492376 473483 455546 438409
1408 438409 421979 406262 391253 377005 363632 351091 339341 328311 317906 308032 298699 289900 281642 273905 266625
1408 266625 259790 253414 247557 242242 237430 233160 229374 226045 223263 221022 219291 218018 217164 216684 216647 216984 217743 218876
1407 218876 220400 222215 224291 226575 229018 231461 233849 236029 237977 239634 240829 241482 241501 240978 239878 238153 235789 232800
1406 232800 229165 224906 220187 215094 209815 204474 199207 194147 189496 185385 181779 178630 176016 173942 172342 171116 170312
1406 170312 169883 169812 170033 170538 171417 172645 174164 175985 178097 180485 183165 186180 189570 193314 197432 201901 206829 212198
1405 212198 218026 224332 231263 238870 247185 256219 265962 276438 287788 300065 313299 327553 342764 358913 376101
1404 376101 394368 413924 434938 457575 481923 508395 537370 569216 604315 643035 685937 733625 786647 845705
1404 845705 911530 984972 1066839 1157906 1258955 1370703 1493514 1627356 1771645 1925300 2086416 2252403
1403 2252403 2419663 2583967 2740299 2883268 3007716 3108977 3183347 3228118 3241628 3223375 3173870 3094767
1403 3094767 2989095 2860819 2714596 2555260 2387853 2217242 2047613 1882439 1724369 1575416 1437015
1402 1437015 1309729 1193669 1088724 994426 910076 834702 767444 707555 654285 606861 564557 526676 492833
1402 492833 462501 435208 410595 388355 368318 350238 333844 318990 305442 293017 281576 270926 260877 251286
1401 251286 242194 233477 225182 217261 209564 202076 194730 187509 180523 173744 167113 160689 154500 148603 143090 137952 133116
1401 133116 128571 124254 120146 116314 112690 109328 106175 103131 100212 97392 94780 92308 89961 87753 85669 83717 81766
1400 81766 79873 78106 76496 74887 73315 71742 70245 68872 67601 66329 65011 63692 62478 61388 60374 59360 58314
1399 58314 57268 56368 55467 54664 53861 53059 52256 51409 50563 49862 49161 48423 47684 47050 46416 45829 45243 44719 44196 43600 43005 42410
1398 42410 41814 41311 40807 40366 39925 39391 38858 38324 37791 37298 36806 36314 35821 35359 34897 34434 33972 33571 33170 32831 32493 32119 31746
1398 31746 31372 30998 30690 30381 30072 29764 29489 29214 29077 28940 28725 28384 27982 27704 27532 27359 27049 26739 26452 26164 25877 25590 25337
1397 25337 25084 24726 24369 24149 23929 23709 23489 23219 22950 22684 22418 22187 22017 21875 21733 21610 21488 21365 21243 21046 20850 20682 20575
1396 20575 20449 20324 20139 19955 19826 19697 19603 19447 19223 18999 18771 18543 18369 18196 18057 17856 17617 17377 17237 17097 16933 16770 16606
1395 16606 16442 16285 16127 15970 15813 15715 15617 15519 15422 15306 15190 15015 14840 14726 14674 14649 14624 14548 14473 14397 14322 14246 14170 14095 14019 13974 13928 13882 13837
1394 13837 13699 13561 13450 13402 13364 13326 13188 13050 12897 12745 12657 12632 12650 12605 12458 12310 12252 12255 12224 12192 12152 12111 12071 12030 12036 12041 11988 11935 11893 11914 11962
1393 11962 12011 11951 11892 11797 11765 11775 11786 11801 11815 11852 11889 11864 11838 11784 11730 11680 11630 11577 11587 11625 11662 11723 11783 11779 11712 11653 11657 11622 11587 11588 11589 11629 11607 11565 11585 11667
1391 11667 11748 11801 11792 11752 11651 11587 11586 11608 11631 11683 11735 11788 11840 11851 11862 11875 11888 11926 11996 12079 12100 12067 11971 11890 11839 11804 11768 11735 11701 11609 11517 11425 11333 11180
1390 11180 11027 10939 10913 10893 10811 10664 10517 10405 10294 10186 10078 9997 9978 9962 9883 9789 9727 9680 9570 9449 9359 9309 9260 9178 9095 9017 8938 8916 8957
1389 8957 8998 8976 8884 8792 8696 8600 8477 8354 8230 8107 8041 7975 7911 7847 7787 7759 7750 7679 7564 7480 7439 7461 7490 7458 7342 7195 7115 7138 7137 7075 7041 7039
1387 7039 7033 6996 6924 6852 6880 6908 6887 6835 6825 6879 6884 6858 6853 6849 6858 6867 6876 6885 6882 6880 6877 6875 6856 6837 6879 6920 6942 6932 6905 6940 6967 6993 6920 6846 6816 6785 6754 6724 6703 6683
1386 6683 6663 6643 6662 6681 6643 6606 6624 6746 6871 6997 7110 7222 7335 7448 7542 7636 7792 7949 8103 8257 8411 8565 8660 8755 8787 8820 8761 8702
1385 8702 8644 8585 8485 8385 8347 8309 8179 8049 7919 7789 7682 7576 7470 7363 7395 7426 7395 7364 7274 7183 7154 7126 7137 7148 7158 7169 7224 7279 7334
1384 7334 7389 7397 7405 7413 7421 7403 7384 7365 7347 7344 7341 7338 7335 7319 7304 7288 7272 7160 7048 6999 6949 6829 6709 6628 6651 6654 6554 6417 6342 6292 6180 6009 5901 5887
1382 5887 5874 5802 5730 5668 5606 5545 5483 5465 5446 5427 5409 5357 5305 5253 5202 5209 5215 5118 5021 5020 5020 5019 5018 4989 4960 4868 4777 4702 4628 4553 4479 4517 4556 4532 4508 4455 4402
1381 4402 4411 4420 4394 4368 4342 4315 4255 4194 4196 4197 4248 4299 4246 4193 4218 4243 4268 4293 4316 4339 4300 4261 4211 4160 4214 4267 4313 4358 4342 4325 4224 4123 4085 4047 4079
1380 4079 4111 4143 4175 4192 4209 4227 4244 4242 4240 4238 4236 4156 4077 4102 4126 4074 4022 3907 3792 3765 3737 3772 3806 3776 3746 3715 3685 3708 3730 3753 3776 3833 3891 3887 3882 3854
1378 3854 3826 3804 3783 3726 3773 3860 3884 3838 3793 3883 3973 3982 3888 3793 3802 3849 3895 3948 4001 4042 4083 4062 4040 4009 3978 3947 3916 3918 3919 3921 3922 3888 3854 3821 3787 3899 4010
1377 4010 3976 3943 3876 3808 3845 3882 3899 3915 3931 3947 3893 3838 3784 3730 3700 3670 3705 3803 3885 3904 3820 3736 3702 3730 3758 3724 3660 3596 3591 3585 3586 3587 3530 3472 3424 3439
1375 3439 3523 3606 3640 3675 3646 3618 3566 3513 3464 3415 3422 3492 3562 3569 3544 3518 3489 3460 3363 3266 3196 3189 3227 3265 3302 3340 3328 3254 3180 3168 3222 3275 3270 3265 3210 3154 3161
1374 3161 3167 3177 3187 3134 3082 3072 3062 3052 3043 3032 3021 3068 3116 3163 3148 3164 3181 3187 3132 3076 3083 3106 3130 3018 2906 2898 2993 3065 3075 3081 3086 3088 3090 3081 3072 3067 3062 3058 3116 3140
1372 3140 3163 3149 3135 3120 3106 3091 3075 3001 2927 2838 2812 2793 2711 2677 2747 2859 2971 2981 2991 3000 3010 3000 2991 2981 2971 2997 3024 3050 3077 3039 3002 2965 2927 2854
1371 2854 2780 2769 2757 2747 2737 2786 2834 2895 2894 2828 2761 2719 2740 2823 2844 2809 2775 2795 2815 2813 2748 2719 2689 2713 2736 2759 2782 2818 2855 2832 2810 2793 2839 2908 2977
1370 2977 3027 3014 2936 2858 2820 2844 2833 2822 2770 2717 2727 2737 2738 2740 2717 2633 2558 2547 2637 2728 2787 2783 2752 2721 2774 2826 2913 2938 2899 2859 2816 2772 2745 2717 2689 2661
1368 2661 2719 2777 2835 2892 2872 2852 2832 2811 2788 2764 2741 2717 2747 2777 2803 2829 2896 2901 2879 2857 2886 2914 2881 2847 2884 2922 2960 2998 3082 3167 3247 3224 3102 2980
1367 2980 2920 2923 2907 2890 2819 2747 2653 2622 2655 2688 2683 2615 2547 2541 2572 2604 2573 2542 2503 2402 2300 2261 2334 2407 2457 2444 2388 2333 2300 2330 2351 2371 2333 2295 2305
1366 2305 2315 2325 2335 2354 2373 2327 2219 2161 2166 2232 2298 2343 2325 2243 2160 2105 2112 2147 2181 2193 2204 2215 2226 2185 2144 2127 2172 2248 2262 2174 2085 2091 2160 2194 2123
1364 2123 2021 1982 1968 1953 1943 1994 2046 2036 2015 1995 1974 1953 1926 1962 2059 2095 2074 2052 2027 2002 1935 1869 1844 1922 2037 2090 2042 1995 2023 2113 2168 2223 2202
1363 2202 2180 2159 2137 2089 2042 1994 1947 1957 1966 1976 1986 1985 1983 1923 1862 1843 1887 1930 1911 1908 1905 1960 2015 2033 2051 2069 2087 2108 2130 2187 2182 2142 2102 2086 2132 2201 2269
1361 2269 2279 2289 2339 2388 2438 2488 2477 2465 2398 2331 2303 2379 2531 2621 2600 2516 2427 2402 2415 2429 2450 2471 2514 2620 2691 2762 2790 2819 2852 2884 2914 3007 3099
1360 3099 3129 3110 3091 3073 3054 2996 3001 3005 2948 2918 2889 2851 2814 2688 2500 2351 2306 2293 2281 2210 2077 1991 1967 2004 2041 2040 1976 1889 1802 1771 1802 1833 1802 1769
1359 1769 1736 1699 1662 1651 1640 1629 1618 1602 1587 1575 1563 1510 1519 1591 1600 1539 1477 1477 1540 1563 1524 1524 1523 1538 1552 1567 1581 1596 1611 1625 1640 1659 1679 1699 1719 1744 1769
1357 1769 1690 1611 1552 1494 1498 1502 1486 1470 1459 1447 1411 1438 1530 1621 1691 1698 1636 1575 1595 1615 1574 1532 1518 1505 1492 1478 1518 1558 1599 1639 1597 1555 1513 1471 1471 1471 1451
1356 1451 1368 1316 1368 1462 1555 1529 1504 1478 1452 1448 1445 1441 1437 1410 1383 1356 1329 1359 1389 1419 1449 1470 1491 1513 1534 1519 1503 1488 1473 1529 1586 1642 1698 1681 1663 1645
1355 1645 1627 1670 1713 1818 1923 1912 1900 1784 1668 1660 1651 1643 1634 1635 1635 1636 1636 1656 1676 1696 1715 1696 1677 1762 1847 1821 1795 1831 1867 1875 1883 1891 1898 1964 2029 2094 2159 2180
1353 2180 2200 2159 2055 2010 2070 2126 2077 2020 1962 1898 1834 1785 1735 1686 1636 1613 1590 1566 1543 1493 1443 1393 1343 1308 1274 1239 1205 1243 1281 1320 1358 1335 1312 1289
1352 1289 1266 1316 1366 1353 1341 1233 1125 1118 1111 1166 1159 1124 1089 1181 1272 1337 1339 1327 1315 1303 1291 1245 1262 1306 1350 1357 1363 1428 1492 1493 1432 1406 1379 1325 1271 1181 1154
1350 1154 1171 1189 1210 1231 1330 1428 1443 1355 1211 1130 1153 1176 1185 1194 1203 1211 1255 1299 1343 1387 1366 1345 1324 1303 1297 1292 1345 1398 1459 1458 1388 1317 1321 1325 1329 1333 1334 1334 1335 1335 1335 1336
1349 1336 1340 1345 1349 1416 1483 1488 1443 1399 1354 1309 1313 1379 1409 1440 1407 1375 1342 1309 1326 1343 1360 1378 1354 1331 1312 1293 1245 1260 1340 1420 1450 1418 1421 1424 1455 1485 1493 1437
1347 1437 1359 1343 1392 1441 1478 1516 1553 1591 1546 1502 1422 1405 1423 1442 1405 1369 1320 1333 1373 1414 1436 1459 1419 1379 1411 1442 1474 1506 1553 1600 1644 1583 1486 1389
1346 1389 1389 1389 1400 1411 1526 1641 1626 1611 1596 1581 1576 1571 1567 1562 1460 1358 1401 1444 1447 1449 1452 1454 1467 1480 1555 1630 1606 1582 1558 1534 1514 1494 1474 1454 1446 1438 1430 1422 1451
1344 1451 1480 1508 1537 1517 1497 1477 1457 1466 1474 1546 1617 1669 1721 1711 1700 1637 1573 1572 1571 1549 1527 1505 1482 1455 1428 1463 1498 1490 1481 1473 1464 1575 1686 1755 1721 1677 1696
1343 1696 1778 1859 1825 1791 1861 1930 1953 1975 2060 2145 2248 2351 2510 2670 2797 2820 2798 2776 2826 2875 2925 2974 3109 3244 3379 3514 3633 3753 3976
1342 3976 4199 4410 4620 4768 4916 5148 5381 5659 6041 6568 7095 7705 8378 9148 10044 10935 11826 12656 13486 14275 14938 15443 15823
1341 15823 16094 16240 16218 15989 15623 15132 14626 14058 13366 12610 11843 11075 10304 9533 8898 8263 7698 7134 6600 6191 5868 5608 5348
1340 5348 5152 5028 4904 4736 4567 4399 4231 4078 3926 3773 3621 3574 3528 3377 3226 3156 3087 3079 3071 3029 2986 2944 2901 2836 2771 2707 2642 2567 2493
1339 2493 2418 2343 2292 2241 2286 2331 2391 2326 2227 2128 2134 2139 2144 2149 2139 2128 2117 2107 2132 2158 2184 2210 2192 2175 2158 2141 2139 2138 2136 2135 2099 2064 2028 1993 1991 1990 2092 2195
1337 2195 2316 2438 2455 2472 2466 2460 2454 2448 2453 2459 2464 2470 2443 2416 2326 2237 2224 2211 2198 2185 2207 2229 2313 2398 2415 2433 2388 2343 2346 2350 2353 2356 2331 2306 2427 2548 2626 2704
1336 2704 2720 2736 2783 2831 2941 3051 3173 3294 3416 3538 3676 3814 4014 4215 4415 4616 4754 4892 5089 5285 5482 5679 5885 6091
1335 6091 6401 6711 7055 7399 7735 8196 8743 9291 9908 10525 11311 12097 12930 13888 15006 16332 17749 19291 20930 22570 24204
1334 24204 25838 27406 28766 29827 30512 30798 30709 30277 29553 28642 27607 26485 25363 24247 23256 22341 21425 20469 19513 18453
1333 18453 17393 16343 15292 14249 13207 12225 11368 10553 9738 8994 8374 7914 7453 7043 6633 6223 5813 5556 5299 5104 4910
1333 4910 4789 4669 4548 4427 4278 4129 3980 3831 3695 3558 3360 3161 3035 2909 2845 2781 2774 2766 2758 2750 2709 2668 2573 2477 2356 2359 2396 2433 2394
1331 2394 2354 2314 2275 2229 2183 2199 2216 2213 2209 2148 2086 2058 2093 2167 2115 2000 1947 2038 2130 2135 2141 2146 2152 2134 2117 2100 2083 2102 2121 2140 2159 2182 2205 2228 2251 2165 2078
1330 2078 2055 2031 1980 1930 1941 1953 1970 1987 2005 2022 1990 1958 1926 1894 1926 1958 1990 2022 2024 2027 1967 1907 1954 2001 2048 2095 2075 2055 2098 2140 2205 2269 2334 2399 2431
1329 2431 2463 2495 2527 2656 2784 2850 2916 2981 3046 3174 3302 3415 3529 3642 3755 3813 3870 4073 4276 4461 4646 4894 5141 5475 5810 6144
1328 6144 6479 6862 7246 7749 8313 8998 9807 10744 11743 12702 13660 14678 15695 16581 17342 17924 18380 18746 18986 19040 18885 18471 17850
1327 17850 17044 16114 15045 13913 12774 11697 10678 9659 8714 7915 7222 6634 6110 5649 5256 4925 4667 4409 4132 3854 3608
1326 3608 3424 3327 3292 3262 3168 2998 2828 2682 2597 2516 2434 2321 2271 2282 2293 2280 2205 2128 2051 2033 2015 1948 1882 1839 1858 1883 1846 1786 1725 1711 1698 1657
1325 1657 1553 1479 1406 1397 1451 1528 1605 1580 1492 1367 1305 1308 1311 1316 1320 1262 1204 1156 1108 1122 1137 1128 1119 1110 1101 1114 1127 1136 1145 1181 1153 1061 969 948 990 997 1004 1041 1077 1114
1323 1114 1151 1153 1155 1095 1035 1010 985 960 934 914 893 872 851 831 810 793 776 791 867 909 951 957 964 912 860 799 800 828 856 900 944 926 907 898 889 879 870 834
1322 834 799 764 728 696 665 695 726 795 865 831 796 802 807 812 817 769 721 677 633 582 594 570 547 584 622 660 697 694 691 688 684 697 709 721 733 761 789 813 837
1320 837 828 757 721 685 706 727 748 769 790 811 832 853 850 847 843 840 800 761 725 689 714 801 888 913 905 897 865 770 684 702 761 821 825 828 832 835 875 914 949 984
1319 984 966 885 840 794 767 740 713 686 729 772 850 866 863 861 798 736 663 695 809 924 989 992 967 942 921 900 879 858 815 771 727 684 697 711 724
1317 724 738 711 684 657 630 650 669 689 709 711 714 712 711 742 711 680 711 758 805 753 700 680 659 639 619 607 596 584 573 608 644 679 714 751 788 825 862
1316 862 842 822 801 781 773 765 757 750 716 682 648 614 624 634 683 670 672 736 762 788 784 780 776 772 736 699 663 626 586 546 530 576 645 652 598 543 574 668 762 793
1314 793 779 765 746 728 696 665 633 601 616 631 646 661 643 624 605 586 586 585 623 600 588 639 630 559 478 500 599 636 625 613 602 590 576 625 638 652
1313 652 642 632 622 612 628 644 660 676 675 674 672 671 699 728 756 785 814 844 774 703 641 641 668 695 676 656 699 743 751 758 766 774 795 815 773 731 757 782 843
1311 843 841 824 807 825 780 735 753 732 711 682 653 623 594 591 588 589 590 611 695 780 801 773 746 776 807 718 629 599 569 542 453 399 346 335 323 312 301
1310 301 355 409 400 392 345 299 280 324 374 424 413 339 333 390 442 432 393 354 374 394 386 378 370 362 397 433 409 386 356 390 451 511 504 498 491 484 409 334 287 302
1308 302 353 405 398 391 468 544 556 506 483 524 525 527 506 484 467 450 409 431 480 530 534 539 543 548 553 557 597 574 555 535 512 489 460 432 503 575 648 658 641 624
1307 624 568 511 483 516 607 697 649 602 585 632 678 661 644 627 606 586 591 596 640 622 574 589 627 666 657 648 640 631 611 592 611 567 527 548 570 529 467 467
1305 467 532 598 565 533 601 668 695 659 619 642 710 716 660 605 602 663 723 720 704 687 667 646 613 579 550 520 446 435 451 467 526 584 678 710 688 666
1304 666 699 732 716 637 594 550 519 487 456 424 439 454 446 375 317 322 292 261 191 184 238 231 145 59 76 156 230 241 229 217 250 282 314 346 310 274 301
1302 301 327 334 341 348 355 331 308 288 268 242 279 380 481 562 580 485 327 227 189 175 160 189 217 245 273 238 202 167 131 150 169 188 207 251 296
1301 296 341 386 364 341 319 297 275 252 230 208 255 302 388 411 392 435 474 451 373 294 333 372 360 285 250 215 204 256 273 290 311 332 353 373 346
1300 346 318 255 255 266 277 293 308 340 373 405 438 444 451 457 464 433 403 373 343 321 299 395 491 499 403 331 321 345 369 396 424 488 552 612 672 718 701 599
1298 599 496 469 504 505 505 486 466 447 428 428 428 432 436 478 584 689 732 731 731 726 722 681 640 599 558 531 504 478 451 461 471 477 483 504 463 452 442 441 377 310
1297 310 305 294 221 187 153 141 129 121 113 136 220 305 327 279 231 179 127 118 108 98 88 79 69 59 50 71 93 115 137 159 181 202 224 223 221 219 218 216 214 217 219 225
1295 225 292 325 358 387 416 327 237 210 287 340 331 319 307 292 276 253 229 206 183 224 266 307 349 296 242 275 369 378 325 314 304 299 357 380 402 330
1294 330 258 189 121 98 137 142 146 170 194 218 242 212 182 156 130 170 273 340 408 430 453 392 269 133 101 215 328 347 366 385 403 388 373
1292 373 358 343 342 341 343 346 333 383 432 419 380 341 419 498 467 373 279 248 293 337 385 433 397 360 324 288 259 230 264 298 297 296 294 293 302 311 320 328 298 268 300
1291 300 332 363 394 363 331 296 261 329 398 404 410 416 422 450 478 444 409 347 286 168 51 15 83 156 228 218 208 219 293 347 297 170 106 132 158
1289 158 83 9 38 66 95 124 75 27 42 56 78 100 122 144 152 161 107 52 -3 -60 70 200 226 251 276 301 295 289 282 276 218 160 164 168 174 180 206 295 336
1288 336 273 233 255 243 168 97 89 121 154 191 228 225 223 276 330 371 308 207 167 266 364 404 444 493 543 530 517 457 397 337 277 286 295 305 314 343 372
1286 372 338 304 214 124 33 -56 35 127 156 186 208 229 251 273 275 277 280 282 282 283 284 284 300 317 333 349 346 344 341 339 340 341 343 344 337 331 387 443 421 399 376 354 319 283
1285 283 311 338 365 392 356 321 338 355 373 390 403 417 430 443 436 428 421 413 369 325 281 237 269 302 334 367 346 325 304 283 337 392 346 300 304 370 459
1283 459 445 344 243 239 236 282 327 332 232 90 10 35 59 59 58 120 182 263 344 363 381 407 432 394 357 318 279 240 201 184 168 151 134 155 176
1282 176 197 218 192 166 140 115 93 70 48 26 59 91 62 32 30 29 90 152 158 165 171 178 148 118 88 58 86 113 140 168 163 159 154 150 161 172 183 194 185 177 168
1280 168 159 212 264 317 369 404 439 370 301 264 228 295 363 381 400 357 313 337 362 386 410 353 295 238 181 233 285 337 389 352 315 278 241 226 211
1279 211 196 181 185 188 295 402 404 406 404 402 368 271 139 132 211 290 231 172 181 191 201 211 212 212 151 89 169 249 226 140 141 266 387 384 356 328 355 382
1277 382 409 436 400 364 387 410 432 455 424 394 406 356 227 224 333 443 470 498 525 553 502 452 402 351 368 386 403 420 428 436 444 452 476 501 526 551
1276 551 613 676 658 536 414 396 458 521 537 552 568 583 561 539 516 494 490 486 482 477 454 430 469 507 470 433 396 359 404 449 432 414 354 294 296 361
1275 361 389 314 242 274 331 388 389 390 414 439 463 488 620 753 698 643 626 609 655 700 746 793 735 677 663 649 698 746 826 906 840 774 798 822 846
1273 846 869 905 940 1037 1135 1168 1200 1129 1057 1121 1184 1248 1311 1317 1323 1309 1231 1229 1331 1475 1619 1711 1802 1894 1986 2022 2059 2157 2256 2392 2527 2662 2798
1272 2798 2952 3105 3322 3538 3823 4109 4331 4554 4813 5073 5519 5966 6510 7054 7598 8142 8772 9401 10093 10785 11436 12087 12673
1271 12673 13258 13845 14371 14772 15049 15193 15337 15357 15251 15033 14815 14616 14355 13931 13382 12754 12127 11495 10864 10233 9602 8967 8332
1270 8332 7801 7270 6805 6340 5978 5617 5223 4830 4540 4250 3956 3661 3366 3072 2989 2906 2886 2866 2786 2707 2565 2423 2343 2262 2181 2100
1269 2100 2010 1920 1934 1948 1950 1952 1892 1832 1808 1783 1697 1610 1637 1663 1628 1592 1586 1580 1574 1568 1532 1496 1461 1425 1365 1305 1245 1185 1197 1208 1165 1122 1132 1267 1366 1404 1387
1268 1387 1371 1413 1456 1488 1521 1553 1586 1611 1636 1598 1560 1547 1534 1521 1508 1473 1438 1466 1493 1523 1554 1439 1324 1279 1234 1252 1269 1292 1315 1401 1486 1560 1634
1266 1634 1645 1656 1663 1670 1677 1683 1737 1791 1782 1773 1837 1901 1964 2028 2118 2208 2298 2388 2420 2453 2548 2643 2750 2856 2963 3070 3191 3313 3434 3555 3812 4068
1265 4068 4221 4373 4572 4770 5113 5457 5917 6376 6816 7194 7615 8161 8784 9471 10171 10872 11576 12281 13092 13903 14714 15525 16331
1264 16331 17137 18005 18874 19750 20626 21395 22163 22868 23510 24029 24423 24685 24948 25156 25239 25116 24785 24314 23718 23027 22212 21259 20180
1263 20180 19118 18055 16922 15789 14710 13631 12698 11765 10927 10088 9285 8545 7930 7440 7030 6619 6148 5676 5309 4941 4735
1263 4735 4529 4323 4117 3884 3651 3410 3294 3255 3217 3082 2947 2803 2659 2577 2496 2509 2522 2535 2548 2470 2392 2258 2124 2096 2172 2247 2219 2124
1262 2124 2029 1990 1952 1859 1767 1775 1783 1737 1627 1595 1667 1761 1793 1721 1649 1626 1603 1643 1682 1688 1694 1700 1706 1778 1850 1818 1787 1731 1676 1683 1690 1598 1506 1414 1323 1297 1272 1246
1260 1246 1221 1258 1295 1228 1161 1108 1056 1067 1077 1038 999 1099 1199 1244 1186 1093 1062 1097 1195 1297 1336 1306 1276 1305 1334 1405 1477 1486 1496 1506 1515 1463 1410 1457
1259 1457 1503 1549 1596 1699 1803 1907 2011 2009 2007 2006 2004 2092 2180 2331 2481 2625 2769 2976 3182 3380 3578 3713 3849 4094 4340 4690 5040
1258 5040 5368 5696 6024 6352 6847 7343 7839 8334 8857 9381 9904 10427 10836 11245 11546 11847 12129 12348 12470 12488 12414 12277 12102 11928
1257 11928 11710 11430 11098 10662 10170 9678 9179 8681 8137 7593 7111 6629 6159 5689 5282 4874 4495 4115 3797 3480 3257 3035 2875
1256 2875 2715 2590 2465 2340 2215 2130 2046 1961 1876 1766 1656 1546 1436 1406 1375 1344 1314 1376 1438 1355 1271 1261 1250 1240 1229 1162 1095 1131 1168 1151
1255 1151 1135 1059 984 963 1004 1006 904 783 661 534 406 367 329 394 460 375 290 204 119 121 124 63 3 -17 -38 -59 -81 -72 -63 8 79 138 196 255
1253 255 313 316 320 261 202 214 227 240 252 240 229 217 205 157 109 61 13 51 88 126 164 224 283 239 195 225 255 285 315 398 481 419 356 409 462 452
1252 452 380 352 428 539 588 607 627 642 658 680 702 661 621 635 649 599 485 398 373 414 454 521 589 591 532 461 453 448 380 322 367 489 549 562 575
1251 575 561 484 392 363 399 434 413 392 433 474 438 402 366 331 356 382 407 432 407 382 361 340 279 280 309 337 309 281 316 351 338 326 314 302 298 295
1249 295 292 289 321 353 322 292 256 220 184 148 176 204 231 259 308 357 406 455 487 518 482 382 300 218 236 254 270 287 304 320 316 311 244 177 145 113
1248 113 81 49 17 -14 -46 -79 -50 -21 3 28 -2 -95 -253 -411 -486 -499 -507 -578 -660 -680 -700 -782 -942 -1040 -1031 -1022 -980 -938 -896 -854 -862 -869 -773 -676 -633 -590
1246 -590 -546 -503 -344 -185 -68 -54 -75 -32 3 -23 -52 -82 30 143 151 159 167 175 228 280 270 260 343 426 509 593 639 686 670 655 715 775 835 895
1245 895 884 872 861 849 874 898 922 947 959 972 984 997 1044 1091 1201 1310 1262 1214 1104 994 1012 1030 1111 1191 1151 1110 1132 1154 1156 1157 1158 1159 1197 1235 1168
1244 1168 1102 1102 1101 1101 1101 1129 1157 1147 1032 866 805 824 843 831 819 807 795 761 728 756 785 731 678 625 571 520 468 416 364 405 446 424 402 399 396 393 389
1242 389 379 368 361 353 368 445 490 431 323 320 390 399 353 307 403 562 667 668 628 588 576 565 553 542 524 506 488 470 441 412 383 354 382 410 469 528
1241 528 546 565 521 477 408 339 370 401 417 370 296 222 222 222 222 222 213 203 194 185 128 72 20 -31 -40 12 31 49 4 -40 -82 -123 -69 47 163 217 212 207 171
1239 171 135 136 200 291 381 413 445 476 508 543 578 613 648 605 562 546 592 656 720 788 856 934 1011 1058 1104 1116 1129 1204 1279 1352 1425 1467 1509 1475 1440
1238 1440 1402 1427 1485 1543 1543 1542 1595 1648 1677 1644 1606 1632 1681 1729 1779 1829 1879 1929 1936 1943 1947 1950 1924 1836 1748 1722 1745 1769 1797 1824 1811 1798 1785 1772 1722 1672 1623
1237 1623 1573 1541 1509 1477 1445 1442 1440 1406 1372 1351 1331 1248 1166 1108 1051 1056 1061 1069 1078 982 824 708 696 726 756 720 684 679 674 638 602 628 717 756 692 619 609
1235 609 685 699 605 512 466 421 406 392 441 491 571 652 719 787 709 568 487 511 576 640 674 707 709 710 660 609 558 507 569 632 590 486 452 522 569
1234 569 553 518 545 534 522 526 529 515 438 370 448 579 647 657 667 673 680 620 560 605 649 657 664 640 616 591 565 602 639 676 713 688 662 640 617 626 635 639 644
1232 644 618 591 640 689 738 787 739 691 748 804 804 804 805 805 869 933 997 1061 1035 1008 981 954 1023 1092 1099 1106 1029 951 936 922 895 868 842 815 877 938 860 782
1231 782 768 858 951 941 923 968 1006 982 966 951 932 913 871 829 891 954 922 891 922 953 989 1025 1062 1098 1138 1179 1219 1259 1218 1177 1136 1095 1101 1106 1112 1118 1109
1229 1109 1100 1091 1082 1061 1040 1124 1207 1195 1183 1170 1158 1113 1069 968 867 835 907 982 1058 1107 1155 1099 1044 1027 1010 1056 1102 1084 1066 1152 1238 1169 1099 1030 961
1228 961 947 934 983 1032 1013 994 913 832 822 813 866 919 863 807 752 696 770 845 919 994 1035 1077 1057 1036 1053 1071 1029 988 961 996 1058 1121 1129 1136 1207 1277
1227 1277 1283 1289 1295 1301 1324 1346 1307 1267 1243 1218 1256 1294 1340 1386 1432 1478 1483 1488 1493 1498 1526 1553 1580 1608 1649 1691 1670 1649 1663 1677 1691 1705 1685 1665 1649 1633 1662 1754
1225 1754 1846 1875 1839 1803 1832 1923 1994 2066 2042 2017 2011 2067 2089 2110 2155 2199 2244 2289 2309 2330 2351 2371 2451 2530 2544 2496 2442 2451 2483 2515 2514 2514 2486 2396 2314 2232
1224 2232 2146 2060 1993 1925 1916 1907 1825 1680 1540 1461 1460 1521 1586 1589 1564 1539 1514 1489 1569 1712 1820 1927 1974 2020 2071 2121 2273 2487 2698 2846 2949
1222 2949 2989 3025 3124 3314 3504 3656 3705 3761 3880 4016 4048 4037 4026 4112 4199 4227 4255 4220 4186 4129 4072 3953 3834 3770 3706 3642 3578 3513 3449 3385 3321
1221 3321 3209 3097 3048 2998 2925 2852 2779 2706 2736 2767 2776 2723 2649 2679 2786 2830 2784 2738 2750 2762 2728 2695 2661 2628 2570 2512 2599 2687 2739 2791 2844 2896 2948
1220 2948 3001 3053 3105 3145 3186 3226 3267 3222 3177 3195 3212 3230 3248 3203 3158 3181 3203 3226 3249 3232 3216 3262 3308 3289 3270 3251 3233 3256 3278 3301 3324 3405 3487 3422
1219 3422 3358 3340 3322 3367 3412 3424 3437 3449 3462 3607 3752 3814 3772 3729 3748 3830 3912 3987 4062 4138 4213 4267 4320 4374 4428 4564 4699 4773 4846 4969 5091
1217 5091 5214 5337 5426 5514 5564 5510 5466 5527 5657 5725 5717 5645 5605 5566 5536 5506 5476 5446 5404 5363 5294 5162 4992 4821 4716 4611 4537 4567 4635 4642 4532
1216 4532 4422 4377 4394 4407 4419 4431 4443 4482 4457 4410 4362 4406 4511 4617 4661 4670 4678 4722 4704 4690 4739 4812 4884 4894 4903 4975 5047 5055 5063 5075 5087 5127 5229 5358
1215 5358 5487 5538 5589 5640 5692 5745 5798 5851 5904 5969 6034 6099 6163 6232 6302 6350 6336 6346 6461 6617 6774 6809 6844 6938 7032 7131 7167 7177 7186 7222 7257 7293 7328
1214 7328 7403 7478 7552 7627 7707 7787 7805 7823 7837 7851 7927 8003 8067 8130 8136 8141 8186 8294 8367 8440 8492 8545 8598 8651 8755 8859 8904 8949 9039 9191 9343 9433 9452
1212 9452 9472 9452 9495 9582 9670 9761 9852 9937 10023 10082 10078 10080 10082 10080 10078 10150 10223 10295 10367 10495 10622 10750 10877 10907 10937 11113 11289 11435 11582 11729 11876 12068
1211 12068 12260 12452 12645 12891 13138 13444 13645 13785 13926 14059 14193 14428 14663 14898 15133 15331 15530 15666 15802 15923 16045 16271 16497
1210 16497 16609 16722 16897 17072 17262 17451 17641 17830 17977 18124 18266 18409 18552 18632 18689 18850 19141 19432 19729 20027 20228 20428 20629
1209 20629 20830 21057 21283 21510 21737 22000 22264 22527 22790 23103 23415 23790 24165 24495 24824 25257 25690 26116 26541 26967 27392 27906 28420
1208 28420 28934 29448 30036 30624 31212 31800 32400 33000 33704 34408 35163 35917 36672 37427 38299 39171 40049 40928 41841 42859 43963 45068
1208 45068 46195 47321 48481 49704 51005 52409 53870 55331 56842 58458 60171 61946 63742 65601 67558 69618 71878
1207 71878 74138 76617 79222 81930 84847 87941 91243 94712 98306 102087 106076 110237 114523 118996 123678 128521 133489
1206 133489 138546 143603 148800 153997 159298 164600 169991 175382 180895 186408 192117 198117 204499 211256 218359 225920 234084
1206 234084 242956 252666 263167 274568 287010 300562 315321 331397 348846 367799 388376 410738 435056 461595
1205 461595 490591 522250 556865 594795 636513 682389 732885 788494 849807 917556 992340 1074807 1165475 1264682
1204 1264682 1372672 1489379 1614453 1746895 1885373 2028012 2172606 2316452 2456426 2589064 2710754
1204 2710754 2817572 2905616 2971425 3012216 3026126 3012187 2970625 2902796 2810953 2698338 2568660 2426203 2275368
1204 2275368 2120495 1965610 1814181 1668922 1531865 1404377 1287087 1180033 1082928 995273 916484 845860
1203 845860 782604 726043 675517 630356 589982 553835 521393 492255 466072 442539 421461 402449 385227 369550
1202 369550 355248 342261 330482 319666 309724 300567 292119 284363 277232 270705 264635 259011 253761 248865 244343 240122
1202 240122 236193 232534 229083 225810 222662 219651 216702 213782 210861 207992 205247 202716 200393 198221 196257 194531 193179
1201 193179 192135 191465 191224 191442 192138 193292 194940 197130 199788 202737 205880 209231 212753 216337 219851 223241 226486 229522
1201 229522 232302 234706 236690 238215 239369 240148 240542 240395 239806 238925 237811 236573 235255 234000 232951 232194 231724 231546 231805
1200 231805 232438 233465 234866 236745 239166 242185 245746 249868 254449 259488 264984 270877 277144 283832 290895 298385 306250
1199 306250 314366 322690 331259 340119 349268 358792 368748 379244 390317 401930 414251 427363 441518 456798 473347
1199 473347 491353 510993 532423 555920 581622 609755 640510 674226 711147 751662 796216 845176 899007 958183
1198 958183 1023310 1094990 1173787 1260279 1354888 1458150 1570446 1692178 1823526 1964605 2115383 2275952
1198 2275952 2446304 2626304 2815670 3014006 3220627 3434319 3653298 3875090 4096675 4314226 4522995
1197 4522995 4717398 4891280 5038223 5152071 5227189 5259056 5244867 5183762 5077003 4927907 4741586 4524668
1197 4524668 4284372 4028216 3763329 3496318 3233083 2978298 2735684 2507849 2296521 2102470 1925845
1196 1925845 1766163 1622500 1493697 1378466 1275515 1183609 1101570 1028215 962561 903682 850839 803298
1196 803298 760545 721984 687128 655447 626637 600443 576538 554662 534660 516268 499334 483685 469160 455686
1195 455686 443169 431511 420561 410367 400797 391789 383322 375308 367751 360591 353804 347286 341058 335018 329186 323445
1195 323445 317829 312364 307107 302097 297294 292726 288449 284515 280956 277741 274983 272665 270722 269127 267824 266756 265813
1194 265813 264795 263777 262553 260956 258939 256464 253590 250175 246214 241878 237258 232430 227337 222119 216927 211859 206896
1193 206896 202058 197541 193399 189642 186176 183057 180312 177957 175977 174379 173155 172369 171957 171870 172158 172764 173661 174866 176445
1192 176445 178291 180344 182590 185044 187721 190607 193578 196673 199828 203108 206459 209809 213177 216671 220373 224367 228626
1192 228626 233177 238017 243231 248924 255158 262014 269494 277750 286796 296761 307683 319595 332546 346705 362237 379211
1191 379211 397725 417998 440227 464569 491201 520482 552635 588004 626911 669874 717458 770183 828528 893057
1191 893057 964287 1042767 1128864 1222867 1324656 1433921 1549972 1671879 1798156 1926644 2054675 2179071
1190 2179071 2296349 2402694 2494178 2567163 2618542 2646184 2649057 2627278 2582146 2515841 2431178 2331423 2219970
1190 2219970 2100104 1975034 1847679 1720699 1596160 1475742 1360784 1252280 1150825 1056656 970011 890900
1189 890900 819111 754191 695697 643238 596286 554286 516705 483078 452948 425941 401673 379862 360252 342515
1189 342515 326435 311813 298517 286345 275214 265040 255725 247034 238960 231427 224457 217944 211794 206019 200556
1188 200556 195385 190466 185755 181265 176984 172786 168588 164466 160344 156320 152297 148170 144042 139874 135706 131725 127744
1187 127744 123797 119850 115903 112081 108360 104765 101351 98145 95143 92265 89455 86770 84236 81827 79527 77353 75340
1187 75340 73536 71866 70259 68687 67240 65876 64512 63177 61905 60793 59807 58838 57806 56783 55821 54958 54094 53234 52374
1186 52374 51574 50773 49972 49172 48444 47716 47134 46552 45992 45431 44766 44102 43462 42822 42286 41750 41203 40656 40113 39570 39100 38692 38257
1185 38257 37697 37137 36576 36112 35648 35175 34701 34228 33755 33322 32890 32562 32233 31914 31595 31276 30957 30687 30417 30147 29878 29676 29474
1184 29474 29272 29069 28798 28526 28254 27983 27602 27221 26840 26459 26142 25825 25507 25190 24951 24712 24473 24234 24021 23809 23596 23384 23122
1183 23122 22860 22702 22545 22328 22112 22042 21971 21790 21609 21490 21372 21203 21035 20867 20699 20582 20464 20347 20230 20051 19873 19695 19517
1182 19517 19385 19254 19123 18991 18790 18589 18388 18187 18079 17970 17861 17753 17551 17350 17172 17056 16967 16815 16639 16464 16325 16186 16047
1182 16047 15908 15784 15661 15502 15406 15341 15277 15177 15140 15121 15040 14893 14746 14692 14638 14560 14419 14308 14258 14170 14082 14039 13997 13954 13912 13805 13699 13593
1180 13593 13486 13364 13242 13147 13114 13117 13120 13022 12925 12853 12782 12715 12648 12539 12492 12511 12529 12547 12502 12352 12203 12133 12167 12206 12244 12245 12247 12284 12258 12229 12199 12166 12133
1179 12133 12066 11999 11959 11982 12034 12085 12037 11988 11958 11928 11961 11994 11985 11976 11967 11958 11909 11861 11778 11757 11816 11876 11839 11803 11771 11803 11834 11803 11748 11693 11741 11852 11928 11941 11931
1178 11931 11921 12002 12083 12101 12120 12161 12203 12245 12286 12319 12352 12349 12409 12502 12594 12581 12504 12408 12312 12213 12113 11937 11761 11585 11514 11503 11430 11294 11159 11127 11095
1177 11095 10963 10831 10772 10775 10705 10530 10388 10349 10348 10284 10165 10108 10055 9938 9834 9834 9830 9722 9593 9464 9395 9326 9214 9164 9179 9194 9151 9045 8912
1175 8912 8779 8685 8592 8498 8405 8334 8262 8195 8127 8093 8121 8173 8121 7980 7839 7754 7669 7596 7523 7513 7502 7460 7419 7377 7335 7264 7194 7123 7052 7024 6996 7030 7065
1174 7065 7033 7002 6971 6939 6942 6945 6947 6950 6912 6874 6898 6922 6970 7018 6961 6905 6852 6800 6751 6702 6718 6797 6899 6897 6830 6763 6751 6740 6764 6787 6846 6843 6783 6723 6760 6796 6813
1173 6813 6768 6722 6739 6747 6754 6765 6777 6810 6843 6877 6910 6953 6996 7018 6977 6985 7097 7285 7412 7471 7530 7586 7641 7661 7680 7699 7718 7699 7679 7723 7766 7727 7688 7649
1171 7649 7611 7586 7561 7537 7512 7442 7372 7370 7432 7485 7539 7531 7461 7377 7357 7397 7438 7389 7278 7243 7313 7429 7483 7475 7466 7428 7390 7313 7298 7277 7194 7091 7092 7156 7221
1170 7221 7189 7156 7141 7127 7012 6898 6805 6774 6744 6651 6534 6416 6298 6181 6112 6106 6099 6030 5954 5877 5797 5716 5623 5530 5437 5345 5295 5245 5195 5145 5166 5188
1169 5188 5186 5122 5032 5004 5000 4995 4987 4979 4970 4962 4921 4880 4840 4799 4752 4706 4625 4606 4653 4701 4683 4603 4552 4501 4447 4392 4357 4321 4349 4376 4437 4499 4495 4429 4396 4425 4450 4413
1167 4413 4357 4302 4246 4190 4121 4113 4133 4153 4097 4042 4093 4207 4266 4262 4259 4318 4382 4383 4323 4263 4255 4309 4329 4348 4368 4388 4345 4303 4252 4202 4152 4101 4042 3982 3985 3987 4013
1166 4013 4039 3965 3891 3855 3881 3907 3870 3847 3823 3796 3768 3778 3787 3738 3689 3658 3689 3720 3689 3631 3573 3579 3648 3716 3784 3793 3802 3792 3782 3772 3761 3773 3785 3797 3809 3807 3806
1164 3806 3804 3803 3834 3865 3834 3740 3685 3733 3782 3830 3863 3897 3909 3859 3811 3867 3958 3987 3961 3935 3968 4000 3920 3839 3821 3802 3799 3797 3794 3791 3804 3816 3828 3841 3853 3865 3878
1163 3878 3890 3829 3768 3707 3647 3640 3634 3566 3497 3397 3297 3264 3231 3260 3351 3443 3472 3417 3362 3308 3253 3247 3304 3389 3473 3432 3390 3348 3307 3271 3234 3260 3286 3324 3361
1162 3361 3399 3436 3410 3384 3358 3331 3288 3245 3202 3159 3119 3080 3041 3002 2976 2951 2988 3025 3060 3094 3125 3156 3158 3097 3013 2929 2905 2943 2981 2957 2942 2927 2912 2897 2852
1160 2852 2869 2952 3034 3086 3076 3038 3000 2982 2964 2887 2810 2767 2786 2832 2879 2925 2972 2960 2948 2935 2984 3034 3021 2968 2915 2921 2926 2949 2972 2972 2909 2803 2759 2823 2886
1159 2886 2868 2849 2831 2812 2829 2845 2862 2879 2870 2861 2852 2843 2780 2718 2620 2585 2617 2649 2719 2728 2672 2617 2557 2498 2541 2585 2663 2679 2663 2646 2626 2606 2621 2636 2651 2667 2708
1158 2708 2749 2786 2824 2800 2713 2662 2611 2613 2615 2621 2628 2639 2712 2786 2797 2748 2698 2644 2590 2487 2385 2393 2463 2509 2555 2542 2529 2516 2504 2491 2478 2404 2330 2284 2300 2357
1156 2357 2415 2437 2522 2622 2660 2633 2606 2582 2557 2532 2508 2540 2573 2606 2638 2664 2691 2658 2626 2630 2696 2763 2767 2787 2808 2764 2659 2635 2757 2875 2847 2735 2624
1155 2624 2652 2742 2787 2771 2793 2816 2865 2914 2901 2826 2750 2779 2887 2994 2996 2936 2910 2885 2849 2813 2777 2741 2755 2769 2783 2797 2737 2677 2621 2564 2496 2490 2511 2532
1153 2532 2465 2397 2334 2270 2253 2299 2344 2327 2298 2269 2299 2328 2307 2285 2228 2234 2265 2297 2333 2368 2354 2339 2325 2310 2277 2243 2267 2292 2286 2218 2149 2143 2145 2147 2153 2159 2139 2120
1152 2120 2164 2269 2337 2301 2182 2063 2014 1966 1980 1994 1986 1978 1970 1962 2003 2043 2022 2000 2037 2074 2048 2023 1984 1946 1970 1993 1928 1862 1858 1855 1852 1849 1846 1843 1856 1869 1881 1894
1151 1894 1912 1929 1884 1839 1865 1890 1853 1816 1847 1877 1908 1939 1862 1786 1773 1759 1772 1784 1797 1810 1804 1799 1793 1788 1765 1742 1782 1821 1852 1882 1808 1735 1681 1627 1631 1635 1665
1149 1665 1631 1575 1622 1757 1892 1908 1820 1794 1830 1824 1818 1914 2009 2104 2200 2165 2130 2158 2186 2249 2312 2272 2231 2217 2204 2253 2302 2285 2269 2252 2236 2191 2146 2205
1148 2205 2264 2269 2275 2280 2285 2248 2210 2318 2427 2495 2563 2570 2576 2673 2770 2867 2964 2955 2947 2939 2930 2875 2820 2865 2910 2889 2805 2694 2583 2517 2451 2323 2195 2066 1936
1146 1936 1948 1960 1909 1796 1683 1633 1647 1661 1680 1698 1690 1682 1674 1666 1645 1623 1602 1580 1558 1537 1515 1494 1496 1498 1496 1495 1464 1371 1314 1256 1264 1272 1338 1405 1406 1345 1257 1273 1358
1145 1358 1381 1379 1378 1437 1434 1362 1290 1319 1349 1278 1208 1238 1332 1390 1448 1474 1500 1463 1426 1433 1441 1386 1331 1318 1305 1291 1278 1339 1400 1434 1405 1418 1432 1441 1451 1441 1431
1143 1431 1421 1411 1414 1416 1418 1421 1439 1457 1471 1485 1436 1326 1215 1166 1182 1197 1154 1111 1137 1163 1189 1215 1257 1298 1278 1257 1247 1237 1232 1226 1238 1313 1388 1400 1335 1269
1142 1269 1262 1255 1330 1405 1417 1430 1400 1371 1404 1437 1427 1417 1407 1397 1478 1560 1579 1598 1626 1654 1578 1502 1452 1402 1414 1427 1452 1477 1407 1336 1360 1508 1598 1564 1518
1141 1518 1536 1549 1500 1501 1564 1662 1635 1582 1590 1701 1813 1853 1893 1933 1973 1913 1853 1898 1942 1924 1907 1827 1747 1725 1702 1617 1532 1453 1373 1398 1423 1444 1464 1381
1139 1381 1298 1299 1300 1301 1301 1259 1217 1176 1134 1183 1233 1282 1332 1335 1338 1340 1343 1319 1294 1270 1245 1275 1305 1273 1241 1221 1201 1244 1287 1306 1325 1282 1239 1166 1093 1124 1155 1170
1138 1170 1186 1201 1216 1274 1331 1388 1445 1508 1570 1574 1578 1652 1788 1900 1888 1807 1788 1872 1956 1992 2029 2065 2102 2180 2258 2336 2414 2494 2574 2633 2630 2622 2717 2852 2924
1137 2924 2963 3064 3231 3397 3584 3772 3959 4146 4283 4420 4626 4832 5041 5354 5795 6237 6663 7089 7598 8211 8813 9352 9898
1136 9898 10506 11174 11841 12513 13185 13843 14500 15090 15534 15853 16110 16320 16384 16249 15968 15566 15102 14540 13978 13405 12832 12133 11330
1135 11330 10492 9717 9029 8404 7811 7217 6712 6207 5806 5404 5099 4793 4488 4182 3924 3665 3510 3356 3246 3136 3027 2917 2812
1134 2812 2708 2707 2707 2671 2635 2599 2563 2410 2257 2167 2076 2071 2065 2060 2054 2017 1981 2006 2032 1985 1937 1889 1841 1765 1689 1616 1648 1721 1794 1812 1829 1787 1745 1702 1660 1655
1132 1655 1649 1644 1639 1633 1628 1623 1617 1703 1789 1875 1961 1945 1930 1940 2076 2233 2265 2154 2043 1961 2004 2122 2240 2238 2237 2173 2109 2056 2004 1952 1899 1883 1866 1912 1957 1994
1131 1994 2031 1963 1896 1879 1862 1908 1954 2008 2063 2014 1965 1999 2034 2069 2104 2204 2303 2341 2378 2489 2600 2711 2823 2918 3014 3109 3205 3264 3324 3446 3568
1130 3568 3738 3907 4076 4245 4349 4454 4621 4788 4998 5208 5563 5919 6181 6444 6782 7245 7744 8244 8826 9534 10250 10966 11758
1129 11758 12674 13584 14369 15162 16080 17229 18377 19388 20399 21361 22324 23175 24026 24762 25374 25856 26213 26445 26677 26729 26657 26428
1128 26428 25992 25427 24655 23749 22843 21778 20713 19522 18332 17142 15951 14887 13823 12829 11835 10909 10107 9381 8655 8026
1127 8026 7396 6804 6337 5957 5639 5357 5074 4866 4657 4390 4124 3844 3627 3444 3324 3323 3322 3298 3211 3110 3008 2903 2797 2786 2774 2694
1126 2694 2550 2476 2401 2301 2140 2061 2086 2084 2020 1946 1871 1856 1840 1825 1811 1796 1782 1779 1775 1811 1784 1738 1754 1793 1833 1856 1880 1904 1927 1873 1818 1791 1827 1887
1125 1887 1947 1983 1957 1952 1947 1939 1930 1849 1768 1749 1731 1749 1767 1761 1693 1611 1592 1600 1609 1592 1638 1742 1784 1697 1547 1474 1504 1523 1543 1568 1594 1580 1566 1493 1421 1384 1411
1124 1411 1464 1518 1496 1475 1477 1541 1594 1584 1579 1635 1699 1762 1791 1882 2016 2087 2135 2183 2243 2303 2358 2414 2511 2544 2516 2549 2745 2941 3078 3216 3400 3584
1122 3584 3796 4070 4380 4690 5005 5319 5611 5904 6204 6504 6985 7592 8128 8664 9307 9949 10592 11235 11750 12265 12773 13280 13719
1121 13719 14034 14182 14331 14498 14540 14416 14083 13649 13215 12623 12030 11416 10802 10125 9449 8818 8187 7563 6940 6391 5967 5543 5118
1120 5118 4673 4353 4150 3947 3725 3504 3282 3060 2879 2697 2579 2460 2263 2066 1973 1880 1860 1840 1757 1675 1557 1440 1385 1331 1346 1361
1119 1361 1314 1267 1280 1293 1244 1194 1156 1118 1143 1167 1135 1103 1071 1039 992 946 845 744 800 980 1057 1008 969 930 945 960 923 887 850 813 816 819 823 826 856
1118 856 885 915 945 938 931 924 918 917 916 916 915 873 830 851 871 923 976 924 873 845 816 851 885 851 817 846 875 846 817 789 760 773 787 800 813 780 746 713 680
1117 680 679 678 677 676 626 575 587 600 644 689 630 571 552 533 458 383 378 478 554 568 573 577 578 579 596 613 630 647 596 545 495 444 432 419 407 394 443 492 540
1115 540 589 642 696 645 594 628 661 695 729 704 679 653 628 556 484 516 548 622 695 707 718 713 709 642 575 490 406 425 444 447 451 454 458 447 436 425 414 378
1114 378 341 304 267 364 460 553 646 570 433 272 215 308 402 397 393 359 325 291 256 258 259 260 262 273 285 238 191 246 364 392 274 160 191 271 289
1112 289 302 315 325 334 374 413 429 383 349 378 409 377 345 416 523 567 521 474 487 499 471 443 415 387 316 246 280 314 369 425 419 350 328 411 466
1111 466 459 409 358 367 375 335 295 317 339 322 306 289 272 341 411 515 557 563 569 570 572 494 416 407 460 518 577 577 577 595 613 572 531 489 510 530 488 393 297
1109 297 302 306 341 375 410 444 453 461 505 487 488 488 485 482 465 447 429 411 350 290 291 293 271 249 230 212 240 331 422 451 401 352 362 371 372 372 372 372 387 402 417 432
1108 432 431 431 430 429 438 447 456 465 496 527 490 389 309 229 207 186 173 161 148 136 103 70 100 130 175 221 266 311 272 234 257 281 254 226 203 180 186 254 346
1106 346 334 269 203 235 267 251 234 217 201 234 266 299 332 405 479 490 501 507 513 421 329 310 396 457 457 485 513 537 561 585 609 571 471 390 413 513
1105 513 550 574 597 617 637 564 491 481 471 410 349 351 352 369 386 404 421 384 346 309 272 261 250 239 228 211 195 179 163 183 203 285 368 316 265 276
1103 276 287 296 306 316 325 349 373 293 213 176 138 101 64 106 147 189 230 256 283 309 335 312 289 266 244 182 120 162 205 198 191 246 301 337 373 347 320
1102 320 333 345 358 370 324 278 294 311 326 341 293 246 229 212 163 115 200 284 369 453 475 496 455 352 269 290 312 333 293 254 214 174 217 261
1101 261 304 348 361 374 324 275 247 220 224 228 206 183 223 263 292 322 253 185 171 261 382 399 315 231 245 258 251 244 267 291 333 374 353 332 257 183
1099 183 212 241 305 370 330 291 232 173 218 263 283 303 323 343 371 399 427 454 495 535 471 407 381 354 359 363 368 373 440 507 456 405 385 365 407 448 489
1098 489 530 527 523 520 516 488 461 433 405 303 202 204 206 186 165 145 125 172 219 204 189 162 136 109 82 22 -37 -66 -94 -127 -160 -130 -100 -77 -55 -94 -134
1096 -134 -198 -262 -221 -181 -112 -42 -4 34 2 -29 42 115 140 166 87 8 -13 -35 -26 -17 17 53 88 124 111 98 148 197 194 191 219 247 202 157 112 67 88
1095 88 109 129 150 92 34 80 126 114 102 28 -45 -48 -52 -24 3 13 23 3 -17 -5 7 51 95 89 83 78 72 91 111 67 24 -18 -62 -74 -86 -22 42 75
1093 75 108 144 181 218 255 237 219 200 182 117 52 91 130 164 198 170 141 134 126 181 236 190 144 124 229 308 262 190 118 153 189 162 135 118 100 82
1092 82 65 118 171 162 153 157 160 164 168 146 123 163 204 187 169 152 135 155 174 89 4 15 25 35 45 63 81 99 118 85 52 19 -12 33 79 63 47 25
1091 25 2 42 82 95 109 18 -72 -74 -76 -78 -81 -104 -127 -151 -174 -161 -148 -135 -121 -150 -178 -206 -234 -195 -155 -116 -76 -75 -73 -72 -70 -10 49 5 -39 -86 -134 -175 -216
1089 -216 -185 -50 56 101 64 -34 -101 -169 -173 -177 -181 -185 -158 -131 -105 -78 6 91 135 74 -16 -44 -9 24 -11 -47 -82 -118 -73 -27 -120 -214 -255 -193 -91
1088 -91 -52 -68 -85 -105 -125 -99 -72 -46 -19 30 80 130 76 -13 -41 -6 27 24 20 16 12 -20 -54 -49 -106 -166 -164 -139 -113 -72 -31 44 58 -17 -94 -146 -137 -68 1
1086 1 47 30 26 22 49 14 -69 -152 -156 -56 0 -4 -30 -56 5 66 65 64 53 42 9 -87 -183 -217 -144 -72 0 73 77 18 -15 -49 -87 -125 -153 -182 -210 -239 -172
1085 -172 -106 -108 -173 -228 -282 -275 -267 -247 -165 -118 -71 -38 -4 63 69 53 37 17 -2 -15 -29 -42 -56 -43 -31 -18 -6 -38 -70 -103 -135 -152 -169 -181 -194 -182 -107
1083 -107 -32 -19 -57 -96 -134 -172 -235 -236 -131 -25 -30 -97 -165 -170 -140 -109 -138 -166 -159 -153 -146 -139 -120 -102 -83 -65 -15 34 56 16 0 -18 -39 -61 -121 -182 -180 -178
1082 -178 -165 -153 -141 -128 -159 -189 -220 -250 -210 -170 -129 -89 -30 27 21 -47 -71 -31 -31 -31 -33 -36 0 -25 -83 -79 -52 -24 -28 -32 -32 -31 -55 -16 22 0 -80 -159 -138 -117
1080 -117 -103 -89 -76 -62 -67 -73 -137 -201 -244 -226 -138 -50 -6 36 18 -63 -143 -119 -18 20 -65 -150 -135 -57 4 -37 -116 -196 -158 -58 37 71 89 45 -26
1079 -26 -98 -109 -59 -4 -12 -35 3 42 19 -66 -89 -54 -81 -136 -191 -109 -26 26 16 -20 -56 -102 -148 -132 -115 -137 -158 -117 -75 -41 -6 24 55 -1 -119
1077 -119 -238 -294 -235 -175 -111 -47 -7 33 -30 -94 -102 -110 -140 -231 -319 -303 -210 -179 -212 -244 -218 -192 -165 -138 -110 -83 -119 -156 -130 -104 -139 -174 -209 -244 -218
1076 -218 -191 -164 -138 -137 -136 -135 -135 -131 -128 -125 -121 -214 -307 -338 -368 -279 -189 -162 -134 -171 -207 -181 -155 -142 -129 -116 -103 -171 -239 -306 -374 -378 -382 -324 -265 -145 -24 -49 -74
1075 -74 -79 -84 -89 -94 -69 -44 -82 -120 -143 -167 -128 -89 -18 53 124 91 -16 -62 -45 -28 -69 -109 -87 -66 -57 -49 -41 -32 31 95 55 15 12 9 -56 -184 -278 -268 -181
1073 -181 -157 -194 -232 -273 -314 -281 -248 -215 -182 -192 -203 -209 -215 -183 -89 27 41 -57 -155 -73 8 57 105 91 77 110 144 177 211 179 148 178 209 272 336
1072 336 399 462 451 440 429 418 415 411 407 403 471 539 544 549 548 547 546 545 566 587 608 628 630 631 633 634 530 426 329 231 209 291 412 471 423 375 323 271 299 327
1070 327 292 258 140 22 50 79 31 -16 -63 -111 -106 -102 -97 -93 -65 -37 -71 -106 -121 -136 -47 41 38 35 -30 -95 -164 -234 -262 -185 -50 22 -8 -39 -15 7
1069 7 31 54 78 101 62 23 24 25 89 153 150 146 39 -68 -97 -126 -149 -172 -165 -53 57 64 -11 -87 -107 -127 -164 -201 -134 -67 -93 -120 -88 -56 -4 -15 -53
1067 -53 -91 -92 -92 -57 -85 -169 -253 -271 -227 -206 -184 -158 -133 -54 23 -1 -27 -48 -70 -52 -97 -206 -252 -233 -213 -213 -212 -211 -210 -188 -166 -105 -106 -194 -219 -143 -68 -30
1066 -30 -96 -201 -244 -224 -205 -123 -41 29 36 16 -2 -40 -78 -175 -271 -266 -199 -131 -126 -129 -132 -139 -146 -173 -201 -167 -132 -117 -102 -150 -197 -208 -219 -289 -358 -420 -419 -387 -355
1064 -355 -317 -216 -92 -72 -143 -214 -226 -176 -136 -158 -203 -249 -304 -358 -386 -350 -330 -310 -326 -278 -214 -212 -234 -255 -222 -188 -255 -321 -336 -288 -275 -262 -229 -197
1063 -197 -226 -256 -312 -368 -361 -354 -326 -297 -268 -239 -243 -247 -250 -254 -258 -262 -266 -270 -259 -247 -173 -99 -39 21 -22 -66 -119 -171 -162 -152 -173 -195 -216 -237 -218 -199 -180 -161 -166 -170 -175 -180
1061 -180 -178 -176 -174 -172 -230 -288 -242 -196 -199 -203 -206 -209 -118 -27 -40 -52 -70 -88 -106 -124 -195 -266 -274 -283 -231 -179 -232 -285 -262 -240 -218 -196 -219 -242 -203 -164 -124 -83 -106 -128
1060 -128 -146 -165 -121 -76 -73 -70 -67 -64 -57 -50 -43 -36 -45 -55 -64 -74 -83 -93 -102 -112 -124 -135 -147 -159 -89 -19 -88 -157 -167 -72 21 11 -10 -32 -60 -88 -67 -45 -23 -2 -56
1058 -56 -110 -101 -93 -96 -99 -164 -230 -255 -280 -243 -206 -165 -124 -83 -41 -60 -79 -98 -116 -108 -100 -190 -279 -287 -191 -94 -102 -101 -101 -107 -113 -119 -124 -130 -136 -159 -181 -203 -226 -201 -176 -152 -127
1056 -127 -147 -167 -186 -206 -232 -258 -285 -311 -221 -131 -82 -138 -179 -158 -143 -191 -226 -260 -236 -212 -203 -195 -187 -178 -242 -306 -307 -308 -315 -322 -224 -127 -97 -67 -37 -7 -62 -117 -74
1055 -74 -31 -30 -132 -200 -121 5 71 -6 -84 -112 -141 -169 -198 -212 -226 -240 -254 -266 -277 -289 -301 -304 -306 -372 -437 -411 -384 -354 -324 -300 -214 -163 -216 -283 -288 -275
1054 -275 -263 -357 -513 -627 -637 -596 -493 -384 -337 -345 -352 -364 -375 -294 -213 -212 -315 -419 -418 -337 -255 -261 -267 -273 -278 -236 -194 -214 -234 -276 -319 -299 -278 -250 -223 -218
1052 -218 -276 -319 -300 -320 -340 -323 -307 -251 -258 -300 -279 -235 -191 -229 -267 -242 -217 -201 -185 -173 -161 -146 -193 -206 -218 -215 -211 -207 -203 -207 -211 -278 -344 -380 -417 -391 -365 -356 -347
1051 -347 -338 -329 -264 -199 -196 -194 -136 -79 -26 -77 -166 -256 -248 -241 -207 -173 -239 -306 -366 -364 -334 -305 -302 -298 -295 -292 -294 -296 -357 -417 -393 -307 -221 -197 -204 -210 -221 -231 -204 -177 -173 -232 -301
1049 -301 -308 -250 -192 -184 -175 -167 -158 -127 -97 -129 -223 -337 -347 -235 -124 -64 -66 -137 -208 -225 -243 -198 -153 -151 -150 -210 -271 -287 -304 -258 -212 -158 -103 -114 -187 -255 -260 -242
1047 -242 -224 -245 -266 -259 -191 -118 -45 -37 -92 -148 -203 -259 -315 -365 -353 -372 -391 -405 -357 -344 -330 -313 -296 -279 -262 -299 -336 -408 -418 -370 -323 -334 -345 -319 -293 -232
1046 -232 -233 -260 -287 -315 -342 -366 -329 -287 -308 -344 -318 -272 -227 -275 -387 -459 -532 -536 -478 -456 -433 -438 -443 -385 -327 -324 -321 -262 -203 -206 -313 -396 -418 -414 -411 -442 -411 -339
1045 -339 -329 -422 -514 -521 -466 -445 -425 -379 -332 -309 -349 -393 -374 -293 -213 -165 -179 -262 -346 -407 -468 -466 -465 -413 -360 -331 -365 -364 -300 -239 -242 -214 -185 -161 -137 -170 -203
1043 -203 -173 -144 -123 -103 -148 -255 -362 -407 -349 -291 -233 -238 -307 -377 -427 -414 -375 -335 -288 -241 -194 -147 -157 -167 -119 -70 -59 -110 -161 -149 -111 -74 -101 -191
1042 -191 -266 -341 -350 -298 -273 -249 -221 -193 -182 -171 -260 -349 -382 -353 -359 -365 -304 -243 -202 -224 -267 -206 -110 -76 -150 -224 -237 -187 -108 -90 -138 -186 -203 -221 -238 -255
1040 -255 -267 -280 -229 -179 -210 -241 -272 -303 -297 -292 -290 -289 -280 -335 -416 -498 -491 -484 -477 -470 -487 -504 -516 -529 -540 -489 -415 -340 -286 -294 -367 -440 -464 -425 -422 -418 -390 -362 -299 -298 -354
1039 -354 -410 -470 -531 -575 -620 -561 -501 -437 -372 -308 -243 -235 -227 -282 -336 -334 -331 -328 -325 -315 -305 -316 -390 -443 -393 -308 -285 -293 -301 -313 -325 -349 -373 -397 -421 -386 -351 -317 -282
1037 -282 -269 -257 -244 -232 -274 -317 -297 -278 -267 -256 -246 -235 -259 -284 -308 -333 -341 -350 -359 -368 -357 -347 -337 -326 -332 -337 -342 -347 -358 -369 -381 -392 -340 -289 -342 -395 -416 -438 -398
1036 -398 -357 -292 -226 -242 -361 -480 -495 -471 -447 -458 -469 -480 -491 -482 -473 -465 -456 -386 -316 -309 -363 -425 -383 -269 -216 -257 -361 -433 -506 -540 -573 -545 -516 -456 -396
1034 -396 -334 -375 -468 -456 -323 -189 -132 -75 -122 -169 -250 -331 -349 -368 -329 -290 -314 -337 -402 -466 -426 -386 -386 -387 -387 -388 -391 -394 -453 -512 -516 -416 -240 -126 -124 -184
1033 -184 -248 -250 -234 -218 -260 -302 -295 -288 -281 -275 -272 -269 -266 -263 -243 -224 -169 -177 -204 -231 -227 -286 -381 -476 -472 -467 -470 -472 -475 -478 -381 -283 -254 -288 -323 -358 -393 -428 -491 -492 -430 -430 -483 -535
1031 -535 -485 -373 -292 -274 -279 -284 -375 -466 -488 -448 -407 -367 -385 -403 -415 -426 -376 -325 -316 -308 -299 -290 -282 -273 -265 -256 -230 -205 -242 -279 -269 -259 -249 -239 -238 -236 -293 -350 -385 -357
1030 -357 -326 -357 -407 -394 -382 -432 -475 -454 -469 -484 -495 -443 -364 -284 -279 -274 -292 -373 -440 -444 -425 -406 -445 -484 -461 -438 -401 -363 -388 -412 -379 -345 -334 -386 -475 -501
1028 -501 -464 -491 -552 -550 -446 -342 -382 -483 -546 -505 -401 -297 -214 -194 -218 -242 -269 -297 -314 -330 -346 -362 -342 -323 -299 -276 -291 -244 -197 -213 -264 -316 -371
1027 -371 -427 -439 -452 -406 -360 -336 -374 -377 -380 -337 -293 -308 -323 -320 -256 -226 -300 -351 -340 -308 -275 -298 -320 -304 -349 -441 -470 -392 -314 -281 -247 -240 -296 -361 -426 -429 -431 -438
1026 -438 -381 -298 -214 -246 -279 -311 -343 -362 -381 -401 -420 -419 -419 -419 -418 -459 -499 -477 -455 -488 -521 -495 -469 -471 -534 -598 -600 -573 -545 -514 -483 -413 -342 -334 -326 -365 -403 -379 -356
1024 -356 -358 -360 -363 -365 -335 -304 -339 -436 -471 -443 -451 -458 -464 -407 -351 -357 -400 -443 -390 -337 -307 -340 -338 -335 -341 -348 -354 -360 -308 -255 -272 -351 -389 -427 -406 -386 -348 -311 -313 -418 -514 -505
1022 -505 -458 -410 -456 -502 -486 -469 -463 -456 -450 -444 -463 -483 -499 -515 -568 -558 -484 -409 -366 -385 -432 -478 -468 -457 -446 -436 -396 -357 -418 -479 -507 -474 -436 -461 -488 -451 -392
1021 -392 -332 -341 -350 -358 -367 -352 -338 -323 -308 -373 -438 -441 -444 -403 -363 -327 -290 -313 -398 -448 -499 -485 -471 -458 -444 -430 -417 -368 -381 -391 -401 -375 -412 -482 -490 -395 -300 -291 -344
1020 -344 -397 -388 -386 -384 -377 -371 -397 -424 -450 -476 -476 -476 -413 -350 -365 -380 -396 -411 -452 -493 -472 -451 -418 -385 -352 -319 -338 -357 -376 -395 -365 -334 -269 -266 -365 -464 -502 -478 -449
1018 -449 -484 -514 -482 -412 -342 -375 -470 -545 -557 -545 -534 -558 -582 -607 -631 -725 -820 -810 -801 -763 -726 -688 -651 -626 -601 -577 -552 -514 -476 -500 -525 -481 -438 -394 -351
1017 -351 -364 -377 -453 -529 -551 -573 -533 -493 -552 -611 -567 -522 -416 -310 -308 -306 -289 -272 -255 -238 -266 -295 -261 -227 -262 -297 -394 -492 -493 -494 -495 -497 -509 -522 -534 -547 -523
1015 -523 -500 -476 -452 -428 -403 -379 -355 -367 -379 -391 -403 -399 -396 -392 -389 -514 -639 -577 -453 -376 -404 -431 -458 -436 -414 -392 -370 -401 -432 -424 -312 -180 -153 -206 -259
1014 -259 -275 -291 -369 -447 -446 -446 -445 -444 -376 -308 -303 -298 -377 -457 -432 -407 -373 -339 -368 -396 -448 -500 -489 -479 -465 -451 -499 -548 -499 -450 -501 -552 -596 -577 -592 -608 -601 -593 -586
1012 -586 -579 -556 -534 -511 -489 -466 -444 -422 -399 -401 -403 -444 -422 -378 -397 -477 -557 -550 -482 -448 -414 -420 -425 -430 -436 -466 -495 -525 -555 -498 -441 -411 -443 -520 -598 -598 -495 -371
1011 -371 -351 -488 -625 -689 -649 -605 -561 -572 -582 -652 -721 -695 -607 -519 -493 -479 -465 -420 -437 -454 -470 -432 -394 -376 -420 -529 -638 -664 -627 -564 -604 -682 -698
1010 -698 -651 -604 -571 -538 -505 -472 -429 -387 -407 -428 -406 -385 -464 -543 -570 -535 -496 -519 -528 -474 -459 -444 -472 -500 -525 -549 -533 -455 -353 -356 -384 -413 -448 -482 -485 -487
1008 -487 -490 -492 -498 -504 -476 -509 -556 -603 -654 -705 -688 -671 -650 -629 -600 -508 -416 -386 -365 -343 -329 -315 -331 -409 -453 -496 -507 -518 -528 -539 -542 -545 -548 -551 -538 -525 -512 -500 -502
1007 -502 -504 -505 -507 -535 -563 -591 -619 -586 -553 -520 -486 -425 -363 -364 -364 -325 -286 -311 -399 -477 -493 -484 -476 -508 -539 -470 -401 -384 -430 -502 -575 -564 -553 -542 -531 -540 -548 -557 -565 -554
1005 -554 -542 -531 -519 -475 -431 -449 -530 -582 -529 -442 -416 -448 -480 -516 -552 -576 -599 -622 -645 -598 -551 -569 -649 -689 -666 -647 -690 -717 -743 -770 -796 -755 -651 -583
1004 -583 -515 -493 -471 -415 -420 -460 -499 -503 -569 -654 -677 -634 -591 -613 -636 -596 -555 -544 -532 -521 -509 -534 -559 -618 -616 -622 -628 -631 -633 -636 -638 -675 -650 -582 -514 -470 -488 -468 -448
1002 -448 -432 -416 -441 -465 -490 -514 -458 -402 -311 -283 -347 -411 -416 -421 -401 -381 -423 -466 -495 -525 -554 -583 -585 -587 -588 -590 -549 -508 -431 -417 -428 -439 -454 -468 -526 -583 -541 -498
1001 -498 -497 -558 -583 -609 -560 -512 -526 -540 -517 -494 -471 -448 -476 -504 -532 -560 -535 -510 -485 -460 -442 -423 -470 -579 -666 -691 -651 -611 -603 -594 -585 -576 -600 -623 -588 -553 -558
999 -558 -626 -658 -691 -659 -627 -658 -688 -695 -702 -765 -829 -811 -690 -592 -557 -566 -575 -525 -475 -494 -513 -531 -550 -580 -611 -641 -671 -664 -656 -648 -640 -655 -669 -742 -815 -832 -786 -776 -765
998 -765 -743 -721 -699 -677 -622 -566 -573 -581 -666 -751 -774 -796 -767 -738 -708 -679 -725 -771 -817 -864 -893 -922 -806 -690 -646 -603 -622 -641 -649 -657 -665 -673 -631 -590 -548 -507 -492
996 -492 -478 -526 -574 -571 -568 -565 -563 -516 -469 -418 -367 -403 -377 -324 -374 -544 -651 -652 -590 -551 -575 -596 -553 -501 -450 -456 -463 -470 -477 -421 -365 -402 -438 -474 -511 -500 -490 -479 -469
995 -469 -467 -465 -526 -587 -608 -630 -652 -673 -675 -676 -615 -554 -490 -426 -366 -410 -529 -648 -627 -607 -573 -540 -506 -473 -477 -481 -485 -489 -500 -511 -522 -532 -502 -471 -503 -597 -668 -635
993 -635 -560 -485 -536 -587 -639 -690 -692 -693 -633 -572 -589 -607 -624 -641 -633 -624 -615 -607 -550 -494 -500 -506 -500 -493 -486 -479 -447 -415 -487 -559 -555 -552 -586 -652 -677 -598 -541 -546 -553 -497 -444 -455 -483
992 -483 -512 -544 -577 -609 -642 -674 -707 -701 -694 -688 -682 -691 -700 -708 -715 -692 -638 -566 -557 -606 -654 -740 -763 -726 -658 -586 -545 -535 -525 -543 -623 -705 -756 -741 -696 -627 -558 -552 -609 -623
990 -623 -575 -531 -550 -662 -774 -819 -802 -732 -631 -569 -569 -621 -643 -619 -595 -574 -491 -407 -386 -396 -406 -421 -435 -523 -611 -637 -663 -673 -683 -693 -704 -683 -663 -580
989 -580 -497 -496 -495 -494 -493 -492 -492 -492 -491 -524 -556 -588 -620 -621 -622 -561 -500 -500 -500 -500 -500 -477 -454 -435 -416 -455 -556 -640 -693 -681 -669 -593 -517 -567 -617 -604 -592 -549 -507 -610 -713
987 -713 -709 -704 -637 -570 -568 -566 -565 -563 -441 -320 -282 -347 -437 -463 -469 -475 -520 -565 -548 -531 -528 -525 -522 -519 -486 -454 -421 -388 -439 -491 -542 -594 -602 -611 -557 -503 -481 -460 -438 -416 -349
986 -349 -282 -277 -273 -383 -494 -501 -507 -507 -508 -508 -508 -430 -351 -419 -486 -519 -551 -584 -616 -612 -609 -605 -601 -591 -581 -570 -560 -608 -657 -601 -545 -522 -498 -475 -452 -467 -483 -498 -513 -565
984 -565 -617 -669 -721 -668 -616 -564 -512 -534 -556 -578 -600 -619 -639 -596 -553 -616 -680 -681 -682 -686 -690 -693 -697 -698 -699 -602 -505 -501 -600 -699 -694 -573 -453 -467 -482 -534 -524 -487 -450
983 -450 -475 -500 -526 -551 -578 -605 -574 -542 -527 -573 -620 -604 -540 -476 -435 -457 -493 -529 -469 -408 -408 -470 -497 -524 -568 -611 -655 -699 -697 -695 -749 -803 -810 -713 -580 -511 -493
981 -493 -538 -547 -557 -507 -394 -285 -239 -272 -367 -467 -504 -456 -408 -419 -430 -474 -518 -559 -599 -631 -601 -567 -596 -626 -593 -537 -481 -463 -445 -489 -596 -647 -595 -465
980 -465 -398 -405 -413 -424 -435 -493 -552 -507 -461 -514 -566 -553 -478 -459 -503 -547 -528 -449 -433 -441 -448 -378 -308 -265 -285 -321 -356 -333 -310 -333 -356 -379 -402 -389 -376 -362 -349
978 -349 -303 -258 -275 -292 -307 -321 -335 -350 -378 -407 -373 -339 -336 -333 -330 -328 -323 -317 -250 -182 -132 -81 -134 -188 -177 -167 -219 -271 -270 -269 -264 -258 -259 -198 820 777 689 601 592 583 578
977 578 574 513 453 417 485 534 520 457 457 522 586 543 500 456 413 430 447 527 607 573 539 568 597 646 695 640 585 507 428 412 396 408 420 370 319 320 320
975 320 320 320 348 376 342 307 332 358 281 143 76 155 246 274 302 330 354 379 392 405 418 431 393 356 380 405 393 380 367 355 341 327 257 187 157 231
974 231 351 470 497 524 493 462 491 582 635 583 452 321 271 325 407 489 432 374 382 390 398 406 417 428 439 450 452 454 518 583 535 488 441 394 397 401 408 415
972 415 409 465 525 523 450 440 495 550 519 487 455 424 404 384 465 545 579 551 495 439 462 484 507 529 545 560 476 391 294 258 292 326 359 392 366 340
971 340 317 356 396 372 361 350 339 328 284 301 346 391 390 389 384 379 350 258 166 136 149 163 180 197 281 366 388 410 426 441 433 362 300 299 323 346 375 404
970 404 374 345 319 356 393 367 335 302 329 355 407 459 484 446 374 302 289 276 266 257 310 363 381 399 417 435 449 463 418 373 346 381 443 505 460 415
968 415 375 334 372 473 511 487 441 395 407 419 364 308 357 405 434 464 430 397 392 388 383 379 393 406 420 434 478 522 543 501 479 519 583 542 428 377
967 377 388 398 370 342 414 486 450 352 353 417 413 347 320 293 257 221 212 266 286 305 329 353 329 306 283 259 287 314 337 361 355 287 251 320 450 477 382
965 382 286 327 369 387 342 354 428 463 393 320 308 318 328 320 313 344 314 261 271 342 414 498 519 472 425 405 385 369 353 345 399 454 445 383 321 359 397
964 397 431 465 440 416 366 380 420 461 436 411 387 362 411 459 480 438 311 184 163 205 257 309 361 414 463 450 410 370 388 406 401 333 281 292 363
962 363 435 480 462 417 372 281 189 201 214 234 254 271 287 314 279 243 270 358 446 431 354 308 324 301 279 355 431 480 466 462 457 449 440 517 594 666 635
961 635 568 500 488 477 436 395 416 438 437 437 436 436 493 550 562 470 376 283 251 283 309 335 266 196 167 201 236 207 195 183 171 159 186 276 365 392 378
960 378 364 346 328 336 344 352 359 331 303 274 246 243 241 238 236 261 285 310 335 380 425 364 241 205 231 254 214 220 226 228 230 274 319 399 416 376 336 293 249 285 321
958 321 294 267 254 240 206 109 44 83 122 161 159 156 154 151 218 285 247 148 122 200 279 253 181 171 227 283 282 344 468 529 496 463 485 506 443 318 169
957 169 124 215 307 339 310 280 313 442 509 445 319 227 240 296 352 352 352 297 242 187 132 140 149 158 166 165 163 162 160 191 223 254 285 326 368 351 334 313 354
955 354 400 383 339 357 376 332 272 275 301 327 280 233 186 140 194 249 264 176 69 67 146 225 225 226 226 227 193 159 184 208 268 266 236 206 187 169 155 140
954 140 137 195 281 263 200 199 296 393 365 233 160 87 64 41 81 121 152 182 209 236 234 170 106 104 183 262 318 311 272 233 190 147 126 105 84 63 65 67
952 67 69 71 73 75 77 79 91 104 116 129 172 216 232 186 146 107 64 21 37 54 70 87 136 186 208 168 140 113 144 175 218 261 204 146 100 117 103 88 63
951 63 101 145 127 90 158 260 300 289 277 324 371 312 254 199 145 112 141 198 254 246 237 264 228 147 66 85 104 126 147 169 191 157 123 117 173 209 246
949 246 224 202 184 165 147 129 133 136 140 144 150 155 161 167 199 230 262 294 236 179 121 63 86 109 191 273 304 272 213 154 156 159 161 163 139 115 56 60 68 77 90 102 168
947 168 234 231 165 88 11 -63 -137 -145 -49 85 158 159 160 158 155 103 51 3 -44 -12 82 239 334 324 314 359 403 398 331 264 259 241 223 209 194 219 244 206
946 206 169 104 39 2 27 67 106 150 193 176 160 143 126 90 54 17 -18 -35 -52 0 114 215 316 318 319 315 311 249 186 139 155 198 241 259 278 296
945 296 315 255 195 163 193 214 234 196 158 139 120 102 83 109 134 97 61 43 26 9 -8 -11 -14 -18 -21 -24 -28 -31 -34 -14 5 25 45 66 88 9 -69 -111 -91
943 -91 -70 -113 -159 -204 -150 -96 -34 27 26 25 -11 -48 -85 -122 -146 -171 -196 -221 -233 -246 -232 -155 -73 8 32 56 9 -36 -79 -121 -110 -37 36 47 8 -29 -107
942 -107 -121 -75 -28 -39 -51 3 58 89 58 35 75 76 77 77 78 79 80 70 61 51 42 62 82 103 123 154 186 276 366 392 356 355 354 343 332 383 435 451 468 484
940 484 501 433 366 303 240 226 275 347 419 465 450 430 473 524 512 435 358 268 177 156 197 293 390 384 316 300 347 390 371 268 165 86 69 117 165
939 165 155 144 136 129 121 113 128 144 159 174 177 179 217 192 134 77 115 154 193 169 142 177 261 284 241 198 269 339 264 126 23 23 28 32 18 67 139 211 259
937 259 244 160 76 45 13 -18 -50 -28 -7 -48 -152 -202 -148 -95 -41 -5 30 45 -1 9 124 212 237 171 105 42 -20 -47 29 110 191 167 143 118
936 118 94 74 53 33 13 56 100 144 188 201 215 131 48 -4 46 80 52 9 69 165 198 186 173 157 141 166 190 214 239 235 232 233 234 221 272 287 302
934 302 319 336 354 267 161 117 177 237 174 112 76 103 181 258 271 221 177 133 88 44 26 70 79 88 81 75 68 62 75 88 101 114 74 34 21 71 102 132
933 132 107 83 77 133 193 190 184 240 292 281 256 231 202 174 160 147 134 120 56 -7 -106 -143 -89 -35 -42 -111 -173 -172 -148 -124 -107 -89 -130 -172 -106 21 113
931 113 102 46 53 116 116 53 -9 -14 -18 2 24 84 82 30 40 78 115 98 144 217 289 248 207 170 133 25 -19 4 28 27 26 83 140 164 125 20 -83
930 -83 -108 -71 -34 -59 -133 -206 -215 -161 -129 -97 -61 -25 15 56 35 14 26 39 51 64 94 125 191 194 155 117 74 31 56 81 106 131 141 152 163 174 141
929 141 107 213 319 381 339 213 87 11 -2 -47 -92 -78 -1 74 88 52 17 -18 -53 -65 -15 39 31 -43 -55 -2 50 12 -26 -37 13 26 40 57
927 57 74 127 180 233 286 288 290 268 185 78 34 55 76 85 94 104 113 145 177 244 249 184 118 153 188 223 259 290 321 379 374 300 226 188 149 173 198 189 181 110
926 110 39 21 4 -13 -30 -1 27 -1 -30 -78 -64 -45 -90 -195 -237 -253 -268 -273 -215 -154 -154 -233 -250 -163 -77 -35 -56 -104 -151 -164 -177 -127 -78 -22 33 26
924 26 -42 -117 -89 -21 -16 -69 -59 56 172 153 134 178 221 220 219 219 218 212 206 258 311 315 257 199 203 277 352 326 301 278 256 269 219 116 13 -31 -75 -59
923 -59 -43 -26 -10 -13 -17 -116 -215 -258 -176 -25 62 26 -10 11 34 -33 -100 -167 -234 -178 -122 -66 -9 -14 -20 -25 -30 -94 -157 -117 -77 -93 -109 -125 -141 -117 -92 -172
921 -172 -252 -343 -434 -380 -264 -221 -303 -385 -342 -306 -333 -415 -434 -310 -186 -162 -139 -128 -118 -107 -97 -88 -79 -99 -245 -405 -503 -492 -418 -354 -289 -283 -277 -274 -271 -269
920 -269 -266 -268 -269 -270 -272 -283 -294 -305 -316 -295 -274 -252 -231 -315 -400 -380 -360 -321 -282 -243 -203 -118 -33 51 136 66 -2 -10 -17 -27 -37 -47 -57 -5 46 -5 -56 -39 -22
918 -22 -5 11 0 -12 -23 -35 -72 -108 -83 -57 -134 -211 -288 -365 -353 -340 -328 -316 -264 -211 -159 -106 -150 -194 -175 -156 -112 -67 -22 21 8 -5 4 76 111 85
917 85 35 -14 -3 7 18 29 16 4 -4 -12 -33 7 113 220 274 266 231 195 183 170 157 145 179 213 185 157 100 43 -9 -62 -111 -98 -57 -16 -47 -77
916 -77 -101 -124 -175 -122 13 149 184 156 163 171 132 94 56 17 -72 -162 -184 -143 -121 -100 -78 -56 0 -4 -40 -76 -99 -184 -270 -293 -303 -313 -319 -325 -311 -298 -343
914 -343 -388 -380 -310 -240 -232 -284 -336 -369 -339 -267 -257 -312 -368 -364 -361 -358 -355 -357 -359 -362 -364 -408 -452 -437 -422 -376 -391 -472 -553 -553 -490 -428 -428 -440 -452 -405 -359 -351 -344 -336 -329 -272 -216
913 -216 -222 -228 -224 -221 -218 -214 -220 -226 -232 -237 -231 -225 -157 -89 -84 -80 -76 -71 -63 -55 -46 -38 -20 -1 16 34 72 110 86 61 26 -8 -44 -79 -34 11 56 102 130 158 186 110 -11 -72 -70
911 -70 -67 -98 -129 -160 -191 -211 -230 -145 -60 -17 25 5 -13 -56 -99 -79 -59 2 65 65 65 78 91 104 118 74 31 30 -34 -104 -71 77 162 137 50 21 54
909 54 66 77 92 108 116 124 70 15 14 13 -49 -113 -167 -221 -130 -38 -11 16 43 71 79 87 200 312 381 451 513 576 520 360 223 149 117 86 116 147 167
908 167 124 54 87 163 176 89 1 -96 -131 -98 -2 83 64 -30 -63 -29 4 -96 -197 -234 -167 -97 -130 -198 -203 -146 -88 -98 -107 -174 -242 -258 -211 -164 -180
907 -180 -253 -326 -340 -355 -372 -390 -407 -424 -403 -381 -418 -455 -462 -406 -386 -365 -408 -451 -488 -525 -522 -414 -268 -184 -209 -235 -260 -285 -298 -247 -170 -92 -103 -114 -124
905 -124 -135 -133 -131 -129 -127 -63 0 62 126 103 81 117 154 168 119 48 -23 -33 18 71 61 60 59 55 50 52 54 56 59 41 24 46 5 -40 -23 -10 -59 -128 -197 -201 -143 -89
904 -89 -35 -1 -29 -64 -36 49 73 -21 -116 -146 -113 -99 -85 -66 -48 -67 -86 -46 -6 -10 -75 -106 -137 -169 -202 -176 -150 -150 -212 -298 -280 -154 -28 35 36 11
902 11 -12 -41 -70 -89 -107 -126 -144 -122 -99 -115 -68 36 80 20 -39 -24 52 70 26 -4 26 18 10 31 51 107 101 66 32 98 164 155 147 139 130 63 -3 -66 -128
901 -128 -96 -2 29 -1 -39 -77 -80 -146 -220 -233 -221 -210 -236 -263 -226 -190 -185 -180 -175 -170 -185 -200 -215 -231 -265 -300 -334 -369 -329 -288 -306 -324 -314 -241 -168 -157 -197 -236
899 -236 -175 -115 -80 -45 -11 23 39 55 9 -36 -82 -129 -113 -96 -119 -141 -160 -178 -206 -171 -109 -47 -12 22 93 101 28 -44 -94 -81 -96 -112 -124 -136 -133 -129 -67
898 -67 -5 -22 -102 -182 -199 -168 -137 -165 -88 49 126 60 -5 -30 6 8 11 2 -5 -10 -14 -46 -15 77 108 109 110 107 105 69 34 0 -35 -48 -60 -73 -85 -108 -131 -50
896 -50 30 114 198 175 90 15 3 14 25 16 8 58 108 94 18 -22 -63 -85 -107 -128 -150 -150 -149 -149 -149 -87 -26 7 -20 -25 -30 -39 -47 5 59 147 173 171 169 162 156 106 56
894 56 69 81 91 101 111 121 118 114 49 -16 27 71 87 41 -25 -92 -59 -26 52 131 141 88 -2 -92 -118 -81 -73 -65 -112 -159 -197 -174 -185 -197 -151 -105 -59 -14
893 -14 -28 -42 -56 -70 -71 -72 -129 -186 -228 -166 -65 -26 -67 -108 -90 -72 -47 -23 36 33 8 -15 17 51 71 91 111 132 84 36 51 66 78 91 103 115 95
892 95 74 54 34 16 -1 -16 -30 -102 -113 -96 -79 -162 -246 -205 -60 24 47 45 43 8 -89 -124 -97 -49 -1 49 101 107 112 79 108 146 121 73 25 13 1
890 1 -10 -22 -68 -114 -160 -206 -156 -106 -114 -122 -119 -53 11 15 -3 -22 -41 -60 -81 -40 27 95 127 158 186 213 216 156 131 107 86 65 103 141 178 152 99 45 45
889 45 44 43 43 25 8 49 90 98 44 -32 -109 -137 -103 -68 -96 -190 -284 -313 -279 -261 -243 -221 -200 -107 -14 78 171 154 138 121 105 42 -19 -81 -143 -155 -166 -178
887 -178 -189 -223 -258 -229 -201 -192 -184 -175 -166 -159 -152 -146 -139 -178 -218 -196 -173 -179 -184 -131 -78 -57 -99 -106 -112 -75 -38 -5 27 62 35 -18 -72 -45 -17 5 28 81 72 36 0 -9
885 -9 -18 -28 -37 -53 -69 -26 16 51 23 -66 -93 -43 7 0 -8 10 29 -13 -57 -78 -99 -117 -134 -163 -129 -32 63 83 -1 -120 -177 -164 -89 -44 0 7 15 23 31 -24
884 -24 -80 -136 -192 -191 -190 -189 -188 -173 -159 -145 -131 -117 -103 -89 -75 -120 -165 -205 -246 -254 -200 -180 -161 -166 -170 -175 -179 -183 -188 -192 -197 -149 -101 -53 -5 -35 -65 -96 -126 -175 -224 -272
882 -272 -321 -234 -146 -58 28 59 89 57 25 54 83 112 142 80 19 -41 -102 -75 -47 -83 -118 -221 -323 -322 -321 -270 -219 -231 -305 -320 -232 -170 -171 -217 -264 -252
881 -252 -240 -153 -67 -62 -160 -208 -152 -15 121 84 46 8 -29 -46 -63 -17 27 7 -13 -34 -54 -71 -87 -104 -121 -126 -130 -135 -140 -136 -131 -190 -248 -248 -248 -247 -247 -211 -174 -138
879 -138 -101 -85 -69 -151 -233 -265 -193 -140 -150 -198 -184 -104 -24 12 48 23 -64 -129 -89 -14 -2 -43 -84 -129 -174 -164 -155 -83 -11 -25 -39 9 57 38 20 1
878 1 -17 -94 -171 -144 -117 -85 -52 -82 -112 -127 -141 -211 -282 -346 -306 -221 -135 -112 -89 -128 -230 -300 -266 -190 -115 -144 -174 -204 -233 -265 -297 -329 -361 -311 -261 -211
877 -211 -161 -175 -189 -140 -91 -125 -158 -191 -225 -187 -150 -112 -75 -95 -115 -134 -154 -146 -138 -130 -122 -156 -191 -122 -53 -90 -128 -166 -204 -216 -228 -240 -251 -272 -292 -250 -208
875 -208 -185 -163 -144 -125 -148 -234 -343 -349 -259 -169 -177 -184 -221 -258 -295 -332 -356 -380 -404 -428 -334 -239 -249 -259 -281 -304 -326 -349 -353 -356 -256 -156 -115 -75 -97 -119
874 -119 -151 -183 -215 -247 -294 -342 -285 -229 -192 -156 -119 -83 -51 -20 -51 -82 -127 -173 -179 -248 -399 -487 -504 -458 -415 -372 -325 -277 -278 -279 -280 -281 -214 -147 -84 -21 17
872 17 -4 -131 -258 -309 -255 -194 -238 -283 -224 -132 -103 -184 -264 -286 -308 -289 -270 -252 -233 -171 -108 -108 -171 -198 -121 -49 -80 -163 -247 -233 -219 -217 -215 -213 -210 -206 -202 -194 -186
871 -186 -210 -172 -130 -151 -253 -293 -267 -242 -348 -454 -438 -318 -242 -270 -295 -320 -341 -361 -358 -292 -254 -279 -358 -375 -313 -190 -125 -122 -215 -309 -344 -379 -358 -337
869 -337 -316 -295 -264 -233 -264 -295 -330 -366 -338 -311 -249 -186 -182 -178 -171 -100 -3 -9 -88 -103 -57 -10 17 45 74 102 74 46 18 -9 13 36 59 82 8 -65 -76
868 -76 -88 -22 42 3 -34 -115 -195 -171 -148 -111 -74 -38 -1 29 60 91 122 46 -29 -42 -56 -58 -60 42 144 140 137 196 255 306 357 408 458 522 586 650 713
867 713 727 741 901 1061 1215 1370 1605 1902 2215 2715 3519 4594 5914 7837 10728 14056 16263 16076 13764 10681 8007
866 8007 6020 4535 3445 2770 2324 1962 1599 1360 1121 944 767 716 665 551 438 406 374 343 311 308 304 238 172 209 246 224 202 166
865 166 192 183 70 -70 -148 -122 -95 -99 -104 -170 -236 -237 -237 -174 -112 -99 -87 -74 -62 -71 -81 -90 -100 -140 -180 -220 -260 -236 -213 -189 -165 -179 -193 -109 -26 -37 -153
863 -153 -245 -274 -248 -221 -230 -176 -79 -44 -75 -105 -120 -135 -150 -165 -171 -177 -183 -189 -170 -150 -131 -112 -75 -37 -100 -163 -146 -67 -50 -96 -90 -84 -78 -71 -92 -49 -7 -27 -89 -151
862 -151 -116 -82 -52 -84 -182 -280 -298 -254 -205 -220 -259 -237 -214 -254 -274 -231 -228 -225 -226 -227 -228 -229 -188 -148 -165 -183 -228 -210 -123 -36 -79 -122 -103 -84 -68 -53 -41 -29
860 -29 -42 -117 -193 -206 -189 -171 -150 -129 -134 -139 -148 -157 -141 -187 -198 -210 -225 -240 -255 -270 -257 -245 -236 -227 -212 -259 -330 -296 -211 -127 -142 -220 -266 -250 -211 -172 -187 -202 -216
859 -216 -231 -181 -131 -146 -223 -305 -325 -280 -234 -193 -152 -110 -69 -112 -154 -197 -240 -256 -273 -290 -307 -287 -268 -249 -230 -252 -273 -294 -315 -362 -409 -352 -295 -333 -371
857 -371 -409 -447 -429 -411 -393 -375 -373 -370 -368 -365 -386 -407 -429 -450 -424 -398 -372 -346 -329 -312 -295 -278 -261 -244 -227 -210 -223 -236 -248 -261 -267 -273 -279 -286 -142 0 -2 -4 -3 -2
856 -2 -1 0 14 28 43 57 39 20 2 -15 -5 4 77 149 124 99 149 325 544 763 1094 1550 2095 2431 2447 2256 1986 1716 1414 1049 736
855 736 548 473 399 343 287 231 175 131 87 43 0 -19 -39 -58 -77 -97 -116 -136 -155 -133 -110 -88 -66 -55 -44 -34 -23 -63 -103 -80 -57 -102 -147 -95 -42
853 -42 -46 -154 -262 -266 -181 -97 -109 -122 -113 -104 -94 -85 -86 -86 -87 -88 -96 -104 -174 -244 -259 -275 -290 -306 -356 -405 -392 -380 -365 -351 -337 -323 -292 -260 -229 -197 -215 -233 -314 -394
852 -394 -374 -353 -271 -188 -195 -202 -146 -91 -90 -90 -90 -89 -146 -203 -260 -317 -284 -250 -279 -308 -385 -462 -435 -408 -276 -144 -158 -171 -133 -94 -56 -17 -42 -68 -93 -118 -117 -117
850 -117 -116 -115 -117 -118 -120 -121 -153 -184 -216 -247 -220 -193 -225 -256 -262 -205 -121 -140 -201 -200 -136 -72 -76 -80 -22 36 66 96 64 31 -12 -56 -100 -145 -165 -185 -101 -17 16 50
849 50 22 -5 17 41 64 87 68 48 174 300 467 634 905 1177 1541 1906 2224 2417 2390 2156 1760 1364 1046 728 522 316 211
847 211 231 243 255 168 81 57 32 67 101 31 -37 -29 -21 -12 -4 -50 -95 -141 -187 -108 -29 -95 -162 -214 -266 -214 -163 -73 16 1 -13 -56 -99 -142 -186 -161 -137
846 -137 -217 -297 -288 -279 -269 -260 -277 -294 -249 -203 -224 -245 -265 -286 -303 -320 -336 -353 -298 -243 -188 -133 -110 -87 -127 -167 -165 -162 -160 -158 -206 -255 -303 -352 -316 -280 -243 -207 -193
845 -193 -179 -228 -276 -318 -359 -400 -442 -419 -397 -312 -227 -268 -309 -287 -265 -228 -191 -153 -116 -100 -84 -68 -52 -58 -64 -71 -77 -93 -110 -64 -18 15 49 -96 -243 -276
843 -276 -204 -189 -278 -351 -320 -208 -96 -133 -170 -207 -244 -190 -136 -163 -293 -386 -375 -325 -275 -301 -328 -355 -381 -345 -308 -272 -235 -242 -248 -255 -261 -276 -290 -242 -194 -181
842 -181 -168 -155 -142 -128 -114 -100 -86 -148 -209 -208 -207 -178 -148 -181 -214 -230 -245 -157 -69 -138 -206 -275 -343 -269 -194 -159 -228 -296 -261 -187 -113 -71 -29 -50 -70 -142
840 -142 -214 -182 -149 -153 -158 -162 -166 -165 -163 -162 -161 -121 -81 -103 -125 -206 -287 -306 -325 -322 -320 -256 -191 -173 -155 -200 -245 -235 -224 -214 -204 -224 -243 -262 -281 -291 -302 -208 -114 -112 -111
839 -111 -110 -108 -154 -199 -245 -290 -330 -370 -347 -324 -356 -388 -419 -451 -404 -357 -372 -387 -337 -287 -237 -187 -239 -292 -281 -271 -224 -178 -131 -84 -164 -244 -261 -278 -298 -318
837 -318 -338 -358 -376 -395 -309 -224 -164 -105 -149 -194 -193 -193 -192 -192 -200 -209 -159 -109 -158 -269 -319 -245 -123 -126 -156 -185 -171 -156 -142 -127 -135 -142 -212 -282 -331 -380 -324 -269 -260
836 -260 -251 -243 -234 -177 -119 -66 -13 -67 -184 -274 -239 -172 -106 -136 -166 -229 -293 -294 -295 -241 -186 -194 -202 -218 -233 -249 -264 -223 -183 -142 -101 -86 -71 -56 -41 76 193
834 193 310 428 460 493 534 574 586 722 955 1312 1730 2274 3077 4089 4967 5221 4793 3907 3008 2234 1653 1196 911 751 633
833 633 515 456 398 339 281 196 112 32 -48 -72 -35 26 87 107 65 -38 -80 -51 -21 -50 -80 -107 -134 -196 -196 -100 -3 -10 -79 -133 -124 -119 -177 -221 -264 -308
832 -308 -351 -374 -334 -330 -325 -370 -415 -433 -388 -264 -141 -82 -86 -148 -209 -270 -331 -303 -212 -180 -210 -248 -223 -203 -245 -301 -358 -356 -355 -354 -354 -291 -228 -144 -59 -117 -174 -173
831 -173 -109 -46 -44 -75 -106 -161 -279 -373 -364 -277 -254 -289 -325 -299 -211 -113 -77 -109 -203 -267 -269 -306 -342 -387 -369 -347 -388 -412 -373 -334 -358 -364 -309 -257 -268 -378
829 -378 -489 -517 -441 -320 -199 -141 -146 -136 -127 -86 -108 -196 -284 -307 -268 -190 -113 -59 -67 -114 -161 -212 -263 -269 -274 -217 -160 -92 -24 -103 -181 -210 -240 -269 -299 -339
828 -339 -379 -314 -250 -273 -296 -318 -341 -358 -376 -393 -411 -510 -609 -605 -600 -468 -335 -249 -266 -333 -400 -411 -422 -401 -380 -358 -337 -319 -301 -345 -389 -355 -322 -288 -254
826 -254 -159 -64 -132 -305 -388 -367 -348 -434 -521 -547 -551 -555 -538 -520 -440 -360 -330 -300 -271 -241 -209 -177 -145 -113 -192 -271 -247 -222 -264 -305 -347 -388 -387 -385 -384 -382 -371 -361
825 -361 -412 -464 -453 -442 -431 -419 -463 -506 -487 -468 -409 -350 -291 -232 -247 -262 -277 -292 -302 -312 -322 -332 -371 -410 -386 -362 -399 -436 -368 -301 -325 -349 -373 -396 -393 -389
823 -389 -386 -382 -399 -417 -372 -326 -228 -130 -177 -287 -350 -309 -233 -220 -226 -232 -242 -252 -258 -264 -270 -277 -290 -303 -317 -330 -339 -349 -358 -368 -383 -398 -351 -304 -281 -257 -234 -210 -257 -304
822 -304 -288 -273 -325 -377 -430 -482 -484 -487 -427 -367 -327 -287 -246 -206 -237 -268 -299 -331 -315 -299 -284 -268 -249 -230 -211 -192 -255 -318 -381 -444 -439 -434 -449 -527 -575 -520 -425
820 -425 -392 -386 -318 -226 -239 -321 -341 -257 -174 -151 -128 -168 -208 -224 -239 -191 -144 -168 -191 -214 -238 -251 -263 -297 -393 -528 -559 -464 -370 -379 -387 -396 -404 -402 -400 -398 -396 -333 -269
819 -269 -269 -268 -277 -285 -294 -303 -288 -273 -321 -369 -358 -346 -335 -324 -281 -239 -259 -279 -266 -252 -239 -226 -226 -225 -163 -100 -164 -228 -291 -355 -344 -332 -320 -309 -222 -136 -154 -171 -190
817 -190 -209 -291 -372 -448 -524 -538 -552 -520 -488 -456 -425 -355 -285 -277 -270 -224 -179 -196 -213 -288 -362 -374 -386 -288 -189 -171 -257 -344 -326 -234 -205 -228 -250 -277 -304 -309 -315
816 -315 -320 -326 -335 -345 -354 -363 -298 -233 -230 -227 -257 -287 -316 -346 -340 -333 -327 -320 -350 -380 -411 -441 -466 -491 -516 -541 -554 -568 -519 -470 -482 -493 -505 -517 -568 -619 -608 -596 -557 -517 -478
814 -478 -438 -431 -424 -417 -410 -391 -373 -354 -336 -290 -244 -237 -334 -450 -461 -355 -248 -301 -417 -493 -466 -399 -333 -322 -312 -318 -325 -331 -337 -437 -536 -447 -359 -292 -224 -261 -298
813 -298 -309 -320 -330 -341 -385 -428 -368 -307 -358 -409 -355 -302 -242 -183 -227 -271 -337 -403 -469 -536 -472 -408 -344 -280 -220 -160 -163 -166 -230 -294 -296 -298 -237 -176 -178 -179 -241 -302
811 -302 -363 -425 -423 -422 -420 -419 -415 -411 -344 -278 -224 -171 -221 -334 -428 -417 -365 -313 -319 -324 -330 -336 -313 -290 -268 -245 -241 -238 -297 -355 -405 -455 -505 -554 -551 -547 -543 -539 -571 -602 -571 -540 -537
810 -537 -534 -531 -527 -485 -443 -463 -484 -421 -358 -295 -232 -269 -305 -237 -168 -206 -243 -280 -318 -234 -151 -213 -275 -334 -392 -347 -302 -243 -183 -204 -329 -453 -473 -454 -435 -443
808 -443 -451 -318 -184 -131 -140 -176 -212 -208 -204 -200 -196 -255 -314 -369 -424 -408 -330 -249 -229 -245 -199 -156 -175 -241 -306 -271 -236 -245 -254 -264 -273 -312 -351 -287 -222 -185 -148 -173 -198
807 -198 -271 -343 -353 -362 -388 -414 -413 -349 -253 -157 -119 -81 -58 -35 -74 -113 -95 -76 -23 -32 -104 -175 -224 -209 -173 -136 -159 -181 -208 -235 -262 -289 -294 -299 -303 -308 -292 -276 -260
805 -260 -243 -239 -234 -288 -342 -353 -301 -245 -251 -346 -378 -308 -238 -174 -173 -237 -301 -304 -245 -259 -378 -475 -468 -387 -368 -344 -320 -265 -272 -316 -359 -303 -247 -258 -269 -280 -291 -343
804 -343 -394 -376 -296 -222 -149 -140 -194 -250 -307 -263 -220 -191 -163 -100 -99 -177 -254 -266 -216 -188 -160 -191 -221 -230 -238 -247 -255 -241 -228 -218 -208 -245 -345 -441 -474 -410 -283
802 -283 -153 -85 -105 -125 -94 -62 -110 -262 -413 -461 -402 -343 -281 -219 -165 -174 -210 -246 -266 -286 -305 -325 -278 -230 -245 -259 -268 -277 -286 -295 -272 -250 -251 -315 -346 -315 -261
801 -261 -207 -184 -161 -138 -115 -169 -222 -217 -213 -223 -297 -335 -373 -371 -369 -367 -365 -286 -208 -194 -243 -343 -381 -353 -326 -317 -307 -298 -289 -266 -243 -279 -315 -360 -342 -297 -252 -246 -241 -274
799 -274 -245 -179 -176 -234 -292 -323 -291 -294 -297 -266 -234 -225 -280 -366 -390 -349 -308 -361 -414 -439 -402 -353 -304 -313 -322 -339 -356 -373 -390 -342 -293 -210 -189 -215 -240 -212 -183 -160
798 -160 -201 -209 -218 -260 -364 -467 -509 -454 -399 -403 -406 -355 -304 -312 -319 -329 -276 -219 -224 -245 -204 -167 -192 -258 -324 -328 -332 -332 -269 -203 -199 -234 -206 -179 -214 -297 -318 -315 -312 -412
796 -412 -511 -503 -434 -420 -468 -454 -378 -283 -251 -242 -234 -258 -281 -305 -329 -319 -310 -300 -290 -256 -221 -252 -345 -442 -477 -448 -418 -385 -353 -285 -280 -315 -350 -390 -429 -469 -510 -485
$$ [...]
##END=	
##TITLE=	1H: Tris(2-chloroethyl)amine; S.1.A.06; CAS 555-77-1
##JCAMP-DX=	6.0	$$ MestReNova 14.1.2-25024
##BLOCK_ID=	3
##DATA TYPE=	NMR PEAK TABLE
##DATA CLASS=	PEAK TABLE
##CROSS REFERENCE=	NMR SPECTRUM: BLOCK_ID=2                                     
##.OBSERVE FREQUENCY=	400.13228420109800254
##.OBSERVE NUCLEUS=	^1H
##NPOINTS=	6
##FIRSTX=	2.9738744881744243465
##LASTX=	3.5408198869737588232
##XFACTOR=	1
##YFACTOR=	1
##FIRSTY=	212479566.48585727811
##XUNITS=	PPM
##YUNITS=	ARBITRARY UNITS
##PEAK TABLE=	(XYW..XYW)
2.9738744881744243465,212479566.48585727811,0.0026410541320631168369
2.9912036773158137137,432662732.41396057606,0.0026877029998364511919
3.0086016038059799627,240261616.30493482947,0.0025732008810444152551
3.5060976535186543224,262854488.8627846241,0.0024728875160208909495
3.5235092596132662202,443932812.89739018679,0.0026607464768678094208
3.5408198869737588232,232798548.51665177941,0.0024861753325409294453
##$MNOVA/PEAK_DATA_TABLE=	(T,F,A,ST,SP,APT,APC)
$$ Complementary to PEAK TABLE
$$ T: Type
$$ F: Flags
$$ A: Annotation
$$ ST: Shape Type
$$ SP: Shape Parameter
$$ APT: Attached Peaks Type
$$ APC: Attached Peaks Count
Compound,None,,1,0.32942491464252610101,0,0
Compound,None,,1,0.3704721810025093931,0,0
Compound,None,,1,0.45992027659555817509,0,0
Compound,None,,1,0.35544311959098257026,0,0
Compound,None,,1,0.42772604890902948815,0,0
Compound,None,,1,0.40000000000000007772,0,0
##END=	
##END=	
