##TITLE=	RM1002-H
Aliquot code:RM1002

##JCAMP-DX=	6.0	$$ MestReNova 14.1.2-25024
##DATA TYPE=	LINK
##BLOCK_ID=	1
##BLOCKS=	2    
##ORIGIN=	Mestrelab Research S.L.
##OWNER=	HGL
##$MNOVA/LINK_BLOCK_TYPE=	ITEM	$$ NMR Spectrum
##$MNOVA/ITEM/POLYGON=	(XY..XY)
5835,5321
8208,5321
8208,8722
5835,8722
5835,5321
##$MNOVA/ITEM/Z=	0
##$MNOVA/ITEM/ANGLE=	0
##TITLE=	RM1002-H
##JCAMP-DX=	6.0	$$ MestReNova 14.1.2-25024
##BLOCK_ID=	2
##DATA TYPE=	NMR SPECTRUM
##DATA CLASS=	XYDATA
##NUMDIM=	1
##ORIGIN=	Varian
##OWNER=	HGL
##.OBSERVE FREQUENCY=	599.77881209999998191
##.OBSERVE NUCLEUS=	^1H
##.SOLVENT NAME=	d2o
##.PULSE SEQUENCE=	presat
##LONGDATE=	2010/05/10 09:49:11.000
##.ACQUISITIONMODE=	SIMULTANEOUS
##$ORIGINAL FORMAT=	Varian
##$MNOVA/SCALES_VERSION=	9
##$PARAMETER FILE=	(datafile, ASCII, h:/OPCW/NMR-Databases/Sulfur%20compounds/Bis(2-hydroxyethyl)sulfide/RM1002-H.fid/fid, 0)
$$ 
##$PARAMETER FILE=	(header, BASE64, h:/OPCW/NMR-Databases/Sulfur%20compounds/Bis(2-hydroxyethyl)sulfide/RM1002-H.fid/fid, 0)
AAAAAQAAAAEAAJnkAAAABAACZ5AAAmesAAAAyQAAAAE=
##$PARAMETER FILE=	(log, ASCII, h:/OPCW/NMR-Databases/Sulfur%20compounds/Bis(2-hydroxyethyl)sulfide/RM1002-H.fid/log, 0)
$$ Mon May 10 09:48:50 2010: Experiment started
$$ Mon May 10 09:49:11 2010: Acquisition complete
$$ 
##$PARAMETER FILE=	(procpar, ASCII, h:/OPCW/NMR-Databases/Sulfur%20compounds/Bis(2-hydroxyethyl)sulfide/RM1002-H.fid/procpar, 0)
$$ exppath 2 2 8 0 0 2 1 0 1 64
$$ 1 "/export/home/vnmr1/vnmrsys/exp1/acqfil"
$$ 0 
$$ dg1 2 2 1023 0 0 4 1 6 1 64
$$ 1 "1:DISPLAY:sp:1,wp:1,vs:0;1:REFERENCE:rfl:1,rfp:1,cr:1,delta:1;1:PHASE:lp:1,rp:1,rp1(ni):1,lp1(ni):1;2:CHART:sc:0,wc:0,hzmm:2,vp:0,axis,pltmod,,th:0,,ho:2,vo:2,,trace:2;3(ni):2D:sp1:1,wp1:1,sc2:0,wc2:0,rfl1:1,rfp1:1;3:FLAGS:aig*,dcg*,dmg*;3:FID:sf:3,wf:3,vf:0;4:INTEGRAL:intmod,is:2,ins:3,io:0,,lvl:3,tlt:3;"
$$ 0 
$$ cr 1 1 1000000000 -1000000000 0 4 1 1 1 64
$$ 1 2321.68344354 
$$ 0 
$$ axis 4 2 4 0 0 4 1 0 1 64
$$ 1 "p"
$$ 11 "c" "d" "1" "2" "3" "h" "k" "m" "n" "p" "u" 
$$ arraydim 7 1 32768 1 1 2 1 5 1 64
$$ 1 1 
$$ 0 
$$ aig 2 2 2 0 0 4 1 1 1 64
$$ 1 "ai"
$$ 2 "nm" "ai" 
$$ acqstatus 7 1 32767 0 0 2 1 0 1 64
$$ 2 101 0 
$$ 0 
$$ acqdim 7 1 32767 0 0 2 1 0 1 64
$$ 1 1 
$$ 0 
$$ acqcycles 1 1 9.99999984307e+17 -9.99999984307e+17 0 2 1 0 1 64
$$ 1 1 
$$ 0 
$$ acqpath 2 2 8 0 0 2 1 0 1 64
$$ 1 ""
$$ 0 
$$ actionid 2 2 8 0 0 4 1 0 1 64
$$ 1 "null"
$$ 0 
$$ alock 2 2 8 0 0 2 1 0 1 64
$$ 1 "n"
$$ 5 "a" "n" "s" "u" "y" 
$$ alfa 6 1 13 13 13 2 1 24578 1 64
$$ 1 6.6 
$$ 0 
$$ apptype 2 2 8 0 0 4 1 0 1 64
$$ 1 "presat"
$$ 0 
$$ ap 2 2 1023 0 0 4 1 6 1 64
$$ [...]
$$ 0 
$$ wshim 4 2 4 0 0 2 1 1 1 64
$$ 1 "n"
$$ 15 "e" "f" "g" "n" "s" "0" "1" "2" "3" "4" "5" "6" "7" "8" "9" 
$$ wp1 1 1 100000 0 0 4 1 3 1 64
$$ 1 60.2042126895 
$$ 0 
$$ wtfile 2 2 15 0 0 3 1 1 1 64
$$ 1 ""
$$ 0 
$$ wtune 4 2 4 0 0 2 1 0 1 64
$$ 1 "st12"
$$ 11 "s" "t" "e" "i" "n" "o" "v" "1" "2" "3" "4" 
$$ z3 7 1 19 19 19 2 1 8192 1 64
$$ 1 17565 
$$ 0 
$$ z1 7 1 19 19 19 2 1 8192 1 64
$$ 1 20922 
$$ 0 
$$ xz2 7 1 19 19 19 2 1 8192 1 64
$$ 1 -2031 
$$ 0 
$$ x4 7 1 19 19 19 2 1 8192 1 64
$$ 1 0 
$$ 0 
$$ x2y2 7 1 19 19 19 2 1 8192 1 64
$$ 1 2229 
$$ 0 
$$ x3 7 1 19 19 19 2 1 8192 1 64
$$ 1 7604 
$$ 0 
$$ xz 7 1 19 19 19 2 1 8192 1 64
$$ 1 8758 
$$ 0 
$$ xy 7 1 19 19 19 2 1 8192 1 64
$$ 1 -2071 
$$ 0 
$$ y4 7 1 19 19 19 2 1 8192 1 64
$$ 1 0 
$$ 0 
$$ y3 7 1 19 19 19 2 1 8192 1 64
$$ 1 -7490 
$$ 0 
$$ y1 7 1 19 19 19 2 1 8192 1 64
$$ 1 -6983 
$$ 0 
$$ yz2 7 1 19 19 19 2 1 8192 1 64
$$ 1 -3534 
$$ 0 
$$ yz 7 1 19 19 19 2 1 8192 1 64
$$ 1 6327 
$$ 0 
$$ z0_ 1 1 19 19 19 2 1 73744 1 64
$$ 1 -4716 
$$ 0 
$$ z2x2y2 7 1 19 19 19 2 1 8192 1 64
$$ 1 -1083 
$$ 0 
$$ z2 7 1 19 19 19 2 1 8192 1 64
$$ 1 -7993 
$$ 0 
$$ z1c 7 1 19 19 19 2 1 8192 1 64
$$ 1 0 
$$ 0 
$$ z2c 7 1 19 19 19 2 1 8192 1 64
$$ 1 0 
$$ 0 
$$ z2xy 7 1 19 19 19 2 1 8192 1 64
$$ 1 -3942 
$$ 0 
$$ z2x3 7 1 19 19 19 2 1 8192 1 64
$$ 1 0 
$$ 0 
$$ z2y3 7 1 19 19 19 2 1 8192 1 64
$$ 1 0 
$$ 0 
$$ z4x2y2 7 1 19 19 19 2 1 8192 1 64
$$ 1 0 
$$ 0 
$$ z3y3 7 1 19 19 19 2 1 8192 1 64
$$ 1 0 
$$ 0 
$$ z3x2y2 7 1 19 19 19 2 1 8192 1 64
$$ 1 0 
$$ 0 
$$ z3x 7 1 19 19 19 2 1 8192 1 64
$$ 1 -908 
$$ 0 
$$ z3c 7 1 19 19 19 2 1 8192 1 64
$$ 1 0 
$$ 0 
$$ z3xy 7 1 19 19 19 2 1 8192 1 64
$$ 1 0 
$$ 0 
$$ z3x3 7 1 19 19 19 2 1 8192 1 64
$$ 1 0 
$$ 0 
$$ z3y 7 1 19 19 19 2 1 8192 1 64
$$ 1 973 
$$ 0 
$$ z4c 7 1 19 19 19 2 1 8192 1 64
$$ 1 0 
$$ 0 
$$ z4 7 1 19 19 19 2 1 8192 1 64
$$ 1 -2741 
$$ 0 
$$ z4x 7 1 19 19 19 2 1 8192 1 64
$$ 1 -1761 
$$ 0 
$$ z6 7 1 19 19 19 2 1 8192 1 64
$$ 1 -1323 
$$ 0 
$$ z5x 7 1 19 19 19 2 1 8192 1 64
$$ 1 0 
$$ 0 
$$ z4y 7 1 19 19 19 2 1 8192 1 64
$$ 1 2132 
$$ 0 
$$ z4xy 7 1 19 19 19 2 1 8192 1 64
$$ 1 0 
$$ 0 
$$ z5 7 1 19 19 19 2 1 8192 1 64
$$ 1 144 
$$ 0 
$$ z5y 7 1 19 19 19 2 1 8192 1 64
$$ 1 0 
$$ 0 
$$ zx2y2 7 1 19 19 19 2 1 8192 1 64
$$ 1 -4748 
$$ 0 
$$ z8 7 1 19 19 19 2 1 8192 1 64
$$ 1 0 
$$ 0 
$$ z7 7 1 19 19 19 2 1 8192 1 64
$$ 1 10133 
$$ 0 
$$ zxy 7 1 19 19 19 2 1 8192 1 64
$$ 1 -2440 
$$ 0 
$$ zx3 7 1 19 19 19 2 1 8192 1 64
$$ 1 -342 
$$ 0 
$$ zy3 7 1 19 19 19 2 1 8192 1 64
$$ 1 -988 
$$ 0 
$$ 
##$PARAMETER FILE=	(text, ASCII, h:/OPCW/NMR-Databases/Sulfur%20compounds/Bis(2-hydroxyethyl)sulfide/RM1002-H.fid/text, 0)
$$ Aliquot code:RM1002
$$ 
##XUNITS=	HZ
##YUNITS=	ARBITRARY UNITS
##FIRSTX=	7666.3677509299996018
##LASTX=	-1948.8701453343990124
##DELTAX=	-0.14671912560104369283
##XFACTOR=	1
##YFACTOR=	7.7813461523305665294e-05
##FIRSTY=	0.15949410200119018555
##MINY=	0.14647893607616424561
##MAXY=	255.1031341552734375
##NPOINTS=	65536
##XYDATA=	(X++(Y..Y))
$$ [...]
4315B051l8J37J58L7l6k7NL1k1j06m8Q7O5l8j8J6n1m0Q7J19M9J8l1j28j12j0j1m9L1J13M8
4310B288m8k9M9O5Kn6m4rMN1J05L9r3j03k3j6n9m4JK2L9N0N0M6K0k0m1m3j4Q0J27%j20m0M5
4305B281n6j23jR1N0K6Rn8l0J13R7r2j40KO8J6J2M2oo0l1J5K2M5N5k7j01k8O4kp9K0J29L6
4300B359r7m8Q3P0m5n5M9O0q6j80q8M7J02J05M3o9o1O2M4r4o8N2J4o4rOo7OJ60J20KL0N1o7
4295B367j03M6J25j0j67j30M3J26O1K1M4l1j49q1P0M3p2n6Mj2oM9L4j2ORm7k0J16J46j1j21
4290B282m5K0o7r9O8J70L3j07r5n5J6J74J80p9k21m2J25P0rj6l8m6rpk8j0RM6J17Q3n7n2R1
4285B402P2p6o5L2l0j36p8M8O8j8j07n7J31J93j8k06j03R3J26O0J6k7l6L2O3k2q4j9O2N2K
4281B370l1l0RK1n6j01KJ03P0L9O2j9j27k3J37O3q2n0j0r7j07j8oJ4J38J38m9q4P3O7j24j36
$$ plain form
4315 2051 2013 2150 2308 2345 2309 2282 2287 2318 2297 2191 2143 2230 2295 2257 2239 2255 2204 2164 2251 2370 2419 2437 2406 2278 2166 2156 2145 2096 2127 2240 2288
4310 2288 2240 2211 2260 2325 2327 2271 2227 2218 2222 2273 2378 2417 2324 2221 2198 2182 2123 2079 2080 2102 2141 2191 2241 2287 2307 2287 2246 2203 2189 2269 2396 2396 2276 2236 2281
4305 2281 2225 2102 2101 2192 2242 2268 2277 2219 2189 2302 2399 2307 2167 2169 2237 2253 2265 2307 2301 2241 2210 2225 2247 2292 2347 2320 2219 2191 2255 2253 2174 2194 2323 2359
4300 2359 2262 2214 2297 2367 2322 2267 2316 2376 2290 2110 2022 2069 2171 2276 2319 2250 2189 2251 2295 2201 2133 2185 2199 2135 2126 2132 2065 2071 2231 2351 2353 2383 2434 2367
4295 2367 2264 2310 2435 2425 2258 2128 2171 2297 2358 2379 2423 2392 2243 2162 2232 2275 2203 2147 2151 2139 2133 2182 2216 2204 2210 2219 2172 2152 2268 2414 2403 2282
4290 2282 2237 2257 2190 2091 2159 2329 2362 2255 2160 2105 2121 2295 2475 2396 2175 2133 2258 2328 2319 2303 2265 2219 2210 2203 2175 2165 2174 2220 2337 2420 2363 2311 2402
4285 2402 2474 2398 2333 2365 2335 2199 2121 2169 2237 2219 2112 2055 2186 2379 2361 2155 2052 2145 2271 2331 2347 2320 2284 2316 2379 2357 2273 2254 2316 2368 2370
4281 2370 2339 2309 2318 2339 2283 2182 2184 2287 2357 2396 2458 2439 2312 2289 2426 2489 2407 2357 2347 2250 2143 2125 2119 2133 2271 2409 2360 2276 2349 2416 2292 2156
4276B156N4J07m9j28lJ06K3r8o4L2M0L8R1Q3%m6o1q3m4K1M%R0R9k0m8Qo5j60n6Q2M3lQ8J05
4271B342n4j46m0N8J7j6N6Q3j3o5LM2NJ4M5Kk2L1J5o7l7N9L4k9NK0m8n5Nj0n4j8J9j4k0M2
4266B189P4L7kk5q5j34l6J51J55m7j04O8J18l3n1Q1L3j22o1J02O6o3o8l4n2m1J8P0J03P2m1
4261B338j01l3K1j0%P8P5j2m6j4lj8RP5Q2mo9k3Qq5j62q6L0P0P8M4o6j00L6J49J02L8L5Km1
4256B397oK2k2k3J8l1j13n3P8Q0k5p0j4M9N8L6oq8j13J9J49N8r6o4Op3r7L1N9k1M8J42Lj39
4251B199k9P5j7p2J7O6Rp9j35o7R4J27K9jjp0k6J52J36o2p3O1K7o8qO4Nn6m7k8J3P0N1k5n3
4246B278k1L4O7L5k4n1q4j03kJ29R3l1m3Mj%J2k6n2l5n8o2O1J62Q3j4ONq3j11j1J04R6k6o9
4241B262N0J08l5j19J5Q6n8j55n5O2P8M1kKP9J19M3o7j14q6mO1M3m%L3N1K0o9j04J1R9lr3
$$ plain form
4276 2156 2210 2317 2268 2140 2137 2243 2266 2168 2104 2136 2176 2214 2305 2388 2388 2342 2281 2198 2154 2175 2179 2179 2269 2368 2348 2300 2308 2243 2083 2027 2109 2152 2149 2237 2342
4271 2342 2288 2142 2102 2160 2177 2161 2217 2300 2287 2222 2225 2267 2272 2286 2331 2333 2311 2342 2357 2290 2253 2312 2346 2317 2322 2342 2294 2239 2244 2234 2180 2162 2181 2167 2147 2189
4266 2189 2263 2300 2298 2273 2188 2054 2018 2169 2324 2277 2173 2241 2359 2326 2275 2356 2389 2267 2206 2308 2374 2311 2243 2209 2157 2116 2134 2204 2307 2379 2338
4261 2338 2237 2204 2225 2215 2215 2293 2368 2356 2310 2296 2293 2275 2284 2359 2441 2437 2368 2345 2353 2268 2106 2020 2050 2120 2198 2242 2176 2076 2112 2261 2363 2401 2436 2438 2397
4256 2397 2391 2413 2391 2368 2386 2355 2242 2189 2267 2347 2322 2252 2238 2287 2345 2381 2375 2287 2174 2193 2342 2400 2304 2240 2246 2173 2076 2107 2166 2145 2193 2335 2338 2199
4251 2199 2170 2245 2228 2156 2173 2239 2248 2169 2034 1967 2061 2188 2217 2216 2215 2145 2119 2271 2407 2345 2272 2333 2360 2292 2284 2348 2353 2297 2250 2222 2235 2305 2356 2331 2278
4246 2278 2257 2291 2358 2393 2369 2318 2234 2131 2129 2258 2351 2320 2277 2281 2280 2280 2292 2266 2214 2179 2121 2059 2120 2282 2365 2351 2357 2362 2279 2168 2157 2261 2357 2331 2262
4241 2262 2312 2420 2385 2266 2281 2367 2309 2154 2099 2161 2239 2280 2278 2280 2359 2478 2521 2454 2340 2254 2250 2311 2354 2350 2350 2383 2434 2454 2385 2281 2292 2391 2388 2295
4236B295j0K6o2m8N3K4k5O1N9r9r1Q1N8j02n6R9R3K6L5j8j18p1N1L1n7m0K5M7M2Qm4l0J5m4
4231B214j30n6J03J24J8n2m3RP8Q3oq1o0k6l7k5L4N4ll7K3P2%p8JJ18P8k5m5m7n2L0O9n6r3
4226B156R7J56n7j64m3J6LP7O2r8m9J74J25j23j04O5J1r1J2Q0k6k2R6J0j79j09J00Q9l7rO3
4221B281J0j6N5K0j15j00K9L5j6N7J06k1j18j1J22R6%l3qJ4Kk5k9k5m3l9J2L0k6n4J7R8P2
4216B377l1p3j2M3K2k6n5p0m4J9M0K0J9Ll2K1J13O0q1j06n2k9K9Q5J4l5O1O3j03j08P5Q8n4
4211B241m0O8N1j2j8l9m8J0L8nk1j0j3L8J08O1m8p6l0K6O5M0l0k8K2J4LL1Ml3K9L9q9j10K5
4206B263K4p0M2J60m7k53p5J48M5j35j06j0L8J01J19K0o1m5m0n6NQ6O5jKL1Ml4k8jJ7L6M7
4201B291Qn1l0P6J10kj14r3k5jK8Q8Q9J0n5p6p8m9K5R5P5l0q1J5J10K8q2l1L2j8kR3Rj67r9
$$ plain form
4236 2295 2285 2311 2249 2201 2254 2278 2253 2314 2373 2274 2183 2264 2322 2220 2164 2263 2356 2382 2417 2399 2281 2210 2261 2292 2235 2195 2220 2267 2309 2317 2273 2243 2258 2214
4231 2214 2084 2028 2131 2255 2273 2221 2178 2187 2265 2348 2342 2261 2201 2175 2138 2113 2147 2201 2198 2161 2184 2256 2256 2178 2179 2297 2375 2350 2305 2258 2206 2236 2305 2249 2156
4226 2156 2253 2409 2352 2188 2145 2161 2164 2241 2303 2205 2156 2330 2455 2332 2228 2293 2304 2213 2225 2305 2279 2257 2353 2363 2184 2075 2175 2264 2227 2218 2281
4221 2281 2291 2275 2330 2350 2235 2135 2164 2199 2183 2240 2346 2325 2207 2196 2318 2414 2414 2381 2373 2387 2389 2364 2335 2310 2267 2228 2240 2270 2244 2190 2207 2305 2377
4216 2377 2346 2273 2261 2304 2326 2300 2245 2175 2131 2150 2190 2210 2229 2232 2200 2221 2334 2394 2313 2207 2155 2126 2155 2240 2254 2219 2280 2343 2240 2132 2207 2295 2241
4211 2241 2201 2269 2320 2308 2290 2251 2203 2213 2251 2246 2225 2215 2202 2240 2348 2409 2361 2285 2255 2281 2346 2386 2356 2328 2350 2364 2367 2398 2402 2369 2398 2437 2348 2238 2263
4206 2263 2287 2217 2259 2419 2372 2119 2044 2192 2237 2102 1996 1986 2024 2125 2244 2264 2203 2158 2118 2062 2067 2153 2218 2217 2219 2250 2254 2220 2192 2191 2208 2244 2291
4201 2291 2299 2248 2218 2294 2404 2402 2288 2195 2170 2169 2197 2285 2374 2384 2329 2253 2175 2126 2151 2246 2321 2291 2210 2225 2335 2363 2281 2250 2282 2264 2262 2355 2364 2197 2098
4196B098R6Q5j4K7N3n0q9KO8O1Pp3p7OK0k4L6J11K4r2p2oL5Q4O1m1o1ql2n3L3O9KK3J10O2
4191B481m1oN1m6j72j31QM5j4LQ3L8p1j8J01N0l2J9Qj17o5J18J06pM2P0r2j63nR4K1m7n7o1
4186B193k5K6K6K7M4pq1k1R8P2o6j01JP2M5K6L4k0q6l0N1%m4M9Q1n2j00K2Q6K2l8p4p6J9J16
4181B289N9l3kM8Kn6n9m0NP7Q5j5j09o8O3J07K4l6kJ1k9l6nN%j8m3MR8Q0ljj0j09j06L0M0
4175B247n1kP6j6p8O3J77R8m5j32j22k0N5J6k7pk3o3k2N0N7L6K4Onk4m8MQ1Mj26p0P1O0k1
4170B223k0J1L5N2lp9k5P4N3kkk3k1N3K2j44j48M9J33M1j5J2M0N7L3m9q5k4M2K7n2r4J9J72
4165B362J09q8r9K6K4o5j07j26o3J15J33o4r0J17J55jk5K5m7p3M9J04M6J2k8r3m7Q0R4Mo5
4161B374p2J5J25O0j26j27L1N9j8j1oq1o7L9K3p3l0P8M8l3LP6N3j7l4k7m2n3k9QJ3k2n3lJ12
$$ plain form
4196 2098 2194 2279 2265 2292 2345 2295 2206 2208 2276 2337 2344 2271 2194 2200 2220 2196 2232 2343 2367 2275 2203 2197 2232 2316 2377 2336 2275 2267 2235 2182 2215 2284 2286 2309 2419 2481
4191 2481 2440 2434 2485 2439 2267 2136 2144 2189 2175 2178 2261 2299 2228 2210 2311 2361 2329 2348 2356 2239 2174 2292 2398 2391 2433 2503 2411 2248 2243 2337 2358 2311 2254 2193
4186 2193 2168 2194 2220 2247 2291 2284 2203 2182 2280 2352 2286 2185 2186 2258 2303 2329 2363 2343 2257 2227 2278 2278 2234 2283 2364 2312 2212 2234 2320 2342 2304 2230 2154 2173 2289
4181 2289 2348 2315 2313 2361 2363 2307 2248 2208 2213 2290 2375 2360 2251 2183 2246 2353 2377 2341 2339 2350 2321 2285 2280 2285 2285 2267 2224 2228 2326 2406 2403 2402 2392 2283 2177 2207 2247
4175 2247 2196 2194 2270 2254 2176 2239 2416 2514 2469 2337 2215 2195 2250 2266 2239 2232 2209 2146 2124 2174 2231 2267 2291 2297 2292 2268 2220 2224 2305 2309 2183 2113 2184 2244 2223
4170 2223 2203 2214 2249 2301 2298 2219 2194 2268 2321 2319 2317 2294 2273 2326 2348 2204 2056 2105 2238 2279 2264 2276 2316 2373 2406 2357 2272 2248 2290 2317 2265 2171 2190 2362
4165 2362 2471 2383 2284 2310 2334 2269 2162 2036 1973 2088 2221 2157 2067 2184 2339 2338 2313 2338 2291 2218 2267 2371 2417 2429 2401 2308 2261 2341 2435 2439 2374
4161 2374 2302 2317 2442 2502 2376 2249 2280 2339 2321 2310 2304 2223 2156 2195 2218 2145 2115 2193 2241 2208 2211 2287 2340 2323 2289 2262 2220 2167 2138 2146 2159 2137 2084 2081 2193
4156B193J44J0j20o9N1O1L2Q3R7j1r8o8j5PK5j3j14j28qP2M7M8Q8N2l1m6j6k0l4j1L2M1j9
4151B262q6n4K9Qm5M0J30K4q8J2J17J2r9m6J8KK0P5N0n8j49j37j1Q8N0j3K1N1K7N0P8%m7L3
4146B364M2n8m3M4k7j10oN7o6q2R1J24l6q0L8Q5K3l4m5NR3P2q1j61n7P9R8J7o8p4JO2O3O8
4141B398P6Lp8m1J7m1r4k1L8KJ4O5Mq0j8M2k8l7P6O9o3n5N4M5J0P2K3j65j64N6J16l5o3O5
4136B262R4Mm9o6q1m8pk2RJ05R1m7o8N7Q1l2p2k6j9pQ1J18J8j01j19n8OL1J7K4O2N7j2o6p8
4131B139p2j3Q6J20P0J9Lj4l0l6m8m0J2N0L1J2L7O0J8o9j00k0O8M3j9J0M4k2p1JN5Mj6L1k9
4126B314j81j58N5J49N7K2Q8O3m3o8n0n0J9J02J1j41j20j3L6J12J92R9n9o5l0q2o7J5k2q5
4121B100MP5rn8J7O2M0J3l8n3N2J21L6k1M0L4q4j15MJ25R7o4j53m2N7l2j11l2K6KN8J12J5
$$ plain form
4156 2193 2337 2347 2227 2158 2209 2270 2302 2385 2482 2471 2373 2305 2290 2297 2322 2309 2195 2067 2059 2131 2178 2226 2314 2366 2335 2289 2273 2253 2219 2208 2240 2281 2262
4151 2262 2176 2122 2151 2159 2114 2154 2284 2308 2220 2232 2349 2361 2262 2216 2234 2236 2256 2331 2381 2323 2174 2037 2026 2114 2164 2151 2172 2223 2250 2300 2378 2378 2331 2364
4146 2364 2406 2348 2305 2349 2322 2212 2206 2263 2197 2115 2206 2330 2294 2214 2252 2337 2360 2326 2281 2286 2379 2451 2370 2209 2152 2231 2329 2346 2278 2204 2205 2267 2330 2398
4141 2398 2474 2477 2399 2358 2375 2334 2240 2219 2257 2259 2273 2338 2342 2262 2244 2286 2258 2221 2297 2366 2303 2248 2302 2347 2357 2429 2452 2287 2123 2179 2295 2260 2197 2262
4136 2262 2356 2360 2311 2245 2164 2116 2109 2087 2096 2201 2292 2245 2177 2234 2315 2283 2211 2185 2166 2159 2240 2358 2376 2275 2156 2098 2104 2135 2152 2176 2238 2295 2283 2217 2139
4131 2139 2067 2054 2140 2260 2330 2349 2352 2338 2308 2272 2224 2184 2196 2246 2277 2289 2326 2386 2404 2335 2235 2215 2283 2326 2307 2317 2361 2339 2268 2269 2324 2328 2312 2343 2314
4126 2314 2133 1975 2030 2179 2236 2258 2346 2409 2366 2298 2248 2198 2217 2319 2330 2189 2069 2056 2092 2204 2396 2495 2436 2371 2341 2259 2192 2207 2185 2100
4121 2100 2104 2179 2170 2112 2129 2191 2231 2244 2206 2153 2205 2326 2362 2341 2381 2415 2331 2216 2220 2345 2442 2378 2225 2183 2240 2208 2097 2065 2091 2093 2151 2263 2278
4116B278m8N8R0n7j42n0O6J10Q5J3k2J7L6Ooj4m3l8mj9o2n7j3L3K2p4j14K0J30M0o0kM4k3
4111B200m5J4N8R9J07lj17o4K8%k5N3Q2Lk6N1Q6Qp4n1J9kr4r5KN0J3kN5J10N4r3j53k0R7l
4106B322j42r3K6L3J6N7O5K5J1j6j04j32k1J04J05L2nJ7L9K6k2p8q5j2O8N1l2p5o5k5O0J29
4101B279O6n2l8L3m0j39l9J33J10j1NP5K2n9l4Jm4o7j4L0L3L3Pm4l0M0N1LnK3J8kQJ9j4p4
4096B283r0j4Q1O6k9n4J2N8M2on1m5Pko0k6N5Mr7l4P9L8l5K2O0l1p3QL4l6m7J7M1J7Lk3m3
4091B131LO9N8Q%Nk0l8l2l3k0J7K0j5j3L9N5J5mK9M5k1q0MJ42R9q4j32k2J5n2o2oL8O7O2%
4085B287k4M0P1Om6k5kpj1KJ1k8j03j06K1J56J63L1j21j08P8J36n8j75k5P7k0n7M0R3Q4M3
4081B423r6j66J5J79Q2m2m1p3r3M7J19m0j37k0P9O1K9k5p3%J08R1%p0r6m4N1N8J5J2j2p4n5
$$ plain form
4116 2278 2230 2288 2378 2321 2179 2129 2195 2305 2390 2403 2381 2398 2434 2440 2434 2420 2377 2339 2335 2316 2254 2197 2184 2217 2239 2165 2051 2071 2201 2241 2181 2179 2223 2200
4111 2200 2155 2169 2227 2326 2433 2430 2313 2249 2277 2277 2252 2305 2387 2390 2364 2415 2501 2509 2435 2384 2403 2401 2307 2212 2214 2264 2277 2275 2330 2440 2494 2401 2248 2228 2325 2322
4106 2322 2180 2087 2113 2146 2162 2219 2284 2309 2320 2304 2200 2068 2047 2151 2256 2288 2283 2300 2339 2365 2343 2265 2180 2168 2236 2287 2255 2180 2115 2090 2150 2279
4101 2279 2345 2293 2255 2288 2248 2109 2070 2203 2313 2302 2307 2382 2404 2345 2311 2312 2268 2201 2187 2217 2250 2283 2290 2246 2216 2256 2307 2310 2305 2328 2346 2344 2352 2371 2357 2283
4096 2283 2193 2179 2260 2326 2297 2243 2255 2313 2355 2349 2298 2253 2260 2258 2198 2172 2227 2231 2134 2100 2179 2217 2182 2204 2264 2233 2160 2168 2202 2166 2119 2136 2177 2194 2197 2174 2131
4091 2131 2134 2203 2261 2269 2269 2274 2254 2216 2184 2151 2131 2148 2168 2153 2140 2179 2234 2249 2245 2274 2319 2298 2218 2222 2364 2463 2379 2247 2225 2240 2188 2126 2120 2158 2225 2287 2287
4085 2287 2263 2303 2374 2380 2334 2309 2307 2300 2289 2291 2302 2274 2171 2065 2086 2242 2405 2436 2315 2207 2285 2421 2363 2188 2163 2240 2220 2163 2203 2296 2380 2423
4081 2423 2327 2161 2176 2355 2437 2395 2354 2281 2188 2235 2354 2314 2177 2157 2236 2297 2326 2301 2228 2228 2336 2427 2427 2357 2261 2217 2268 2326 2341 2353 2341 2267 2212
4076B212j6n7m5N0L9J1J45J93l3j60nN6p5o0J00Q4m8m9L1K3l5m5JM1K8j7n4p8o9qL8J6j4j0
4071B190J2N7O5l3o7Q5J62rj15mK8p3k3J21Q5n5j04r8o8J8N5MkL0k7j19j00PR2R3M2L1L0o6
4066B244j43l4Q2Ko8J8L5o5p3pkK7J14J01nm9l5KN9N4k7l7K5L2K2M9K5j9J4J4o8o1Pk4l4Q5
4060B260J11k5q4m4m0pP7N2m1k6N0O5K0q7j55k5J66J35j1l7mJ2N6M3o0o1Po9j28L6J59M1p2
4056B314m1pQL1kk1L9K4n7RJ15K3j10q5m3n0JM5K2N2P8l4j33o8K2P3J23O0q2l9J16O2j09j03
4051B233j2j0k3PL1N1K8p7j24l5N1N1K5j4l5Jj5r9m0J51J68K3k9k1o4n5K0K7mj6m0PJ31Q8
4046B380q1n1P5qj03J7Q7j5l6K9J3OK9o0j09J7N4n4jJ17K6m0R4Q4j07q2O5j3j25l8K1mQ3J37
4041B407j2p1Q8J03r3j47rL7l7o6l4pJ2L4N6N5K1J4O6O8n5j56j01K2P6L7n2j09n0N9Q1K9M
$$ plain form
4076 2212 2196 2139 2094 2144 2183 2194 2339 2532 2499 2339 2334 2390 2315 2255 2355 2439 2391 2342 2373 2396 2361 2316 2317 2358 2386 2369 2315 2237 2168 2160 2198 2214 2200 2190
4071 2190 2202 2259 2324 2291 2224 2309 2471 2462 2347 2343 2371 2298 2275 2396 2481 2426 2322 2224 2156 2174 2229 2233 2231 2261 2234 2115 2015 2022 2114 2207 2249 2280 2310 2244
4066 2244 2101 2067 2149 2151 2083 2101 2136 2071 1998 1991 1989 2016 2130 2231 2226 2177 2142 2144 2203 2257 2230 2193 2218 2250 2272 2321 2346 2327 2341 2355 2287 2226 2233 2209 2175 2260
4060 2260 2371 2346 2262 2218 2178 2171 2248 2300 2259 2233 2283 2348 2368 2281 2126 2101 2267 2402 2391 2354 2350 2362 2418 2461 2401 2340 2347 2278 2150 2186 2345 2386 2314
4056 2314 2273 2266 2274 2305 2303 2282 2321 2345 2288 2297 2412 2435 2325 2240 2197 2147 2148 2193 2215 2267 2345 2311 2178 2110 2132 2205 2328 2388 2306 2267 2383 2445 2336 2233
4051 2233 2221 2211 2188 2195 2226 2277 2305 2228 2104 2069 2120 2171 2196 2182 2147 2148 2133 2034 1994 2145 2313 2336 2307 2286 2222 2167 2187 2214 2210 2194 2154 2161 2292 2380
4046 2380 2299 2248 2323 2315 2212 2229 2316 2301 2265 2294 2307 2313 2342 2282 2173 2190 2244 2190 2189 2306 2332 2292 2386 2470 2363 2281 2346 2333 2208 2170 2191 2187 2270 2407
4041 2407 2395 2324 2412 2515 2422 2275 2266 2303 2266 2200 2166 2159 2171 2205 2261 2316 2337 2351 2417 2485 2430 2274 2173 2195 2271 2308 2256 2147 2097 2156 2237 2266 2270
4036B270k3p3n5K4K2m3j9N5N4L9Q1N5p0j23n0L1P7Q0J5k5M0O1n0q1L2N8k9l4J5mrL5Rm2RO3
4031B395J9k6l4n9m6Rl3j25p8O9J16L4q5j24PJ60Q8p2j5J20M1r7l7R3R3K8k6p8p7k0%k6%N6
4026B270M5j8n8p3p4l2M8Q8O4N7Q9O7nl0n3j36j25K8Q1k8k9Q2L0j17o1J12J20J5m2q0j19n9
4021B057P1J07L4j0K6L4k4l2J8j0p6j8M9k0k6J08R1p4m2O8o3j82nJ18rl4R6O5n5k4K5j1QL0
4016B290l4KJ28P1q7n4L8j2k5O8N3m9n3l7q3o8K2L8qOP4R8K9p5p7mk8q9J1J07k7j26N0J82
4011B331M7m4N5N8q1j12l3qK4J01O1q7j19j7K4mK2L5n8j04MO3m5r5K4R6M5M7Q0j9j38r0K4
4006B087P3Q9M5p5q8N4R7pj7M4k2q1N6J51j7j90j22K0N9Q3J26Q2m4j17p1K6M7k6n0L5P3j1
4001B309m8K0L1l0nO3Qj09j32n6M5R7K2q3l1Q3M5k2M7P2n0r3nOm3qK9RL6N8j1j8P1J3j45p6
$$ plain form
4036 2270 2247 2174 2119 2143 2165 2122 2103 2158 2212 2251 2332 2387 2317 2194 2144 2175 2252 2332 2347 2322 2362 2423 2373 2292 2324 2382 2353 2319 2334 2330 2321 2356 2365 2323 2332 2395
4031 2395 2414 2388 2354 2295 2249 2258 2225 2100 2022 2091 2207 2241 2156 2032 2039 2199 2287 2215 2200 2320 2361 2264 2227 2320 2413 2441 2415 2337 2260 2240 2240 2214 2214 2270
4026 2270 2315 2297 2239 2166 2092 2060 2108 2196 2260 2317 2406 2473 2468 2438 2385 2249 2124 2152 2233 2205 2176 2258 2288 2171 2110 2222 2342 2357 2315 2235 2116 2057
4021 2057 2128 2235 2269 2259 2285 2319 2295 2263 2281 2271 2195 2177 2226 2206 2180 2288 2379 2305 2263 2331 2268 2086 2081 2199 2190 2156 2252 2317 2262 2238 2263 2252 2260 2290
4016 2290 2256 2258 2386 2457 2370 2316 2354 2342 2317 2385 2438 2389 2336 2299 2216 2148 2170 2208 2200 2206 2280 2378 2407 2332 2255 2251 2223 2134 2145 2252 2225 2099 2149 2331
4011 2331 2378 2334 2389 2447 2366 2254 2221 2213 2237 2338 2399 2312 2193 2176 2200 2196 2218 2253 2195 2091 2095 2158 2113 2018 2042 2138 2183 2230 2310 2291 2153 2063 2087
4006 2087 2160 2249 2294 2219 2131 2185 2282 2275 2258 2302 2280 2199 2255 2406 2389 2199 2077 2097 2156 2239 2365 2447 2403 2286 2215 2241 2288 2262 2212 2247 2320 2309
4001 2309 2261 2281 2312 2282 2277 2340 2348 2239 2107 2051 2096 2193 2215 2132 2101 2184 2229 2207 2254 2326 2276 2183 2178 2184 2141 2133 2162 2171 2207 2265 2254 2236 2307 2320 2175 2099
3996B099J19Q4q0o6M5O3L6K5j8p3o8k3J8L7M0L4qq4q5M1J08Pp7NJ07Q4j3q1o1L0Q3L9k3n1
3991B293n7k1L3J9j0Ol8j33p1J08J25K8L9N9l5o3M7Q3kn7n4k4L0rj36q4J45J61o5j19M1P8
3986B317j1J2O7qo6kJ3o9n9N0N5m0m9J2J2K1R6Q3n2q9J5K5p1o1M2M3l4n3l9m8l0M9J19J00
3981B350j5j03n5L0%o9l2M5N8M8L5l1q0m5oj2J3P4Q0K5j9oN4P7or3m1N7L7m2l9J6M4L7j0p7
3976B299p2K3P0or6q6LP3O0J3J8M2k3r8j4J23N4j30j00P7N6r7n1R9M8q5l4N4qo6PO0L6J5k8
3971B236r6p2K0L0j0J7P7J02J00L3p6n7P1O0q2j02rOl4l4n6q8PJ41R0o9p2O9J06j5r7k1Q3
3966B258M0p8n7R7J39j9j62j23RQ1P1K7J8N2L6p3j10L5J57O3j05j43j02n4M2J06N2K2Q4K9
3962B392j47j20R7J10o2l9J20L7j56q7J09Q3n5m3K9Jj6P3J09Jj05o7N4R4rj16n6R0J00nm2
$$ plain form
3996 2099 2218 2302 2222 2156 2201 2264 2300 2325 2307 2234 2166 2143 2161 2198 2238 2272 2264 2180 2095 2136 2244 2251 2174 2179 2286 2370 2357 2276 2215 2245 2328 2367 2344 2293
3991 2293 2236 2215 2248 2267 2257 2263 2225 2092 2021 2129 2254 2282 2321 2380 2345 2282 2329 2412 2410 2353 2299 2275 2305 2296 2160 2076 2221 2382 2317 2198 2239 2317
3986 2317 2306 2318 2385 2377 2311 2309 2322 2253 2194 2244 2299 2259 2210 2222 2234 2255 2351 2434 2382 2293 2308 2333 2262 2201 2243 2286 2252 2199 2160 2112 2082 2131 2250 2350
3981 2350 2335 2232 2177 2207 2207 2138 2106 2151 2209 2257 2292 2261 2181 2136 2130 2118 2131 2205 2285 2310 2291 2285 2339 2416 2410 2317 2276 2333 2370 2328 2289 2305 2349 2386 2376 2299
3976 2299 2227 2250 2320 2314 2218 2132 2135 2208 2268 2281 2299 2341 2318 2220 2206 2329 2383 2253 2153 2230 2286 2189 2138 2237 2285 2200 2166 2220 2212 2146 2153 2213 2249 2264 2236
3971 2236 2140 2068 2088 2118 2108 2125 2202 2304 2404 2437 2361 2304 2375 2435 2353 2251 2242 2248 2214 2180 2124 2036 2043 2184 2274 2205 2133 2202 2308 2293 2196 2175 2258
3966 2258 2298 2220 2163 2260 2399 2380 2218 2095 2104 2185 2256 2283 2301 2353 2389 2316 2206 2241 2398 2461 2356 2213 2111 2057 2099 2205 2257 2279 2363 2392
3962 2392 2245 2125 2222 2332 2270 2231 2351 2388 2232 2145 2254 2337 2282 2239 2268 2269 2253 2326 2435 2436 2331 2264 2318 2412 2403 2287 2231 2321 2421 2416 2374
3957B374k1n0n9jlp0l4P5N4o7r3j0N3N3J9j4KN6O7J4n3o9%P8K5j07r3O9J16j3j11o4K6P4P0
3952B293K2l7m8j6ll6l5N6J34P4n7j00n0J1O5Q3L2jK0j3q0m1L7J4k6lk3n9J5O6k3n0N9O2n2
3947B290m5L1Pj6L9K1o2n7k2m7nJ18J36K0n5l6LK0RlJ3J7l0p4r2j06m3J02J17l7n8J20J38
3942B413q7j55M3J47L1m5OOm8l4j3o5r2k8K7L4M1K9j6k3jl4o1NQ2P8K5m8q8J9J64Q4j22j07
3937B167O6Q0k4l1nm4m6J2J3l3l7nK7N4N1Rk0kM7P0J2o4n2rl7l9L8N1j1K0R4M5k2jk2r3m1
3932B218P0O2jl6q9q0O2J40N2k7m1p9m9Q9R0p7j05L2L5p0j9J23R8m0o0%l2j09o2M2M9K6Q0
3927B292P4p0j57p4M7J12J14Pj20r0K1M4N0R4L3q8p9j3%P2J27l0j79l9J10rj04RP3Pj3k4n5
3922B142K7J19Qj16%J32N3p0q3o4j9P1R5L6K9O6L3m1q0q8o1K5R0O1Qj7n8r8n3M5P2J1l3k4
$$ plain form
3957 2374 2353 2303 2244 2243 2240 2170 2136 2211 2265 2198 2105 2095 2148 2201 2220 2206 2208 2264 2331 2345 2292 2223 2223 2301 2326 2219 2126 2195 2311 2298 2187 2123 2149 2223 2293
3952 2293 2315 2278 2230 2214 2211 2175 2140 2196 2330 2404 2347 2247 2197 2208 2273 2356 2388 2387 2407 2394 2314 2273 2310 2324 2298 2295 2272 2213 2228 2294 2271 2221 2280 2342 2290
3947 2290 2245 2276 2283 2267 2306 2327 2265 2208 2186 2139 2134 2252 2388 2408 2353 2317 2320 2340 2349 2346 2359 2376 2346 2272 2180 2074 2031 2133 2250 2213 2155 2275 2413
3942 2413 2326 2171 2214 2361 2392 2347 2353 2359 2311 2277 2264 2199 2107 2079 2106 2140 2181 2210 2194 2171 2170 2136 2075 2080 2162 2240 2265 2217 2129 2148 2312 2396 2274 2167
3937 2167 2233 2313 2289 2258 2253 2209 2163 2175 2188 2155 2118 2113 2140 2194 2245 2254 2234 2232 2279 2349 2361 2297 2245 2236 2199 2160 2198 2249 2238 2258 2352 2397 2375 2374 2352 2259 2218
3932 2218 2288 2350 2349 2313 2224 2144 2206 2346 2398 2371 2330 2251 2202 2291 2381 2304 2199 2231 2266 2196 2177 2300 2398 2358 2298 2298 2266 2157 2095 2137 2186 2212 2292
3927 2292 2366 2296 2139 2065 2112 2224 2338 2345 2225 2135 2156 2200 2250 2344 2377 2289 2210 2197 2197 2269 2396 2366 2187 2148 2258 2249 2145 2154 2227 2234 2221 2197 2142
3922 2142 2169 2288 2296 2180 2180 2312 2365 2295 2212 2148 2129 2200 2295 2331 2360 2426 2459 2418 2338 2250 2189 2214 2304 2365 2373 2356 2298 2200 2147 2192 2264 2275 2242 2218
3917B218qJ2P1J15P1k2o6l9J5M4Rn8o2J1M8Pk9j3RK1K2k8j17j13K6J37J07M2K4mn7o5n2o2
3912B214m4%PM5J39Q6j29j74QO9k5J3J30R3Kj7q2j45m9N1QJ0Q5J7r1j2P3pk0Q0L3j01o8K9
3907B228K2J8L2o3j51o1N5N2L3M0OlO9R1No1o2n0j9K4Qm1j1P0Q0J1m8n3k9mJ3J9Lk4l6k6n
3902B132K3L9Ol3K0J11P0o5o6N3M1r0q2K5Lp6k3M6J5L0J06O5m4l2L2L7M3K3r5j19N2J38J9
3897B404o1l9n3l7N9O5k9m1pk6k8j7n5nJ20M5j43o5J43R8m2k0j2j00o5O2Q7P3Q2Qo6pM6j3
3892B361m5j8j3RJ8q6j35L3J55M0o1j5j7o6kO4Jn6k4k3m9K7J34J00l8p8LK6n3m4P9Q4l0k2
3887B259P7M1n1k0Qo5o1N5P2m7j14n3N7P3l5n8J37K62N8k03j99q7m0L8J17N9k9mJ8k2J6J05
3882B364O6l6m4k1o4q8k1N3Q2P8J1r0j01%N4QnN8M9m9o7%Mm5jR7R8J6l6m2l4j6jj5j8RPn1
$$ plain form
3917 2218 2210 2222 2293 2408 2479 2457 2391 2352 2367 2411 2420 2362 2300 2311 2359 2366 2337 2324 2333 2354 2376 2348 2231 2118 2144 2281 2388 2430 2454 2450 2393 2328 2276 2214
3912 2214 2170 2170 2177 2222 2361 2447 2318 2144 2152 2221 2196 2209 2339 2432 2434 2417 2335 2190 2141 2192 2200 2210 2295 2312 2221 2209 2282 2275 2255 2335 2368 2267 2199 2228
3907 2228 2250 2268 2300 2237 2086 2025 2080 2132 2165 2205 2211 2208 2277 2368 2373 2312 2250 2200 2181 2205 2213 2172 2161 2231 2311 2322 2274 2221 2192 2188 2201 2220 2223 2199 2163 2137 2132
3902 2132 2155 2194 2200 2167 2187 2298 2368 2303 2237 2290 2331 2241 2159 2184 2187 2111 2088 2134 2149 2179 2285 2350 2306 2274 2306 2343 2386 2409 2314 2195 2247 2385 2404
3897 2404 2343 2304 2251 2214 2273 2338 2309 2268 2261 2235 2207 2190 2135 2130 2250 2295 2152 2087 2230 2328 2286 2266 2254 2154 2089 2151 2238 2311 2393 2401 2335 2328 2374 2361
3892 2361 2316 2298 2285 2294 2312 2226 2091 2124 2279 2319 2258 2243 2226 2160 2158 2222 2223 2167 2143 2120 2071 2098 2232 2332 2294 2216 2219 2245 2192 2148 2227 2311 2281 2259
3887 2259 2336 2377 2326 2306 2314 2249 2188 2243 2315 2268 2154 2101 2158 2231 2196 2138 2275 2537 2595 2392 2193 2106 2066 2104 2221 2280 2251 2247 2265 2243 2259 2364
3882 2364 2430 2394 2350 2329 2265 2177 2156 2209 2291 2369 2380 2290 2189 2189 2243 2251 2246 2304 2353 2304 2237 2237 2241 2196 2195 2292 2390 2406 2370 2328 2294 2278 2277 2262 2244 2253 2260 2209
3876B209n8K6O7j5o4K2Q2Lo9l3krK8O4K7PM2j4j44j07R4J55qj03L7J65O8p4n1Nm7n5O5J09
3871B422J9m8r6j79j48QN1J2J12K04O4q7l7J6l5k9Ok7rP5L1p5l2M3rk1Q4Q0o0r0K3O1j6l8
3866B275L0L2j01j94p0J28J32l3j06j0Q2N6j0j1K5Pn2o0k4lL3R3Q5J8NK6k0o2lN3J0j7M0M0
3862B394o1p7N3R8n1j42oJ18M3n5m4l9n5J4Q7M1l4k3L3P9M3j16k03m3J44J03mrj7l5N1J19
3857B406L1n9k5K9K8j8q2n8M7J6j35j08P5Q7m0l8M8M7LpJ3P2J05M1nK5lp7n1Oj0k0l0j13j11
3852B089N4J10k6p7j2j9l7O3J46J03pr2n6O2K9j29r9M3l0j24O0K16P7l9N0O8l4o4k8lL7K6
3847B357n3o3k0l8l4Rn2j09J4J05Ll6Q5J26N6%q4j42l4R5Q1N5M6n3q1N5Q2l4j5N3m5r1L7M3
3842B318q5o7M0Q8J64J56j08k72m8J62P7kK3o7j45j3Q5k9j15k0Q0N1m8p3L5J26N3k4L8N7o3
$$ plain form
3876 2209 2151 2177 2244 2229 2165 2187 2269 2272 2203 2170 2168 2159 2187 2251 2278 2285 2327 2313 2169 2062 2156 2311 2303 2200 2237 2402 2470 2396 2345 2350 2303 2248 2313 2422
3871 2422 2441 2393 2297 2118 1970 1978 2029 2041 2153 2357 2421 2334 2297 2313 2278 2249 2255 2228 2219 2294 2325 2250 2218 2261 2252 2231 2315 2395 2335 2245 2268 2329 2313 2275
3866 2275 2305 2337 2236 2042 1972 2100 2232 2199 2093 2083 2165 2221 2211 2200 2225 2232 2180 2120 2096 2093 2126 2219 2304 2322 2327 2353 2333 2271 2268 2321 2331 2314 2354 2394
3862 2394 2333 2256 2309 2407 2356 2214 2208 2326 2369 2314 2270 2231 2176 2190 2277 2318 2284 2261 2294 2373 2416 2300 2097 2054 2198 2301 2297 2288 2271 2236 2287 2406
3857 2406 2437 2378 2353 2382 2410 2392 2310 2252 2299 2315 2180 2072 2147 2234 2194 2156 2204 2251 2254 2247 2260 2332 2437 2478 2473 2498 2495 2418 2367 2373 2363 2343 2313 2200 2089
3852 2089 2143 2253 2227 2150 2138 2119 2082 2145 2291 2394 2387 2295 2239 2301 2330 2201 2102 2145 2115 1991 2051 2267 2344 2305 2355 2423 2389 2325 2297 2294 2331 2357
3847 2357 2304 2241 2221 2183 2149 2158 2106 1997 2011 2116 2119 2083 2168 2294 2350 2350 2266 2124 2090 2185 2266 2321 2367 2314 2233 2288 2370 2336 2321 2374 2329 2238 2275 2318
3842 2318 2233 2166 2206 2294 2458 2614 2506 2234 2186 2348 2425 2423 2446 2379 2234 2221 2306 2277 2162 2142 2222 2273 2225 2152 2187 2313 2366 2342 2380 2437 2374
3837B374j16j7P0N8j6r5p1N1P4l3n6M2R3O3Kp2o7M3N9o0q8OK5j4ql9j01n0M7K9j5J3J7j1L6
3832B173Q3M0j3l2o5n7K0K9m4j3J20J47N2LK6kj17j79o8J05J32L8pk4q3p1L1K3o2K7J93J07
3828B512j26j50j1J3n0j6O5N3j2qL7J3o4n8J0qp1j3R3O8qJ1J7p6j15l2K3%J2O0N4ll1NM9L1
3822B274ML7J2j50k00J7J79N4r1n4j4k0O8J31K7n5J0L6l0j9M0J8j9J6M3J4j6l0k8J0L2jk3
3817B272j3k8m5oL2J3J3N0J4q1p2N2R1lk7P7R6n2j45p6m%J6J1o1o4N6J14L8%N0M8m8j01m1
3812B176On7q7N1J55Rj27K3J86O2j23j11k4L4R0N5q0j12%Q0R7Q2Ko7l5k4n3K6J03rr4L0Q5
3808B349o4j34m4mj1L0N1N2Q1N1l4l5j3n6j6J08P3p2o3L3N0M8K9o8p2N4L4j21r1P3Q0j0l2
3803B256l6m6j3J4K5P6P6l2p5j6ml2j4j7m0J3L6l6j7J08J00MJ3K0o1m6N3J7o3qL4p1j21j0
$$ plain form
3837 2374 2258 2241 2311 2369 2353 2258 2187 2238 2312 2279 2223 2265 2358 2421 2423 2351 2284 2327 2386 2326 2238 2244 2269 2255 2247 2208 2107 2057 2104 2133 2118 2131 2148 2137 2173
3832 2173 2256 2296 2283 2251 2186 2129 2149 2178 2134 2121 2241 2388 2440 2443 2469 2467 2350 2171 2103 2208 2340 2378 2371 2347 2264 2193 2224 2247 2185 2212 2405 2512
3828 2512 2386 2236 2225 2238 2188 2172 2237 2290 2278 2270 2307 2320 2256 2198 2208 2200 2129 2116 2209 2277 2269 2280 2297 2221 2106 2074 2097 2097 2109 2169 2223 2220 2189 2194 2243 2274
3822 2274 2278 2315 2327 2177 1977 1994 2173 2227 2136 2082 2068 2048 2116 2247 2274 2219 2229 2265 2235 2216 2256 2274 2255 2271 2314 2328 2312 2282 2254 2264 2296 2295 2272
3817 2272 2259 2231 2186 2180 2212 2225 2238 2288 2302 2221 2149 2201 2292 2289 2262 2339 2435 2383 2238 2162 2158 2158 2174 2185 2124 2060 2116 2230 2268 2268 2318 2366 2318 2217 2176
3812 2176 2182 2125 2038 2089 2244 2253 2126 2149 2335 2397 2274 2163 2139 2173 2263 2318 2238 2126 2126 2206 2303 2385 2387 2320 2285 2261 2208 2234 2337 2328 2234 2264 2349
3808 2349 2285 2151 2107 2103 2092 2122 2173 2225 2306 2357 2323 2288 2275 2219 2203 2311 2384 2312 2249 2282 2332 2380 2409 2341 2269 2323 2357 2236 2145 2218 2298 2288 2256
3803 2256 2220 2174 2161 2175 2200 2276 2352 2320 2245 2229 2225 2193 2179 2162 2122 2135 2171 2135 2118 2226 2326 2330 2343 2363 2302 2256 2309 2326 2263 2255 2289 2218 2097 2087
3798B087O8nr2l7R9R3o9r6Q1J27n4j10N5J35M4rj6r1j24nJ14O3m0KJ23J08l8j06o8n1n0NL2
3793B175nnM0M6L4L9lq1j03o2lP4J14O1j3l1pN6J00J0j21q1L3kq4qJ04O6l1m9pK0J4MJ0No
3787B303K8M8k6q2pO5L2ol5j23j39NJ15O7j6o4q8k8N4K2k3N0R9M2K0K7m9q8LP2N3M0No8m0
3782B268N6K4n9JJ05M8j03j25MP5l2j04L4J37Kr4K6Q0l7m5N4L3k8J1Jq3o0K8L8L4L9n1j32
3777B145n5L6Lk2L8O9M7M6P6Q9M2n9j18o1K8M8qq1r5j5N1L2K1K8l2o4M3J29O4k4o6q4mJ00
3772B347K0j18n7K3o0n8R4R4k5KM8o0r7K4P0J2NNj8L7J02M5n1q9q9qJ13Q1q4j19mM6j0m7j5
3767B159M4M2j2QP9J8j13q5K4K9J5L3l1q1K2J01N7O1P0o1j08M3M2j47r6J47J20r0o0R6M7r6
3763B277q6PKo0l1P1Q0k0o3l1m1m6N0R7po5K7J04P1J0k8l6j2k3o2k8M9L5k5mN6O4L6J2P%n0
$$ plain form
3798 2087 2155 2150 2058 2021 2120 2213 2144 2048 2129 2256 2202 2092 2147 2282 2326 2317 2301 2210 2086 2081 2195 2258 2218 2220 2343 2451 2413 2307 2239 2188 2138 2143 2175
3793 2175 2170 2165 2205 2251 2285 2324 2321 2240 2137 2075 2072 2146 2260 2321 2308 2277 2270 2326 2426 2436 2315 2234 2267 2265 2181 2173 2277 2343 2312 2263 2256 2276 2290 2294 2304 2309 2303
3787 2303 2331 2379 2353 2271 2264 2329 2361 2355 2320 2197 2058 2063 2178 2245 2229 2165 2077 2049 2103 2125 2102 2152 2251 2293 2313 2340 2291 2203 2206 2278 2331 2371 2376 2308 2268
3782 2268 2324 2348 2289 2290 2395 2443 2340 2215 2219 2294 2262 2158 2192 2329 2331 2237 2263 2343 2306 2261 2315 2348 2320 2331 2332 2249 2189 2217 2255 2289 2328 2277 2145
3777 2145 2090 2126 2129 2107 2145 2214 2261 2307 2383 2472 2514 2455 2337 2276 2304 2352 2344 2263 2168 2153 2204 2236 2257 2285 2253 2189 2232 2361 2425 2401 2335 2251 2247 2347
3772 2347 2367 2249 2192 2215 2155 2097 2191 2285 2260 2262 2310 2250 2153 2177 2247 2259 2264 2269 2251 2288 2390 2435 2384 2295 2206 2198 2311 2392 2308 2189 2185 2231 2221 2174 2159
3767 2159 2203 2245 2233 2241 2320 2338 2225 2140 2164 2193 2208 2241 2210 2129 2151 2252 2309 2370 2440 2379 2271 2314 2356 2209 2113 2260 2380 2290 2230 2326 2373 2277
3763 2277 2191 2198 2200 2140 2109 2180 2260 2240 2177 2146 2105 2059 2109 2206 2199 2134 2161 2265 2336 2346 2318 2282 2270 2247 2185 2157 2206 2241 2216 2212 2268 2332 2368 2380 2387 2387 2337
3757B337q8k8M5K4J4O5Mj33j03J4ml7L5M1k6J9O0l7m1Q4M1r0rQ6n9j43NN3l3N6J93P1r4m4
3752B278J9l5m0rn8m3R1J09rj8O6N2k2o2r9p6N6J18Qp6n0l7k0N6L5r9j15j2lk6P8J61P8k1
3747B275k1K3P1O5l7r2%M7l6n3K2L0QL6mj05r3rJ4M2J01P1j6m4n7o1J6N9k6n7L8N0l1l0K4
3742B220L0K8J1m5j5Q0K7j03q4qj9RP8K9l3L0M1n2k2Q5J8j03l3Q2L4k6N3J17J4j14r9k9p5
3737B126j23QJ71J35J7oj5o2m6QOkK0L0M6L7p9j22N7J60Np1L2j9j72r8M0NK3J54Q6r2m9N6
3732B266j1l4O4J5j38j02N5R3M1mo1r1j5Q5R7M5J1J5K7L4L9j7j42j59K2J53N7k9M5M8r6j15
3728B198M4Q6o5j35qJ10P2KK1L1m9r9o8o4p0JN0K6P9J53M1r9rR9Oq5l9%RK0o2j31J5J73R2
3722B345k9MK6j8kJ0n0m6J1ml0j0k6m2L8R8O5L8Jo7k7R4P5l6m1j0l4l1j5k9J1M1o4r1J04J73
$$ plain form
3757 2337 2249 2221 2266 2290 2304 2369 2373 2240 2137 2151 2147 2110 2145 2186 2160 2179 2239 2202 2161 2245 2286 2196 2187 2273 2214 2071 2076 2129 2096 2152 2345 2416 2322 2278
3752 2278 2297 2262 2222 2213 2155 2112 2203 2312 2303 2285 2351 2403 2381 2319 2220 2144 2200 2318 2326 2250 2200 2163 2143 2199 2234 2135 2020 2008 2005 1979 2057 2218 2296 2275
3747 2275 2254 2277 2348 2413 2376 2284 2284 2331 2295 2242 2264 2294 2302 2338 2334 2229 2136 2127 2141 2183 2284 2355 2339 2295 2238 2177 2193 2252 2226 2169 2207 2257 2226 2196 2220
3742 2220 2250 2278 2289 2244 2229 2309 2336 2233 2149 2141 2122 2131 2209 2238 2205 2235 2276 2224 2202 2287 2305 2202 2169 2251 2285 2259 2312 2429 2443 2329 2230 2201 2126
3737 2126 2003 2011 2182 2317 2334 2328 2313 2251 2205 2213 2219 2217 2237 2267 2313 2350 2271 2149 2206 2366 2371 2300 2332 2313 2141 2043 2083 2088 2111 2265 2351 2259 2210 2266
3732 2266 2255 2221 2285 2300 2162 2060 2115 2208 2249 2245 2184 2093 2078 2163 2260 2305 2316 2331 2358 2392 2431 2414 2272 2113 2135 2288 2345 2316 2361 2409 2313 2198
3728 2198 2242 2328 2263 2128 2120 2230 2302 2304 2325 2356 2307 2208 2140 2076 2006 2007 2057 2083 2162 2315 2356 2257 2248 2347 2353 2268 2229 2229 2238 2258 2196 2065 2080 2253 2345
3722 2345 2316 2320 2346 2328 2326 2336 2286 2240 2251 2247 2217 2207 2181 2139 2177 2275 2340 2378 2379 2312 2285 2379 2454 2418 2377 2367 2333 2302 2287 2258 2269 2310 2246 2155 2259 2432
3717B432k7j22j3J8l0JK4RN8P1k0n3m3j25j16R9K02M4j03r4m2J1K8k6j9O1L0m2L5Q7n3j35
3712B147l4L2L8R9R4k9p0qK4O8R9l2j72p4Q9N2m0kP7R0K9q5j30k2Q2J5j08j12j8O4O5Om1n6
3707B137m2L0P8Nm4O1Q7q3j15Q8J25p2r9P3R3m3p3rJ1J0M7N0m1j13mJ68J12j00j02M7jj21
3703B160j4J16K5m1N9O2o7n2P3O9l5r8j12n4Q1J22k6j51p0O7N9j6%O6P4N9K8r2j66j6J52O5
3698B327q3m3J5l1jP6Qq4l7M8J20K00J05j45j73J8K6j07n4P8P8P9Q0q7k26q0J02M8p7q1j8
3694B081O5J32J09L5ql1l7j8m1p7kQ4Qr4l8M0K4K7N9J9m4n2m3QJ08R3p1j36l4Kr0q8M9J12
3689B151L3lP5R6j0q3m1j9n6k3P4Q1rm0L7J02M7o2o3Kk9n9P3J67%j51l4R8M8k4o3j24o1J11
3684B241Q9p8o2N5J6o1k3J3L0P3lj45o9J06M5q3J4J29N3mL0no1j8oo9l9O4P5K6J9j0o0jJ04
$$ plain form
3717 2432 2405 2283 2270 2288 2258 2259 2283 2292 2350 2421 2401 2348 2305 2180 2064 2163 2365 2409 2306 2212 2170 2181 2209 2183 2164 2225 2255 2213 2248 2335 2282 2147
3712 2147 2113 2145 2183 2282 2376 2347 2277 2269 2293 2361 2460 2428 2256 2182 2271 2323 2283 2281 2358 2448 2477 2392 2262 2240 2322 2337 2229 2117 2099 2163 2228 2234 2193 2137
3707 2137 2095 2125 2203 2208 2164 2225 2312 2229 2114 2202 2327 2255 2156 2229 2322 2279 2206 2197 2208 2218 2265 2315 2274 2161 2157 2325 2437 2337 2235 2282 2281 2160
3703 2160 2146 2262 2287 2246 2305 2367 2300 2248 2321 2390 2355 2257 2145 2091 2172 2294 2268 2117 2047 2114 2173 2157 2157 2223 2297 2356 2384 2292 2126 2110 2262 2327
3698 2327 2244 2201 2216 2185 2184 2260 2268 2184 2147 2195 2315 2515 2620 2475 2302 2320 2346 2239 2185 2263 2341 2420 2500 2413 2187 2107 2209 2257 2180 2099 2081
3694 2081 2146 2278 2387 2422 2414 2383 2346 2328 2287 2210 2208 2292 2300 2206 2168 2208 2232 2259 2318 2337 2293 2241 2198 2206 2314 2407 2336 2200 2166 2168 2078 1990 2039 2151
3689 2151 2184 2181 2256 2352 2342 2259 2218 2199 2143 2120 2194 2275 2266 2226 2263 2365 2412 2350 2287 2289 2260 2201 2274 2441 2441 2290 2256 2354 2402 2378 2315 2191 2130 2241
3684 2241 2330 2252 2190 2245 2261 2200 2177 2190 2220 2293 2290 2145 2076 2182 2227 2144 2158 2287 2340 2336 2366 2361 2300 2282 2276 2207 2168 2232 2307 2333 2352 2342 2282 2281 2385
3678B385O0r0j31n7j6k8rJ5J5M6P9Rq3l0N1on0L1L8m4L4J64J6k05r0J35O8q5mJ07L6l2ml3
3673B292q7JJ18O4l3oK3m6p5k0j4m3RP6M2%L2M2jj7k5q0j03l6M5Q9J02N4j6k5j7o5q0K0Q8
3668B308J4p2j4J00Q9j5l1K0m6j49o7O2pq4N5J50Kj03j1N2M2Q9R6j1n2nl7r3n5j5j2M6R4M0
3663B380m%n4r3j0O8M4L4L6m8j02j6M3j4m4OK1MJ6J6j5j7Kj2l1pJ8J1K8Q6Q6qn3J5L6p1j24
3658B227l3M2Km5j2O6J04L6p7o3P1J07j9j12o6PJ0j5J2P2O1j2j4K8k9j19o4L9M1K8M6l2j37
3653B150p9N6P9L3L1L6J6ol0m1m2n4k5N7M5p9r1K5N5RL5N1j0k1L5M6L8J9p5j13K5J35R1M2
3648B443%j06r3O2N3q9l9R0Nj02jJ09N1o2j23o7R0R4j26j73R2K37N7j25j13j6N5K9n9l6N1
3643B188On2N7J01m2m9J16J05l8k8%j09j12M9Q1mJ2L3o5p9M1O5j9k2Pl8l4Q7J26pj11p6j7
$$ plain form
3678 2385 2445 2355 2224 2167 2151 2123 2114 2129 2144 2190 2269 2278 2195 2165 2216 2210 2160 2191 2229 2185 2219 2383 2399 2194 2104 2239 2307 2222 2218 2325 2361 2329 2325 2292
3673 2292 2205 2206 2324 2388 2355 2349 2372 2326 2251 2231 2217 2174 2183 2259 2301 2301 2333 2375 2374 2357 2332 2252 2149 2113 2158 2247 2349 2403 2387 2362 2345 2280 2200 2220 2308
3668 2308 2322 2250 2236 2336 2425 2410 2379 2399 2353 2204 2137 2199 2192 2108 2163 2313 2315 2212 2201 2253 2295 2384 2480 2469 2417 2412 2375 2282 2227 2212 2200 2246 2340 2380
3663 2380 2376 2376 2322 2229 2219 2287 2331 2365 2401 2353 2251 2235 2278 2264 2220 2226 2247 2251 2267 2283 2268 2251 2253 2241 2210 2203 2221 2232 2260 2346 2432 2424 2371 2386 2422 2351 2227
3658 2227 2194 2236 2238 2193 2181 2247 2351 2387 2310 2247 2318 2425 2406 2294 2228 2235 2245 2230 2242 2314 2375 2363 2349 2377 2348 2229 2165 2204 2245 2273 2319 2287 2150
3653 2150 2071 2127 2206 2239 2270 2306 2322 2316 2286 2245 2203 2149 2124 2181 2226 2147 2056 2081 2136 2145 2180 2231 2221 2200 2235 2281 2319 2338 2263 2150 2175 2310 2401 2443
3648 2443 2443 2337 2244 2306 2359 2270 2231 2321 2326 2224 2223 2332 2383 2321 2198 2131 2221 2315 2189 2016 2108 2345 2402 2277 2164 2148 2203 2232 2173 2137 2188
3643 2188 2194 2142 2199 2300 2258 2209 2325 2430 2392 2364 2364 2255 2143 2192 2273 2269 2281 2314 2249 2170 2211 2276 2257 2235 2242 2204 2170 2257 2383 2376 2265 2189 2172
3639B172JL8O5J9k5JL1K7K7qj02j21pQ5N3Llj7m2l5j0%nJ1P1Q0l4j15l0L7l9m2R6J08l6p2
3633B182LK4L0N5J2k9J7J2p0m3N4M5%kn1n7Q7J32n7j50nP0k5o3JO0P8K4n6k2O0Jq7l7j0o9
3628B114k0J03P9J8O2M5o5n2K2o4j47k7Q7K6k3K8K8j3K7Q9M1m8m3J4mj03j58j08rQ4J66J99
3623B348J27qj02j05n6pL0N8M0n4j39q5P0J25Qr4l0O7N4N7J60J13j50k30kR3p3r6N0K7o7J8
3619B147O0o4m4J16P5n8k4j0r2QJ56J6j46LJ18l4p5J03J35j0p6p9o2O3J49Qj35o5L6J1k0n
3614B205J9N3J8j10j06Q4J34m4j07K7P5lk3j%L0K4o3l7J26J06q5o3J21P4j16r4K0k9o7N7J18
3609B343Qq8q7m4L6J06O5j9rN1M5k3q6p3J4L9n5j14k8Q1J12P8op6l4L2J3K3J11O2j47k15m7
3604B068J14J18K0o3l1O2K9p7l9N0l7j61p4Q9J05J6n3p4j4J04J61R1m4j13k6J13Q8o0p7K8
$$ plain form
3639 2172 2173 2211 2276 2295 2270 2271 2302 2329 2356 2348 2246 2125 2118 2203 2256 2259 2256 2239 2197 2162 2152 2152 2147 2158 2229 2309 2275 2160 2130 2167 2128 2086 2182 2290 2254 2182
3633 2182 2185 2209 2239 2294 2306 2277 2294 2306 2236 2193 2247 2292 2292 2290 2239 2182 2269 2401 2344 2194 2189 2259 2234 2171 2172 2232 2310 2334 2278 2256 2316 2317 2230 2193 2183 2114
3628 2114 2094 2197 2276 2294 2356 2401 2336 2284 2306 2242 2095 2068 2155 2181 2158 2186 2214 2201 2228 2317 2358 2310 2267 2281 2277 2174 2016 1908 1899 1983 2149 2348
3623 2348 2475 2467 2365 2260 2204 2197 2227 2285 2325 2271 2132 2047 2117 2242 2250 2156 2126 2193 2247 2304 2464 2577 2427 2197 2195 2288 2215 2119 2169 2196 2129 2147
3619 2147 2207 2143 2099 2215 2290 2232 2208 2198 2106 2114 2270 2286 2140 2143 2261 2227 2152 2255 2390 2380 2304 2225 2163 2226 2375 2383 2248 2183 2219 2230 2210 2205
3614 2205 2224 2277 2295 2185 2079 2163 2297 2253 2146 2173 2248 2245 2222 2221 2221 2251 2275 2212 2175 2301 2407 2322 2259 2380 2454 2338 2244 2264 2235 2168 2225 2343
3609 2343 2351 2263 2176 2132 2168 2274 2339 2320 2311 2362 2407 2384 2298 2225 2239 2278 2223 2109 2081 2162 2274 2352 2346 2270 2236 2268 2281 2304 2415 2477 2330 2115 2068
3604 2068 2182 2300 2320 2257 2226 2288 2317 2240 2201 2251 2214 2053 1979 2068 2173 2189 2136 2062 2048 2152 2313 2404 2360 2247 2221 2334 2422 2362 2285 2313
3600B313K6o5n1M0O1K6K0J7j8m2l3m4p8k0J33J47l6j24j1L6k1M2J06m6j74n8K9m1j5R3M8l1
3595B229M3R7J8m4n9q9p1mJ2L4R5N1p0n3N8P0Qk7l8k1Ml4o4J2O4J9K7Q0J6n5knj22j10L4N6
3590B159l8m9L8J31J71Q8p1j23n1J1L8L7k2p2l5J3L1P0M8o8r0J8L5m6pP6K5l0M4Q7j5j24j14
3585B165mR3M5q2o4N0J0j04m5P5L6j0O2O2o4p8L5N6qk4m6j09p9M4J01Q4P4L0m2k7L2Lm5oK3
3580B243j0J2O8L9pPLj5L7M5m6l8Q3M2j51j76j1J04R7M4j9m4j3J5K5K4l0p5OR5M2l6m2o5o2
3575B191L6K8j34j19J05J56Kl7M7O2M2K4m6j02o8k1J6O7L1r6j18l0KQQ8J28L2r0j23m5P7Q8
3570B201NK0R7K7r6p2j7l0L1J21N8m9n3n2m8N3Q4m8r4K9P2Pqj7o2l3J6l9n8M0P6J1jL5M5P3
3565B324P8l1r8NR1K6m9m9m3l2Opp7q7qM6J5k8RP0M0m2l8K8L1k0l8j2K2K8NJ5O5N2k3j3N2
$$ plain form
3600 2313 2339 2274 2223 2263 2324 2350 2370 2387 2369 2327 2294 2250 2172 2152 2285 2432 2396 2272 2261 2297 2276 2318 2424 2378 2204 2146 2175 2134 2119 2212 2260 2229
3595 2229 2272 2369 2387 2343 2284 2195 2124 2120 2132 2166 2261 2312 2242 2189 2247 2317 2325 2298 2260 2239 2243 2209 2145 2157 2221 2240 2267 2347 2363 2308 2306 2301 2179 2069 2103 2159
3590 2159 2121 2072 2110 2241 2412 2500 2429 2306 2255 2266 2304 2341 2319 2247 2212 2225 2256 2326 2374 2306 2216 2234 2269 2223 2216 2292 2317 2287 2331 2418 2403 2279 2165
3585 2165 2161 2254 2299 2217 2153 2203 2213 2109 2064 2139 2175 2165 2227 2289 2225 2147 2182 2238 2230 2206 2160 2051 1972 2016 2117 2201 2275 2305 2263 2236 2268 2271 2226 2220 2243
3580 2243 2233 2245 2313 2352 2345 2352 2355 2340 2377 2422 2376 2338 2421 2463 2312 2136 2125 2229 2326 2370 2351 2307 2294 2309 2334 2358 2328 2253 2259 2354 2396 2360 2318 2253 2191
3575 2191 2227 2255 2121 2002 2107 2263 2265 2228 2275 2337 2379 2403 2357 2255 2187 2166 2182 2249 2280 2184 2066 2036 2038 2046 2134 2262 2294 2204 2081 2036 2113 2201
3570 2201 2206 2226 2323 2350 2254 2182 2165 2135 2166 2287 2345 2296 2243 2191 2143 2196 2280 2232 2138 2167 2239 2246 2238 2221 2159 2126 2142 2103 2045 2085 2161 2172 2171 2206 2251 2324
3565 2324 2402 2371 2273 2278 2369 2395 2346 2297 2254 2222 2228 2221 2144 2057 2049 2095 2110 2082 2091 2161 2201 2159 2121 2149 2180 2160 2122 2110 2132 2160 2165 2180 2245 2297 2274 2261 2313
3560B313Mj06r7J8R8J03O2J9Kk1n2k4J1m6p2L5Q4j1m1K2j0p4k6Rk8mK9l7m4P1Q2j5LR6P3k6
3554B400j09j56q1Q6J19j2o8J2Q1N7k4o2L6J34L3j31j17k2j0j4Kk6j0J01J14k7j02j5R8J12
3550B399Pj13p3O6N7p7j09l6OJ0k2o9j5J13J04Mlnq2k6J33P5j29j32oRJ3J08J08j5m6K5N1
3545B330M4O2M8j8m9j2K5Kl7j0L3j6p4lQ9K7q2o9k0l4k3M1L3m8m9L7P3J3m6k6L1L6j1k1L7
3540B313P1J9l3l3n0r8o4N4Q2pm0K7M8LK4Q1K4r9q7L8N6m9p1K9P5M0L1Jj07j16K1L6j13j08
3535A998P7J25J2l2rrRJ1l1J6J08K1j20o1Nr8r5Q6J20L8J04J23q4j68J0O9n3j8J14N2o9MJ36
3530B391J05k2n6RJ1q4j00J8N6l6m7L6L4k5m0p2r2K6J49P0p6q6k8nlkK5Q1M1q3q4L7N5NL7
3525B245J5j27j22P5J32mm7M4N7k7p8p7l6N6J25P3l3m3L4Q3N8Jn8o7K0J17P7n1r6m2K1O4N7
$$ plain form
3560 2313 2317 2211 2114 2132 2230 2333 2395 2414 2416 2395 2343 2319 2330 2284 2212 2247 2331 2320 2279 2301 2291 2217 2191 2200 2172 2168 2197 2160 2116 2187 2269 2254 2257 2353 2426 2400
3554 2400 2291 2135 2054 2140 2259 2247 2179 2191 2272 2329 2305 2243 2279 2413 2446 2315 2198 2176 2166 2152 2154 2128 2118 2219 2333 2306 2204 2189 2287 2399
3550 2399 2406 2293 2220 2286 2343 2266 2157 2121 2127 2137 2115 2046 2031 2144 2248 2252 2249 2244 2162 2136 2269 2344 2215 2083 2077 2086 2099 2207 2315 2300 2254 2279 2330
3545 2330 2374 2436 2484 2466 2417 2405 2430 2432 2395 2385 2418 2402 2328 2325 2414 2441 2359 2290 2270 2236 2213 2254 2287 2239 2190 2227 2300 2313 2267 2241 2272 2308 2297 2276 2313
3540 2313 2384 2403 2370 2337 2287 2189 2125 2179 2261 2254 2214 2241 2289 2292 2316 2397 2421 2322 2235 2273 2329 2280 2209 2238 2313 2353 2384 2385 2278 2162 2183 2219 2106 1998
3535 1998 2075 2200 2212 2180 2171 2162 2171 2182 2151 2167 2275 2296 2176 2115 2120 2022 1927 2013 2133 2171 2275 2398 2314 2146 2156 2225 2172 2154 2268 2320 2251 2255 2391
3530 2391 2496 2474 2418 2427 2438 2354 2254 2272 2328 2292 2245 2281 2315 2290 2250 2178 2086 2112 2261 2331 2255 2169 2141 2136 2133 2131 2156 2237 2278 2195 2111 2148 2203 2208 2245
3525 2245 2260 2133 2011 2086 2218 2214 2167 2211 2268 2241 2163 2086 2050 2106 2231 2304 2271 2228 2262 2345 2403 2404 2346 2279 2299 2416 2493 2442 2346 2304 2325 2389 2446
3520B446j3m2%j6q4o0K7N4O4O9%p0n4m8l8O9R3q6j41N2J00o9p0O9K6o2K5P5k7o4k6n3n4J3
3515B105rq0k2Q0Q1N2L4l9j03o5K7R3R9J7p6n0M2N4mk5J1O6P2Pm8k1K6K9L1L1nm2m9n2m1Q
3510B234N3M4kl7l3k1l4k1N0P1nl1PoJQ8L6j38q9J10O5r8m1M4k5KJ26N2r5l2L8n1n8O6P0m0
3505B300p4j7N1N1n3j12nO1k6k0R8O3m4PN7l0k5R9N6j21j43k0M4Km9rQ9R7J0l2n4j14o6P4
3500B145L3j09n0Q9M6k5Nk0o9J4Q7M9M5O3JrL6n1j39k7M0o9l4J39Q6p5j2R3K0m5k5l1K3J38
3495B362P1r0n1O5J1m5J3k2j51j17N2J15M8k2l1K0O4M3L0M9mj11j08rK9kl6o4l7Q4J62J00
3490B418J4kk2n0l7m6j01o0Q0R2m8r3RO4L3J6Jl8j8M5K5l7kQ0O8m3j32q2O5J12Ko6j6ml7P
3485B197M6K1O3J21Oj00J2Q2o7j22J7O5Kpm2j09m1O2K4K2J34J12l4n2Kk3m5l2m5qO0oq0J8
$$ plain form
3520 2446 2433 2391 2391 2375 2291 2231 2258 2312 2376 2445 2445 2375 2321 2273 2235 2304 2397 2311 2170 2222 2322 2253 2183 2252 2278 2216 2241 2316 2289 2225 2199 2146 2092 2105
3515 2105 2096 2016 1994 2074 2155 2207 2241 2202 2099 2034 2061 2154 2253 2270 2194 2144 2186 2240 2236 2211 2222 2288 2360 2367 2319 2298 2324 2353 2384 2415 2410 2368 2319 2267 2226 2234
3510 2234 2287 2331 2329 2292 2259 2238 2204 2183 2233 2304 2299 2268 2275 2269 2270 2358 2394 2256 2167 2277 2342 2244 2203 2247 2222 2224 2350 2402 2307 2275 2313 2262 2204 2270 2340 2300
3505 2300 2226 2209 2260 2311 2258 2146 2141 2202 2176 2156 2254 2317 2273 2280 2337 2307 2282 2381 2437 2316 2173 2153 2197 2199 2150 2141 2230 2327 2337 2305 2251 2137 2071 2145
3500 2145 2178 2069 2019 2108 2154 2129 2134 2114 2045 2059 2146 2195 2240 2303 2304 2295 2331 2280 2141 2114 2154 2085 2051 2190 2276 2201 2189 2282 2302 2257 2232 2201 2224 2362
3495 2362 2433 2343 2292 2357 2368 2323 2336 2314 2163 2046 2098 2213 2261 2239 2208 2228 2292 2335 2365 2414 2410 2299 2191 2182 2211 2209 2173 2109 2072 2156 2318 2418
3490 2418 2432 2430 2408 2358 2321 2275 2174 2114 2194 2286 2238 2145 2154 2218 2251 2267 2268 2230 2212 2257 2282 2245 2243 2323 2391 2348 2216 2134 2199 2311 2313 2247 2231 2227 2190 2197
3485 2197 2243 2264 2327 2448 2454 2354 2366 2448 2381 2259 2276 2341 2343 2336 2294 2185 2144 2206 2230 2252 2386 2498 2464 2412 2414 2391 2346 2314 2269 2261 2321 2315 2235 2253
3480B253P9k7n4M1M9J8M0j3r4j6Q2K8m1p2j20k7J69J25p1m5N8j5m2M9j8j17K0J15k5o8N7N7
3475B375j0L6K2j01r5J5M6M0L5l3p2j4PMP5Q7oj5J6q3j18L5P4r3j29L4J20O3jl9n7p2p2K0
3470B094J53J12m1l3N3k1j00OJ04K9q9j26o4O2P9m5n9P6R1j1k4j5o0l1J6m0j2J26M9j80j26
3465A973J15J30K5O0R1rq3o8k2M3M8m6o0O6R8j2n3nPJ3L3nm5J7P5L6J0N0L7m6p6l3j4m4o2
3460B244m2j7J8O3O9J7l6p0r8o9M0J15Q9K9k1o3k8N7M4m6o0%M5N0k3j41j02P0O8p9l4J26O3
3455B278r6m6J12J32L0o8o1M2N2p1o8R7J13l1m9L8L5Lrq0q5O6J09n5j09K3M9n9o1L1O6M8K1
3451B397j9k7oqk4j7l4o9l3M6N0k1m7K7R5M6l5pO8N7K7N6L2q1j18m7QK8N1M3K0Lq0j89j31
3445B061M5J00M6M5N1j4l6L2N3j2m5oRl0m8k8k4k4K2M1k0LJ48J18j29j94J3J03j2m5J0QN6
$$ plain form
3480 2253 2332 2305 2251 2292 2341 2359 2399 2386 2292 2276 2358 2386 2345 2273 2153 2126 2295 2420 2349 2304 2362 2347 2305 2354 2336 2219 2239 2354 2329 2261 2318 2375
3475 2375 2365 2401 2423 2322 2227 2242 2288 2328 2363 2330 2258 2244 2251 2255 2330 2417 2411 2396 2412 2329 2211 2246 2320 2227 2098 2132 2252 2315 2314 2275 2218 2146 2074 2094
3470 2094 2247 2359 2318 2285 2338 2317 2217 2223 2327 2356 2267 2141 2077 2139 2218 2173 2114 2190 2281 2270 2246 2231 2171 2140 2156 2116 2104 2230 2279 2099 1973
3465 1973 2088 2218 2243 2303 2394 2385 2302 2234 2212 2255 2303 2257 2197 2263 2361 2349 2296 2291 2298 2311 2344 2339 2294 2311 2386 2422 2432 2482 2519 2473 2397 2364 2350 2306 2244
3460 2244 2202 2185 2203 2266 2335 2352 2316 2246 2148 2079 2119 2234 2323 2352 2331 2268 2240 2297 2341 2295 2235 2235 2280 2330 2307 2166 2064 2134 2202 2123 2089 2215 2278
3455 2278 2182 2136 2248 2380 2410 2342 2281 2323 2375 2304 2236 2333 2446 2415 2366 2404 2439 2442 2433 2353 2268 2334 2443 2388 2279 2302 2351 2292 2231 2262 2328 2376 2397
3451 2397 2378 2351 2345 2337 2313 2296 2262 2193 2160 2206 2256 2235 2188 2215 2310 2356 2321 2314 2382 2439 2466 2522 2554 2473 2355 2308 2316 2344 2395 2438 2458 2461 2381 2192 2061
3445 2061 2106 2206 2252 2297 2348 2334 2298 2330 2383 2371 2326 2320 2329 2299 2251 2223 2199 2175 2197 2238 2218 2221 2369 2487 2358 2164 2177 2280 2268 2223 2233 2241 2297
3441B297J60N9j64j46O2J20K8k4j9QM3J6n0l2J8k4o9J0Q4K4n8l6J3J3J4L3j2j08j08K9J15
3436B296M1n5k6N0M5k0k6O1J12K5r2r7m0k2k0JJ3L8N8rp9lR3M1j2N2O5m0o6J6K3r8k01j38
3431A986P2J84P9j7L6K1p4J1J27k1j58K5J62k0j59o2J4L1J05P6o6m2J03P4m9l4J7nJ8N9j4
3426B479r0l6K1kJ6N7k0j22o0L3n1j56l4J49J20PM0J21O8m7r6o8KL7rqQ6P5q6j43m6KLN2M6
3421B340k3K5J24M8r8r2oK4J1j3k4rl6q3jJ28O6p7o1Pk5k7L0J9K1J03P4o8o0P0O0m3l4L9L1
3416B440l5r7j16n4N7J16O9m2q4nO4L6M0R9L3j12j11j4KJ4R6J08L0j6l5o8p2n3m1MK8l0l3
3411B218N9L3q6j6J63J27m5p2PJ4k8j7M6O4%j8M6j4j74r4J48J02j24q6N8m0j28L5J62P9k7
3407B392n6j5O4Rj55r9J28J11o8m8M2qoP9L8m4oj1r5q1k4k4M5J32N9j3M1j3j75j23O1R7P4
$$ plain form
3441 2297 2457 2516 2352 2206 2268 2388 2416 2392 2373 2381 2424 2440 2390 2358 2376 2352 2283 2293 2377 2401 2343 2307 2320 2333 2347 2380 2368 2260 2152 2181 2296
3436 2296 2337 2282 2256 2306 2351 2331 2305 2366 2478 2503 2411 2314 2274 2252 2232 2233 2246 2284 2342 2333 2254 2251 2344 2385 2373 2425 2490 2450 2384 2400 2423 2325 2124 1986
3431 1986 2058 2242 2321 2304 2340 2361 2287 2298 2425 2404 2246 2271 2433 2413 2254 2192 2206 2237 2342 2418 2352 2310 2413 2487 2438 2404 2421 2416 2434 2493 2479
3426 2479 2389 2353 2374 2372 2388 2445 2425 2303 2243 2276 2225 2069 2035 2184 2304 2311 2351 2472 2540 2493 2397 2329 2331 2368 2359 2351 2437 2512 2426 2283 2237 2239 2242 2294 2340
3421 2340 2317 2342 2466 2514 2416 2324 2318 2342 2353 2340 2316 2307 2271 2188 2187 2315 2381 2304 2243 2250 2225 2198 2228 2247 2268 2371 2445 2377 2317 2387 2447 2404 2370 2409 2440
3416 2440 2405 2308 2192 2138 2195 2311 2380 2338 2254 2249 2313 2349 2389 2488 2521 2409 2298 2284 2286 2300 2396 2504 2534 2518 2483 2415 2343 2290 2249 2253 2281 2251 2218
3411 2218 2277 2310 2224 2208 2371 2498 2453 2381 2388 2402 2374 2357 2403 2467 2467 2449 2495 2481 2307 2213 2361 2463 2339 2253 2311 2271 2143 2178 2340 2419 2392
3407 2392 2336 2321 2385 2394 2239 2140 2268 2379 2311 2263 2305 2297 2291 2370 2408 2364 2358 2347 2252 2171 2147 2123 2168 2300 2359 2346 2387 2374 2199 2076 2137 2234 2308
3402B308R2J3q7l6pp9LJ67O1j88j66P8K07J41qj21j05PQ2P3K1k3l7n5r1o5PJ4J3R2Q4n7o9
3397B269N3J9q2NR5po6Nj4p2RP0qj6Q1P3j6l6k6k7K4Q7O2l7j20r1N1J33N0m2m6o0p7oN8L4
3392B329Qk0o2J6J44N3j28p3N4k4p7N5O9j02j14P4J53N9l8p6n8j4j0l4pK4NJ3O6N3k9p2n9
3387B178o4r4p6L3J46J32M7L0L9l7r6j8R4J10N7l4j14o9N4O5k9l7K5Pn8n5j5%%j5l3nL2ll4
3382B163K9P0kl5M4O4JJ1K0j03j65j5P8j5rJ67K08N4p3j05q7k7k2p2nJ26P3m8J8R5k0j27q7
3377B204k5N4J40O7p2n0j4j07n3J56J22p7m1P9lp6k2o9j45j6J21M9j7M7O0nk0LLj7n5m6O2
3372B237J15J6p9p0k6K7O5J4l6L2R1M4J8J9p3j54r9nL9N7J3n9m2mpP9J66J0j61l3R8l9j22
3367B131NM3k2Onq3K6J86O8r3K1J36J9p3qK2j1j4l0m8QM9k1n9L5R5j4j32o5P8P4l4m5Rll5
$$ plain form
3402 2308 2400 2413 2326 2290 2283 2204 2207 2374 2435 2247 2081 2159 2366 2507 2499 2378 2273 2280 2362 2435 2456 2433 2396 2341 2250 2185 2192 2206 2219 2311 2395 2338 2269
3397 2269 2322 2341 2259 2264 2359 2352 2286 2291 2277 2205 2214 2284 2276 2260 2341 2414 2398 2362 2336 2309 2333 2420 2482 2445 2325 2234 2285 2418 2468 2426 2380 2320 2243 2237 2295 2329
3392 2329 2337 2317 2255 2271 2415 2468 2340 2267 2321 2297 2220 2275 2344 2242 2128 2202 2355 2414 2376 2300 2242 2228 2218 2184 2177 2201 2206 2219 2285 2338 2309 2237 2178
3387 2178 2114 2020 1944 1977 2123 2255 2302 2332 2371 2334 2238 2220 2314 2424 2481 2447 2333 2264 2318 2383 2354 2317 2342 2349 2291 2236 2221 2221 2221 2206 2173 2168 2200 2197 2163
3382 2163 2192 2262 2260 2225 2269 2333 2334 2345 2365 2262 2097 2082 2160 2145 2136 2303 2511 2565 2492 2387 2300 2273 2251 2179 2174 2300 2373 2325 2343 2438 2418 2291 2204
3377 2204 2179 2233 2373 2440 2368 2318 2304 2197 2144 2300 2422 2345 2304 2383 2380 2304 2282 2213 2068 2052 2173 2222 2205 2252 2312 2307 2287 2290 2293 2276 2221 2175 2237
3372 2237 2352 2368 2289 2219 2193 2220 2285 2299 2263 2295 2386 2430 2448 2467 2394 2240 2141 2136 2175 2232 2245 2186 2144 2140 2133 2212 2378 2388 2227 2194 2292 2253 2131
3367 2131 2136 2179 2157 2163 2158 2075 2101 2287 2355 2262 2283 2419 2438 2365 2357 2379 2368 2354 2324 2276 2284 2333 2312 2253 2288 2383 2369 2237 2172 2250 2324 2290 2245 2254 2251 2216
3362B216l7m3J4J31Q1r9o8J06L8j36n5J03N7j1L7M1rMQm2n0k0mK2K4k6j2K3n1p3P3R9r8j49
3357B094K2Q9K5K4L4nJ2L1m6j04p0m4QJ08J11Jm1kL3O2N7J3L1L5j05j66J0P6q8m7K02J62j18
3352B404j66l9l3p1m0m0o1j3M9R2J40J24L4njk8l7l1n5j7Q5P4%N2Q2n8j18QL9n0pP2j5r7k3
3347B250L8NrPJ9P1R8J2p7m3K2On1o6LJ00P4p3j14K1R8%q3l1K4pl7j2K2L1Pn9q2OP4Ko0j0
3342B176Jm1M3J44J6j37l7J24J13O0J8j08j69n9jl3P1J90O6j10q5k5p0o0L2N0RJ7N7N1k8o8
3337B207M4J36kj38J1J74O5p6m7j6j6K2k4j13l4O6j3m0O9J7j09PJ12o8j61L3J20J2K6J20Q3
3332B467M5N7m7j71j19j8j0J1M6j4p7k0O7P0K1j0K7Q5M5p3j04m1j8k6M0J16P8n8j47r8K2Q7
3328B233P3M1J9lm1p5l2Q0R4l0p1K4K7p4n7L3K1k2l5p6m8J01J30j2m7K4j7m8P3J06m2r6j6
$$ plain form
3362 2216 2179 2136 2150 2281 2362 2263 2195 2301 2339 2203 2148 2251 2308 2297 2334 2375 2366 2370 2378 2336 2286 2266 2262 2284 2308 2282 2270 2293 2242 2169 2242 2341 2243 2094
3357 2094 2116 2205 2230 2254 2288 2283 2295 2326 2280 2176 2106 2062 2070 2178 2289 2290 2249 2247 2280 2342 2399 2412 2443 2478 2373 2207 2217 2293 2205 2158 2360 2522 2404
3352 2404 2238 2199 2166 2095 2055 2015 1954 1941 1990 2082 2222 2346 2380 2375 2374 2346 2309 2278 2223 2206 2291 2365 2365 2417 2499 2441 2323 2331 2370 2320 2313 2385 2370 2273 2250
3347 2250 2288 2293 2284 2291 2310 2381 2479 2491 2414 2371 2393 2399 2348 2282 2285 2385 2459 2386 2272 2293 2391 2391 2308 2277 2301 2294 2257 2245 2267 2298 2305 2246 2164 2170 2244 2246 2186 2176
3342 2176 2177 2136 2179 2323 2339 2202 2165 2289 2402 2462 2480 2372 2203 2144 2143 2110 2181 2371 2437 2327 2242 2217 2147 2087 2119 2169 2178 2195 2252 2303 2275 2207
3337 2207 2251 2387 2385 2247 2258 2432 2497 2421 2374 2358 2342 2364 2340 2227 2193 2259 2246 2206 2275 2292 2183 2190 2302 2234 2073 2106 2226 2238 2264 2384 2467
3332 2467 2512 2569 2522 2351 2232 2214 2204 2215 2261 2247 2170 2150 2217 2287 2308 2298 2325 2410 2455 2382 2278 2237 2219 2193 2233 2349 2427 2369 2222 2124 2146 2233
3328 2233 2306 2347 2366 2363 2322 2247 2215 2295 2389 2359 2288 2312 2339 2265 2208 2241 2262 2240 2205 2129 2081 2182 2312 2300 2253 2277 2260 2212 2285 2391 2349 2253 2237
3323B237pm5k6K3J04J71M0j80j70J0N3k3l8j7j5LL1L1lm9qJ02L6j76j37J22J35l1M5J62k2
3318B358j74j7R6k7r2j0L6J6l2r1l1J44J70Lr1m0j2n2o5k1L7O4N5L9Qk2K5Q9J9j15j03J9R6
3313B279J16N7p9j04J3Kj38j24J1L3J0N2O3M2M8J0l2L4O3l3k5Q5M1n6RL5q4q9J4%k2K3n4j51
3308B049k0J30O9L1J06O5n9p5n1m1J6K7l8k4J7m9k9J33J15p9j05Llk5M7Q1M8Pn5o3J3pj01
3304B133k3J22P6l0l8n5l5R7J10j8RN8j23j83Q2J70o1j17L5K7l7L8N5j8L3J13M3o1q2n9%L5
3299B296j7j1P7L1r1l8N2j2l9L0k5j22m1L4l3l5N7M4k1qjk8oK4M6J11J10j5q6l5ppM4N8jl6
3294B299l9k1P3J33K9r4r3m3K3R7M7o1pP2m0j24k4%p0J3J13qj02K5J16K5o6o4j7K6J1k7QJ1
3289B221p8n3Q4M4j00l1R2J8m4N2P3lJ8N2j7n2j3LN2J18L5j00p5j2o1n3O8J04L0OL6M6L2j9
$$ plain form
3323 2237 2230 2185 2159 2182 2286 2457 2497 2317 2147 2157 2210 2187 2149 2132 2117 2120 2151 2182 2179 2130 2122 2224 2260 2084 1947 2069 2204 2173 2218 2380 2358
3318 2358 2184 2167 2263 2236 2144 2134 2170 2186 2154 2063 2032 2176 2346 2349 2258 2218 2206 2154 2089 2068 2105 2169 2224 2263 2271 2249 2274 2363 2382 2267 2164 2183 2279
3313 2279 2395 2452 2373 2269 2282 2284 2146 2022 2033 2066 2076 2128 2191 2233 2281 2291 2259 2293 2356 2323 2298 2383 2424 2368 2377 2412 2328 2239 2253 2253 2231 2254 2200 2049
3308 2049 2029 2159 2228 2259 2365 2430 2371 2296 2245 2204 2220 2247 2209 2185 2202 2153 2124 2257 2372 2293 2188 2191 2188 2163 2210 2291 2339 2346 2291 2228 2241 2234 2133
3304 2133 2110 2232 2308 2278 2240 2185 2150 2247 2357 2339 2348 2406 2283 2100 2182 2352 2291 2174 2209 2236 2199 2237 2292 2274 2307 2420 2463 2402 2320 2261 2261 2296
3299 2296 2279 2268 2345 2376 2285 2247 2299 2287 2248 2278 2253 2131 2090 2124 2091 2056 2113 2157 2136 2128 2127 2099 2093 2117 2163 2274 2384 2369 2283 2248 2241 2234 2278 2336 2335 2299
3294 2299 2260 2239 2312 2445 2474 2380 2287 2244 2267 2364 2411 2350 2343 2415 2375 2251 2227 2227 2157 2170 2283 2275 2173 2198 2314 2339 2273 2209 2192 2218 2229 2202 2210 2221
3289 2221 2143 2090 2174 2218 2118 2087 2179 2197 2153 2205 2278 2275 2293 2345 2328 2276 2263 2266 2318 2436 2471 2371 2296 2284 2223 2170 2238 2342 2372 2378 2414 2460 2492 2473
3284B473p3m7J6J4LK9j5r0l4O7J8p3kQ7j5j43n5J00P7k3pL7j9r4j02q4k6P4R8L2jj0m9k6N0
3278B187K1n3oO1L1J1J2k6K2J40O3j21q1M5l2j05J2O5j0LL8m1l9R5R7m5j11q7l5O0Q5k2m4
3274B190P1N9j01j15N4J40P2lk8p1j01l3P3O0k3MP4K0m9oK9PL2K1p5l0J30O8j45j63o3m5J3
3269B066J18O5j0P2R3m5q4jml6rj6j8N4K4j02o7M9J8j5P5P5k7j6K5l7m2M6L8k3j2l9j07l7
3264B071R1R2L6Mp0j15k6O2N5O0Q1J4n0K8J41R3p8j41j4Q0j1j03n6j4l0K3P5Lm6rl1l9J05
3259B281J45r8k67j34J0J8N5J14P7K2L4L4LQL3L2j6r1j13m7OOJ9N0O4P0L1o2r7n5l2J8J10
3254B228N6r5k4J52N0j56o5J38R9o4j14m9M7P3J7K8Q9J2r0k2k1j85j27J58J76m7q2J5Nj0K
3250B194m0RJ35O1q4J6J11n1j28L5Q8oRL0p1q4J0j5j07o5M6R7O5m5j19k6J00N1n7l5N2O2O
$$ plain form
3284 2473 2400 2353 2369 2383 2386 2415 2400 2310 2276 2343 2361 2288 2286 2373 2358 2215 2160 2260 2337 2314 2307 2344 2325 2231 2129 2045 2019 2093 2191 2223 2222 2212 2163 2137 2187
3278 2187 2208 2155 2149 2210 2241 2252 2264 2238 2260 2400 2463 2342 2261 2306 2274 2169 2181 2246 2236 2239 2277 2236 2197 2292 2389 2344 2233 2146 2111 2171 2256 2234 2190
3274 2190 2261 2320 2219 2104 2158 2298 2370 2367 2339 2268 2167 2134 2207 2267 2244 2248 2322 2342 2293 2287 2316 2323 2355 2376 2301 2271 2401 2469 2324 2161 2098 2053 2066
3269 2066 2184 2249 2239 2311 2404 2359 2275 2274 2270 2234 2225 2209 2191 2245 2269 2167 2100 2149 2167 2152 2227 2302 2275 2259 2284 2247 2205 2251 2289 2266 2254 2215 2108 2071
3264 2071 2162 2254 2290 2294 2224 2109 2083 2145 2200 2260 2341 2355 2305 2333 2474 2567 2489 2348 2334 2414 2403 2300 2244 2230 2200 2223 2298 2301 2255 2246 2215 2176 2281
3259 2281 2426 2328 2061 1927 1937 1955 2010 2124 2201 2223 2257 2291 2294 2302 2335 2367 2351 2260 2147 2100 2106 2112 2131 2181 2245 2315 2346 2284 2187 2132 2100 2118 2228
3254 2228 2284 2189 2165 2317 2367 2211 2146 2284 2383 2319 2205 2156 2203 2276 2293 2321 2410 2422 2332 2310 2289 2104 1977 2135 2311 2264 2182 2197 2202 2192 2194
3250 2194 2154 2163 2298 2359 2275 2291 2402 2351 2223 2258 2346 2340 2349 2379 2308 2224 2234 2219 2112 2047 2093 2190 2255 2210 2091 2065 2165 2216 2159 2124 2176 2238 2244
3245B244k2LJ5l4n7JK7kL9J01N2pK3J8n3m5K9N1J9l5n3J4M0r0j49LR5Rk2K1%J3Q4M2j4L6k3
3239B373j63k4K12Q0j92j45M3P6M2Nl8KM3l7n5N3M0n4mL6m5k2O4ql6R8P5q3m4L4n9k6J52R9
3234B492o6k0J9j02j16l7m2QR1k9j25M4J07o0l0J40N4p6K9O7p6j02j1K5O8R0ml8J4q3j69K
3230B064J24k7j09lK8QN7L7mP8P0p7l3J34N9o2L7O5p6n4O1m5j77p7M7N5O8O1j5k9J9J0k5m5
3225B224p1l0P3N9l4j4M3Jj1M9J5p7n5J0J3J3L6K3j0l5m6nP1O3k9q6o4lJ1o1p4Q4J85N5p4
3219B249k8Nl9k2J2j1L3J01K8o9k6J5j4J8N1k7l8O7N3o9n5M4M2j5l2m0m1k2l6o1k6M7R9R2
3214B285nj13q8J1K0j7J7N9K6j0L0Q7N7m8p3J7N3k4o6m6n2k4O4O4J6O7P5o0r5K6O2N8J42Q9
3209B604j27j29M9M6l7mm1j26J0J36l8j32P7J39o9r3R5J09k5l4K2l0j06o6L5J7j03r9K9L1
$$ plain form
3245 2244 2222 2225 2240 2206 2149 2150 2177 2175 2214 2315 2367 2360 2383 2401 2348 2303 2332 2383 2402 2367 2314 2328 2368 2278 2129 2132 2227 2236 2214 2235 2235 2248 2332 2374 2360 2396 2373
3239 2373 2210 2186 2398 2478 2286 2141 2184 2260 2302 2307 2269 2271 2314 2277 2222 2275 2315 2261 2257 2293 2248 2226 2290 2282 2246 2344 2419 2336 2292 2326 2267 2241 2393 2492
3234 2492 2426 2406 2425 2323 2207 2170 2128 2136 2227 2198 2073 2117 2224 2164 2134 2274 2328 2252 2281 2348 2272 2170 2159 2184 2252 2342 2338 2300 2314 2231 2062 2064
3230 2064 2188 2161 2052 2049 2077 2085 2142 2179 2175 2253 2323 2246 2213 2347 2406 2344 2381 2446 2370 2316 2377 2332 2155 2078 2125 2180 2248 2309 2294 2265 2284 2294 2269 2224
3225 2224 2153 2123 2196 2255 2221 2207 2250 2251 2240 2289 2304 2227 2172 2182 2195 2208 2244 2267 2257 2222 2176 2171 2242 2305 2276 2190 2126 2123 2134 2073 1999 2083 2268 2323 2249
3219 2249 2221 2226 2187 2165 2177 2166 2199 2300 2328 2259 2233 2248 2234 2252 2303 2276 2238 2305 2358 2289 2234 2278 2320 2305 2273 2233 2192 2170 2134 2073 2047 2094 2193 2285
3214 2285 2280 2167 2079 2090 2110 2093 2110 2169 2195 2185 2215 2302 2359 2311 2238 2255 2308 2284 2218 2172 2120 2096 2160 2224 2240 2307 2382 2322 2227 2253 2315 2373 2515 2604
3209 2604 2477 2348 2397 2443 2406 2402 2361 2235 2245 2381 2343 2211 2288 2427 2358 2265 2360 2469 2444 2410 2432 2402 2296 2230 2265 2282 2179 2080 2109 2140
3205B140o3j2O1j9k3J26J34MJ5O8j4o6n1j16j08P5J25m3r6RO3Q6P3p8j77l5J15R6O0L9k2j3
3200B353J5j00j66nJ00J1k7jo0n1O6K1j10j0J60R2n0l0M3L0n7j40j13PK7n3QJ75J76J6o3j0
3196B254L2l3j21o1J19J95J14K5l9j10r4kM4O3P2j5r9j8M3o8j19j6K1j4K6M3lJ6K7n4m3N8
3191B243J8m0P2R9q3j38k1NjQ8Q3l2k7M5K7J5K4m9j02o5n5k2J24J70K2m6K8M8K3Qp2j02OK5
3186B318p9k0R6l9j90n6J03P0Pj0lQ3J02p3j26R0J47o8j40l9n6o3J00J34o1j36J5J23Q8L9
3182B356K1Jm6r6p9JO0P9P5J9m1j7J7l0o5qP2J06M9q2j05L9J00rn1Qk1p3k3j7p4j0Q1K1l5
3176B223L1L5n5n6pj5jM7Pn3kO1J9k9K5J01P0n6r8J3Q9J0p3m4QK2Nl4k4L6Kj04o2R4J25L7
3171B347m4j09q8N4J02mk6J7o5r1Q1J33m5j04OL2J1O7P8K9K6j4j16j10j2K3K1K9LRM3k9p8
$$ plain form
3205 2140 2077 2065 2126 2107 2084 2210 2344 2348 2363 2431 2417 2351 2300 2184 2076 2151 2276 2233 2137 2146 2209 2295 2368 2290 2113 2078 2193 2289 2349 2388 2366 2353
3200 2353 2368 2268 2102 2097 2197 2208 2181 2180 2120 2069 2135 2156 2046 2036 2196 2288 2238 2208 2251 2281 2224 2084 1971 1978 2005 1952 1960 2135 2311 2327 2264 2254
3196 2254 2286 2253 2132 2071 2190 2385 2499 2524 2485 2375 2281 2279 2323 2386 2458 2443 2344 2326 2369 2301 2182 2166 2187 2173 2199 2242 2239 2255 2282 2228 2185 2243
3191 2243 2261 2221 2293 2392 2309 2171 2150 2155 2154 2242 2325 2293 2266 2311 2338 2353 2377 2328 2226 2161 2106 2084 2208 2378 2400 2354 2382 2430 2453 2461 2389 2287 2293 2318
3186 2318 2239 2219 2315 2276 2086 2030 2133 2203 2210 2200 2197 2280 2382 2309 2183 2273 2420 2352 2212 2173 2117 2054 2154 2288 2227 2091 2106 2229 2317 2356
3182 2356 2377 2378 2332 2236 2157 2158 2218 2297 2372 2391 2350 2333 2350 2320 2255 2247 2319 2425 2474 2392 2287 2326 2426 2417 2366 2374 2353 2280 2257 2240 2166 2156 2237 2258 2223
3176 2223 2254 2289 2234 2178 2171 2156 2155 2202 2209 2156 2154 2215 2234 2205 2230 2331 2401 2345 2247 2260 2349 2359 2286 2242 2250 2272 2277 2243 2219 2255 2257 2153 2091 2185 2310 2347
3171 2347 2303 2194 2106 2160 2262 2258 2232 2249 2184 2093 2174 2307 2262 2158 2164 2196 2207 2274 2352 2381 2407 2393 2277 2167 2155 2178 2199 2228 2231 2240 2283 2254 2176
3166B176P0J39m8j39MM8k4L4J08N1K0K0q4j34j2N8%k3lRN0N5l5o6kPl1l6o7o9K9N0m6k6N8
3161B141jj4J37J29n9p0L6Mj5M3k4p9Q1J49l0j26o1m0K9J41Oj98m8J97J07q3n6Nk4j2L6M5
3157B346N3M4j9p2p5m2M2J03M3m2k4K6L4J3n8j24q5l0qJ11K27Q1j52j45l9k2L3J04K2q1n4
3152B210k7oQ6O9q8q6O4O9k0l2n7o9L9J02O0R4P0j53k08M5J01j04o2J49Q6p2QR3k7j32o0Q2
3147B224J23j0j49n0J37J12k8p4r1r7j3N4J6j2pj8M1J16L8p1l9om2%N1J1L0Q5j7r6K5N1j02
3142B192j06K4L5L0N9n5j27P3K00K7r4j7J4ML8Lk6N3L7p3KJ22Kr7J4K4r9l8R5N1m3p0q6k2
3137B146P0Nn0O4O9r4o5Q8L8n0K2K2n6J4Q7K0J0M6k6l3O8j6j52j3J56P3j1Oo5j00J6K9o2l
3132B253P0k4n1N2L5m2lJ9l7j6N0N4O8O4j8k9L9j6j10n4J7J2L5Kj26j00O3O6j0J9j7j04j2
$$ plain form
3166 2176 2246 2385 2337 2198 2202 2250 2226 2260 2368 2419 2439 2459 2375 2241 2229 2287 2287 2264 2261 2270 2320 2375 2340 2274 2272 2279 2248 2212 2145 2076 2105 2155 2109 2083 2141
3161 2141 2140 2126 2263 2392 2333 2263 2299 2303 2288 2331 2307 2228 2309 2458 2428 2302 2241 2201 2230 2371 2377 2179 2131 2328 2435 2352 2296 2301 2277 2265 2301 2346
3157 2346 2399 2443 2424 2352 2277 2235 2277 2380 2423 2381 2357 2383 2417 2430 2372 2248 2163 2133 2125 2236 2463 2544 2392 2247 2208 2186 2219 2323 2345 2264 2210
3152 2210 2183 2177 2263 2332 2244 2158 2222 2291 2271 2239 2182 2113 2152 2254 2314 2408 2478 2325 2117 2162 2263 2159 2097 2246 2332 2260 2268 2361 2334 2202 2142 2224
3147 2224 2347 2337 2188 2138 2275 2387 2359 2285 2194 2097 2084 2138 2154 2142 2135 2117 2158 2274 2312 2241 2202 2196 2154 2154 2205 2216 2246 2331 2314 2218 2243 2294 2192
3142 2192 2086 2110 2145 2175 2234 2179 2052 2125 2325 2352 2258 2241 2255 2259 2297 2300 2274 2327 2364 2291 2293 2415 2417 2320 2334 2358 2259 2221 2316 2367 2324 2254 2168 2146
3137 2146 2216 2221 2171 2235 2304 2210 2145 2233 2271 2221 2243 2265 2209 2223 2310 2330 2340 2386 2360 2327 2395 2379 2227 2214 2370 2443 2432 2438 2373 2273 2289 2318 2256 2253
3132 2253 2323 2299 2248 2300 2335 2293 2290 2309 2272 2256 2306 2360 2428 2492 2474 2445 2484 2468 2358 2304 2321 2333 2368 2370 2244 2144 2207 2273 2263 2282 2265 2161 2149
3128B149P1m5l9J33P8p9jK7j54j03J49J05j01o0O3N5L7K0j8O1J06q7j96j5Q4j8j4M3m2o6K7
3123B170j1p5M3J00n0r6M1Q6J1k8k2J7N6Mo2NO3m1j32n9O1J07P4ol4kl6p8K3J06mr7NJ11Q4
3118B334J1n2q0m4j9k9K0O8Nk5O9R7J6nK1k6q7q5l5N4R7Rm7L3N3k3RP0k3r2k3k1n8N8J35k0
3113B365j49q3nJ9O1O0K4M7N1l4p3j7Rj0k3k7J2P0K2n7j7M7K4Kj5o4j7R6N0o0m2o8j64l4J84
3108B184J19rP1N9j27j18K8Lm7J3l1j17j6J03R8J11Q2q2j10M8N8m5%M4l1j8L3m7m8P1Mj34
3103B149JJ74P2n4l4n5r8l5J8K1O5M8o0n5M5L4k1k8p9j05K3J26P2J4k6j14j02L8R2P3R5J9
3098B313j49j15P3J16O1Q9P8m3j01l1L4J5n5p0J0L4o3j02k6K9O6R6Np8M4J26k6q7N2L6j02
3094B229k9R2Lp8l8n4n0P9J03k7n1J6J0J0L3l6o5O3J33L0q1j31j16K3J41N6n9j9N5M4rp1o8
$$ plain form
3128 2149 2220 2175 2136 2269 2347 2268 2267 2294 2140 2037 2186 2291 2190 2130 2193 2248 2285 2305 2287 2348 2454 2367 2171 2156 2240 2222 2208 2251 2209 2143 2170
3123 2170 2159 2084 2127 2227 2177 2081 2122 2208 2219 2191 2169 2186 2242 2246 2184 2189 2252 2211 2079 2020 2081 2188 2262 2256 2222 2220 2184 2106 2129 2235 2231 2134 2139 2250 2334
3118 2334 2345 2293 2213 2169 2150 2121 2141 2209 2214 2189 2258 2355 2371 2366 2387 2361 2274 2189 2154 2208 2305 2314 2267 2300 2353 2330 2339 2409 2386 2294 2271 2250 2192 2250 2385 2365
3113 2365 2216 2133 2128 2147 2208 2268 2292 2339 2390 2356 2283 2266 2275 2265 2242 2215 2227 2297 2319 2262 2245 2292 2316 2318 2303 2239 2222 2318 2368 2308 2266 2198 2034 2000 2184
3108 2184 2303 2294 2365 2424 2297 2179 2207 2210 2163 2176 2145 2028 2012 2115 2213 2324 2406 2324 2214 2262 2320 2275 2275 2319 2288 2270 2303 2256 2208 2279 2283 2149
3103 2149 2150 2324 2396 2342 2308 2253 2155 2120 2138 2159 2224 2272 2212 2157 2202 2236 2215 2187 2108 2003 2026 2152 2224 2238 2212 2098 1996 2034 2126 2199 2294 2313
3098 2313 2164 2049 2122 2238 2299 2388 2466 2423 2322 2291 2325 2340 2285 2215 2225 2259 2196 2094 2068 2097 2163 2259 2264 2186 2230 2356 2330 2243 2295 2331 2229
3094 2229 2200 2292 2295 2217 2179 2125 2075 2154 2257 2230 2179 2195 2205 2215 2248 2212 2147 2210 2343 2373 2292 2161 2045 2068 2209 2265 2206 2187 2242 2286 2277 2206 2138
3089B138J1%q6jJ40O2m0K2Kj01PJ47K3r2ML9k7J8L0r5j16j3Jj2J5k8m0P6P9n1k3R7P1L4O8
3084B359j7j19m8J0k5M3Q7m5l4J75J39j01r9M0Jn8K5O4pp4r7n1K2QpN6K4p1L8J47m2j49P9
3079B273J56o5j09J7k3n8O5L8j29j22mP1J57J21j08j50O9J07m6k8P2M6L2M4l1j4J15L5j55
3074B376q1R2L7o4k4qm5qK2k9n4j2K4K5J0nrrM1J16K6j67q9J59Q0j85j22O9J4j3R2oj61k9
3070B063Q2n1m0J23N2p8J7O1l8jO4k8j8J21M0j49j17r%L8O9%mO6J2o3j2Pl4K5P2k2q2l7NO3
3064B197Q8n1j48JJ18K6oP9P6K7Po1r2j0mn5O4J77P3qJ7o6j29lJ5j18l3J53O9p7k6K2mL6M3
3059B397k0mrj33j09Q6J31M9K5m3j09J2R0l7m5P9Qj20n9m1q1O1J35n3q6P0j2j15J01J66j28
3055B206j93L7N8j9P5O8q1l1Q6Pm7J8l0j04KJ09M8p9j58r0J12J70L1%N1n9j19K5M6p3J7J58
$$ plain form
3089 2138 2149 2149 2063 2062 2202 2264 2224 2246 2248 2147 2154 2301 2324 2232 2236 2275 2248 2266 2296 2201 2085 2072 2073 2061 2076 2048 2008 2084 2163 2112 2089 2186 2257 2291 2359
3084 2359 2342 2223 2175 2185 2160 2203 2290 2245 2211 2386 2525 2424 2325 2365 2366 2308 2333 2397 2390 2316 2219 2168 2190 2198 2191 2247 2271 2200 2238 2385 2343 2194 2273
3079 2273 2429 2364 2255 2272 2249 2191 2256 2294 2165 2043 2039 2110 2267 2388 2280 2130 2199 2306 2260 2232 2304 2350 2382 2426 2395 2381 2496 2531 2376
3074 2376 2295 2387 2424 2360 2336 2328 2283 2275 2297 2268 2214 2202 2226 2251 2261 2256 2247 2238 2279 2395 2421 2254 2165 2324 2404 2219 2097 2166 2180 2167 2259 2253 2092 2063
3070 2063 2145 2094 2054 2177 2229 2151 2168 2229 2191 2190 2254 2226 2208 2329 2369 2220 2103 2094 2094 2132 2201 2201 2197 2263 2275 2212 2200 2207 2173 2198 2270 2248 2166 2129 2134 2197
3064 2197 2285 2234 2086 2087 2205 2231 2225 2304 2380 2407 2414 2353 2261 2251 2247 2192 2256 2433 2506 2498 2515 2449 2320 2317 2332 2214 2181 2334 2403 2326 2300 2322 2318 2354 2397
3059 2397 2377 2373 2364 2231 2122 2208 2339 2388 2413 2370 2261 2273 2363 2326 2281 2360 2368 2248 2189 2148 2067 2128 2263 2210 2124 2194 2182 2067 2168 2334 2206
3055 2206 2013 2050 2108 2089 2164 2232 2151 2120 2206 2213 2166 2184 2154 2050 2052 2161 2209 2130 1972 1882 1994 2164 2195 2195 2246 2187 2068 2093 2139 2066 2083 2241
3050B241M6n8J7Ro2rJ1p2m4N9P4O3Pj10m6J41N9j18jJ21j9o6L0n2j25L5R3oN6J19j8n5K9p4
3045B275j33O4J08r1j01Nk8J8J41J5j02O8J10q8m5J06o7k14kJ32K4M1J35K3r7j9P2L8n7j11
3040B220k2J27J14j5m7oJ9J2q1j42K5J69%j39rM9J1J49J75j05j73M5J0j25L0P7j48r6J65J00
3036B389m8K8m7k33p9J68J21O1P7p4j38Q6J43n6p8Oo2n1P4K7n2J2k7j18K4J32j6n4Q4K6j07
3032B218n4k6p7K7J26M0K9J16Pj65j31l8jM9K2n8J9J12K9MP8k5j43j2O6n3l5P9J3k3P8Qj39
3027B140m3P8J8K2Q0k1q1N2R5j7r7j26n1J38J10j47j16J45R3r2J6J10oK4J51L7q7QL4q5j16
3022B266q2j8J24J13q7p8R8L1j01J3R8lk6l5j47j01Q3Q1N2J74J26q5q4j2j03p9Q7O6j3M2k3
3018B377j45kJ46L3j0O0o7j48M6J02m7pO4o5m8J17K0j12L9Q3j10j03L6NL5J62K6j53j0J08
$$ plain form
3050 2241 2287 2229 2246 2255 2193 2184 2195 2123 2079 2138 2212 2275 2282 2172 2126 2267 2326 2208 2207 2328 2309 2243 2273 2221 2096 2131 2224 2218 2274 2393 2375 2320 2349 2275
3045 2275 2142 2206 2314 2223 2122 2127 2099 2117 2258 2273 2171 2239 2349 2261 2216 2322 2255 2041 2039 2171 2195 2236 2371 2394 2297 2278 2350 2388 2331 2220
3040 2220 2198 2325 2439 2424 2377 2371 2390 2402 2321 2179 2204 2373 2373 2234 2225 2274 2285 2434 2609 2504 2331 2376 2386 2261 2291 2368 2220 2124 2289 2389
3036 2389 2341 2369 2322 2089 2010 2178 2299 2360 2437 2363 2225 2311 2454 2398 2320 2326 2264 2213 2287 2314 2262 2274 2247 2129 2153 2285 2269 2215 2299 2325 2218
3032 2218 2164 2138 2061 2088 2214 2254 2283 2399 2406 2241 2110 2072 2071 2120 2142 2084 2103 2215 2244 2248 2326 2301 2158 2146 2212 2159 2124 2203 2216 2193 2271 2279 2140
3027 2140 2097 2175 2193 2215 2295 2274 2193 2245 2340 2323 2226 2100 2049 2187 2297 2150 2034 2179 2272 2180 2196 2306 2300 2324 2475 2512 2425 2433 2467 2382 2266
3022 2266 2184 2166 2290 2403 2316 2238 2336 2367 2266 2279 2377 2374 2348 2313 2166 2065 2148 2229 2281 2455 2581 2496 2412 2400 2297 2218 2305 2371 2358 2400 2377
3018 2377 2232 2230 2376 2409 2399 2459 2392 2244 2290 2392 2345 2338 2402 2337 2289 2406 2426 2314 2353 2436 2326 2223 2259 2264 2299 2461 2487 2334 2324 2432
3013B432l4r2j2LO2J25m0j82m8M0l9k8op3L2J92N4r6L8J22K2mm8j41N1K92P3k02k3J32o9j51
3008B382J4M9l4l5k3k3k8q9o3R6P3r1J3J84L6j02L5N8r0n5L4l9l4Q5O1k0k7n9k2J08Pj86j5
3004B200K01Lj72kP2l4J2O4j4M9J23q5k27r4o9j24P8K48J01k7Jj9J8J21L4q1J7J8j53p3J44
2999B330Q4o0n5j06j29M3R8l6J8J39J4p1K2m8j62mJ32N3M8O0j03j22Q3R6l6J0O1NM0L6j12
2995B328n8J19j6j85pJ01m7rJ43M3n3K4m1j36L9J50k7j13l6j8L6J16rj13K0M7r0j0J52O8l5
2990B383l5j18j02J15J14r5k4J64N1j23r4j0J16K25L2k18p1J21j9j01L0No6N4P4n2J8Q4j21
2986B337k04oN8j4M2O8lL6N7o9o1Q7P1NM1k3j03M1J09p3q3J28J18n8p2k1j0M5L7n5l5J6k2
2981B384K8J00m7j53mM1p7k3N6l9K3J85J9j78JJ17p0j18k6o9PK08R7j29l3P8k5j5L0j26j35
$$ plain form
3013 2432 2398 2306 2294 2297 2359 2484 2444 2262 2214 2254 2215 2187 2181 2108 2140 2332 2386 2290 2328 2450 2472 2468 2420 2279 2330 2622 2695 2493 2470 2602 2533 2382
3008 2382 2396 2445 2411 2376 2353 2330 2302 2213 2150 2246 2319 2228 2241 2425 2461 2359 2394 2452 2362 2307 2341 2302 2268 2353 2414 2394 2367 2308 2286 2394 2401 2215 2200
3004 2200 2401 2404 2232 2230 2302 2268 2280 2344 2330 2379 2502 2417 2190 2096 2027 1903 1981 2229 2330 2303 2304 2285 2303 2424 2458 2377 2394 2412 2259 2186 2330
2999 2330 2414 2354 2299 2193 2064 2107 2205 2169 2187 2326 2340 2269 2291 2243 2081 2077 2209 2262 2310 2370 2267 2145 2228 2324 2288 2298 2359 2364 2404 2440 2328
2995 2328 2270 2389 2373 2188 2181 2282 2235 2226 2369 2412 2359 2383 2342 2206 2245 2395 2368 2255 2219 2201 2237 2353 2344 2231 2251 2298 2208 2198 2350 2418 2383
2990 2383 2348 2230 2128 2243 2357 2262 2238 2402 2453 2330 2236 2226 2342 2567 2599 2381 2310 2431 2412 2311 2341 2346 2280 2334 2408 2356 2374 2458 2337
2986 2337 2133 2127 2185 2171 2213 2281 2278 2314 2371 2302 2241 2328 2399 2404 2445 2422 2319 2360 2469 2396 2313 2441 2559 2501 2429 2408 2398 2443 2480 2425 2390 2406 2384
2981 2384 2412 2512 2465 2312 2308 2349 2272 2249 2305 2266 2289 2474 2493 2315 2316 2433 2363 2245 2219 2150 2157 2365 2462 2333 2300 2378 2353 2338 2368 2242 2107
2976B107R1Q4o3L3Q5r5j19mm1k1J36R1n3J8R0J7J4nj21n9P8k8p6J04N3j73o2J37L9j7P4j2
2972B302n7J13M7j74j6J91qj36N1Q5j7K4l0j66l1J32J4l1Q9M4l2K6l7r0Q4N8k17j15J74J3
2967B290j89%P0m3J14J73j49j68J97J68j52j52j2J3Q7O2j34j16N4L4O3J89Mj97L5J51j06q1
2963B205J72O7n1J06j1k76o6J77k6j13O8Pq1J01R8r4j5P8n5nJ12n9n4K32J08j79P3K95nj04
2959B705J19j8k30l6M8j08K0J81rq4M7n7j30P4N5j56n0N0j59j46J23J18J5R2K8r4L8M0j71
2954B305k0K57N8j55QM2p5M7O0j66j00R2n3r5J18J1j60R4J70j50r4J88J2j57K8l2j71J53K63
2950B478j79k01K26J42j59kR6j17o5J15ro7Q5N3j9Q0lj82o2O4k5L5J38l8r1J19O8j26%R4o3
2946B385j6J48K2j07l8q6j10Q1P8j04K0J59k7m3J60L6j51K8R7j02q9Lo5N1J88o3j67J44J08
$$ plain form
2976 2107 2198 2282 2219 2252 2337 2242 2123 2119 2078 2057 2193 2284 2231 2249 2339 2356 2370 2365 2244 2185 2263 2235 2159 2263 2316 2143 2081 2218 2257 2240 2314 2302
2972 2302 2245 2358 2405 2231 2215 2406 2398 2262 2313 2398 2381 2405 2375 2209 2178 2310 2324 2293 2382 2426 2394 2420 2383 2293 2377 2435 2218 2103 2277 2290
2967 2290 2101 2101 2171 2128 2242 2415 2266 2098 2295 2463 2311 2159 2147 2160 2247 2309 2175 2059 2113 2147 2210 2399 2403 2206 2241 2392 2286 2205
2963 2205 2377 2444 2393 2499 2488 2212 2146 2323 2297 2184 2252 2259 2178 2279 2377 2283 2268 2346 2291 2286 2398 2339 2285 2517 2625 2446 2519 2814 2809 2705
2959 2705 2824 2806 2576 2540 2588 2480 2500 2681 2672 2588 2635 2578 2448 2522 2577 2421 2371 2421 2262 2116 2239 2357 2372 2464 2492 2398 2436 2476 2305
2954 2305 2285 2542 2600 2445 2453 2495 2420 2467 2527 2361 2261 2353 2300 2205 2323 2334 2174 2268 2438 2288 2194 2382 2394 2237 2265 2233 2062 2215 2478
2950 2478 2299 2098 2324 2466 2307 2305 2401 2284 2219 2334 2325 2258 2343 2396 2377 2457 2454 2272 2210 2274 2249 2284 2422 2384 2293 2412 2480 2354 2354 2448 2385
2946 2385 2369 2517 2539 2432 2394 2308 2198 2279 2357 2253 2273 2432 2405 2362 2522 2558 2407 2435 2532 2430 2341 2344 2279 2330 2518 2455 2288 2432 2540
2941B540k26q6J38o5n8K32R7j28P4Q7k02j02R5q4l5K87J05k41n7J23k8JM3k16j76J97J45j08
2937B352kM3j18JJ07j18n5K74R3k53q7Q9o7o1O1mM3J33p6j35J90J94j37j29J8m5J2O4j93j71
2933B023K51K33r3J7J18j60j27J63K4j13J42J24j71p5Q0p6l8J25n3j17J34O2j39M8Q2j80j4
2929B270K26j03k32J63J30j95NJ49j69j18J86l9j97J62J83j14M9J98j02j03J52l7j87R1Q9
2925B457j06J30K31j45j72Q6n8j21J99J38j53K9J50j40r6J55m8j74P6j8k24J20L33jr2P2o7
2921B561r2J26n6k55P5J75j34LK30j15k41R5j1k07K07L27j68j54K04qj69J35N1k33M2J73k18
2917B343j76J95M1j19J46J13j09J03J88j40j24R8o8j12J56O6j26P9R5j50OJ41j49q6K49j2
2914B648k42J70K13k27n0K88m7j65K18O7k96j7J49j80j14J64l7j10J74O3j57O0O8k01pJ95
$$ plain form
2941 2540 2314 2228 2366 2301 2243 2475 2572 2444 2518 2605 2403 2301 2396 2312 2277 2564 2669 2428 2371 2494 2466 2467 2510 2294 2118 2315 2460 2352
2937 2352 2350 2393 2275 2276 2383 2265 2210 2484 2577 2324 2237 2326 2259 2198 2259 2255 2298 2431 2355 2220 2410 2604 2467 2338 2356 2311 2323 2387 2194 2023
2933 2023 2274 2507 2414 2431 2549 2389 2262 2425 2449 2336 2478 2602 2431 2356 2436 2360 2322 2447 2394 2277 2411 2473 2334 2382 2464 2284 2270
2929 2270 2496 2393 2161 2324 2454 2259 2264 2413 2244 2126 2312 2273 2076 2238 2421 2307 2356 2554 2452 2349 2501 2464 2277 2368 2457
2925 2457 2351 2481 2712 2567 2395 2481 2423 2302 2501 2639 2486 2515 2665 2525 2429 2584 2536 2362 2438 2420 2196 2316 2649 2648 2556 2628 2561
2921 2561 2469 2595 2539 2284 2359 2534 2400 2403 2633 2518 2277 2372 2361 2154 2361 2688 2520 2366 2570 2562 2393 2528 2579 2346 2388 2561 2343
2917 2343 2167 2362 2403 2284 2430 2543 2434 2537 2725 2585 2461 2559 2491 2379 2535 2601 2475 2554 2649 2499 2505 2646 2497 2411 2660 2648
2914 2648 2406 2576 2789 2562 2512 2800 2753 2588 2806 2873 2577 2560 2709 2529 2415 2579 2542 2432 2606 2669 2512 2572 2640 2439 2432 2627
2910B627j28j68J64K9j76Q5R2j68O0K39j13j32J70l9j96J96K28j04L7J13k57j29K92K2k09
2906B535J67P2m03j10L07K0p6J87k1j85J75J21k77m3K38n8q9J83Nj19J22m2k58J52K37k59
2902B581j21K78j00k65K85K18k88k5K34j64j26K23j11k96K15K38j63K7J33k57r5L29K5j79
2899B596J71M1k48J35K18k57n1L23j51k90L04J57l33R4L46k16k08K34l6j95K27P8l01L6J08
2895B782l33nM51q1k94L21K18l09J6K59j34l4K15j79j25M25L3m97N4L03k51j14K77j58k38
2891B602L24R4l16J42J78l85j6M83q5k60L17P0l37K01K54l62KM90j36l13K94J1m08J88K40
2888C272m16j4M90j85k91M32K2o05Q1L58l34r7M85Qj52L50l9m37K54K98m44p2M77j10j75M29
2884C585q2n79K16L74l24N2M90k62l28L95j6m22L61L15n22l8N07k38k09N80J3n06L52K95o41
$$ plain form
2910 2627 2499 2331 2495 2524 2348 2433 2525 2357 2417 2656 2543 2411 2581 2542 2346 2542 2770 2666 2703 2816 2559 2430 2722 2744 2535
2906 2535 2702 2774 2371 2261 2568 2588 2512 2699 2678 2493 2668 2789 2512 2469 2707 2649 2560 2743 2748 2629 2751 2709 2451 2603 2840 2581
2902 2581 2460 2738 2638 2373 2658 2876 2588 2563 2797 2633 2507 2730 2619 2323 2538 2776 2613 2640 2773 2516 2421 2750 2775 2596
2899 2596 2767 2808 2560 2695 2913 2656 2605 2928 2777 2487 2791 2948 2615 2709 3055 2839 2631 2865 2829 2634 2861 2939 2638 2674 2782
2895 2782 2449 2444 2895 2814 2520 2841 3059 2750 2766 3025 2891 2857 3072 2893 2768 3193 3226 2729 2783 3086 2835 2721 2998 2840 2602
2891 2602 2926 3020 2704 2846 3024 2639 2623 3106 3021 2761 3078 3148 2811 3012 3266 2904 2906 3396 3260 2947 3241 3252 2844 3032 3272
2888 3272 2856 2842 3332 3147 2856 3288 3310 2705 2786 3144 2810 2713 3198 3206 3054 3404 3365 2928 3182 3480 3036 2964 3441 3331 3156 3585
2884 3585 3503 2924 3140 3514 3190 3242 3732 3470 3142 3537 3521 3099 3460 3775 3253 3215 3722 3484 3275 3855 3868 3362 3714 4009 3368
2880C368o3O00k68l73N00L9n06L35L52n15L1O04k77l18N39rn43L74M12m24J39O05l65l66M91
2877D362m8m05N40K84o50J64O97l84k85O23j73o36M96L47n38L45O69o57k96R46jo22O27L42
2873E747q32K25R16m27k70R02k4n78P10L99o67M91R16o36j91J119j10o25R70M22r73M60J082
2870I026o98k00J352Kn63J241N60j040O18J307p15m4J745J01n44J611Q27j043Q89J674o70
2867A5436J61K246L00m21K111J193q59J520K278o48M15K931O17m4L109J921l79K814L709K06
2864C8616J858M739J398J095N846M193J182O016P695L681P405J2708R405J2011K3233K5773
2861A66854K8519M5652N7800N9885P4161Q9612Q9555J03141J35603J52670J77976K47488L15446
2859A744362L74440M78432M94667J86492l17394n85686n01560l45540k81315k28751j61993
$$ plain form
2880 3368 3305 3905 3637 3264 3764 3803 3297 3632 3984 3469 3500 4104 3827 3509 4048 4039 3496 3870 4282 3858 3997 4602 4237 3871 4362
2877 4362 4314 3909 4449 4733 4083 4247 4944 4560 4275 4898 4725 4089 4585 4932 4394 4739 5408 4751 4455 5401 5400 4778 5405 5747
2873 5747 4915 5140 6056 5629 5359 6261 6237 5659 6369 6768 6101 6592 7508 6872 6681 7800 7690 7065 8035 8457 7484 7944 9026
2870 9026 8328 8128 9480 9482 8919 10160 10720 9680 10298 11605 10890 10846 12591 12692 12148 13759 14586 13543 14432 16106 15436
2867 15436 15597 17843 18143 17722 19833 21026 20167 21687 23965 23317 23732 26663 27280 27236 30345 32266 31887 34701 38410 38616
2864 38616 40474 45213 46611 47706 53552 57745 58927 64943 72638 76319 83724 96432 105837 117848 141081 166854
2861 166854 195373 241025 298825 358710 432871 522483 612038 715179 850782 1003452 1181428 1428916 1744362
2859 1744362 2118802 2597234 3091901 3278393 2960999 2375313 1873753 1528213 1246898 1018147 856154
2858H56154j34846j24261r6231p9792p7226n9207m0940m0102l4214k0785k0157k1759j2863
2856I3771r465j2977q423m096q646q331k413l769n803j077m86m359k011P76k447k540R13q63
2853A7754k847K25M37k383p05J029j540j521R52n31j770P07N07j767j15J259j042j045R66
2850H570l50j362P04N04j334L6R83r52o61J113k45j230N97M67j050J87R08r33p26Q85j93r77
2847D941O03M33r23J31P69p42n24P68k29q39N18K82q27J65O07p27l10R14q8o93M48J03q61
2844C919K00O27o58l43O76k56o16O00K18p87J82N78o47l19P43j02n73M92K63o10J55M68n47
2840C663k26O32j51n01M40J68n69J60L62n75k08N80j41m07M20Q7n38K01L22n32o5O09k58m80
2837B993M93K23m88J52L59l76l1M58l71n07M13J47m52K03L20m58r8M85j87l00M80J19m96J40
$$ plain form
2858 856154 721308 597047 500816 421024 343798 284591 243651 203549 169335 148550 128393 106634 93771
2856 93771 84306 71329 62906 58810 50164 41833 39420 35651 29848 28771 28285 23926 21915 22691 20244 17704 18617 17754
2853 17754 14907 15132 15569 13186 12481 13510 11970 10449 11401 10870 9100 9807 10314 8547 8432 9691 8649 7604 8570
2850 8570 8220 6858 7562 8066 6732 6768 7751 6799 6138 7251 7006 5776 6373 6840 5790 5977 6885 5952 5226 6111 5918 4941
2847 4941 5544 5977 5054 5185 5954 5212 4688 5456 5227 4388 4906 5188 4361 4526 5133 4406 4096 5010 4922 4229 4677 4780 3919
2844 3919 4119 4746 4088 3745 4421 4165 3549 4149 4367 3580 3762 4340 3693 3374 4117 4015 3442 3934 4197 3587 3742 4210 3663
2840 3663 3437 4069 3918 3417 3857 4025 3456 3616 3978 3403 3195 3775 3634 3227 3647 3734 3196 3397 3719 3187 3122 3731 3473 2993
2837 2993 3486 3709 3221 3373 3732 3356 3325 3783 3412 2905 3318 3465 3013 3216 3536 3078 2980 3465 3278 2978 3458 3577 3081 3221
2833C221L06m35j91L46j23j42M43km52K62L67l78j58K51k64k02M49L5m27J65J74m42KM98j29
2830C174k71K84k2l88J44J57l52M9M23j03j12L16j00k95L60K13m62p4K81k51j26M17j00m42
2826B720K61K61l87o7K75k35j30M14n0m25J50J41l33J33M51j86j80L62o7m48J60K70k32j6
2823B842J87k58j10L55q8l56K33J73l71kL56j33j89J67j50k57L31K40k66P4K99k31j81K59
2819B924j14l43K20K45j78Q5K15k82j35L82M8k68J12M6l37j9K03j91j25K07q2j67K63R6k70
2816B535J08K44k34j03K79q9k36K64J79k20O0J73k37o9K74j37k71K50J25l31MK47j72j19K75
2812B799N1j17J93O8k18J03K00k23j17K28n6k15R2Mj45K48K21l57k37K37K3j71J11L1j79J28
2808B702J73k49j43K26P6J4K26n9l53M0K28j18q7J26j19j86J12K0j45J18J04k32n0K34j7j07
$$ plain form
2833 3221 3527 3092 2901 3247 3124 2982 3425 3423 2971 3233 3600 3222 3064 3315 3051 2849 3298 3333 2906 3071 3245 2803 2805 3303 3174
2830 3174 2903 3187 3165 2777 2921 3078 2726 2775 3198 3095 2983 3299 3199 2904 3264 3477 3015 2941 3222 2971 2845 3262 3162 2720
2826 2720 2981 3242 2855 2788 3063 2828 2698 3112 3062 2637 2787 2928 2595 2728 3179 2993 2813 3175 3108 2660 2820 3090 2858 2842
2823 2842 3029 2771 2661 3016 2928 2572 2805 2978 2607 2605 2961 2828 2639 2806 2656 2399 2730 2970 2704 2778 3077 2846 2665 2924
2819 2924 2810 2467 2687 2932 2754 2839 3054 2772 2637 3019 3067 2799 2911 2957 2620 2601 2804 2613 2488 2695 2613 2446 2709 2805 2535
2816 2535 2643 2887 2653 2550 2829 2740 2504 2768 2947 2727 2787 2960 2723 2654 2928 2791 2520 2770 2895 2564 2568 2815 2643 2524 2799
2812 2799 2850 2733 2926 2994 2776 2879 3079 2856 2739 2967 2911 2696 2788 2792 2647 2895 3116 2759 2522 2759 2782 2611 2722 2753 2574 2702
2808 2702 2875 2626 2483 2709 2785 2799 3025 2966 2613 2653 2881 2763 2676 2802 2683 2497 2609 2629 2484 2602 2706 2474 2424 2658 2641 2534
2804B534J34j7j98R4J67r4j6J01r3nK14o1k21J08J02j55M9J57j56n8K16j23k85K21K94j37
2800B772o9J27r1m7J77j08k60J51J54k38r2J55m2PK52j7k18R7R3k04rJ63j55j60J59L6j01
2796B532J60J05j91%J88n3m0J42j42k89J10J81j60j39J6q0KJ39m0j9K53N2k51MJ45j36o5J65
2792B589n7j26J77M8k31M4K10q4k3K25k1j63J21M8k03L9J53j72q3K55L5j68J58K06j55j65
2789B657Om5K0J45j2r6Qj08j51J56J71j47p8J11p3p2K28J42j00J6J3j98l2K00M7J7J32j30
2784B827k79P2J27j71j5K15p9k07P4M2j21M8M4j52O6K16j49j88K13J20j98j2Q9j84q3K30O4
2780B609j17Q7J26n6m1k9j16j7N1o4N4K27j7j88P2J41n9j2L9j28n7J05o9j01J84J27j02N2
2776B701Q0k30j51J12q7j54J95J12k25L1K80n3j42J48L9j49P5J11j05PQ0j59j2L28N2k53J5
$$ plain form
2804 2534 2668 2651 2453 2547 2714 2620 2604 2705 2612 2607 2821 2760 2539 2647 2749 2594 2643 2800 2644 2586 2802 2679 2394 2615 2909 2772
2800 2772 2703 2830 2739 2692 2869 2761 2501 2652 2806 2568 2476 2631 2589 2596 2848 2831 2613 2710 2803 2599 2590 2753 2598 2438 2597 2633 2532
2796 2532 2692 2797 2606 2606 2794 2741 2701 2843 2701 2412 2522 2703 2543 2404 2420 2340 2342 2481 2441 2422 2675 2727 2476 2480 2625 2489 2424 2589
2792 2589 2532 2406 2583 2631 2400 2444 2654 2570 2547 2772 2751 2588 2709 2757 2554 2593 2746 2574 2491 2746 2781 2613 2771 2977 2822 2657
2789 2657 2663 2618 2638 2783 2771 2675 2683 2575 2424 2580 2751 2604 2526 2637 2564 2492 2720 2862 2762 2778 2791 2593 2561 2761 2808 2825 2957 2827
2784 2827 2548 2620 2747 2576 2561 2776 2697 2490 2564 2606 2485 2533 2577 2425 2491 2707 2558 2370 2583 2703 2505 2493 2582 2398 2315 2545 2609
2780 2609 2492 2579 2705 2649 2608 2579 2463 2446 2497 2433 2487 2714 2697 2509 2581 2722 2663 2651 2690 2562 2505 2610 2541 2440 2624 2751 2649 2701
2776 2701 2781 2551 2400 2512 2425 2271 2466 2578 2353 2384 2664 2611 2469 2617 2656 2507 2582 2693 2588 2595 2675 2516 2504 2832 2884 2631 2646
2772B646N7k64j09K07M1k1K10M3k48n8Q2j16p9J03j5r0M4L8O2K28O0k70j37J24N5RM6j01p1
2768B476K10J12k07j02P4n4k4J20n6j45J06Q8j38KJ41q3j12J03K7q6R6J22p4n4J6q5l1J15
2764B557K8l5N3j2n9R9K2k07k8J76p5j52J73J49j39m6R4o5p0Q7J1l6O2p9k12M9J83n6j04J5
2760B383j01j48J7k5q9J63K55Mm6O0m0l4J40M1j11N7J26l3L4J25r3j53N9L4n4J20P4k30j29
2755B406J69N5q7Q4J04q2r7n0l1J29J39j33j40J26P7q5O0J10j29j60K5P3Q6R2o9j10Q3O8r6
2751B617pM3j56j30J03P3k0M3n4j52R7J86j20j43J17K3j39N1J16p3l9M0r9m2J61K0j05J50
2747B561J96j05j13Q5oj20k4J4N1J78N5k05j30K7p9r2Q3O4l3K8J3p1L0P8o6n6P2pq3J1K0J4
2742B390J45Q5j41o2J24K8j6R9m1j78Q7K05p8j00J50O2j56p3M2M0R5L1j65j33j9r2j6K28J34
$$ plain form
2772 2646 2703 2439 2330 2537 2578 2557 2767 2810 2562 2504 2586 2470 2391 2494 2479 2389 2433 2471 2533 2761 2821 2551 2414 2538 2593 2602 2648 2547 2476
2768 2476 2686 2798 2591 2489 2563 2509 2485 2605 2549 2404 2510 2598 2460 2462 2603 2520 2408 2511 2538 2452 2548 2670 2596 2542 2558 2473 2442 2557
2764 2557 2585 2550 2603 2591 2532 2631 2653 2446 2418 2594 2519 2367 2540 2689 2550 2504 2598 2533 2463 2550 2561 2525 2587 2508 2296 2345 2528 2472 2368 2383
2760 2383 2282 2134 2151 2126 2037 2200 2455 2459 2413 2473 2433 2399 2539 2580 2469 2526 2652 2619 2653 2778 2685 2532 2591 2625 2571 2691 2765 2535 2406
2755 2406 2575 2630 2543 2627 2731 2649 2552 2502 2471 2600 2739 2606 2466 2592 2669 2584 2644 2754 2625 2465 2490 2563 2649 2741 2672 2562 2645 2713 2617
2751 2617 2610 2653 2497 2367 2470 2543 2523 2566 2512 2360 2457 2643 2523 2380 2497 2520 2381 2432 2548 2475 2436 2476 2377 2335 2496 2516 2411 2561
2747 2561 2757 2652 2539 2624 2618 2498 2474 2488 2539 2717 2772 2567 2437 2464 2385 2293 2376 2440 2407 2435 2448 2377 2407 2485 2419 2363 2435 2428 2345 2356 2376 2390
2742 2390 2535 2620 2479 2417 2541 2569 2553 2652 2611 2433 2520 2725 2647 2547 2697 2759 2603 2530 2572 2612 2707 2738 2573 2440 2421 2329 2313 2541 2675
2738B675j06pP7j10j20N4L6J0J00rj56j6R3J3P1J16j00j64M1M5m5R0J04j07q1N5n3n4J66J00
2734B718j60j30LJ5Q5P2j43j31J13P6o9N9J15m6k8L8r8m9J94Q9j71q7K7o1J5J68O6l4K2m9
2729B619j20K3N1p1j5Oj72q5J98Q4j72n3Q4nL7J11l8n0J19J6j64l2O3m2K5J12o1q9J27Q1j15
2725B472m4K8o7KJ03m5q6J03N8j36m6J10O2J5k9j52n9J86J30o4kP9k4n1j7r7q7L6K9J9J33
2720B559Q6n9M0J40p5k35j09j1k1J3Ok8M2N0m5K0J50P4k1j2j13j83%J18L0P2J42n6j87oP7
2716B458n9p4K8Q0J31O9j23j01O8l2j75OJ52M5L6P2q6j08R2M8j39j7J45K3n9L3O8P2L9j50
2711B542j99N1J31l9j7N9r0r7Q8kj39Q0J46j59j65J36J05n9Q0J64kn7j7p1j5J10K3n4Q1Q5
2707B699r5j30q7j09NJ66P0p7j8L7lmm9j10K5J56L5m1O1K2r3J0J03j1p5m2q7p8K6J6%J15P7
$$ plain form
2738 2675 2569 2562 2639 2529 2409 2463 2499 2509 2609 2600 2444 2428 2521 2534 2605 2721 2621 2457 2498 2543 2498 2588 2692 2585 2504 2559 2506 2452 2618 2718
2734 2718 2558 2428 2431 2446 2531 2603 2460 2329 2442 2518 2449 2508 2623 2577 2549 2587 2489 2440 2634 2723 2552 2465 2492 2431 2446 2614 2680 2646 2668 2619
2729 2619 2499 2522 2573 2502 2487 2493 2321 2236 2434 2518 2346 2293 2377 2372 2409 2520 2482 2432 2551 2567 2403 2371 2434 2392 2417 2529 2468 2379 2506 2587 2472
2725 2472 2428 2456 2389 2391 2494 2449 2363 2466 2524 2388 2342 2452 2514 2529 2500 2348 2289 2475 2605 2541 2539 2618 2594 2543 2526 2429 2342 2378 2407 2426 2559
2720 2559 2645 2586 2626 2766 2691 2456 2347 2336 2315 2328 2334 2306 2348 2398 2353 2373 2523 2597 2576 2564 2451 2268 2268 2386 2416 2488 2630 2574 2387 2381 2458
2716 2458 2399 2325 2353 2433 2564 2633 2510 2409 2477 2445 2270 2276 2428 2473 2509 2581 2495 2387 2479 2527 2388 2371 2516 2539 2480 2513 2581 2653 2692 2542
2711 2542 2343 2394 2525 2486 2469 2528 2438 2341 2429 2427 2288 2368 2514 2355 2190 2326 2431 2372 2452 2616 2614 2557 2540 2469 2454 2564 2587 2533 2614 2699
2707 2699 2604 2474 2387 2278 2283 2449 2519 2442 2424 2461 2458 2454 2405 2295 2320 2476 2511 2470 2531 2553 2460 2470 2573 2562 2487 2445 2358 2280 2306 2322 2322 2437 2514
2702B514j13n6J26O3k5O6L9j20j08j7j8K3O5k8n1Q2P0q9q2M8O5J0l5n5kO9M1j8rJ8N4M1j01
2697B467j52P6K10qj57l1J1p3k8M3J0J8L8LP0J38l2j50J3O7q1j9J50O4m8np6j55PR6l9k6Q7
2692B488l2j12Q1J51ll2Np4o2O7N7l7p0j06p9M9L6o2P2K06Pj58pJ04J5m6n7m4N7O7q8p3J09
2687B429Q9k7J8Mj17l4J29P4lL9np3%L4lM3Lj78j38O7O0QJ28J04p9n4J5j14j05R9J09J7O4
2683B603Oj32l3P4n0m5J02j4j47L2R7p5k6R6n1o8J71J08j61j01L0r3q6Q5J9r7L7J17L5N2M4
2678B529j38j87m4mqQ2Q0qJ5L2l6J1R2%o9pl6n8J27K17Rj29m7j9p4o1j1M7R7j5k06j66M3J29
2673B187Q5L1pK9J01N1o0p0k8L5J52J38o5j18M3Q2j6m1m8m7O5R2p2j10Kk5n6P4N7r7NJ83O2
2668B614p9j7j1n0Rm5j57J3J59n3j36J16J36p1pJ16j3l9R8K5r3LJ1j07J0J67L6p1K8J7p6o
$$ plain form
2702 2514 2401 2345 2471 2534 2509 2575 2614 2494 2386 2369 2351 2374 2439 2411 2360 2442 2512 2423 2341 2389 2454 2464 2429 2374 2372 2441 2482 2464 2455 2473 2527 2568 2467
2697 2467 2315 2391 2601 2593 2436 2405 2416 2343 2315 2358 2368 2386 2424 2427 2497 2635 2603 2453 2466 2533 2452 2433 2583 2647 2599 2594 2518 2363 2370 2466 2427 2401 2488
2692 2488 2456 2344 2425 2576 2573 2541 2546 2472 2410 2477 2534 2497 2427 2321 2242 2291 2327 2265 2337 2543 2550 2392 2385 2489 2504 2458 2401 2357 2414 2481 2393 2320 2429
2687 2429 2518 2491 2509 2513 2396 2362 2491 2565 2562 2601 2596 2523 2523 2557 2554 2597 2600 2422 2284 2351 2411 2419 2547 2651 2572 2518 2533 2419 2314 2413 2522 2539 2603
2683 2603 2609 2477 2444 2518 2468 2423 2525 2511 2364 2396 2493 2418 2392 2488 2437 2369 2540 2648 2487 2386 2416 2323 2237 2322 2341 2244 2281 2398 2433 2485 2529
2678 2529 2391 2204 2160 2156 2148 2230 2310 2302 2317 2349 2313 2324 2416 2416 2347 2340 2304 2246 2373 2590 2599 2470 2423 2404 2330 2269 2258 2305 2402 2387 2181 2015 2058 2187
2673 2187 2272 2303 2296 2325 2426 2477 2417 2347 2319 2354 2506 2644 2579 2461 2504 2586 2570 2529 2481 2434 2499 2591 2519 2409 2411 2386 2330 2404 2461 2364 2369 2552 2614
2668 2614 2535 2518 2507 2457 2466 2421 2264 2277 2436 2383 2247 2363 2499 2428 2421 2537 2524 2485 2583 2608 2515 2518 2529 2422 2432 2599 2635 2564 2592 2609 2533 2527
2664B527M1p0q3K9L5l8m6J2R7R3l8p6Nl9j00M6J09p7j04O0K3o0O3M1j73r3J59J10l0Nj7n9
2659B352P1Q6q0l4J00n0j47O3J26m9m7L4o9q7O2O1k5Qk3j44p2J01J01K4j3p2p5QJ1j8O6J23
2654B392Q3P9M8p8r1K9L0m4m1o4r4KN2k1M1J57M0q0%k6j39J5J91M1p7M6M5p3k4Lj21q0Q2M9
2649B372k5N7Q3J7K9j3j40r0M3l8j34QJ57J12Oo1n3L1M8j9K1R1Ko1M0N9k6J3O0l1m5K7k0o5
2644B455K4J3j17j04j8k4J9R5L6j0O2K9p7l4pj06n2J30J20L2N9J8r0l4K4p4o3O5M1kJ06Q4
2639B600r8q8L7nm6M2M8j1M0P3%k8k4n7%R8L3o6j2N3K5%l3q1l3L3kpL4k9p0M7Q4k5l2Ro0k7
2634B422J30O9j23q1K5m8n6Q5J01qm1m0l6L7R4N9J3n0j15k7R8J2q2K6N1j18j39RL7LN1M1k8
2629B371kK2k5LN0m1j00J2Q6K4k6j0L0P0L7k6ML1n3p1J3j8q9J7J39R8L3k4j15n9J02O3p2l4
$$ plain form
2664 2527 2568 2498 2415 2444 2479 2441 2395 2407 2504 2597 2559 2483 2488 2449 2349 2395 2504 2427 2323 2383 2406 2346 2409 2450 2277 2184 2343 2453 2423 2428 2411 2352
2659 2352 2423 2509 2429 2395 2495 2445 2298 2361 2487 2438 2391 2425 2356 2269 2331 2392 2367 2375 2352 2208 2136 2237 2338 2362 2349 2277 2202 2210 2221 2203 2269 2392
2654 2392 2475 2554 2602 2524 2433 2462 2492 2448 2407 2343 2249 2251 2303 2282 2323 2480 2520 2440 2440 2414 2275 2290 2481 2522 2445 2491 2536 2463 2439 2442 2321 2241 2323 2372
2649 2372 2347 2404 2487 2504 2533 2520 2380 2290 2333 2295 2161 2169 2326 2438 2444 2383 2330 2361 2409 2390 2411 2502 2504 2443 2483 2542 2516 2529 2589 2558 2513 2540 2520 2455
2644 2455 2479 2492 2375 2271 2253 2229 2248 2343 2379 2369 2431 2460 2383 2349 2342 2236 2184 2314 2434 2466 2525 2543 2453 2419 2443 2369 2306 2371 2412 2410 2516 2600
2639 2600 2502 2414 2451 2446 2400 2442 2490 2479 2519 2592 2592 2564 2540 2483 2483 2581 2614 2548 2536 2589 2614 2614 2581 2500 2467 2500 2498 2491 2525 2496 2426 2473 2557 2532 2500 2509 2449 2422
2634 2422 2552 2621 2498 2417 2442 2394 2338 2423 2524 2516 2475 2435 2399 2436 2530 2589 2602 2552 2437 2410 2508 2520 2438 2464 2515 2397 2258 2267 2304 2307 2358 2399 2371
2629 2371 2369 2391 2366 2369 2419 2378 2278 2290 2376 2400 2374 2364 2394 2464 2501 2475 2479 2510 2457 2386 2399 2381 2292 2309 2448 2546 2579 2555 2440 2381 2483 2546 2474 2440
2624B440Kn9L2J49oj51j6O2n3o5L3O5Q7M4j14r7J01M7j48n2Q5m1o0J19O0j23j3J33K2m9L2
2620B466J3n0KL2kJ5Mo7m0K2k8p7k7K9P4R2Ko5K8P2l7n4K9Qk7J9l1j22k6J00K0r5n0O8J15
2614B412K2j27p8J02P9n2ML4j04m4J79J01r1J8J20j4k9O8n1j66l7J1q9l1P3L2M3J01j3r0L8
2610B421N4p4n2or7n0J22O0q0RJ00K3lJq7p0O2K2r8j9J04O3j8m3l2N5J07nj12q7o8m5Q9J37
2605B383j1p7K0O6L8Qp2j00K3Q2j6l2M2j2r6k8M8L8N2P4J6q0j40r1P1J35Pk1J44J44o1j46
2600B408j01p6J5J19L8n7K9N4o6p5K2L1K9N4ok9P1N1j04q8O3R2L3j4o9m6N7L3q7q5nM0R3N6
2595B480j10j15N9N5o8l0or6kJ55J1j41K4J16m1n7O0Lo4K3L8l2%lp8MJ27L6p1j4pp5j0J03
2590B274J18R3K9o5l9K7o6j37NR5k3j03n0PO7Q4k0o9M4Q0l5o4J0M3N1L9kL8J06Lj10j7M2p1
$$ plain form
2624 2440 2442 2383 2415 2564 2558 2407 2391 2453 2400 2335 2368 2433 2520 2564 2450 2353 2454 2501 2353 2301 2386 2345 2285 2404 2464 2341 2328 2461 2483 2434 2466
2620 2466 2479 2429 2431 2463 2461 2476 2480 2413 2373 2395 2367 2290 2263 2292 2366 2458 2460 2395 2423 2495 2458 2404 2433 2441 2414 2433 2402 2280 2254 2354 2374 2279 2229 2297 2412
2614 2412 2434 2307 2229 2331 2410 2358 2362 2396 2292 2248 2427 2528 2437 2455 2575 2561 2532 2600 2549 2383 2346 2357 2268 2237 2310 2342 2385 2486 2473 2383 2421
2610 2421 2475 2401 2349 2343 2246 2196 2318 2378 2298 2307 2407 2430 2427 2428 2341 2271 2333 2355 2257 2238 2342 2405 2387 2344 2312 2367 2474 2469 2357 2270 2202 2157 2246 2383
2605 2383 2372 2295 2315 2381 2419 2427 2355 2255 2278 2360 2344 2312 2354 2342 2246 2218 2266 2304 2356 2430 2446 2366 2226 2135 2206 2341 2348 2327 2471 2615 2554 2408
2600 2408 2307 2231 2246 2365 2403 2346 2375 2429 2363 2288 2310 2341 2370 2424 2418 2389 2460 2511 2407 2319 2382 2474 2507 2493 2424 2378 2435 2468 2381 2296 2291 2331 2424 2480
2595 2480 2370 2255 2314 2369 2301 2271 2265 2169 2167 2322 2333 2192 2216 2332 2291 2234 2294 2297 2233 2256 2294 2262 2262 2259 2181 2185 2312 2348 2277 2263 2256 2181 2171 2274
2590 2274 2392 2485 2514 2449 2410 2437 2371 2234 2239 2334 2311 2208 2158 2165 2232 2316 2296 2227 2271 2351 2316 2252 2262 2305 2356 2395 2393 2431 2537 2540 2430 2413 2455 2384
2585B384n9J09J16j3p6j19j08M9J33J9k3P1M6p0r9r1o6M1R5J6m8q7j49p0J15J16JK4O5LJ0
2581B335M1q4j61j8J03P2L6po1mO6j4n1P1J35P7J3o7j00J3N5r1j06P3P6n4jR5Qr5r3l9R0J68
2576B481Nj33JP8p9j19J4M3K3M9l7j18M2J71K6q5qK4mL0Lp7j4J01P2k3q3j02k7N8Jl6Q0R8
2571B455m9p5R%L1J56J01q9r4j1m8n8K2J5k8K2K5n4n2pl5k2Q8J21K0o0j5J04J32Oq7j4O8Q5
2566B662J43J50ko5R8J94P1o7j23j26o4l5r0o3J7o8j63j7J05np4j7m9q3K7O8j4NN1j6rJ04
2561B545P7m1n4n7r1J8J70J60J09J25J07P5R9J04J09J91J99P6K2jj70k83j70j10k10j97o7
2557B735l4n5k7l3m9j5j5k5M4N4o4r3JKn4j0N0K1l1o0k8P1O7o4l7J53J59J2N3J96J62L9J1
2552C136K5lp4j38r4j5r2j87n2R6Mq9j8Km7LL7j1L1R3lq0%L0k3j6n2j49o1J24N3j49j18N9
$$ plain form
2585 2384 2325 2434 2550 2537 2461 2342 2234 2283 2416 2435 2412 2483 2529 2459 2360 2269 2203 2244 2339 2355 2307 2220 2071 2001 2116 2232 2233 2257 2322 2325 2335
2581 2335 2376 2292 2131 2113 2216 2288 2324 2317 2256 2252 2318 2304 2253 2324 2459 2536 2549 2482 2382 2395 2450 2359 2253 2326 2402 2348 2347 2442 2450 2355 2262 2223 2313 2481
2576 2481 2486 2353 2354 2432 2353 2234 2248 2291 2314 2363 2326 2208 2250 2421 2447 2362 2354 2378 2374 2404 2407 2330 2316 2417 2489 2466 2383 2281 2254 2312 2313 2277 2357 2455
2571 2455 2406 2331 2340 2340 2371 2527 2628 2539 2445 2434 2386 2328 2350 2365 2337 2359 2384 2330 2278 2271 2236 2214 2302 2423 2443 2383 2368 2472 2604 2610 2523 2509 2577 2662
2566 2662 2805 2955 2953 2888 2986 3180 3251 3184 3061 2935 2871 2836 2746 2683 2700 2632 2469 2452 2557 2552 2478 2461 2412 2329 2356 2424 2410 2415 2466 2450 2441 2545
2561 2545 2622 2581 2527 2470 2379 2397 2567 2727 2836 2961 3068 3143 3242 3346 3455 3646 3845 3921 3943 3942 3772 3489 3319 3209 2999 2802 2735
2557 2735 2701 2646 2619 2586 2537 2522 2507 2482 2526 2580 2516 2423 2424 2426 2372 2362 2412 2433 2402 2342 2314 2385 2452 2388 2351 2504 2663 2675 2728 2924 3086 3125 3136
2552 3136 3161 3158 3084 2946 2852 2837 2745 2558 2506 2602 2606 2517 2499 2501 2454 2457 2494 2483 2514 2607 2604 2524 2524 2554 2531 2515 2463 2314 2253 2377 2430 2281 2163 2222
2547B222Q9k6j22j11j7M4M4Q3J05J3n6%L4ql1m9n5L4R1%k9N0J1n1P3J43Ko2j6r7j30M7Q8o7
2542B246l7J02L1m8P3J41O2%r3j92q1R0K8o7OJ3q5KJ91J55l4j06k2P0M5n1l8L6m2j50n7N5
2538B243%KJ24J22J0k2l7q5n2K1L0K6j3j15r2O4Q1k2oL6jM2J05pq9K7N1p3l9Q3M8J2R5P2p9
2532B562j33p8kO0%j17m7J29J33N7M0l7j10NQ4m5q5K5pj06l6K8l4k0O3O1N6M4j06j82MJ54
2528B360N8n6o5l0P3J10m1p7J18R0j93j66J30J32p5o0M8J6mM8J1n7l3Kk5o1m8M3J35P7n7o0
2523B343Jk0oR9R1k9m7Pl8j08p8j6RM6R8Q1j0n3LQj08j12R1J91M2o7j6qm5J2O8M0K4Rn5n0
2518B397J6k6j00k2O0qn6RM4Qj0kRJ1l2o9k1M6N9N3%r1n2R1P8n2m3L0jmP2M8m8m7%J4N9R9
2512B519N1k1q8j46n8J28J07q2j03qm4p3M4R8J9j6j8o5k7J04J12mm2J4J3o6r2rO1nj01m7P5
$$ plain form
2547 2222 2311 2285 2163 2052 2035 2079 2123 2206 2311 2324 2268 2268 2302 2294 2263 2214 2159 2193 2284 2284 2255 2305 2316 2265 2338 2481 2483 2421 2405 2308 2178 2225 2313 2246
2542 2246 2209 2311 2342 2294 2367 2508 2570 2570 2477 2285 2204 2294 2322 2255 2261 2274 2189 2191 2382 2537 2503 2397 2375 2445 2490 2439 2401 2437 2395 2245 2188 2243
2538 2243 2243 2245 2369 2491 2501 2479 2442 2357 2305 2326 2356 2382 2369 2254 2162 2226 2307 2285 2279 2315 2314 2356 2461 2454 2365 2392 2443 2370 2331 2414 2462 2474 2569 2641 2562
2532 2562 2429 2351 2349 2409 2409 2292 2245 2374 2507 2564 2604 2567 2457 2462 2546 2501 2416 2441 2434 2328 2292 2320 2286 2266 2329 2390 2446 2490 2384 2202 2206 2360
2528 2360 2418 2362 2297 2267 2340 2450 2409 2332 2450 2540 2347 2181 2311 2443 2368 2308 2356 2372 2368 2416 2427 2370 2337 2339 2314 2253 2205 2248 2383 2460 2403 2343
2523 2343 2344 2324 2318 2417 2508 2479 2432 2439 2401 2293 2215 2199 2208 2254 2352 2433 2423 2370 2373 2381 2273 2161 2252 2443 2485 2418 2402 2394 2349 2361 2429 2469 2493 2502 2447 2397
2518 2397 2413 2387 2287 2265 2325 2317 2261 2270 2314 2322 2312 2310 2319 2330 2298 2229 2208 2254 2313 2366 2366 2275 2223 2314 2392 2340 2297 2327 2326 2322 2394 2442 2394 2347 2347 2361 2420 2519
2512 2519 2570 2549 2461 2315 2257 2385 2492 2410 2307 2299 2255 2182 2226 2324 2343 2327 2309 2244 2217 2321 2433 2429 2387 2401 2414 2348 2256 2247 2308 2303 2202 2155 2230
2507B230Q3J0j2L2O3Nr6p7L9L2m9K1R7j6q0N2P7o5q5mnK6J19O9m0LM2n1r3l4JM2O7m1j29l4
2502B199O3L7J4j3p4MJ51R0o7m9K9L0N2M4m4l1L3q7j80LJ20l2j10j8J6N9J59P7q9l7M9m6n7
2497B295Q6J01L4O4J4j30j02Kp1j26J1R5K5mL0M0N6N2k0o9o4o9k3Q7Q4m6q5lO8Q2M0k6j5K6
2492B439m8j24k1J10P5k5o7m3M2J03L2n3l5j3l6LN8L3j1l6q4q6j0M8R7J48O9q0n5K6o7r9Q1
2487B371J18r0j37K9P7J8L2J8r3j17J1J20P7m3n5M4J4j32r5P2P5L2R9J9j97j36J01N9j01k3
2483B167J00P0L9L0jN7R1p5j50N4J24q2j42J4M9l6l9J9R3J22j0j39l2R3On8Kj7m8O6R7n2j03
2478B309rJ8pj8o8p2J2J8k6N0Q8l0n3L1l9j06N7J51Ln2N2J9r8o0L9O2N2K0j5jMk4J6M2n0o0
2473B255O5L3j17n1R8L3o5j8PmN8M5n3j9M1p3j16M8R4k5J8J45N8q9m4L7Mj7M9O5n6j68o4J49
$$ plain form
2507 2230 2313 2323 2311 2343 2406 2411 2315 2238 2277 2309 2260 2281 2378 2362 2282 2334 2411 2346 2261 2257 2252 2278 2397 2466 2426 2429 2471 2420 2327 2293 2294 2336 2403 2362 2233 2199
2502 2199 2262 2299 2313 2300 2226 2230 2381 2471 2404 2355 2384 2414 2466 2510 2466 2435 2468 2381 2201 2204 2324 2292 2182 2164 2180 2239 2398 2475 2386 2349 2398 2352 2295
2497 2295 2381 2482 2516 2580 2594 2464 2362 2364 2293 2167 2178 2273 2298 2294 2324 2364 2420 2472 2452 2383 2319 2250 2227 2314 2398 2352 2267 2264 2332 2414 2454 2428 2413 2439
2492 2439 2391 2267 2246 2356 2431 2406 2339 2296 2338 2441 2473 2420 2385 2372 2336 2339 2397 2430 2419 2383 2299 2213 2203 2251 2348 2496 2565 2485 2430 2456 2389 2290 2371
2487 2371 2489 2399 2262 2291 2368 2386 2418 2436 2343 2226 2237 2357 2434 2391 2336 2380 2394 2262 2167 2239 2314 2346 2445 2464 2267 2131 2232 2291 2190 2167
2483 2167 2267 2337 2376 2406 2405 2462 2553 2478 2328 2382 2506 2424 2282 2296 2345 2309 2270 2289 2382 2504 2494 2355 2323 2416 2422 2364 2366 2349 2301 2367 2464 2412 2309
2478 2309 2300 2318 2311 2293 2225 2153 2165 2183 2157 2207 2295 2265 2212 2243 2204 2098 2155 2306 2309 2257 2309 2328 2230 2170 2209 2271 2323 2343 2328 2327 2331 2307 2323 2365 2315 2255
2473 2255 2320 2353 2236 2185 2283 2316 2251 2233 2240 2236 2294 2339 2286 2267 2308 2235 2119 2167 2261 2236 2254 2399 2457 2368 2324 2361 2365 2348 2397 2462 2406 2238 2174 2323
2468B323J43n9j25m4l6n1K4O2L2L2j8j28o1J52J68l5j61j22l2K1%j5O4P9m5n4Q2M8j00k3J26
2463B247L6q3J9J14K7o0k8M6Q7N2k8m7KL3K1l7r2j5J33J04l0qM2p6j18M1Q1n5o1L1nm5K5K2
2458B375p4n2O3P6k3q5j5J01P9o8j03ON3M3Q6N9o3o8N1Q0K5k4r5j09N2J78O9o9k7N2L8jk1
2453B589l5k4j1k4l7n3p2m9jRPL7O3O6N3k2r7m2O5M4l4k8pm5m9L6J11M7j36j91J5J95R8k5
2448B453L3L0j04p0J03J03j7l2k0p8r4k4O0J08N8n2n6J3l0r0rN8Kj7K3Nj4K2K1mMk2k4P7N4
2443B470j70j93Q4K07N2m2k2l9k9L1jp0l6L2M5Qn2k4J21J18r4j31R7J70k5j67j17K5J52R7
2439B497j17j67jO4KJ4M8K3K0k7j33o7J36J60N1K5l2j17jJ35%j32pJ02M1j4l9l6O9R0q0j06
2434B401R1R6r0j08m6r0o0L1j7l3Q1K9j10J6J85Q7J3R4J7j49r2rq6o5Q0O7m2l0L6O7R3O2j3
$$ plain form
2468 2323 2466 2407 2282 2238 2202 2151 2175 2237 2269 2301 2283 2155 2094 2246 2414 2379 2218 2096 2064 2085 2085 2070 2134 2213 2168 2114 2196 2244 2144 2121 2247
2463 2247 2283 2200 2219 2333 2360 2300 2272 2318 2405 2457 2429 2382 2384 2417 2438 2401 2309 2294 2427 2531 2501 2493 2535 2459 2341 2382 2463 2408 2347 2378 2373 2328 2353 2375
2458 2375 2301 2249 2312 2388 2365 2280 2265 2366 2445 2377 2274 2280 2333 2376 2462 2521 2458 2390 2441 2521 2546 2522 2427 2318 2370 2548 2617 2548 2521 2573 2611 2610 2589
2453 2589 2554 2530 2519 2495 2458 2405 2333 2284 2283 2292 2299 2336 2399 2465 2518 2496 2399 2357 2422 2466 2432 2404 2397 2352 2303 2339 2450 2497 2361 2170 2185 2380 2478 2453
2448 2453 2486 2516 2412 2342 2445 2548 2531 2499 2479 2401 2307 2283 2343 2451 2509 2457 2401 2414 2384 2294 2285 2343 2345 2328 2351 2356 2342 2364 2385 2381 2385 2363 2339 2416 2470
2443 2470 2300 2107 2191 2398 2450 2408 2386 2347 2318 2349 2348 2278 2242 2274 2319 2327 2275 2251 2372 2490 2396 2265 2362 2532 2507 2340 2223 2248 2400 2497
2439 2497 2380 2213 2212 2276 2278 2292 2340 2363 2383 2356 2223 2156 2292 2452 2503 2528 2496 2379 2378 2513 2513 2381 2374 2476 2517 2503 2464 2428 2497 2587 2507 2401
2434 2401 2492 2588 2498 2390 2344 2254 2194 2225 2208 2175 2256 2285 2175 2191 2376 2463 2476 2570 2587 2438 2346 2337 2251 2186 2266 2333 2291 2261 2297 2364 2457 2519 2506
2429B506j6PoJ0Ln8K8J86N4j71l6J75K6j54n7Pp9o9l0p8JJ61Q1j16r9K1L3L1N0Pl5k0PO3J12
2424B545K2j04n9L0k5n1O8J12Pm8j4ojM3L4j4K5Q9J7q7%J80J78J1r2p6k8pp9j90j21N9M6n7
2419B407M0R2j31j85J02J62p2k9J88P1r6N7J33l8j1J62P0o7Q4K16J01j8l3n3m5k2o6m9O9N3
2415C092j14j81j23q0m1m2j31j20P7J89O3p7m6P6J42Q4jL4J11P9J8J1m6j19m9N2Oo0k9qk0
2410B747lj3p0q9q3p0JM6oMJ03N9r0p5L9M8K0M3M5L1Pq1j14j1j4j50r0J10Q4m4QL5q3m2J47
2405B449J22l7lJ22P6o7q1M5J16J0p5O2J75Pj58o3K7n3p3j0l6p3l6m6p1OM4m8o3L3L1n1k6
2400B255P6J22Q4oq0p6m0pN5O8j5k0J06J28j6j01q0n6j3M3Oo0l1K1J8J2j0n8k5N3J3p0k1Q3
2395B358R3L7l2q6l6P2N9n3n1P9J48P4o3j35o7N3P2nk4L2K7n5n3M9N3m3kJ28L5j69j25L4L
$$ plain form
2429 2506 2490 2497 2491 2501 2504 2446 2474 2660 2714 2543 2507 2682 2708 2554 2497 2504 2425 2356 2326 2248 2249 2410 2491 2375 2276 2297 2330 2361 2411 2418 2383 2363 2370 2433 2545
2424 2545 2567 2463 2404 2434 2409 2358 2426 2538 2545 2497 2483 2477 2476 2519 2553 2539 2564 2653 2670 2583 2583 2763 2941 2952 2860 2784 2756 2749 2670 2480 2359 2418 2464 2407
2419 2407 2447 2539 2408 2223 2325 2487 2415 2386 2574 2645 2549 2606 2739 2701 2690 2852 2922 2855 2939 3155 3256 3238 3205 3152 3107 3085 3019 2970 3039 3092
2415 3092 2978 2797 2674 2594 2553 2511 2380 2260 2337 2526 2589 2512 2466 2542 2684 2768 2767 2801 2912 2991 3009 3020 2974 2855 2806 2858 2864 2804 2775 2767 2747
2410 2747 2744 2731 2661 2572 2489 2419 2420 2466 2460 2464 2567 2626 2536 2461 2500 2548 2568 2611 2656 2687 2694 2613 2499 2488 2474 2324 2234 2344 2428 2384 2392 2427 2344 2302 2449
2405 2449 2571 2534 2531 2653 2729 2662 2581 2626 2742 2752 2677 2739 2914 2921 2763 2700 2727 2674 2601 2591 2555 2482 2446 2400 2329 2335 2379 2331 2268 2301 2332 2281 2255
2400 2255 2331 2453 2537 2531 2451 2375 2335 2328 2383 2451 2436 2416 2522 2650 2634 2533 2453 2397 2384 2427 2433 2373 2342 2363 2381 2393 2383 2325 2300 2353 2366 2296 2275 2358
2395 2358 2451 2488 2456 2370 2334 2406 2465 2412 2361 2440 2588 2662 2599 2464 2397 2450 2522 2517 2493 2525 2552 2497 2444 2493 2546 2503 2501 2629 2664 2495 2370 2404 2407
2390B407m0Q3J20j9p2k4k3jM0l1p0L8N5n6l0L7o6r1O5P1n5K1J29Lr8j8Ln1l0k4m6M2J09L3
2386B411QM3n5j19J8R2K9O8R2p7j43NQj20o0O0K0OR4J02M9kj19j71l5L3m5M0K07Q5j34q0L8
2381B348k1n0M2N0n0q9j4Q3P2m1n0P3N2j02o1J04O2p0m4j0p3k5J26J43K8l3j5J1J7LPK0l2
2376B461j03q3j4PKk2n7rR1N5o3m8M1K7k0L0J07J00Pn8%N6m2j01O0J57J1p0Kl8j03J8P2p4
2371B399r5J4k7m8J27J28j31j59Q6J48km7M7J40J19p9k48j24Q0M2o1j0M2NpomP5Q9r5k11n1
2366B136J49J78J03j0q5j6O1l6j32m0P6O1J5j4m5rO2M4l3l5J0Pj7j4k2n9o3K3R5L1n1K0J05
2361B495K5p4l7kk6%K8l4p7n1m9rJ26J71N2m5m1k7mK8J8K8P9N2m2p1p4r1k7O0L9J2M2k1r0
2356B363K7J32K6l2R3R5q3j62q2J3N9Lq9rJ50R1p5m9O2M2j3j5l1l4lmj6J1Qj4Ll2j06k7J23
$$ plain form
2390 2407 2367 2450 2570 2551 2479 2455 2432 2431 2471 2440 2370 2408 2463 2407 2377 2414 2348 2257 2322 2393 2338 2359 2488 2491 2393 2375 2378 2327 2297 2273 2227 2269 2378 2411
2386 2411 2419 2462 2407 2288 2306 2398 2427 2495 2587 2510 2367 2372 2380 2260 2200 2260 2280 2286 2380 2482 2531 2529 2410 2239 2204 2237 2192 2232 2439 2524 2390 2310 2348
2381 2348 2327 2277 2319 2369 2319 2230 2216 2299 2371 2330 2280 2353 2405 2303 2242 2346 2408 2338 2294 2284 2211 2186 2312 2455 2483 2450 2435 2446 2463 2466 2473 2493 2461
2376 2461 2358 2275 2261 2268 2270 2248 2191 2182 2273 2328 2265 2217 2258 2285 2265 2295 2402 2502 2509 2451 2451 2507 2465 2364 2424 2581 2592 2522 2524 2486 2383 2401 2473 2399
2371 2399 2304 2318 2291 2243 2370 2498 2367 2208 2294 2442 2440 2393 2440 2580 2699 2620 2372 2248 2328 2370 2309 2299 2341 2346 2339 2333 2329 2404 2493 2398 2187 2136
2366 2136 2285 2463 2566 2556 2471 2455 2516 2480 2348 2308 2384 2445 2460 2446 2401 2392 2454 2498 2465 2430 2440 2447 2430 2416 2394 2335 2272 2295 2390 2421 2370 2390 2495
2361 2495 2520 2446 2409 2407 2381 2381 2409 2375 2298 2247 2198 2189 2315 2486 2538 2493 2452 2425 2421 2449 2467 2495 2574 2626 2584 2513 2439 2348 2321 2381 2420 2432 2474 2453 2363
2356 2363 2390 2522 2548 2516 2609 2704 2621 2459 2377 2390 2449 2452 2363 2354 2504 2595 2520 2471 2533 2575 2562 2547 2516 2482 2479 2475 2459 2470 2478 2464 2467 2435 2329 2302 2425
2351B425Q2n5o6k6oN3N5m6l9Q1R2L2L5j3j14o0N2mr4j6J04J04lj35j56k5Q3Q6Q8M0q7p6R2
2346B483J03l8m8J7j2m0k3k5K2O0q9j93J8J86J5r6Q7J80L2r4r6k7P5N9p3o6M4Kn5P8J51K3
2341B660k3M7%j04r0l7k8k7l0J0J04O7r8r3Q1Q5o8q7J4N6M2J8qj6m8r8k4J27J26j1q4o3%P4
2337B474N1m7l9J3l8j9J47J60J1NN3l6n1M6k8j46j9J13K1l6K9Pn8n3n4j3J15R9n7m7N5J7j
2332B674P6Oj10pJ01Rn1k4q2j14m5p3j37k2R6N2L8P6Mp9l8M1J25J36m6j53O8K01k8j28O4P0
2327B700r5n0K8p3p6M8N1L6J01N5l5nn7j69j6J93Q0o3L2M4p6k6Q5O7N6N6j7J4J04np7J28K23
2322C261P7J09K41J52J28L15L11K15M29O35N28M72M52K7n25o55n37m58l55l16l82k87j11j41
2319C585j67k0k8j79j06M3k7r6j9K2L5P4J1l2J08J82J26K03K89J78J80L69L79L53N88P37O79
$$ plain form
2351 2425 2507 2452 2386 2360 2354 2407 2462 2416 2377 2458 2550 2582 2617 2604 2490 2430 2482 2478 2384 2368 2472 2576 2573 2438 2282 2257 2340 2426 2514 2554 2467 2391 2483
2346 2483 2586 2548 2500 2517 2505 2465 2442 2417 2439 2499 2410 2217 2235 2421 2436 2340 2427 2607 2639 2545 2449 2422 2497 2556 2483 2417 2461 2463 2408 2486 2637 2660
2341 2660 2637 2684 2684 2580 2490 2453 2425 2398 2368 2378 2482 2549 2451 2358 2439 2524 2456 2369 2383 2439 2481 2499 2491 2475 2427 2329 2305 2432 2558 2547 2463 2400 2400 2474
2337 2474 2525 2478 2439 2452 2414 2395 2542 2702 2713 2718 2771 2735 2684 2730 2702 2556 2537 2650 2671 2635 2664 2671 2613 2560 2506 2493 2608 2707 2650 2603 2658 2675 2674
2332 2674 2750 2756 2646 2639 2740 2749 2698 2674 2592 2478 2433 2360 2223 2201 2297 2349 2387 2463 2467 2388 2350 2391 2516 2652 2606 2453 2521 2722 2694 2566 2630 2700
2327 2700 2605 2555 2583 2510 2434 2482 2533 2569 2670 2725 2690 2685 2628 2459 2443 2636 2716 2653 2685 2729 2653 2627 2712 2779 2835 2891 2874 2888 2992 2987 2910 3038 3261
2322 3261 3338 3447 3688 3840 3968 4283 4594 4809 5238 5873 6401 6873 7325 7352 6827 6172 5635 5177 4822 4506 4124 3837 3726 3585
2319 3585 3418 3398 3370 3191 3085 3128 3101 3005 2986 3008 3043 3117 3128 3096 3204 3386 3512 3715 4004 4182 4362 4731 5110 5463 6051 6788 7467
2315G467Q69J163J080R11Q18J86q79j387j257j134j016p22n34m86l42k63l53l33j83j15q5
2312C405l8p2r6m4n4m7P1O5q7m9Q7N6O1J91J43N3K38L47J31P3L47N12M87N20N65N41M01m3
2307G764o08p72n94n17m84l61l44l49j61n0j63j68o0p4k1J37Rk61j81M5L6k3mm3k1P8l1j86
2303B593m3J04lk4Q2j9j33J8J08k1m3O3N1prk0J5Q0J2o2K7N7o6p4J3J3N2J12m1j76jJ35jm3
2298B749P8J8j19m9O2J7o8p9j7N2J5k4R8J38q2j87l5j6j00M7J73K7l0Q7M7j3J16J01j18j50
2294B738n6q7l1J35Q1n8KL9n1k8J4p3l2J31R9L6J48J10j24j23N0L9l9k3l7l2M6J6m1O3Q8p3
2289B927q2L0j9l4R6L2j41n4N7l9jJ88J41k4m9r8j51j9P0oJ4K2j58j28J71J58q9j4J55L8n6
2285B937J2l9j12n7o7m4J84K49K3n3J7n7o1Q0K9n5J13J28j22j09R7K9o8O1Q2j3Qm7j44M2J76
$$ plain form
2315 7467 8336 9499 10579 11490 12308 12494 11615 10228 8971 7837 6821 6099 5565 5079 4737 4474 4121 3788 3605 3490 3405
2312 3405 3367 3295 3199 3155 3101 3054 3125 3190 3103 3054 3141 3197 3258 3449 3592 3645 3883 4230 4361 4434 4781 5293 5780 6300 6865 7406 7807 7764
2307 7764 7156 6384 5790 5273 4789 4428 4084 3735 3574 3524 3361 3193 3133 3059 3038 3175 3184 2923 2742 2787 2823 2800 2796 2753 2732 2810 2779 2593
2303 2593 2550 2654 2651 2627 2709 2690 2557 2575 2683 2662 2619 2682 2733 2726 2717 2697 2712 2792 2804 2742 2769 2826 2760 2686 2699 2712 2764 2876 2835 2659 2658 2793 2792 2749
2298 2749 2827 2845 2726 2677 2739 2756 2688 2609 2592 2644 2659 2635 2733 2871 2789 2602 2567 2551 2451 2498 2671 2698 2668 2755 2802 2789 2905 3006 2888 2738
2294 2738 2682 2595 2564 2699 2780 2722 2724 2763 2712 2684 2698 2625 2593 2724 2823 2859 3007 3117 2993 2870 2920 2959 2920 2897 2860 2828 2874 2890 2849 2912 3000 2927
2289 2927 2845 2875 2856 2822 2918 2950 2809 2755 2812 2773 2772 2960 3101 3077 3028 2930 2779 2760 2830 2824 2838 2860 2702 2574 2745 2903 2814 2800 2955 2993 2937
2285 2937 2949 2910 2798 2741 2674 2630 2814 3063 3086 3033 3050 2993 2932 3012 3041 2986 3099 3227 3105 2996 3093 3122 3054 3115 3197 3184 3192 3145 3001 3043 3219
2280C219o1j23J20N7j56jJ27p1j26j0l7L5K03L3j65J2N9j49QK86Q0j46j2oj01P6J19j13m3
2276C114J79K3j16M2L9m2J08L3k81j30K11N2j15J09J39n8K3J22rOO2q3lK39N4j61Q8J19k46
2272C518j82J48K8j26O0P9j4J23O6j85mK35j1j15J20pk32L1J76o8pJ88k3j22R7K7j01J33J35
2267C967j52kK35Qn3J56m9k41R1J56j57nK27m7n2K89P4k30P4J52j73K1K74j22k37J78P0k13
2263D239J27K57q7R4M16L4j97J20K8k28Q7K16q3Q5L55M5l8K51J9k05K06K27k01O1M31O5mL89
2259F709J25j99K28K70k13L9M03m7j39L79K37n3L40L33q4L26O84R5K1N96L21k8N24N37j7M23
2255A1810Q73K63K76R78N91K11J044J130L03O79J261O09O60J623J297Q60J928K321J693K456
2252C2866L495L312M490P273Q849J0678J4567J7429J9194K3457K8105L0574L5245M3052M9896
$$ plain form
2280 3219 3158 3035 3155 3212 3056 3055 3182 3111 2985 2975 2938 2973 3176 3209 3044 3056 3115 2966 2974 3260 3340 3194 3182 3176 3075 3151 3270 3157 3114
2276 3114 3293 3316 3200 3242 3281 3239 3347 3380 3099 2969 3180 3232 3117 3226 3365 3307 3330 3452 3443 3449 3511 3428 3425 3664 3718 3557 3645 3764 3518
2272 3518 3336 3484 3512 3386 3446 3525 3511 3634 3700 3515 3511 3746 3735 3620 3740 3733 3501 3532 3708 3640 3633 3821 3798 3676 3773 3800 3699 3832 3967
2267 3967 3815 3813 4048 4056 4003 4159 4110 3869 3960 4116 3959 3954 4181 4134 4082 4371 4445 4215 4289 4441 4268 4289 4563 4441 4204 4382 4452 4239
2263 4239 4366 4623 4536 4630 5046 5080 4883 5003 5031 4803 4890 5106 5023 5108 5463 5508 5470 5721 5740 5535 5741 5968 5767 5828 6259 6324 6320 6709
2259 6709 6834 6635 6863 7133 6920 6959 7362 7315 7176 7555 7792 7739 8079 8412 8328 8654 9338 9433 9454 10050 10371 10343 10867 11404 11387 11810
2255 11810 12683 12946 13222 14200 14791 15002 16046 17176 17479 18158 19419 20028 20688 22311 23608 24468 26396 28717 30410 32866
2252 32866 36361 39673 44163 51436 60285 70963 85530 102959 122153 145610 173715 204289 239534 282586 332482
2250C32482N9246P3992Q4708Q8364R2797Q3472K9946n5333j15200j20268r6607p5765o1398
2248C20436m8223l8148l2449k7901k2977j8775j5015j0831p604o285m809k362j077n84J416
2246H4812L493M466P514J2758J6617K0778K7617L3106L7197M5519N5183O1337P0631Q5901
2244E66929J00503J19868J50107J73345J81130J90031J73308O2412j22212k51148k54975j99152
2242H90146j56811j27119r7365p8020o8224n7051m6960m0407l1416k2115j8607j6768j2809
2240A16474j0696j0293p627m692l830k135J000L041N017Q690J2285J5063J8850K3393K7090
2238A91630L0961L6612M3155N0487O1520P5545Q5832R0971R4420Q1661K5971o1359j23414
2236F83992j27321j01109q0201o5497n0391m0529l6015l0318k4730k1541j7120j2176j0645
$$ plain form
2250 332482 391728 465720 550428 638792 731589 815061 845007 789674 674474 554206 457599 381834 320436
2248 320436 272213 234065 201616 173715 150738 131963 116948 106117 98513 92228 87419 85057 83980 83396 84812
2246 84812 88305 92771 100285 113043 129660 150438 178055 211161 248358 293877 349060 410397 481028 566929
2244 566929 667432 787300 937407 1110752 1291882 1481913 1655221 1717633 1595421 1344273 1089298 890146
2242 890146 733335 606216 508851 430831 362607 305556 258596 218189 186773 164658 146051 129283 116474
2240 116474 105778 95485 87858 83166 79336 77201 78201 81242 86259 94949 107234 122297 141147 164540 191630
2238 191630 222591 259203 302358 352845 414365 489910 575742 666713 761133 842794 868765 807406 683992
2236 683992 556671 455562 375361 309864 259473 218944 182929 152611 127881 106340 89220 77044 66399
2234F6399r808p025n730o126m740l131l454l082j675j897k392j330r43j575r75k48q77r31
2232A0460j66m93q82j48p1o80j97K36n04n73J43j54n51L6K9n92j92K76k45k29L79j6n15K1
2228E372J89l24j91L2l41j42M08k0m32J09K15k84o1K51j93k51K13K1k90J8K1k92j0J83k20
2225C981j42K71l5k97J23J33k52MK50j34j50J94m8k67P5M5k66M4K78j49k18J42L6j00J70N2
2221C740k90k6J85j76j74J94K7k23J8Q8r2J9J8k42k1L55J05j19J54J28k00j28j9j74n7J18
2217C208j33j78J99J81r1M8J47j02j28j4j18mK40j9k56R4K19j13o9J24j17j60J79J05j48N2
2213C146J21j68o7K01kj34R0K4j65L7J34o7OJ17j31j56J07mj41J92K99n0j07Lj80j61J44P6
2209C164r1J19J47j34p8P2j26j12J80O0j78KN8j67l6J76n7j66Q9R4o7Rrj25P7J58j89k08J63
$$ plain form
2234 66399 56591 49566 43836 37710 32970 29839 26385 23303 21628 19731 17339 16009 15066 13491 12516 12268 11391 10460
2232 10460 10294 9801 8919 8771 8700 8020 7823 8059 7555 6982 7125 6971 6420 6456 6485 5893 5701 5977 5732 5503 5882 5866 5351 5372
2228 5372 5561 5237 5046 5078 4737 4595 5003 4983 4551 4660 4875 4591 4530 4781 4588 4337 4550 4571 4281 4299 4320 4028 4018 4201 3981
2225 3981 3839 4110 4075 3778 3901 4034 3782 3786 4036 3902 3752 3946 3898 3631 3706 3751 3485 3529 3807 3658 3440 3582 3618 3518 3688 3740
2221 3740 3450 3424 3609 3433 3259 3453 3480 3257 3275 3363 3271 3290 3308 3066 3045 3400 3505 3386 3540 3668 3468 3340 3321 3147 3090 3208
2217 3208 3075 2897 3096 3277 3186 3234 3381 3279 3151 3137 3019 3015 3255 3236 2980 3074 3293 3180 3111 3235 3118 2958 3137 3242 3094 3146
2213 3146 3267 3099 3032 3233 3231 3097 3187 3211 3046 3083 3217 3150 3156 3273 3142 2986 3093 3089 2948 3140 3439 3389 3282 3285 3105 2944 3088 3164
2209 3164 3073 3192 3339 3205 3127 3199 3073 2961 3141 3201 3023 3025 3083 2916 2880 3056 2999 2833 2922 3016 2949 2958 2949 2824 2901 3059 2870 2662 2825
2205B825J36o4P1L5k28k0L04P2j41O6Q0j06rQ4o1n7M5l8l5R3Lq3N9M8q7M2J46n6j52r3j43
2200B736l7K06M4k08K2J93p0j02J05n7j98J08K08o6n8J12j3r0N3L8m4K3l0j40OJ20jj0L7r0
2196B797o8J11kj15J33J68j22k6K25k1k34PO0j19K7J59p3j04Q9m1j81M4J11o8J6J41k8n2J35
2192B969P2n9M2M8p1OL1j54j08J19P9j8O4mj51l0N4j16j14P9P8L4J07L2j04k4M9j0J8kj39
2187B777k2J86Qj52R7J55j35j13J22M3m1R6L8j10J4O0j23n7J54P2l5L2j5m1J27M1k68j69J20
2183B861M6l1J37Q2j33m3J03L3J8J2j67j71M1M7j0J35R5j30j5J93Nj37O8J08o1j1R4J6PO2
2178C254k1k7J13R2mM2N7N1K42L61K27J98L13L09L74N63N09L81M50J87m91o92m00m43o10l26
2175D709q7k56l18j88k04j65Lm7j38L7J21l1l6N8K0N5J26m9j38J15K37J10J71K98K19K36M02
$$ plain form
2205 2825 2961 2897 2968 3003 2775 2755 3059 3131 2990 3056 3136 3030 3021 3105 3044 2987 3032 2994 2959 3052 3055 2972 3031 3079 2992 3034 3180 3124 2972 2879 2736
2200 2736 2699 2905 2949 2741 2763 2956 2886 2784 2889 2832 2634 2742 2950 2884 2826 2938 2925 2835 2888 2926 2882 2905 2875 2735 2741 2861 2860 2850 2887 2797
2196 2797 2729 2840 2838 2723 2856 3024 2902 2876 3101 3080 2846 2853 2913 2794 2821 2980 2907 2803 2892 2851 2670 2714 2825 2757 2773 2914 2886 2834 2969
2192 2969 3041 2982 3024 3072 3001 3007 3038 2884 2776 2895 2974 2956 3020 3016 2865 2835 2889 2773 2659 2738 2816 2850 2957 2989 2885 2861 2910 2900 2918 2916 2777
2187 2777 2755 2941 2949 2797 2894 3049 2914 2801 2923 2966 2925 3021 3059 2949 2963 3023 2900 2843 2997 3069 3034 3066 3051 3010 3137 3178 2910 2741 2861
2183 2861 2907 2876 3013 3095 2962 2919 3022 3055 3073 3085 2918 2747 2788 2835 2825 2960 3055 2925 2910 3103 3108 2971 3039 3147 3086 3075 3169 3185 3192 3254
2178 3254 3233 3206 3319 3411 3407 3449 3506 3557 3799 4160 4387 4585 4898 5207 5581 6144 6653 7034 7484 7671 7180 6488 6088 5645 5035 4709
2175 4709 4622 4366 4048 3860 3656 3491 3494 3447 3309 3346 3467 3436 3400 3458 3478 3533 3659 3610 3472 3587 3824 3934 4105 4403 4622 4858 5260
2171E260M00M32O95P99P42R18J117J038Q38L04p59j493j312r84r73p92m81m40m01k24k86m20
2167C978k26k3n6m3k2j54j22Q7L9j19m2K2m4O3J63k5j08J43L04K36J97J85J74K97M14M02M70
2163F190O00N28L23P6l42p11o85n07m80m38k93j85j30j86l57k71P2R0j91j66K0m5m4J52R4
2160C114r3lN4j14o7J06l3j56O1J58pl7Kq4m2J02L3p9j4Ll2P3R8m7m5J6j25j59Q7J70J5m3
2155B912p6j72o6J39P8p7m5QJ0O4N8j0Kk6j21k0J22k5j29O3J16l2L8J19q7j33Q8M7j28K9J75
2150B921j0j02Kk8p3K1Mn8P5J48%n1j0r6q6Q9Q7l8OM0n4l7J4o9l3J35Q0n1M8P7j06j04P7Q5
2145B903Lj2q3j15J8Q4J5J8k7j79j26M7k3r3R0J16q5l3J46L9r1OM0pO1N8m1N3J51m5j64K9
2141B753J05l6m3M1Qj7Ql0j0Q4L6q1m8J4k3k3M2R1J03%j78j43N8N2n8L3J16Jl9N1K5n1n5o3
$$ plain form
2171 5260 5660 6092 6787 7586 8328 9246 10363 11401 12239 12543 11784 10291 8979 7995 7022 6230 5749 5309 4908 4684 4398 3978
2167 3978 3752 3729 3673 3630 3608 3454 3332 3419 3458 3339 3297 3319 3275 3338 3501 3476 3368 3511 3815 4051 4248 4433 4607 4904 5318 5720 6190
2163 6190 6790 7318 7641 7717 7375 6664 5979 5472 4992 4554 4261 4076 3946 3760 3403 3132 3204 3294 3103 2937 2957 2912 2868 3020 3114
2160 3114 3021 3018 3072 2958 2891 2997 2964 2808 2869 3027 3020 2983 2985 2901 2859 2961 2994 2915 2901 2904 2872 2945 3043 2996 2951 2967 2842 2683 2770 2940 2955 2912
2155 2912 2836 2664 2598 2737 2815 2738 2693 2701 2711 2775 2833 2823 2825 2799 2678 2658 2780 2755 2626 2689 2805 2773 2811 2930 2843 2710 2798 2845 2717 2746 2921
2150 2921 2911 2809 2811 2783 2710 2731 2735 2677 2752 2900 2900 2849 2839 2743 2657 2746 2833 2795 2801 2841 2787 2750 2764 2695 2662 2797 2877 2826 2874 2951 2845 2741 2818 2903
2145 2903 2906 2894 2811 2696 2714 2798 2813 2831 2804 2625 2499 2546 2523 2430 2520 2636 2551 2518 2664 2703 2612 2618 2658 2651 2712 2770 2729 2782 2933 2888 2724 2753
2141 2753 2858 2822 2779 2820 2828 2811 2819 2789 2779 2863 2899 2818 2770 2784 2761 2738 2780 2871 2974 2974 2796 2653 2711 2763 2705 2738 2854 2855 2816 2867 2892 2841 2786 2723
2136B723K8K36J92r0j08P5L8p2l7m3n0Q5Q1r4k7J10j03k63j8J17o6o6J29J01n1n3QM7N6l5
2131B850r6j1pj21m8J18Q3J6N0k8r7O8J43l5m8J02Mj43MJ43M9oK4j5J0J18O0j03j06OP3O2
2127C119l5j10k7M9l4p8QO1P6Q6l8j81j13ml2JJ19J12O6Q3Jq9rOj13j9J64L5j32j8L8o5%O7
2122B994r1r8J27J35PO3K7j87j47N0j7j00N6Q4o9oJ56P7n0l7m2o1L1J23J33J22M6q5j32r7
2117C012n7QK1o1m2Q4P5j6PJ9k9L2O3p9r2P0K3j32k7J07lq0m0p9n3J17J17j4M4R4n6r9K0J7
2112B971j0Q7N8r2n2O7M2J5J0p9n0J29J04q5j08o5p6L8J48J3p9L5L1o4M2J19l7r7QJ0j8J2
2108C027q1j43M4J47Nk4L7q0j01R8Q5r0PJ41nq4M5O9K2O2%j07j9N5k7J2R3m9j15O3O5q2RP9
2103C158j06j04J14M7j26K1J25q0j37O2J12Ml1l8l3K1Km4N4J22pq8%O0M6K0m6n0O0O8j4M9
$$ plain form
2136 2723 2751 2987 3179 3089 2981 3056 3094 3022 2985 2942 2892 2977 3058 2964 2937 3047 2944 2681 2663 2780 2714 2648 2777 2878 2827 2774 2782 2829 2885 2850
2131 2850 2754 2743 2736 2615 2567 2685 2768 2784 2834 2806 2709 2777 2920 2885 2837 2939 2943 2800 2804 2947 2996 2990 3014 2999 3009 3127 3187 3084 2978 2984 3057 3119
2127 3119 3084 2974 2947 2996 2962 2884 2892 2953 3029 3115 3077 2896 2783 2779 2747 2748 2867 2979 3045 3128 3129 3040 3031 3037 2924 2905 3069 3104 2972 2954 2992 2927 2927 2994
2122 2994 2903 2805 2932 3067 3074 3137 3164 2977 2830 2880 2863 2763 2819 2903 2834 2828 2984 3061 3011 2974 2932 2871 2902 3025 3158 3280 3326 3241 3109 3012
2117 3012 2955 2963 2984 2923 2881 2965 3040 3024 3031 3050 3021 3053 3116 3037 2945 3015 3038 2906 2879 2986 2983 2903 2863 2784 2731 2848 2965 2951 2995 3089 3033 2934 2954 2971
2112 2971 2961 3048 3106 3014 2962 3029 3071 3086 3096 3017 2967 3096 3200 3115 3007 2942 2866 2904 3052 3065 2986 3021 3052 2988 3030 3149 3112 3015 3023 3033 3015 3027
2108 3027 2946 2803 2847 2994 2999 2975 3012 2932 2831 2929 3014 2924 2931 3072 3067 2983 3028 3097 3119 3181 3181 3074 3055 3110 3083 3095 3188 3139 3024 3087 3152 3070 3079 3158
2103 3158 3052 2948 3062 3109 2983 3004 3129 3049 2912 2974 3086 3090 3059 3021 2988 3009 3011 2967 3021 3143 3136 3048 3048 3108 3154 3174 3128 3078 3138 3206 3192 3241
2098C241J09l5j17l5q1j68j9J04j8o6N5N5o2r2m3N6J32K8j01j5O3k9nJ01k5j35M2J13n7n9
2094B937N0l7q1M7K5o8N4J19j9k0M6j05j42J08J53p5r8K8J3J6R2J0q7nL1n5l8K2kJ0K3q6j23
2089B743kK2j1J16J89K3j00m5L2J02J09o3j70j2Q2n7r6K0K2j2O0N3o7j06q0n5M3J28O1j0K0
2084B939K8%j1n0o9k9q0j59l0J33O0k1O9Q0J9R0J00q1j44n0n0j8J15P3m0R2J61r8k11K3J21
2080B962k1n2Nk4n3m5j7Q6J00p3j00J00Q4j37j10O7O5J8L9j6k0J02N6j11l9Q2o3j57J8R9m8
2075B797j26l9Q3J43M7j13j16k3%N1J05j4r7M3R4l0L5J71J9j60p5lk8N6R1k9mR3n5j64J7O9
2070B838j16r2Q5M1n5J0O0N7R8M2q9o1J9k4k5N1K4NP1Oj27n3L8m0j7J12K3j29k3J15O0Plo1
2065B847n0K8OpP5K4j14n0M8n9j02M2N9n9l4O1N1K9Nq2r4NK2l8j8K1K8P2R2K0j1K0k6p2RQ3
$$ plain form
2098 3241 3350 3315 3198 3163 3082 2914 2895 2999 2981 2915 2970 3025 2963 2871 2828 2884 3016 3044 2943 2928 2991 2962 2957 3058 3033 2898 2940 3053 2996 2937
2094 2937 2987 2950 2869 2916 2941 2873 2927 3046 3027 3007 3053 2948 2806 2914 3067 2992 2894 2922 2935 2951 3043 3053 2966 2961 2992 2937 2899 2921 2919 2929 2952 2866 2743
2089 2743 2741 2763 2752 2868 3057 3080 2980 2935 2967 3069 3178 3115 2945 2933 3015 2958 2862 2882 2904 2892 2952 3005 2938 2832 2752 2697 2740 2868 2929 2919 2939
2084 2939 2967 2967 2956 2906 2837 2808 2728 2569 2539 2672 2732 2711 2780 2860 2879 2969 3069 2988 2844 2794 2744 2726 2841 2914 2874 2966 3127 3029 2818 2841 2962
2080 2962 2941 2889 2894 2870 2817 2772 2755 2841 2941 2868 2768 2868 2952 2815 2705 2772 2837 2855 2894 2878 2858 2960 3016 2905 2866 2948 2885 2728 2746 2845 2797
2075 2797 2671 2632 2715 2858 2905 2792 2676 2653 2653 2704 2809 2795 2698 2741 2835 2805 2840 3011 3030 2870 2795 2792 2764 2820 2911 2882 2878 2971 2916 2752 2769 2838
2070 2838 2722 2630 2715 2756 2701 2711 2771 2828 2926 2968 2879 2818 2837 2813 2788 2839 2863 2868 2939 2945 2818 2765 2803 2763 2746 2858 2881 2752 2729 2844 2904 2911 2908 2847
2065 2847 2797 2825 2831 2824 2899 2923 2809 2759 2807 2748 2646 2688 2747 2688 2654 2715 2766 2795 2800 2718 2624 2629 2651 2613 2595 2616 2644 2716 2808 2828 2817 2837 2811 2739 2748 2831
2060B831K2p1j00o3J9O1L2J3J0k0j8j2q1p3R8J23q4j42K7O2l8l2Jl4J5R4K8m5K8P6j6r7n7
2055B557N4J15N2l3j3J9mL6R4K4j2Q9O6j12j36l0MM3O4j04k01J0J47k0r9K1L8j7L3M2l5n4
2051B638n1k5J08J26q3j21R2J01o3j6P9J1J0M2j26j99K8J27pRO9q9j53M2J22Ql8j7RN8nj42
2046B544p6K6j02j07J81K28m1o7R5L9l9L6qq2P2J42l4m6R5Mj20j3Pj23l3J21j3j31L2J20j9
2041B688p4j1oL0J27O7j18j33L2J02Ko9LP9L2m1m8k8J1R5R9l7j29p1L1O6kj32j18Q7J52k4
2037B662r1L0L7m2J2N2n6p0O4R7J2l5o1q4m5j0l4j0O0O1L5L8J5qM6J04P2j8j20j59n1Q0L1
2032B614r1o7O3J22O3m1p0mL2K1N2M9m6l6P8J4j28n7L7o1o5J18J55M0j7j26k44p5J69J07K
2027B608J10J20l9m3K1p6j19j2Kj2J05R8r9j24N5J01k0j05r2RQ6jq6K0Q3m7q2M3N7oK8J5r7
$$ plain form
2060 2831 2853 2782 2682 2619 2638 2699 2731 2744 2754 2734 2716 2704 2623 2550 2648 2771 2687 2545 2572 2634 2596 2564 2565 2531 2546 2640 2668 2623 2651 2727 2711 2614 2557
2055 2557 2611 2726 2778 2745 2732 2751 2747 2783 2877 2901 2889 2978 3044 2932 2796 2766 2770 2813 2877 2773 2572 2582 2729 2709 2610 2631 2669 2652 2685 2727 2692 2638
2051 2638 2587 2562 2670 2796 2713 2592 2684 2785 2722 2706 2785 2796 2806 2848 2722 2523 2551 2678 2671 2680 2749 2660 2507 2549 2671 2679 2641 2624 2633 2691 2686 2544
2046 2544 2468 2494 2392 2285 2466 2694 2653 2586 2681 2720 2681 2717 2709 2627 2699 2841 2807 2761 2856 2860 2740 2727 2734 2611 2578 2699 2686 2555 2587 2707 2688
2041 2688 2614 2603 2597 2627 2754 2821 2703 2570 2602 2704 2706 2637 2640 2719 2751 2710 2662 2634 2645 2740 2839 2802 2673 2602 2633 2699 2697 2565 2447 2534 2686 2662
2037 2662 2571 2601 2638 2596 2608 2660 2604 2534 2598 2695 2707 2672 2611 2527 2482 2472 2438 2428 2488 2549 2584 2622 2637 2629 2675 2779 2851 2833 2713 2554 2503 2583 2614
2032 2614 2523 2456 2519 2641 2704 2663 2593 2589 2621 2642 2694 2743 2697 2661 2739 2753 2625 2568 2605 2544 2479 2597 2752 2792 2775 2649 2405 2330 2499 2606 2608
2027 2608 2718 2838 2799 2756 2777 2701 2582 2570 2572 2560 2665 2763 2664 2540 2595 2696 2676 2571 2479 2488 2574 2573 2487 2507 2590 2543 2461 2504 2561 2555 2583 2598 2501
2022B501q7K6M4K3N3O4M7J4p8j23j1P3J0l3j9k4L9J44Q7o2q3k4M4J23N1j60j27J17J26k0N
2018B740J7r9k9J15m4k05pJ44jo6L4M0J4K7q4j69lJ15j1m2J03J02j6lM2mk7k1o6p3mK0kK5
2013B562O2L6k2m5nL6j2o5PR0L7k8%Jn2n2j2K0M5Jr0n5P6P2k5k1L4K5J5Kn7q4o2p2m3R2J61
2007B572P0l1p0q5k9O1N4LJ6J1m8m8j6k5K5J30R2o3r7J5R3N8k9o9j2N4M6lm5o0j5L5LJQ6P2
2002B752m2nJ03J0j11m4Nn7oP4l2j15j9J1o3J4J51J12pn6o9n2l0o6m2J04J17n5r7K0J9o4l7
1997B423K4M2R0R4qo5m0n2m6M3O4l7q8l8J1K5K1J1K1Jo6o2N0J16P3Jm8k4N9K7j03n8Q4Mj53
1992B396q2K9k1j0J04Q5j1k3k7jJ13R7r9j23N9J09J4l0n6n0N2N1j03j05M9N5k2K6N8ol5n3
1987B440m6J21K30K2j80r6l7j30p2J06J20N1K7j9m8j8l8k3J06Q6r3m4J35M0j23n1j4q6K4J39
$$ plain form
2022 2501 2414 2440 2484 2507 2560 2624 2671 2685 2607 2484 2473 2546 2556 2523 2504 2480 2519 2663 2750 2688 2605 2581 2625 2748 2799 2639 2512 2629 2755 2735 2740
2018 2740 2757 2658 2629 2744 2700 2495 2488 2632 2631 2565 2599 2639 2653 2680 2596 2427 2424 2539 2528 2486 2589 2691 2675 2672 2714 2710 2683 2662 2596 2523 2519 2539 2537 2562
2013 2562 2624 2660 2638 2593 2588 2624 2612 2547 2554 2644 2681 2653 2653 2654 2602 2550 2538 2558 2603 2604 2514 2459 2535 2607 2582 2561 2595 2620 2635 2637 2580 2496 2434 2362 2319 2411 2572
2007 2572 2642 2611 2541 2456 2427 2488 2542 2545 2561 2572 2524 2476 2460 2435 2460 2590 2682 2619 2522 2537 2630 2688 2659 2590 2578 2632 2678 2675 2630 2570 2555 2590 2593 2594 2680 2752
2002 2752 2710 2705 2808 2818 2707 2663 2668 2611 2605 2679 2647 2532 2513 2524 2461 2475 2626 2738 2731 2675 2606 2554 2524 2458 2416 2520 2637 2582 2485 2505 2524 2460 2423
1997 2423 2447 2489 2579 2673 2665 2600 2560 2508 2462 2505 2569 2532 2444 2406 2417 2442 2463 2474 2495 2496 2430 2368 2418 2534 2607 2608 2560 2536 2595 2622 2519 2461 2545 2549 2396
1992 2396 2314 2343 2322 2312 2416 2501 2490 2467 2440 2439 2552 2649 2550 2427 2486 2595 2609 2579 2523 2473 2525 2576 2473 2368 2417 2472 2450 2476 2534 2528 2493 2440
1987 2440 2394 2515 2745 2767 2587 2491 2454 2324 2252 2358 2478 2529 2556 2537 2489 2471 2433 2410 2516 2602 2509 2465 2600 2640 2517 2466 2452 2366 2390 2529
1983B529j0q4O3L9j05jJ34J4o8J6kn7L4M9j11j48j0N8L5M4N7L1j4l2K4O5m1j41l9Q8M6j5j0
1978B438m0n0K6M9K7Q6J00l3q7NOp8l3J03J37L4r3q7M9P0p1r6L1L5o5m8L7P9Q4Lj20p1O2K8
1973B517l5L8K0j06n0P5No8qj8m4O5O2j26j27P2J20M5L6%l0O1N8j15j32L3N4m0l4J2L7J05
1969B482J21M1Olo7m4O7O4oom2r0K0J08k1j11k5Mm2k6m4n8P9J32m8q1J03P6j03n3N9MPR5K9
1963B627n2J4J2q7o1j3q1p5K0J0j1N5K9n8J2J11L7q1r2j5J07J15o0j31J8N9l4O5J95K9j47
1959B517m0O9J5j1nm4j8Rq4j05M2P8m6p5LM2O2O7K0j3o2j57j09J11J52l2r1JJ7nK1K3M3Q9
1954B484Qj04j0J08K7n7l3p2q9O0J50M8l0j7k0LJ9o7q5P3J41L7lJ0o1j04m1K1O3N7p2j26L9
1949B357J03p0j12L5L5n6%M9j1RQ2L2l0ON0P2M0j06j60K7J37%m0R1P8n0m2L7N3K7o3j32j4
$$ plain form
1983 2529 2519 2435 2498 2537 2432 2431 2565 2579 2511 2527 2525 2468 2502 2551 2440 2292 2282 2340 2375 2419 2476 2507 2493 2461 2485 2550 2509 2368 2329 2417 2463 2448 2438
1978 2438 2398 2348 2374 2423 2450 2536 2636 2603 2516 2521 2527 2449 2416 2519 2656 2690 2597 2510 2559 2629 2558 2462 2493 2528 2463 2415 2452 2531 2615 2618 2498 2427 2489 2517
1973 2517 2482 2520 2540 2434 2384 2459 2464 2396 2388 2370 2326 2391 2453 2327 2200 2272 2392 2437 2473 2473 2443 2504 2562 2447 2315 2348 2402 2362 2328 2340 2377 2482
1969 2482 2603 2644 2650 2647 2580 2536 2603 2667 2661 2655 2613 2523 2543 2651 2630 2519 2494 2498 2456 2430 2386 2328 2407 2539 2491 2410 2513 2589 2486 2433 2492 2496 2503 2598 2627
1963 2627 2575 2589 2601 2514 2453 2440 2359 2284 2304 2314 2303 2358 2387 2329 2341 2452 2489 2408 2316 2301 2408 2523 2463 2332 2350 2409 2375 2440 2635 2664 2517
1959 2517 2477 2546 2561 2550 2545 2501 2483 2492 2408 2303 2345 2423 2377 2302 2305 2347 2409 2476 2496 2483 2421 2264 2155 2266 2418 2386 2295 2296 2313 2308 2329 2352 2395 2484
1954 2484 2492 2388 2378 2486 2513 2456 2423 2351 2262 2322 2472 2520 2490 2473 2453 2456 2475 2408 2323 2396 2537 2574 2571 2581 2520 2416 2375 2396 2459 2516 2444 2318 2357
1949 2357 2460 2390 2278 2313 2348 2292 2292 2341 2330 2339 2421 2453 2423 2429 2479 2551 2591 2485 2325 2352 2489 2489 2449 2540 2618 2568 2526 2563 2616 2643 2580 2448 2434
1944B434J20L8n6j9l6q8JM6n4o4Qk7KJ41P0j37j01J4p5q7J09J67L4j7nl3jO2K4l8k6J2N4N5
1939B527l1m8L0m6j95o2J67Q1r5k7P4L4J1Nn6m0L0j4n3J6J7o8m1N6J14J63J24m9j19l3m9j05
1934B318K7J43L1q0l6L4R4J01o7k15r7N5Ol3M0L7j3M1R2L7l1p4p8J4J10O5m1r2r4m6K4M1L0
1930B343L1k4o2M0R8jj2O8l5j35L0J27l7p0O6J2r7oM4j2Q1J58j6j25k8m6j09L1J03l9l3J16
1925B461O6n3oJq6l7M4rj8N9J9m4J0Lr5o1N0M0NO6J00K9n9q3k2M5J2m5k0J2K9R7Q1r5j50K2
1920B368J08K3j3Kk3pL5RJ3L5p9j55J1J29Mo0J2m2j11L3J60O5m8n5m8k2J8J4K1M4k4r5k9L7
1915B330JLO5Q1O6Jj06l8J59Q8j68j46L9Qo9PJ9j1J14J43q3j79LJ12O3M2L8L1P1M7n3m0J6
1910B654n6j03k8k5q6n1l0p2KJ22R2L1K9l0m9N1J5j19J5K51J46r8j09k6kM6L4p4p5QjJ7J22
$$ plain form
1944 2434 2554 2592 2536 2517 2481 2393 2394 2440 2386 2322 2330 2303 2305 2446 2516 2379 2278 2292 2217 2130 2239 2406 2440 2423 2418 2385 2384 2446 2470 2432 2406 2418 2472 2527
1939 2527 2496 2448 2478 2432 2237 2175 2342 2423 2328 2301 2375 2409 2420 2425 2369 2329 2359 2345 2292 2308 2325 2257 2216 2272 2386 2549 2673 2624 2505 2472 2423 2318
1934 2318 2345 2488 2519 2439 2403 2437 2531 2632 2565 2350 2253 2308 2314 2281 2321 2358 2345 2386 2478 2515 2484 2410 2332 2346 2456 2521 2480 2388 2294 2248 2272 2313 2343
1930 2343 2374 2350 2288 2328 2426 2425 2413 2481 2446 2311 2341 2468 2431 2361 2427 2439 2342 2336 2380 2368 2449 2607 2591 2466 2438 2392 2283 2314 2417 2378 2345 2461
1925 2461 2527 2474 2468 2469 2383 2346 2390 2381 2363 2422 2441 2397 2407 2410 2315 2254 2304 2344 2349 2415 2515 2544 2485 2402 2380 2425 2437 2392 2372 2384 2413 2510 2591 2496 2346 2368
1920 2368 2476 2499 2486 2488 2465 2458 2493 2502 2515 2550 2471 2316 2327 2456 2460 2400 2412 2370 2259 2292 2452 2517 2469 2414 2366 2344 2362 2376 2397 2441 2417 2322 2293 2330
1915 2330 2331 2334 2399 2480 2546 2547 2441 2403 2562 2650 2482 2336 2375 2383 2314 2321 2340 2329 2443 2586 2503 2324 2327 2439 2502 2544 2582 2613 2684 2731 2678 2638 2654
1910 2654 2598 2495 2467 2442 2356 2305 2275 2203 2205 2327 2419 2450 2479 2449 2400 2451 2466 2347 2362 2613 2759 2661 2552 2526 2524 2570 2604 2530 2455 2463 2462 2479 2601
1905B601P8o2m5J4l6l7Mp1j11J6P8J0J0L7oqL4%j3L7j0j07q1k6j4N5P6o9j19O4J63L6p7n5
1900B366J7N6Lo7rM7n4q1P7R5p1q0M5O2P0J17L4n9M8J28Kq2rO0Q0N1o8j37q1p3r2L2J06m1
1895B492j20JL1m1J8R9K7n1n1l4J8L8o8r7Q5J72L5m2RJ2J7O2%q4NJ07M0m4l5j1J0pj02j07
1890B384M3Q7l6k4J32J12q2j65n6R6J36L9n0j2L9pn6o8q3l7R0J38K6j12j39n3K7PNR5P2j10
1885B438j20M8J5j46n7J20O0l0M0N0m8l4P6J30J09Qq2NJ27L4r1l9k2j27j03L0N6M9R6O5j3
1881B644k5l8p6m5j8n2j6L0n6r2K3K4q8k7J33J32N3J4n8r0l7m8q6mM8j1L1J29L5q0k3lo2k
1876B259L7p6o2J02P3o8j5P2Qj8M2K6j1J5L8N3M9o4j42k9K9j05j08Q8J44J9n0m8j2N0J3q6
1871B223m2N5L2N1J34M9n6M6M0j79j37J38R1j41o4J26P7l9n9o0lQ4L8m1j9l8q2L9J64Q4OL7
$$ plain form
1905 2601 2679 2617 2572 2586 2550 2513 2517 2446 2335 2351 2429 2439 2449 2486 2480 2472 2506 2506 2493 2530 2520 2413 2332 2306 2292 2347 2423 2354 2235 2299 2462 2498 2421 2366
1900 2366 2383 2439 2442 2375 2366 2413 2359 2278 2355 2450 2379 2299 2344 2406 2476 2593 2627 2568 2616 2744 2746 2664 2655 2715 2795 2846 2778 2641 2560 2487 2395 2427 2533 2492
1895 2492 2372 2373 2404 2363 2381 2480 2507 2456 2405 2371 2389 2427 2359 2262 2347 2519 2554 2512 2521 2533 2550 2612 2612 2528 2533 2640 2680 2636 2601 2590 2600 2593 2491 2384
1890 2384 2427 2514 2478 2454 2586 2698 2616 2451 2395 2491 2627 2666 2616 2604 2643 2636 2580 2512 2429 2392 2482 2620 2646 2534 2395 2342 2369 2376 2381 2476 2548 2438
1885 2438 2318 2366 2381 2235 2178 2298 2358 2328 2368 2418 2370 2336 2412 2542 2651 2659 2577 2582 2709 2743 2652 2613 2591 2464 2361 2391 2447 2496 2592 2657 2644
1881 2644 2619 2581 2505 2460 2442 2390 2374 2404 2348 2256 2279 2303 2215 2188 2321 2453 2506 2520 2462 2372 2335 2287 2201 2197 2245 2234 2265 2394 2429 2349 2326 2323 2261 2259
1876 2259 2296 2220 2158 2260 2333 2265 2250 2322 2330 2312 2354 2380 2369 2384 2422 2475 2524 2460 2318 2289 2318 2213 2105 2193 2337 2356 2306 2258 2246 2296 2309 2223
1871 2223 2181 2236 2268 2319 2453 2502 2446 2492 2532 2353 2216 2354 2445 2304 2240 2366 2443 2404 2345 2285 2282 2366 2404 2363 2344 2306 2224 2263 2427 2511 2517 2554
1866B554k3j02NJ19P5J8kn3l7M9K6o4o8k8k5l9m8MJ10O5j11p3J27J18K2J12J32n7p9P2%j49
1862B650k1J44N9n8l2PJ8L7J6k2k8n8j18j53j55q5N7J11L3njn2l7P5M9n7J0J30J01O8P7k1
1857B739j19o6k4p4p8l0M0J37Q7r3m3J45Lk27p3J06o3j56PM0lJ17J18o8n5P0j1p0M5M3l9M2
1852B447R5RL0O4p5r5N7j1j76m9J02Lk2Q4J0q9K9P7m8l5P5K5n6j0L7O0J04O0l1rL9j5o3n7
1847B566m7pJ3o6r6J2M7j9J6R6N3l6q1q6OJ04K5o3J1J0r1K5J90N2q9L7N0j34p5J70J70Jr7
1842B667j61j35K6N9r9j46l8M0P5N1n2m6Q0O4l7J3L6q9p4Q8P5m1n3p8j02J9R3rl1O8Q6R7J16
1838B562n5j94j7J00p6r2J13Q7m2P4J24p8r9P8K6j53j10L0O0M7J0n7m4KrK0R1N3l6l2mk1m8
1833B310p5k4J53J96k9j93j15j2N3J31O0j08q1M4J4lQ0Rj28n0O4J0kM9k4o8L2J8r8k5R8L4
$$ plain form
1866 2554 2531 2429 2434 2553 2628 2646 2644 2591 2554 2603 2629 2565 2497 2469 2444 2405 2357 2361 2471 2536 2425 2352 2479 2597 2619 2731 2863 2806 2727 2799 2799 2650
1862 2650 2629 2773 2832 2774 2742 2749 2767 2804 2820 2798 2770 2712 2594 2441 2286 2201 2258 2369 2402 2397 2396 2344 2307 2382 2431 2374 2384 2514 2615 2683 2760 2739
1857 2739 2620 2554 2530 2456 2378 2348 2388 2525 2612 2519 2476 2621 2624 2397 2324 2430 2367 2211 2218 2258 2255 2372 2490 2422 2367 2437 2426 2356 2401 2444 2405 2447
1852 2447 2542 2551 2581 2645 2570 2475 2532 2521 2345 2296 2398 2401 2379 2463 2473 2384 2413 2490 2442 2407 2482 2507 2451 2441 2478 2538 2642 2702 2671 2662 2701 2686 2623 2566
1847 2566 2519 2512 2525 2459 2363 2375 2422 2403 2419 2515 2568 2532 2451 2365 2371 2475 2500 2437 2448 2458 2367 2392 2582 2634 2545 2582 2632 2498 2423 2593 2763 2764 2667
1842 2667 2506 2371 2397 2456 2357 2211 2173 2213 2288 2339 2287 2241 2321 2385 2348 2361 2397 2308 2234 2322 2397 2356 2303 2225 2123 2142 2235 2226 2195 2263 2349 2446 2562
1838 2562 2507 2313 2296 2396 2320 2228 2341 2428 2386 2460 2584 2506 2407 2485 2511 2358 2248 2278 2338 2385 2395 2338 2294 2296 2287 2307 2398 2451 2415 2383 2379 2358 2310
1833 2310 2235 2211 2364 2560 2531 2338 2223 2211 2264 2395 2455 2347 2266 2310 2324 2321 2401 2410 2282 2232 2296 2306 2304 2353 2329 2261 2293 2311 2213 2188 2286 2320
1828B320qR5R4l5n8L5R7M8q7j23K3P6o9r5M2L3o6k4J5n0j1Q1K3k6M5K9n4pM4j8qP2K7m6%M9
1823B463K6J2kk4j1l9q0K2J46O4o8l6J6j0j9j9k2K7J2j11o3J28Q2j03l5J36J13K4l6j30j20
1818B343J7L3m0j0j0n1Q3J77k3j44K3O6o5k0L9r8j16K9Ol8J23J67Kj0N9m6q9L9J2j22o3L8
1814B311nj1N7O5P1P6k0p2Lj1q0MP4k4l3O6J7p7j2N0K0J7k4p6N4J48p7k41k9J61P6j3k6l7
1809B402O0J37l6k01r6Rk8NP8N8N6O9jlM4r6k09mJ53J3l1Q6j9j78l1J41O8k6l8o0lP3k0r5
1804B277K7P5l1l4J5m7m7P0P7K3M4qj14k1J30O8l7mJ6oN3R1lj18j61j19J5J22J02M7J1m3k0
1799B450Q0N0p7p4l3j07j03K9N7RN4O1k6j4M4l0p5K9O4l5p4QJ03J19j0j50p8Q6R3J9J2%k7
1794B454k5o3p5O7J43pj04m5o9q5P2J09o0o3P0Oq0J8N9nL9N3o8o6M1oo1L4P3L3M7k5j32K1
$$ plain form
1828 2320 2312 2407 2501 2466 2408 2443 2540 2588 2501 2378 2401 2477 2408 2313 2355 2388 2322 2298 2313 2263 2252 2333 2356 2330 2375 2404 2350 2343 2387 2369 2361 2433 2460 2414 2414 2463
1823 2463 2489 2501 2499 2475 2464 2425 2345 2367 2513 2577 2509 2473 2489 2479 2460 2441 2419 2446 2458 2347 2284 2412 2494 2391 2356 2492 2605 2629 2593 2463 2343
1818 2343 2360 2393 2353 2343 2333 2282 2365 2542 2519 2375 2398 2464 2399 2379 2418 2320 2204 2233 2239 2201 2324 2491 2493 2483 2542 2496 2407 2446 2458 2336 2273 2311
1814 2311 2306 2295 2352 2417 2488 2564 2544 2472 2475 2464 2384 2388 2462 2438 2405 2471 2488 2411 2399 2449 2469 2486 2462 2386 2440 2588 2511 2270 2241 2402 2478 2465 2439 2402
1809 2402 2462 2599 2563 2362 2266 2275 2247 2252 2330 2388 2444 2513 2512 2509 2553 2457 2248 2244 2397 2410 2379 2465 2446 2268 2237 2378 2446 2420 2382 2322 2319 2392 2372 2277
1804 2277 2304 2379 2348 2314 2329 2282 2235 2305 2382 2405 2449 2441 2327 2306 2436 2504 2467 2463 2479 2473 2526 2617 2614 2496 2335 2216 2231 2353 2455 2502 2513 2470 2450
1799 2450 2530 2580 2503 2429 2396 2289 2186 2215 2272 2281 2335 2396 2370 2356 2400 2370 2295 2324 2388 2353 2279 2287 2390 2509 2499 2349 2271 2357 2450 2469 2481 2481 2454
1794 2454 2429 2366 2291 2358 2501 2494 2390 2345 2276 2191 2263 2372 2312 2249 2319 2325 2245 2263 2322 2317 2356 2409 2341 2275 2316 2310 2249 2283 2356 2389 2436 2411 2279 2300
1789B300J82k0j76M5J62j8p0M4M2K2M5m4j04j4mn5N0P6j22j41R8J51Rl5n6j09m5K1k9lR7M4
1784B343k0M9L5p3l6L6j5k3K6K1R9K00J0k07k3J84J8r9O4Q5o6m0N0l7j32j12p2rN8M8L8M6
1780B446n4j42j8J14N6k6m1n1%O8Qk1J03R2q9p5O0j1q5N4J17j2n1J9K9K8L0m5q9m6l3j0P8
1775B403N1o6qQ6m3j35O6K36R3j32j53k1L7m1m2J00Q8j02p0J55J26o5o9k9q1k4M7o3n9J40
1770B425J14q3m2M9n6m7J03K0j19OJ07J6K1Q1m6j52o0K0M1R2M4q6o9K6L3M6M8n5r7k7n4p2
1766B227Q7J21q5j14P1R4kJ4K8KN1K3j08n8R5M1q5q2p6m6Q1N9j07l8J56P8r9p2jK4R5R7J4
1761B485L4M6q1p5Q9O4n7kK2q6l8P7Rk6O6Qr7pK4j17q0R3O3n3o3p8m7Q3O5o2L1J56Pj19j6
1756B318K9l0l1o0r2L5J14J1pN4k2j7J36N2j47rJ75J8j14qJ9k8j0o3p9J00J09r8k1J84M2p3
$$ plain form
1789 2300 2482 2462 2286 2331 2493 2475 2405 2449 2491 2513 2558 2514 2410 2396 2392 2337 2387 2463 2341 2200 2298 2449 2458 2423 2367 2258 2213 2234 2205 2202 2299 2343
1784 2343 2323 2372 2407 2334 2298 2334 2319 2296 2322 2343 2442 2642 2652 2445 2422 2606 2624 2525 2589 2674 2608 2568 2618 2581 2449 2337 2265 2256 2314 2362 2400 2446
1780 2446 2392 2250 2232 2346 2402 2376 2335 2284 2284 2352 2360 2339 2442 2534 2445 2370 2430 2419 2334 2388 2505 2493 2442 2461 2490 2518 2548 2503 2414 2368 2335 2325 2403
1775 2403 2454 2388 2380 2466 2423 2288 2354 2590 2683 2551 2398 2377 2414 2373 2331 2431 2519 2417 2347 2502 2628 2563 2494 2465 2384 2360 2407 2344 2285 2425
1770 2425 2539 2456 2414 2463 2407 2360 2463 2483 2364 2370 2477 2493 2514 2595 2549 2397 2337 2357 2398 2490 2534 2448 2379 2405 2438 2484 2532 2477 2380 2353 2299 2227
1766 2227 2314 2435 2350 2236 2307 2401 2399 2413 2441 2443 2494 2517 2409 2351 2446 2487 2402 2320 2244 2198 2279 2338 2231 2193 2349 2427 2328 2256 2255 2279 2374 2471 2485
1761 2485 2519 2565 2484 2409 2498 2562 2505 2503 2525 2439 2401 2478 2487 2461 2527 2535 2438 2431 2455 2338 2258 2351 2414 2361 2298 2220 2173 2256 2321 2259 2290 2446 2453 2334 2318
1756 2318 2347 2317 2286 2226 2134 2169 2283 2294 2287 2341 2319 2302 2438 2490 2343 2334 2509 2527 2413 2405 2424 2396 2386 2323 2244 2344 2453 2355 2334 2518 2560 2487
1751B487J16R6j12kP9j68j26K06Q8j95KJ94k2j29l2o0J4K19J09r7L0R5j09p7J49J34O8Q5o5
1747B977j31J04J08j85j36Q1p6k16k7J2r4P9K01l2j38K6O6L1O7j4j13k7k0j16K2J54n3j81
1743B369RJ10M9L7m9j27L9R5j41j19J70J01j09N7J79l1p3P9j9j70p3RPR9J42Q3J11Q4n9j7
1738B842P3j30k31L2J01j05l3J36k2j33J8J3r3J0N7n9J0J22k4j08M6J07N8N1m6j07O0P1j74
1734B542r4K13J05j24N6K03lr2K2L0M8J15k8j75n4J4j07j02l3r2o3N0j9n4J29J59k0l1M7k7
1730B615n0K7lj2Q4L9o8k0k1r5M9K00L4r2K9L6n4POp1Q8J96n3j34J21J06j49j09Lr3o1R4J2
1725B661j05m9n8o2J05Q0j51q5J34O0k6P1Nj03O9J56rMJ68J38J12J80Q4L8K46K72R3K04M20
1720D652L76L95N14L38K06M60M93P9k13m03p29p20l61l48n17k95n9j39j38q3k40k29N3R7%
$$ plain form
1751 2487 2603 2699 2587 2585 2664 2496 2370 2576 2664 2469 2471 2665 2643 2514 2482 2422 2436 2655 2764 2667 2697 2792 2683 2606 2755 2889 2957 3042 2977
1747 2977 2846 2950 3058 2873 2737 2818 2742 2526 2499 2511 2417 2496 2697 2665 2527 2553 2619 2650 2717 2703 2590 2563 2543 2427 2449 2603 2550 2369
1743 2369 2378 2488 2537 2574 2525 2398 2437 2532 2391 2272 2442 2543 2434 2491 2670 2639 2566 2645 2626 2456 2383 2392 2399 2498 2640 2723 2834 2918 2859 2842
1738 2842 2915 2785 2554 2586 2687 2582 2549 2685 2663 2530 2548 2561 2468 2478 2535 2476 2486 2608 2584 2476 2522 2629 2687 2738 2692 2585 2645 2716 2542
1734 2542 2448 2661 2766 2642 2698 2901 2898 2806 2828 2858 2906 3021 2993 2818 2764 2778 2671 2569 2536 2444 2381 2431 2412 2358 2487 2646 2626 2595 2642 2615
1730 2615 2565 2592 2589 2577 2661 2700 2632 2612 2591 2496 2545 2745 2779 2687 2716 2752 2698 2705 2711 2640 2728 2924 2871 2737 2858 2964 2815 2706 2709 2616 2555 2649 2661
1725 2661 2556 2507 2449 2387 2492 2572 2421 2336 2470 2530 2504 2575 2580 2477 2546 2702 2693 2697 2865 3003 3115 3295 3379 3417 3663 3935 4028 4232 4652
1720 4652 5028 5423 5937 6275 6481 6941 7434 7513 7300 6897 6168 5448 5087 4739 4222 3927 3868 3729 3591 3508 3268 3039 3092 3189 3189
1717C189R6M8j65n4J31j2m0J74J09jK53L65J58K65N68N26M72O75P44P32Q76P79N01O67Q93
1713A1949L96m47j031j410j419r38o19o76n39k96m13n16k85j33j32m9p5j87k4J40l6j29L5
1710C166N7kO1Kp9J29K16k3K0L48L26J79L39M01K44L09M11K65K71M36K19k21m63o43p14m78
1706D776l35m22k49jj84l23n4M5j15o1j0j46n3Q8j39k15P1M4j69M1J75j19j38R9m3j28J95
1702B630J72j79k5K47j2j85K8Mj31Q3J85k4l5P2l6o2L3n3l9J70N1k11n1J31k1jJ59j9j71o
1698B704j7j23J12K19q2j43O6J6m3P4p2k41L0J92j8L2K08k8j59J03Q2j42qO7j49l5K02l7j78
1693B632J15J11j28K3J28j05l0J87q4k46J06J77q3K0J43r7j04J18j5j33P7N3j32M8J58q3n7
1689B799J52rj26O8Lj55J01K10j00r3J38n2k02O7J23l9Q5J07j78j26J39Nj10J03N8j75l0J33
$$ plain form
1717 3189 3285 3333 3168 3114 3245 3233 3193 3367 3476 3475 3728 4093 4251 4516 5084 5610 6082 6757 7501 8233 9109 9888 10389 11056 11949
1713 11949 12345 11898 10867 9457 8038 7100 6481 5805 5266 4970 4557 4041 3756 3623 3491 3442 3367 3180 3156 3296 3260 3131 3166
1710 3166 3223 3221 3282 3284 3205 3334 3550 3527 3547 3895 4221 4400 4739 5140 5384 5693 6104 6369 6640 7076 7295 7074 6611 5968 5254 4776
1706 4776 4441 4019 3770 3769 3585 3262 3208 3253 3138 3077 3067 2921 2868 2956 2817 2602 2673 2717 2548 2589 2764 2645 2507 2606 2563 2435 2630
1702 2630 2802 2623 2598 2845 2833 2648 2676 2680 2549 2632 2817 2793 2758 2830 2794 2732 2765 2712 2673 2843 2894 2683 2632 2763 2742 2741 2900 2881 2710 2704
1698 2704 2687 2564 2676 2895 2813 2670 2736 2752 2709 2783 2711 2470 2500 2692 2674 2706 2914 2886 2727 2830 2912 2770 2762 2829 2680 2645 2847 2810 2632
1693 2632 2747 2858 2730 2753 2881 2776 2746 2933 2849 2603 2709 2886 2803 2823 2966 2869 2765 2883 2868 2735 2812 2865 2733 2781 2939 2856 2799
1689 2799 2951 2942 2816 2884 2887 2732 2833 3043 2943 2850 2988 2936 2734 2801 2924 2885 2970 3077 2899 2773 2912 2917 2807 2910 2968 2793 2763 2896
1685B896j9k3J18M8K5J07l5n9K27J56k03q2J41j29k65RO4k0J13M9j20J46K95j35k88N1O0j06
1681C021R2J65l5L0P9k02j81J15kj46J15J07j75J5K64K7m9J64K7j32Q3P8j33M4J57j33j30
1677C265R3q7j66J16Ok43R9K74j63j80K23R2j31R6O5j65P6J91j66j07K02m2j71J95R8k39R4
1673C325L19j14j33K45M2j90Q4L4j98J53L08j56j43K26mj55K25J18k71RJ92j84n1L44Nj98
1669C832K74K34j98L9K39r7M4L93ok23K03N2m04n4J98k02p3L15o1k15K92J19l71N7L46j82
1666D551j48L07k3k58K14J47k65N2K33j53L0L25j55j46N62L25k31K57M57j56R9O99J93n7N96
1662G455L64l78o2J29m62k19L79j42m10K89K12k63K91M96k53j01N17M4j73M91K87k18M12O04
1658I289j31J69P82J23q2P03L95j67O64R00LL54J094L86L07J380R97J78J038J344M25R89J917
$$ plain form
1685 2896 2877 2854 2972 3020 3045 3152 3117 3058 3285 3441 3238 3156 3297 3168 2903 2912 2976 2956 3069 3118 2998 3144 3439 3304 3016 3067 3127 3021
1681 3021 3113 3278 3243 3273 3352 3150 2969 3084 3082 2936 3051 3158 2983 2998 3262 3289 3240 3404 3431 3299 3382 3460 3327 3371 3528 3395 3265
1677 3265 3358 3271 3105 3221 3227 2984 3083 3357 3194 3014 3237 3329 3198 3294 3359 3194 3270 3461 3295 3188 3390 3348 3177 3372 3470 3231 3325
1673 3325 3644 3530 3397 3642 3684 3494 3578 3612 3414 3567 3875 3719 3576 3802 3798 3643 3868 3986 3715 3724 3916 3732 3681 4025 4030 3832
1669 3832 4106 4340 4142 4181 4420 4323 4367 4760 4754 4531 4734 4786 4382 4328 4526 4324 4251 4566 4505 4290 4582 4701 4330 4387 4733 4551
1666 4551 4403 4710 4687 4429 4643 4790 4525 4577 4810 4657 4687 5012 4857 4711 5273 5598 5367 5624 6081 5925 6024 6723 6916 6859 7455
1662 7455 7819 7441 7379 7508 7046 6827 7206 7064 6654 6943 7155 6892 7183 7679 7426 7325 7842 7886 7713 8204 8491 8273 8685 9289
1658 9289 9158 9327 10109 10232 10150 10853 11248 11081 11745 12645 12648 13002 14096 14482 14789 16169 17166 17344 18382 19726 20151 21140 23057
1655B3057J090J107K542K226J547L082L915L459N598Q852J0062J2505J7025J9186K0872K5963
1653A62088L0169L2088L7754M6072N3314O5587Q2663R2322R6483J02011Q2790R789q4543j34658
1651F73929j26021r7346p6536o1363m7391l7778l2288k6907k1123j6661j2814q820o739o673
1649I5469n197k425j514q48J947L863M742R066J4867J8092K2834L0435L4988L8989M8329N6699
1646C70336O1436P2349Q8291J02949J27765J62702J82268J89805K04100J70544J7745j85032
1644A565258k84020k51551j88505j51227j20053r0119p4810o4965n1477m1853l5133k5021
1643A86524j8135j8237j7232j3734j2686j1362p286m908m396j736J505L053N555R695J2906
1640A09526J5564J9334K3169K6286L0208L5790M2275N0483O2864P7140Q6610R1610R3978P3795
$$ plain form
1655 23057 24147 25254 27796 30022 31569 34651 38566 42025 47623 56475 66537 79042 96067 115253 136125 162088
1653 162088 192257 224345 262099 308171 361485 427072 509735 602057 698540 800551 883341 893130 808587 673929
1651 673929 547908 450562 374026 312663 265272 227494 195206 168299 147176 130515 117701 108881 102142 95469
1649 95469 90272 87847 86333 85485 87432 91295 96037 105103 119970 138062 160896 191331 226319 265308 313637 370336
1646 370336 431772 504121 592412 695361 823126 985828 1168096 1357901 1562001 1732545 1750290 1565258
1644 1565258 1281238 1029687 841182 689955 569902 479783 404973 340008 288531 246678 211545 186524
1643 186524 168389 150152 132920 119186 106500 95138 87852 82944 78548 76812 78317 81370 86925 96620 109526
1640 109526 125090 144424 167593 193879 224087 259877 302152 352635 415499 492639 579249 670859 764837 838632
1638H38632O647q2742j32200j22464r3249p4470n9857m5227l7338l2865k6122k1028j8243
1637I9474j3509r759j0036r517o916o366o490m549l432l790k674j608k509k419r47j119j677
1634A2157o08k91j150o49R2o39p37J31k44p56Q0K26o24l51J92l36l30K81k04o36J06J78m87
1631E401q4L53l15l77K83k1l86J84J24n35j80K12l39k53M48J12l51J55J99l60p7K71k48k96
1627C920K55M2k82J18J01l42m5K46j85j58K98J7k86J03J17k16P8K42k45k21K02l5k38J42J05
1623C733k02P6J44k79l1M21p8m58M1J37k39%K29j53j32K37j9k45J18R4k58kK41q5p9K47N1
1619C509j63P6L3k10j0R0j65m1J62j51j84K50J29k33N2K34j39j52J05j00j77J62P2j89J02
1616C062K08k08j64J85n1k60J04K14n1j8L9j35k8J42o6n7K50M0l39q5J79n1r7J07O2M8J73
$$ plain form
1638 838632 845279 762537 630337 507873 414624 340154 280297 235070 197732 164867 138745 117717 99474
1637 99474 85965 76206 66170 56653 49737 43371 36881 32332 28900 25110 22436 20828 18319 15900 14953 13834 12157
1634 12157 11549 11258 10108 9459 9551 8912 8175 8306 8062 7306 7386 7612 6988 6637 6829 6493 6163 6444 6240 5604 5710 5888 5401
1631 5401 5317 5670 5355 4978 5261 5240 4854 5038 5162 4627 4447 4659 4320 4067 4515 4627 4276 4431 4630 4270 4193 4464 4216 3920
1627 3920 4175 4217 3935 4053 4154 3812 3767 4013 3828 3670 3968 3985 3699 3802 3919 3703 3781 4023 3778 3557 3759 3724 3486 3628 3733
1623 3733 3531 3607 3751 3472 3441 3862 3784 3326 3367 3504 3265 3265 3494 3341 3209 3446 3427 3182 3300 3394 3136 3134 3375 3290 3211 3458 3509
1619 3509 3346 3422 3455 3245 3235 3325 3160 3119 3281 3130 2946 3196 3325 3092 3144 3378 3239 3087 3192 3092 2915 3077 3149 2960 3062
1616 3062 3270 3062 2898 3083 3032 2772 2876 3090 3039 3021 3060 2925 2897 3039 2973 2916 3166 3206 2867 2782 2961 2910 2813 2920 2982 3030 3203
1612C203k6k17J6P5j52m5R6j18n2K57L4k37R3K08j72j34J47o3j97J02O9k22n7J63J0PJ56J3
1608B957q0P5j2j87oJ22l5mJ20j3m0J12l3k21j8J24l2k9M9q7o9J63R6j47j36n1j2J40J47p3
1603B820o6R7Op3P2N3n4O6N9j35K1K48m6k95l7R5m3O7J49j36k26J4M6j8J13R3o6K6R0j14j17
1599B709O6l4j42N6J00q1k8R2kjQ8m7j28M3L8j12J7J66M1lP9l6j05O6O6j23q2M4j7k6R0Q5
1594B879J3k9j02o1P9Nj15O6J49j15j68O6N5m1J00Q4j39q8K0j31q7J78M6k04RJ94k7q9J01
1590B648N9m2N6L2r4NJ07J5J6P1l2n1N2m9j62mQ1nP0J26p0j05P7Qj20N7J28q4j13po6k6J31
1585B709J0j15J00J42j30r4J39M0m4J44R4j45n4P8n8MK48J08j28P2K92J71J10K20K11K36M62
1581D822N73M72M43M96L83L0m16o62n60l94m29m68l31j98j81j68j08oO2l7j92j44J3M5M0N8
$$ plain form
1612 3203 3177 2960 2976 3051 2899 2854 2950 2832 2780 3037 3071 2834 2927 3135 2963 2829 2976 2913 2716 2818 2887 2665 2608 2771 2781 2788 2944 2957
1608 2957 2877 2952 2940 2753 2747 2869 2834 2830 2950 2937 2897 3009 2976 2755 2737 2861 2829 2800 2849 2762 2693 2856 2952 2805 2669 2618 2606 2746 2893 2820
1603 2820 2754 2851 2857 2784 2856 2909 2855 2921 2980 2845 2866 3114 3068 2773 2736 2831 2788 2855 3004 2868 2642 2656 2702 2684 2797 2890 2824 2850 2940 2826 2709
1599 2709 2775 2741 2599 2655 2755 2674 2646 2738 2736 2735 2823 2776 2648 2691 2729 2617 2634 2800 2841 2838 2917 2881 2776 2842 2908 2785 2703 2747 2730 2704 2794 2879
1594 2879 2892 2863 2761 2700 2779 2784 2669 2735 2884 2769 2601 2667 2722 2681 2781 2865 2726 2638 2658 2527 2440 2618 2664 2460 2469 2663 2636 2547 2648
1590 2648 2707 2665 2721 2753 2659 2664 2771 2786 2802 2873 2841 2790 2842 2793 2631 2627 2708 2703 2773 2899 2829 2724 2801 2809 2689 2746 2874 2790 2677 2670 2604 2578 2709
1585 2709 2719 2604 2704 2846 2716 2622 2761 2801 2757 2901 2995 2850 2796 2874 2816 2820 3068 3176 3048 3120 3412 3583 3693 3913 4124 4360 4822
1581 4822 5395 5867 6310 6806 7189 7219 6803 6141 5581 5187 4758 4290 3959 3761 3580 3412 3304 3298 3360 3323 3131 2987 3000 3045 3085 3143
1577C143rm4P5J35P9J33K08J42J41K71K72K18L04L44L33N81R05R00Q08R69J075P18p2r53j424
1574I252j260q98p40o13m28l88m09l16k53k05m4j8k20k35l4j7r5j7pr7jJ09%j6J53J50L8P6
1569C467R6P1K30L37J98K21M70M60K90L86M91K85k5l37o31o12l78m03n03k88j00j81j39J6
1566C421j07k44o2P0o7j07K5M8l4p9q6l2K8j5o8n3p3o7N4Q0l0NR5%k6J25N4j85j44J9rJ2J05
1561B653m6j85K7J78L6J2J05k9j27N2R3j07j02Q0M0j27j00N6J32O7m3k9O7L6p2n4J6L3L7l8
1557B661j53l9J83Q9j31m5Q8n1j33LN1J0Q8J38M5m0q7j01L3J42j4j90j22nL3P7L7p0oJ13J7
1552B621q2%J5p8m5Kn4NJ25K3j23l6P0L3J3K0j6QN7K1K7J15Q1l9o1p6j04J2J05l2j24oN0P
1547B534L3Nj24j08Kj0PJ15M5j20n9Q3N1l2o1n7L7R8o0j66K4J77Q9J1ro1J6J50N0p5M6R4p6
$$ plain form
1577 3143 3134 3090 3165 3300 3379 3512 3720 3862 4003 4274 4546 4764 5068 5412 5745 6326 7231 8131 8939 9908 10983 11701 11629 10676 9252
1574 9252 7992 7094 6354 5741 5313 4925 4516 4200 3947 3742 3698 3680 3460 3225 3191 3174 3079 3062 3055 2958 2957 3066 3066 3050 3203 3353 3391 3467
1569 3467 3563 3634 3864 4201 4399 4620 5090 5550 5840 6226 6717 7002 6977 6640 6009 5397 5019 4616 4113 3825 3725 3544 3405 3421
1566 3421 3314 3070 3008 3078 3011 2904 2929 2977 2943 2864 2778 2746 2774 2759 2691 2638 2565 2498 2552 2632 2602 2607 2702 2702 2676 2801 2855 2670 2526 2545 2536 2548 2653
1561 2653 2607 2422 2449 2627 2663 2675 2780 2751 2624 2676 2769 2662 2560 2640 2680 2553 2453 2509 2641 2708 2665 2636 2703 2739 2667 2613 2629 2662 2699 2661
1557 2661 2508 2469 2652 2741 2610 2565 2653 2602 2469 2472 2523 2533 2621 2759 2804 2764 2677 2576 2609 2751 2737 2547 2425 2420 2453 2530 2567 2497 2491 2604 2621
1552 2621 2539 2539 2554 2476 2431 2433 2379 2384 2509 2532 2409 2373 2443 2476 2489 2509 2493 2501 2558 2579 2606 2721 2802 2763 2702 2626 2522 2534 2639 2607 2483 2477 2527 2534
1547 2534 2567 2572 2448 2340 2342 2332 2339 2454 2499 2379 2320 2403 2454 2422 2361 2304 2341 2439 2379 2213 2237 2414 2503 2514 2505 2444 2460 2610 2660 2585 2631 2725 2649
$$ [...]
##END=	
##TITLE=	RM1002-H
##JCAMP-DX=	6.0	$$ MestReNova 14.1.2-25024
##BLOCK_ID=	3
##DATA TYPE=	NMR PEAK TABLE
##DATA CLASS=	PEAK TABLE
##CROSS REFERENCE=	NMR SPECTRUM: BLOCK_ID=2                                     
##.OBSERVE FREQUENCY=	599.77881209999998191
##.OBSERVE NUCLEUS=	^1H
##NPOINTS=	43
##FIRSTX=	2.1032704541408651089
##LASTX=	4.7853489500632813147
##XFACTOR=	1
##YFACTOR=	1
##FIRSTY=	0.39687174289151533335
##XUNITS=	PPM
##YUNITS=	ARBITRARY UNITS
##PEAK TABLE=	(XYW..XYW)
2.1032704541408651089,0.39687174289151533335,0.0022554120294716729737
2.6137507276906242204,0.35161766096933622094,0.0028790695007718950307
2.624283133467150364,0.71997529025757600607,0.0026543324294180264435
2.6347537460762220363,0.36138920564211168829,0.0026182879781177881111
2.7316382589320915564,64.778538696921287965,0.0023565157524460763651
2.7421885678832493838,135.00743458470108749,0.0024084680634842104904
2.7526760663303617704,67.848097433923726385,0.0024182360334469008879
2.7707060403796806014,0.17344370191083072208,0.0029806581505836577013
2.8456169635099302084,0.34263407575837506736,0.0028212512208092084716
2.8561480498887901192,0.71224093729128801211,0.0030079947657862290793
2.8666567968727934002,0.38300895117399597067,0.0030123989459807922961
2.9122303542633720674,0.039788025100557497526,0.0030039372416615678536
3.5014115396167704297,0.050862051981793797439,0.12169715848027796989
3.6061531477014607816,0.38019276205766294741,0.0027181703561389011434
3.6166581795347743089,0.75752920544008017778,0.0026343733019619009796
3.6272524227965456944,0.34857908118726926849,0.0028484030075752119447
3.7291509097428980901,67.636595652192099237,0.0025012993582390380572
3.7396628365520561132,134.31735670085842571,0.0024529570419034359835
3.7501641929586484459,64.575875577392281457,0.0024440101987190931965
3.8474340198231082866,0.40411792889302333709,0.0027470976405378115873
3.8578724179810937045,0.7735382416304987796,0.0027074730199782431894
3.8684655192639931798,0.36208879688209905101,0.0028620324159778390109
4.0209464146632107884,0.047568066661367626458,0.002793738928576551192
4.0280902682714225804,0.066564127635897224478,0.0031859422765917518733
4.0361397650795707293,0.044337412105823224839,0.0018054068485781509575
4.2549892246158487197,0.067789916978082884191,0.0026981094676155614742
4.2653856845595408132,0.12959630062491958591,0.0029884736291608923926
4.276013903003373251,0.068050354878027630168,0.0022075709018016011209
4.749388852325096444,0.08508667251088181116,0.0018083314359045852583
4.7507281733604740381,0.12076828044321924471,0.0019081435262033050529
4.7526074255153085701,0.32503295754606520429,0.0024479436945422710856
4.7545527430129954638,0.1838354998387059791,0.001765915323029411876
4.756943155476204943,0.28220670051313700988,0.00095366770663371806718
4.7576823552468860967,0.19275095358285368463,0.0014909640434801448364
4.7664834610949426974,255.05860872110403648,0.0021290415361311840724
4.7761902497695452041,0.098605275195474920147,0.00038634144050262781605
$$ [...]
4.7791283460355051815,0.31301235803069704655,0.0026405120209309252029
4.7804833074663530823,0.18670987929013668771,0.00046108495146685891941
4.7814549442909957122,0.18696176395608099519,0.0014541898796912901271
4.7830565118839558636,0.18891746061512965094,0.0016481284598829813118
4.783863121218072223,0.11458049713748515164,0.00095989993748094341267
4.7853489500632813147,0.087517435151307165775,0.00030563059925403933447
##$MNOVA/PEAK_DATA_TABLE=	(T,F,A,ST,SP,APT,APC)
$$ Complementary to PEAK TABLE
$$ T: Type
$$ F: Flags
$$ A: Annotation
$$ ST: Shape Type
$$ SP: Shape Parameter
$$ APT: Attached Peaks Type
$$ APC: Attached Peaks Count
Impurity,Artifact|Weak,,1,-0.25797435903140364388,0,0
Compound,Artifact|Impurity|Weak|13C Sat.,,1,-0.10074136238058641057,0,0
Compound,Artifact|Impurity|Weak|13C Sat.,,1,-0.51349257773876655353,0,0
Compound,Artifact|Impurity|Weak|13C Sat.,,1,-0.21064025384602708124,0,0
Compound,None,,1,-0.17469776509714574075,0,0
Compound,None,,1,-0.15457473346251693336,0,0
Compound,None,,1,-0.20228658389778814142,0,0
Artifact,Artifact|Weak,,1,-0.80000000000000004441,0,0
Compound,Artifact|Impurity|Weak|13C Sat.,,1,-0.42784676133562299372,0,0
Compound,Artifact|Impurity|Weak|13C Sat.,,1,0.32125819743094136127,0,0
Compound,Artifact|Impurity|Weak|13C Sat.,,1,0.019789626831277461194,0,0
Artifact,Artifact|Weak,,1,1.2116414593045665704,0,0
Artifact,Artifact|Weak,,1,0.044325003452529140868,0,0
Compound,Artifact|Impurity|Weak|13C Sat.,,1,0.033509575907255471916,0,0
Compound,Artifact|Impurity|Weak|13C Sat.,,1,-0.2000000000000000111,0,0
Compound,Artifact|Impurity|Weak|13C Sat.,,1,-0.13777033241051256374,0,0
Compound,None,,1,-0.040333636749190056314,0,0
Compound,None,,1,-0.27837178424555369949,0,0
Compound,None,,1,-0.059358522605083841039,0,0
Compound,Artifact|Impurity|Weak|13C Sat.,,1,-0.11699083899108414508,0,0
Compound,Artifact|Impurity|Weak|13C Sat.,,1,0.25066967519908733841,0,0
Compound,Artifact|Impurity|Weak|13C Sat.,,1,-0.47967897659035724223,0,0
Artifact,Artifact|Weak,,1,-0.005427422281261244652,0,0
Impurity,Artifact|Weak,,1,1.2008016160959524843,0,0
Artifact,Artifact|Weak,,1,-1,0,0
Impurity,Artifact|Weak,,1,1.1602686726175488463,0,0
Impurity,Artifact|Weak,,1,-0.063765144719083510783,0,0
Impurity,Artifact|Weak,,1,-0.88727484176782445147,0,0
Artifact,Artifact|Weak,,1,1.999999999999999778,0,0
Artifact,Artifact|Weak,,1,1.999999999999999778,0,0
Artifact,Artifact|Weak,,1,1.999999999999999778,0,0
Artifact,Artifact|Weak,,1,1.999999999999999778,0,0
Artifact,Artifact|Weak,,1,1.999999999999999778,0,0
Artifact,Artifact|Weak,,1,1.999999999999999778,0,0
Solvent,None,,1,-0.032501395072078859139,0,0
Artifact,Artifact|Weak,,1,-0.80000000000000004441,0,0
Artifact,Artifact|Weak,,1,-1,0,0
Artifact,Artifact|Weak,,1,-0.2000000000000000111,0,0
Artifact,Artifact|Weak,,1,-1,0,0
Artifact,Artifact|Weak,,1,-0.927446310323691403,0,0
Artifact,Artifact|Weak,,1,1,0,0
Artifact,Artifact|Weak,,1,-1,0,0
Artifact,Artifact|Weak,,1,-0.50155462540217854439,0,0
##END=	
##END=	
