##TITLE=1H NMR: Isopropyl methylphosphonofluoridate (Sarin); S.1.A.01; [107-44-8]
##JCAMPDX= 6.0         $$ Bruker NMR JCAMP-DX V2.0
##DATA TYPE= NMR SPECTRUM
##DATA CLASS= NTUPLES
##ORIGIN= UXNMR, Bruker Analytische Messtechnik GmbH
##OWNER= markku
$$ 1.90 TopSpin 3.5 pl 5
$$ 2016-06-27 15:47:18.992 +0300  VERIFIN\htkoskel@EDEMO
$$ Compression mode = diff/dup
##.OBSERVE FREQUENCY= 400.136492236791
##.OBSERVE NUCLEUS= ^1H
##.ACQUISITION MODE= SEQUENTIAL
##.ACQUISITION SCHEME= undefined
##.AVERAGES= 32
##.DIGITISER RES= 16
##SPECTROMETER/DATA SYSTEM= amx400
##.PULSE SEQUENCE= zg45
##.SOLVENT NAME= CDCl3
##.SHIFT REFERENCE= INTERNAL, CDCl3, 1, 11.03137
##AUDIT TRAIL= $$ (NUMBER, WHEN, WHO, WHERE, PROCESS, VERSION, WHAT)
$$ ##TITLE= Audit trail, TopSpin 3.5 pl 5
$$ ##JCAMPDX= 5.01
$$ ##ORIGIN= Bruker BioSpin GmbH
$$ ##OWNER= htkoskel
$$ $$ C:/Bruker/TopSpin3.5pl5/data/OCAD/05-3-0009/1/pdata/1/auditp.txt
$$ ##AUDIT TRAIL=  $$ (NUMBER, WHEN, WHO, WHERE, PROCESS, VERSION, WHAT)
(   1,<2016-06-27 15:46:55.528 +0300>,<VERIFIN\htkoskel>,<EDEMO>,<jcamp>,<TopSpin 3.5.5>,
      <fromjdx created from
       Z:\OCAD\JCAMP\05-3-0009.dx
       data hash MD5: 32K
       D6 BB 7E 7F A5 26 40 5A 87 EF F6 0B C4 E8 CD 69>)
$$ ##END=
$$ 
$$ $$ hash MD5
$$ $$ C8 6B 6A 1E 28 7D 29 01 12 B5 BD 64 E0 7F 2B 5D
##$RELAX= 
##$RELAX= 
##$RELAX= 
##$RELAX= 
##$RELAX= 
##$RELAX= 
$$ Bruker specific parameters
$$ --------------------------
##$DATPATH= <C:/Bruker/TopSpin3.5pl5/data/OCAD>
##$EXPNO= 1
##$NAME= <05-3-0009>
##$PROCNO= 1
##$ACQT0= 0
##$AMP= (0..31)
100 100 100 100 100 100 100 100 100 100 100 100 100 100 100 100 100 100
100 100 100 100 100 100 100 100 100 100 100 100 100 100
##$AMPCOIL= (0..19)
0 0 0 0 0 0 0 0 0 0 0 0 0 0 0 0 0 0 0 0
##$ANAVPT= 1
##$AQSEQ= 0
##$AQ_mod= 2
##$AUNM= <au_zg>
##$AUTOPOS= <>
##$BF1= 400.13
##$BF2= 400.13
##$BF3= 400.13
##$BF4= 500.13
##$BF5= 500.13
##$BF6= 500.13
##$BF7= 500.13
##$BF8= 500.13
##$BWFAC= (0..63)
0 0 0 0 0 0 0 0 0 0 0 0 0 0 0 0 0 0 0 0 0 0 0 0 0 0 0 0 0 0 0 0 0 0 0 0
0 0 0 0 0 0 0 0 0 0 0 0 0 0 0 0 0 0 0 0 0 0 0 0 0 0 0 0
##$BYTORDA= 0
##$CAGPARS= (0..11)
0 0 0 0 0 0 0 0 0 0 0 0
##$CHEMSTR= <none>
##$CNST= (0..63)
1 1 1 1 1 1 1 1 1 1 1 1 1 1 1 1 1 1 1 1 1 1 1 1 1 1 1 1 1 1 1 1 1 1 1 1
1 1 1 1 1 1 1 1 1 1 1 1 1 1 1 1 1 1 1 1 1 1 1 1 1 1 1 1
##$CPDPRG= (0..8)
<waltz16> <mlev> <mlev> <mlev> <mlev> <mlev> <mlev> <mlev> <mlev>
##$D= (0..63)
0 16 0 0 0 0 0 0 0 0 0 0 0 0 0 0 0 0 0 0 0 0 0 0 0 0 0 0 0 0 0 0 0 0 0
0 0 0 0 0 0 0 0 0 0 0 0 0 0 0 0 0 0 0 0 0 0 0 0 0 0 0 0 0
##$DATE= 718967118
##$DE= 135
##$DECBNUC= <off>
##$DECIM= 0
##$DECNUC= <off>
##$DECSTAT= 4
##$DIGMOD= 0
##$DIGTYP= 1
##$DQDMODE= 0
##$DR= 16
##$DS= 0
##$DSPFIRM= 0
##$DSPFVS= 0
##$DTYPA= 0
##$EXP= <>
##$FCUCHAN= (0..9)
0 0 0 0 0 0 0 0 0 0
##$FL1= 0
##$FL2= 89
##$FL3= 90
##$FL4= 90
##$FN_INDIRECT= (0..7)
0 0 0 0 0 0 0 0
##$FOV= 20
##$FQ1LIST= <freqlist>
##$FQ2LIST= <freqlist>
##$FQ3LIST= <freqlist>
##$FQ4LIST= <freqlist>
##$FQ5LIST= <freqlist>
##$FQ6LIST= <freqlist>
$$ [...]
##$VALIDCODE= 0
##$VALIST= <valist>
##$VCLIST= <CCCCCCCCCCCCCCC>
##$VDLIST= <DDDDDDDDDDDDDDD>
##$VPLIST= <PPPPPPPPPPPPPPP>
##$VTLIST= <TTTTTTTTTTTTTTT>
##$WBST= 256
##$WBSW= 4
##$XGAIN= (0..3)
0 0 0 0
##$XL= 0
##$YL= 0
##$YMAX_a= 0
##$YMIN_a= 0
##$ZGOPTNS= <>
##$ZL1= 120
##$ZL2= 120
##$ZL3= 120
##$ZL4= 120
##$ABSF1= 11.03137
##$ABSF2= -0.5388165
##$ABSG= 3
##$ABSL= 3
##$ALPHA= 0
##$AQORDER= 0
##$ASSFAC= 0
##$ASSFACI= 0
##$ASSFACX= 0
##$ASSWID= 0
##$AUNMP= <proc_no>
##$AXLEFT= 0
##$AXNAME= <>
##$AXNUC= <off>
##$AXRIGHT= 0
##$AXTYPE= 0
##$AXUNIT= <>
##$AZFE= 0.1
##$AZFW= 0.1
##$BCFW= 1
##$BC_mod= 2
##$BYTORDP= 0
##$COROFFS= 0
##$CY= 15
##$DATMOD= 1
##$DC= 2
##$DFILT= <>
##$DTYPP= 0
##$ERETIC= no
##$F1P= 11.0313701629639
##$F2P= -0.539169635430179
##$FCOR= 0.5
##$FTSIZE= 0
##$FT_mod= 7
##$GAMMA= 1
##$GB= 0
##$INTBC= 1
##$INTSCL= 4.404202e-010
##$ISEN= 128
##$LB= 0.1
##$LEV0= 0
##$LPBIN= 0
##$MAXI= 18.44205
##$MC2= 0
##$MEAN= 0
##$ME_mod= 0
##$MI= 1
##$MddCEXP= no
##$MddCT_SP= no
##$MddF180= no
##$MddLAMBDA= 0
##$MddMEMORY= 0
##$MddMERGE= 0
##$MddNCOMP= 0
##$MddNITER= 0
##$MddNOISE= 0
##$MddPHASE= 0
##$MddSEED= 0
##$MddSRSIZE= 0
##$Mdd_CsALG= 0
##$Mdd_CsLAMBDA= 1
##$Mdd_CsNITER= 0
##$Mdd_CsNORM= 0
##$Mdd_CsVE= yes
##$Mdd_CsZF= 0
##$Mdd_mod= 0
##$NCOEF= 0
##$NC_proc= -2
##$NLEV= 6
##$NOISF1= 6.5
##$NOISF2= 5.6
##$NSP= 1
##$NTH_PI= -2928810
##$NZP= 0
##$OFFSET= 11.03137
##$PC= 1
##$PHC0= 61.54339
##$PHC1= 40.6
##$PH_mod= 1
##$PKNL= yes
##$PPARMOD= 0
##$PPDIAG= 0
##$PPIPTYP= 0
##$PPMPNUM= 100
##$PPRESOL= 1
##$PSCAL= 0
##$PSIGN= 0
##$PYNMP= <proc.py>
##$RDF1= 0
##$RDF2= 0
##$RDFWHM= 0
##$RDINT= 0
##$RDPOS= 0
##$REVERSE= no
##$SF= 400.134393009733
##$SI= 32768
##$SIGF1= 2
##$SIGF2= 1
##$SINO= 6459.115
##$SIOLD= 1024
##$SPECTYP= <>
##$SREF_mod= 1
##$SREGLST= <1H.CDCl3>
##$SSB= 0
##$STSI= 32768
##$STSR= 0
##$SW_p= 4629.77091902536
##$SYMM= 0
##$S_DEV= 0
##$TDeff= 0
##$TDoff= 0
##$TI= <>
##$TILT= no
##$TM1= 0
##$TM2= 0
##$TOPLEV= 0
##$USERP1= <user>
##$USERP2= <user>
##$USERP3= <user>
##$USERP4= <user>
##$USERP5= <user>
##$WDW= 1
##$XDIM= 32768
##$YMAX_p= 392283486
##$YMIN_p= -359814
##$CURPLOT= <A4>
##$CURPRIN= <$1#1#0#1#1#1#1#1#0#-1#-1#1#-1>
##$DFORMAT= <normdp>
##$LAYOUT= <+/1D_H.xwp>
##$LFORMAT= <normlp>
##$PFORMAT= <normpl>
$$ End of Bruker specific parameters
$$ ---------------------------------
##NTUPLES= NMR SPECTRUM
##VAR_NAME=  FREQUENCY,     SPECTRUM/REAL,   SPECTRUM/IMAG
##SYMBOL=    X,             R,               I
##VAR_TYPE=  INDEPENDENT,   DEPENDENT,       DEPENDENT
##VAR_FORM=  AFFN,          ASDF,            ASDF
##VAR_DIM=   32768,         32768,           32768
##UNITS=     HZ,            ARBITRARY UNITS, ARBITRARY UNITS
##FACTOR=    0.141289395722209, 1,           1
##FIRST=     4629.62962962964, 30523,        -108638
##LAST=      0,             50886,           -2912089
##MIN=       0,             -359814,         0
##MAX=       4629.62962962964, 392283486,    0
$$ Real data points
##PAGE= N=1
##DATA TABLE= (X++(R..R)), XYDATA
$$ [...]
12281a521o9042K6473N819J0162A1179d7517b492l6717k1132J8370j1454K4232
12269b9193L201P88h674l1290C6222E080f142C1920A5389l170a8363l8477K3247
12256c3593N803B6033j1180k864b3097k8096K2893M802k2568k2082q337e246o1879
12243f7125b8002P100l3154o684M464M905J010a6j9382j8108J4953k0519Q863
12230c4209J5636B4948I728b4785k1198K0438k3020I253f5959b6224Q299k1482
12218c9407J1852L980N855j1259A1910e3252J4665J0060M368B5878l830a1356
12205i636C8518c4086l6908b7960J2286n8486b7881j2613A0228c8590k7055L1011
12193c4634a1229C1765O459h311j6473j4160J976a2308A464b4394J484j3680a6475
$$ y = [-1521, -70563, -44090, -38271, -28109, 11179, -47517, -2492, -39209, -60341, -41971, -53425, -29193, -25992, -25204, -8674, -39964, 36222, 5080, -6142, 31920, 15389, 12219, -18363, -56840, -33593, -27790, 26033, 14853, 11989, -23097, -51193, -28300, -23498, -46066, -68148, -76485, -5246, -67125, -28002, -20902, -54056, -60740, -56276, -51371, -50361, -16, -19398, -37506, -22553, -43072, -34209, -18573, 24948, 9728, -24785, -45983, -25545, -48565, 9253, -65959, -26224, -17925, -39407, -27555, -23575, -17720, -28979, 11910, -53252, -38587, -28527, -24159, 25878, 22048, -11356, -9636, 38518, -34086, -70994, -27960, -15674, -74160, -27881, -40494, 10228, -38590, -65645, -34634, -11229, 31765, 38224, -8311, -24784, -38944, -36968, -12308, 1464, -24394, -22910, -36590, -16475]
12179c738I408b7916k0568A0804L1025A0529e3722a5813D1611a8734k5819L713
12167d0840E148A745e564l3419E724a5103A9702a4749l7279A5339g453n2626J2228
12154d7851A9139R445C302c4188k6915a2832L064k4761C1166c342C5576d5470
12141e5285b3460j132j1714M857l909N720f671m7183D032b5202J1251r758j6655
12128d0364f374k9211n694p861k5959k4685L3502K0251a9432F3733d4487J8023
12116b6464J0677j3872A5543R171L840f640F7241b5774h843a679D6614a2379H283
12102B2158m154J2141b1432m3535j470a3988k4957l8168g634A4014K6215n770
12090C4459a3740k8821O272a0178k4126B0974a4694l2844J8704K025j09l6859
$$ y = [-3738, 9408, -27916, -48484, 10804, 41829, 10529, -53722, -15813, 41611, -18734, -44553, -40840, 5148, 1745, -5564, -38983, 5724, -15103, 19702, -14749, -52028, 15339, -7453, -60079, -47851, 19139, 28584, 3302, -34188, -61103, -12832, -9768, -34529, 31166, -3342, 35576, -45470, -55285, -23460, -24592, -36306, -31449, -35358, -29638, -6671, -53854, 4032, -25202, -13951, -23709, -40364, -6374, -35585, -41279, -49140, -75099, -99784, -66282, -46031, -19432, 63733, -44487, -26464, -15787, -29659, 15543, 24714, 28554, -6640, 67241, -25774, -8843, -1679, 46614, -12379, 8283, 22158, 18004, 30145, -21432, -64967, -66437, -13988, -38945, -77113, -7634, 14014, 40229, 34459, -13740, -42561, -36289, -10178, -34304, 20974, -14694, -47538, -28834, -26809, -26918, -63777]
12078f3777b3717J728p7B6736n473e4392a9275m8195N959K0142m6722m5087O3758
12065f9420c3167k1580a7860F839a7508i18B2210C194a0880b447k4731J3510k3635
12052c7303i512j9981i466j0466B9152P693c6937A1340A843b1095B1819G32a9340
12038B9565r404c2316P119B6240a2497I901M5786d6142p505K4868m763K033l1643
12025f3152b0177A3281K761f4869D65M6638J0232a5483B5394p653c3897k1656
12013e5553K1508j4105B338Q4073b9958b777l1608O011J3038k9636P651J0713
12001b6608j16n2253d207n9482k0883J8272h424n8916c0660a1836m5313b1108
11988b2257k3963j4934j98i644l3093J0585A131e9820j4609K2551J7483j128N159
$$ y = [-63777, -23717, -21989, -22066, 26736, 21263, -54392, -19275, -67470, -61511, -41369, -88091, -133178, -69420, -33167, -54747, -17860, 6839, -17508, -918, 22210, 3194, -10880, -2447, -27178, -13668, -37303, -9512, -29493, -9466, -19932, 29152, 36845, -36937, 11340, 1843, -21095, 21819, 732, -19340, 29565, 20161, -32316, -25197, 26240, -12497, 9901, 55687, -46142, -53647, -28779, -33542, -31509, -63152, -20177, 13281, 16042, -64869, 465, 47103, 57335, -15483, 25394, 17741, -33897, -55553, -34045, -48150, 2338, 86411, -29958, -2777, -34385, -28374, -15336, -44972, -37321, -26608, -26724, -78977, -4207, -63689, -84572, -66300, -8424, -67340, -30660, -11836, -57149, -21108, -22257, -46220, -61154, -61352, -9644, -42737, -32152, 1131, -59820, -74429, -51878, -34395, -35523, -30364]
11975c0364l4527K6845A1053B303M0481f1960l0693b8328C2278b7649j9916n5039
11963a02604c2014r871j3327J9045j4393H075d5118l5182B7797b0087k239A4966
11950c1002d498k128A7573J4903D392f041A3877b5798J734A4707a8040c802n502
11937i304k7481f335D5254D777L3807g084C9782c798B164b0737c449j5901N736
11924a3614J359k1250N583i638I757f6m958m3954Q905a4048j1825M494j3021J2200
11910b2200j1106C1996C305b1543B0546b3256J765A306b8113a1683j2439j016
11898b5138J065d02l1626g147j6114F216L456b5100H690J4231a1543C462L4730
11885C8192A8712m438d1355a987B7829L5710i246d54B019L0674b3231l1818K573
$$ y = [-30364, -64891, -38046, 11053, 2303, 42784, -61960, -92653, -28328, 32278, -27649, -47565, -102604, -32014, -41885, -55212, -36167, -50560, 8075, -45118, -80300, 27797, -20087, -22326, 14966, -31002, -4498, -6626, 17573, 32476, 4392, -6041, 13877, -25798, -24064, 14707, -18040, -3802, -9304, -36785, -6335, 45254, 4777, 38584, -7084, 39782, -3798, 2164, -20737, -3449, -19350, -13614, -12255, -33505, -27922, -9638, 9757, -66, -5024, -48978, -40073, -14048, -25873, -21379, -34400, -22200, -33306, 31996, 3305, -21543, 20546, -23256, -21491, 1306, -28113, -11683, -24122, -25138, -24073, -402, -32028, -7147, -23261, 6216, 9672, -25100, 8690, 22921, -11543, 3462, 38192, 18712, 14274, -41355, -1987, 27829, 63539, -9246, -454, 2019, 32693, -23231, -55049, -52476]
11872e2476R652a569B0196a8751o689D329d4167n938j6236d935j7537g160A4163
11858b1137A3197J2352G343a5662k0620j3725J9556C057R876J2667a1992l4560
11846d6552R323l689A4709N815c7626e565k3118j6610a0810K528k0203n451k0726
11833e4662J0766J0187d865k7193j085m9830p188M3782R230a5981j6727r868A0764
11819C3189o564E37h5212c6414k0392a6001n1876J9337K271h547F439a2275A5684
11805C5210c8935k1716a6991l9483j4059b9722m4424b7125k4354n325C3063j0139
11793B2924e9391J45b6472k2671J0445C2539l240a2098A7255b9894A0768g924
11780a3625j3514k9104Q237K2385k372h56j7351C392R41a3347O649j0665n1592
$$ y = [-52476, -42824, -1569, 20196, -18751, -25440, 4329, -44167, -50105, -66341, -4935, -22472, -7160, 14163, -21137, 13197, 25549, 7343, -15662, -36282, -50007, -30451, 3057, 12933, 25600, -11992, -46552, -37229, -40918, 14709, 20524, -37626, -5565, -28683, -45293, -10810, -8282, -28485, -33936, -54662, -43896, -33709, -4865, -32058, -33143, -82973, -90161, -46379, -37149, -15981, -32708, -42576, 10764, 33189, 26625, 537, -85212, -36414, -56806, -16001, -67877, -48540, -46269, -8547, 6439, -12275, 15684, 35210, -38935, -60651, -16991, -56474, -70533, -29722, -74146, -27125, -51479, -56804, 33063, 22924, -59391, -59246, -26472, -49143, -38698, 32539, 29299, -12098, 17255, -29894, 10768, -7924, -13625, -27139, -56243, -48006, -25621, -27993, -856, -18207, 3392, 4333, -13347, -6698, -17363, -68955]
11767f8955b8053a3433o288m7773j9367c030A9006i261k2381l6326b004C209a8118
11753D2889g405k2789e306A9159f278k095j9167m0673c0637j902a147l6941N878
11740c2210p711a9081k6815M910j0546r715o691j1175c5058k5035m38J831I878
11726h428A5367l67g097D375L0854A1062a052j3011k2983j2643m973J4918R47
11713c8797Q809F559b2483e493l7736n639J7312j3236a0416j0535j5377N386i96
11699i205j5621f927k6362a0563D324J207J0044a5025A701i133j3900A2845d9445
11685g0681n5530b6010R907k0132R253j0193B3268a2923n6432M847K7386k5867
11673f2989J2155j707J3181Q11j2883r305K1495I125a447m8794b5023R974m464
$$ y = [-68955, -28053, -13433, -19721, -67494, -86861, -3030, 19006, -9261, -31642, -67968, -2004, 3209, -18118, 42889, -7405, -30194, -5306, 19159, -6278, -8373, -27540, -68213, -30637, -32539, -1147, -38088, -32210, -39921, -19081, -45896, -40986, -51532, -61247, -67938, -79113, -35058, -60093, -60531, -58700, 9878, -8428, 15367, 15000, -7097, 4375, 35229, 11062, -1052, -14063, -37046, -49689, -54662, -39744, -38797, -29988, 6559, -22483, -5493, -43229, -48868, -31556, -44792, -10416, -20951, -36328, -30942, -996, -9205, -24826, -6927, -33289, -10563, 4324, 5531, 15575, -15025, 1701, -9133, -23033, 12845, -49445, -70681, -126211, -26010, -16103, -36235, -26982, -37175, 23268, -12923, -69355, -64508, -37122, -62989, -50834, -52541, -39360, -38549, -51432, -60737, -39242, 9125, -1447, -50241, -25023, -15049, -19513]
11660a9513j1333a4303l9916k0625J5948k4209c8450n798j9772j976h902p023
11648a5925k2912j2357J3424J310l3295a9775j8320o5763M9467Q624K1981q3307
11636a07093N2485a5825l5419A6265J8368a4128k0774E3280h882n771E655a5889
11623f422n0278i950j1025n0575c4981I159e8959b3440n06A8423D04d521k5722
11610c0243B0369F394e361A1607b1676H961d782l7132o2939J1333a304l3062j3635
11597d8001p892j3089J5736K5213p642m2040J7180b2892l1878J2456J0960l213
11585c4567P295j6277J7384m1387c1324j1426M620b280C0910R475r375f8791k779
11572g1570r94b327L05k0071k3640a6902l6956J6986d01m5603K0950o4040f413
$$ y = [-19513, -30846, -14303, -54219, -74844, -58896, -83105, -38450, -44248, -64020, -65996, -8902, -15925, -38837, -51194, -37770, -36460, -69755, -19775, -38095, -103858, -54391, -45767, -23786, -107093, -54608, -15825, -51244, 16265, 34633, -14128, -34902, 53280, -8882, -14653, 5655, -15889, -6422, -56700, -9950, -20975, -71550, -34981, 9159, -58959, -23440, -23946, 18423, 404, -4521, -30243, 20369, 6394, -5361, 11607, -21676, 8961, -4782, -41914, -104853, -93520, -1304, -34366, -48001, -55893, -68982, -53246, -28033, -35675, -77715, -60535, -22892, -54770, -42314, -31354, -34567, -27272, -43549, -26165, -67552, -31324, -42750, -38130, -2280, 30910, 40385, 31010, -68791, -71570, -72564, -2327, -2022, -22093, -45733, -16902, -53858, -36872, -401, -46004, -25054, -89094, -6413]
11558E390i903l9636m551i480n0318b7127J3284A4804b0677j2312j5986J1329
11546c7646J2440a15k6303P737m8818K8425l8253L8570l1496N312j3098j9367
11534i7406I079k188d3978a9097Q330n902k9252k7332K9913R143h883k3394r665
11521d1942p981F881K1000E983e667j9619l3573K9261R087h375l1560J2229f442
11507c7427a6252o5954M0347B640a2733l1672Q142B6129b1821A223d2666a9953
11494f6606K8019a5461B313L709g8512L3660h437p146l6604Q34A1143g6275c4909
11480a3425J59l4343J4204l5250J8150N155O071J6806j145f701j2695m0120k1145
11467h0661b9617j1630L52m3216J9427b3522n2182J5714j7689c7642l4053c5293
$$ y = [5390, -9903, -49539, -54090, -9480, -59798, -27127, -13843, 14804, -20677, -32989, -48975, -37646, -25206, -115, -26418, -18681, -67499, -39074, -77327, -38757, -70253, -64941, -78039, -97406, 9079, 6891, -43978, -19097, -10767, -16669, -45921, -73253, -43340, -34197, -8883, -32277, -41942, -49923, 6881, 27881, 5983, -5667, -25286, -58859, -29598, -20511, -8375, -39935, -27706, -6442, -37427, -16252, -82206, -41859, 2640, -12733, -44405, -36263, 26129, -21821, 1223, -42666, -19953, -66606, -38587, -15461, 2313, 6022, -78512, -44852, -8437, -15583, -52187, -51353, 11143, -76275, -34909, -13425, -13266, -47609, -33405, -68655, -50505, -45350, -39279, -22473, -23618, -6701, -19396, -59516, -80661, -29617, -41247, -40895, -84111, -64684, -23522, -75704, -59990, -77679, -37642, -71695, -35293]
11454c1299M27D568a1368j5719F808c4527j2987K1205r328l9770K9001l7736b8940
11440e7869a113k3778j6887D8265e1k1252n1721e420h01l0774O308I636c4767
11426h215l5521J3345N694d6m0066j0423J4562j9343b1248k3368K149J9801r3541
11413a16207c8023k2133n750a8657A8579b6376E103J7386a162B6017N471a926
11400c7542M159L924j2753a5961O71k8155K450k853m0289b1233b29m6473a8569
11386B5343J4186I202b2581A2900e0726g04m5209A7861b5265n485J2785k6855
11374d4820K1905R242j1537C4331b5589l6644K3980m7072K9715j6152C585d28
11361a6166j2913m7795K0376h69j5872k3813m1089M0425f934j2737h73B7688i045
$$ y = [-31299, -30872, 4568, -11368, -27087, 6808, -34527, -47514, -26309, -35637, -75407, -46406, -84142, -28940, -57869, -1113, -24891, -41778, 48265, -51, -21303, -73024, -5420, -801, -31575, -25267, 9636, -34767, -8215, -43736, -30391, -24697, -46, -40112, -50535, -35973, -55316, -21248, -44616, -42467, -22666, -116207, -38023, -60156, -65906, -18657, 18579, -26376, 5103, 22489, -1162, 26017, 31488, -1926, -37542, -33383, -29459, -42212, -15961, -15290, -43445, -40995, -43848, -84137, -21233, -229, -46702, -18569, 25343, 39529, 9202, -22581, 12900, -50726, -704, -45913, 17861, -25265, -30750, -17965, -44820, -22915, -13673, -25210, 34331, -25589, -62233, -38253, -85325, -55610, -71762, 3585, -428, -16166, -29079, -76874, -56498, -869, -16741, -40554, -81643, -41218, -6934, -19671, -873, 27688, -9045]
11347c9228I224c7141M747b765D458P884e3586K4821q767a4521j8044L028r288
11334c8825i261l5055J6393k0134j5196J6082K1518D439a7409l0424M820a0299
11321c8807k3908a6972g922m6811a0811M55l2453g338k4830a5514q294k1661p236
11308e2705a9463B809J396b8641a844j6315q129R183m9797c2138h59A5037F064
11294e2380k1807L3104J397o890L590j9552l7749K8891b5840C717f2490l943K712
11281f3721K850b3952R674k6173m2452J4436L2540C312d2689H463a1992m6462
11269e8454a4149m3847a5211N390B1123c9868k5698Q346M340f715m2373b3710
11256h666k5581k7768K6129B0685d4220k1533K4820J5748R868n6500L614O789
$$ y = [-39228, 9224, -37141, -32394, -2765, 4458, 12342, -53586, -28765, -37532, -14521, -32565, -29537, -38825, -9261, -44316, -27923, -48057, -63253, -47171, -25653, 4439, -17409, -47833, -43013, -10299, -38807, -62715, -16972, -7922, -54733, -10811, -10356, -42809, -7338, -32168, -15514, -23808, -45469, -52705, -19463, 2809, 4205, -28641, -1844, -18159, -26288, -17105, -66902, -32138, -859, 15037, 6064, -52380, -74187, -41083, -39686, -46576, -42986, -62538, -100287, -71396, -25840, 3717, -62490, -66433, -63721, -60871, -23952, -14278, -40451, -82903, -68467, -35927, 3312, -42689, 8463, -11992, -58454, -14149, -57996, -15211, -9821, 21123, -39868, -65566, -57220, -52880, -6715, -49088, -23710, -8666, -34247, -62015, -35886, 20685, -44220, -65753, -40933, -25185, -15317, -71817, -68203, -61414]
11244f1414A5999R329c8023J7615j5865j8177b3464d555l7418j3210K2959n0605
11232h2829k8603B30e7256q384a7095o1950K2709A395J9063J767f0013c357o572
11219i929o4004b9198L029k3461q008K1388a5032F3759A4495g837o8138J9329
11207e6646a5300i40A7220c1238j7138M372R98j7218K5898k8350a0793j6409p051
11194c4253a4599K224A5331e5651K4936O318M836B2207B608b7354j6012K12a8124
11180b9057A1799a2069k479l3024O614J8100k0449J754J1534m657J2969q485a3413
11166C1340G208b7808n7607K0345b1510E5205c7107k6738o759J8749k0665K5403
11154d7117o940l227f758b913q143B2802g1351K3388a2970O80k598m1884a7645
$$ y = [-61414, 15999, 25328, -38023, -20408, -36273, -54450, -23464, -4555, -41973, -55183, -32224, -82829, -111432, 230, -57256, -65640, -17095, -79045, -56336, 1395, 20458, 22225, -60013, -3357, -9929, -73933, -29198, -26169, -49630, -57638, -36250, -15032, 63759, 14495, -7837, -75975, -56646, -15300, -940, 17220, -31238, -48376, -44004, -43006, -60224, -34326, -62676, -10793, -27202, -34253, -14599, -12375, 15331, -55651, -30715, -24397, -19561, 22207, 2608, -27354, -43366, -43154, -18124, -29057, 11799, -12069, -14548, -47572, -40958, -22858, -43307, -41553, -30019, -34676, -21707, -30192, -13413, 31340, 7208, -27808, -85415, -65070, -21510, 55205, -37107, -63845, -70604, -51855, -72520, -47117, -54057, -57284, -6758, -2913, -11056, 22802, -71351, -47963, -12970, -12290, -14888, -56772, -17645]
11140A73g2943L0442B3188O111g813j6585k4301q016K777d455j8023l2335Q579
11127d6234a5125D30d5646j7228e149l6326j0617K354l5097L427K6155J0541j2919
11114e7631j8349o0209O6323a1023k4390P766K060G181j739Q53d862m846n7679
11101f7387J2505R515K0319j3809k4837r158a5858k3698j7015b2064m4892a4396
11088C1669A2260d249a947k6175Q91j6038a3455p2856c5339k3569c252A880f4533
11074e2523k2464J9342a5358j2402c669p2203b2775h861A5159b3854m4048a4152
11061e3456g926l3499N61a2084j866r507l5426L281K2761l031C0603a7414J688
11048a5726l259a772p1808k1228K2704k9889d1727h595n0678b5440k9269n99b0501
$$ y = [173, -72943, -42501, 23188, 29299, -7813, -24398, -48699, -56715, -53938, -4455, -22478, -54813, -46234, -15125, 430, -45646, -62874, -5149, -41475, -52092, -49738, -84835, -81408, -55253, -44712, -57631, -75980, -136189, -69866, -11023, -35413, -27647, -25587, 7181, 5442, 6295, -4862, -9708, -67387, -54882, -45367, -25048, -38857, -63694, -72852, -15858, -39556, -56571, -22064, -66956, -14396, 31669, 12260, -4249, -1947, -28122, -27231, -43269, -13455, -86311, -35339, -58908, -3252, 1880, -64533, -52523, -74987, -55645, -15358, -27760, -3669, -75872, -22775, -8861, 15159, -23854, -67902, -14152, -53456, -7926, -41425, -40864, -12084, -13950, -23457, -58883, -55602, -32841, -35872, 30603, -17414, -15726, -18985, -1772, -73580, -94808, -72104, -101993, -41727, -8595, -59273, -25440, -54709, -55308, -20501]
11034c9879l6738c5036J3732r540R359k1d03n0399K2246j66L968c83j8213M698
11020a3898c733I85J022b641p1812c2432a0863j7934j7304C530h676n654r692
11007b4022a117k2604l34I35a05080b8129q93n493m36A0256i331n729A6934d3790
10992e1524b0625D1262c0281j456C7555a666k4072J2573l1082J2474F5300b8735
10979b4121j7091l9989K3627e674q1588c3263m522m0954N771b5050F572d0853
10966a7941m11m800k7589J6149a6868k8470A4975e9258k700l4636A4632K768a6645
10952A0523c4070Q354a1198A3782d6458j5219J3871b1215m3245J9225i893F516
10939e571n9581a5596N8j3272l040l4782J6641n1845K969b8156k3675j5264K5198
$$ y = [-39879, -76617, -35036, -21304, -30844, -21485, -21506, -403, -50802, -28556, -28722, -24754, -383, -18596, -13898, -3733, 985, 2007, -2641, -74453, -32432, -10863, -28797, -46101, 3530, -8676, -14330, -24022, -1117, -23721, -24055, 935, -105080, -28129, -29022, -34515, -34951, 10256, -9331, -15060, 16934, -43790, -51524, -20625, 41262, -30281, -31737, 37555, -1666, -25738, -13165, -44247, -31773, 65300, -28735, -24121, -41212, -81201, -57574, -5674, -87262, -33263, -37785, -78739, -72968, -25050, 6572, -40853, -17941, -18352, -23152, -50741, -34592, -16868, -45338, 14975, -59258, -61958, -96594, 14632, 17400, -16645, 10523, -34070, -25716, -11198, 13782, -46458, -61677, -47806, -21215, -64460, -45235, -9893, 6516, -5571, -65152, -15596, -15538, -28810, -31850, -66632, -49991, -101836, -98867, -28156, -51831, -67095, -41897]
10926d1897a4579p400j2923J461C401d1126a7632m4592B1130a105A6118d0446
10913a6827j735k3287a2534m402m7173B938J1053g0184D08a2501B2283b5213l8718
10900f3931b5785l1008A8372i306j2769O880j2837l846I956M141c7631n664j3665
10887e6960a7015l6572j052j2276P655J5961F18a9653B2518B758c0160l1577e852
10873b1892n881n34n5561b9377o096r639k8549K6487B2259c7472n34a3221p623
10860b0844k2721J955G69i4032L8127M349j8731K2052c170m1495A4571B644f7106
10846b1291N308l8734b0409n8720b2645l940K139j5904l2307b3860l2013K3814
10834c2059N821L147B6741b3074m5070K9087D4590c2799J0047l1769a187E4316
$$ y = [-41897, -14579, -21979, -34902, -33441, 3401, -41126, -17632, -62224, 21130, -1105, 16118, -40446, -16827, -18562, -41849, -12534, -16936, -64109, 2938, 13991, -70184, 408, -12501, 22283, -25213, -63931, -25785, -56793, 18372, -9306, -22075, -15195, -28032, -31878, 9956, 14097, -37631, -43295, -56960, -17015, -53587, -54639, -66915, -59260, -43299, 618, -19653, 22518, 2758, -30160, -61737, -5852, -21892, -27773, -28307, -83868, -29377, -35473, -45112, -73661, -47174, 22259, -37472, -38006, -13221, -20844, -43565, -41610, 769, -94032, -55905, -51556, -70287, -48235, -3170, -44665, 14571, 2644, -67106, -21291, -15983, -54717, -20409, -79129, -22645, -26585, -24446, -40350, -72657, -23860, -55873, -32059, -26238, -23091, 26741, -23074, -68144, -39057, 44590, -32799, -22752, -54521, -1187, 54316]
10821b700j060B396d9938p561p416D196J2377p286f5000J3302O266J783m4427
10808h8076K8964a8215h714p969m7144b9213n1K29o2582p672M8867j5J4911j0794
10794d6320k9153J3845M24a5169k3942n403a0989A9417P117b4372N359j5871M896
10781b9988J276l5395K4383a9584l1580B885d3828O667k1163a4327d667p405l5859
10768d7931n0133K1362a6296C603K0679b9216k6689J8654i241c881l7561K0268
10756b1174A7872a4746k4809o074i221j352l2834d478l639J020l307A0179h424
10742c8016n7244c9691q972J7234g897n9295b5188k9349L627B185a8784A1258
10729F059e3198o728D358M2767A944d872k7652k3691j8086a9641p883j3354J1593
$$ y = [-2700, -3760, 2396, -49938, -57499, -64915, 4196, 16573, 9287, -65000, -51698, -45432, -43649, -88076, -59112, -18215, -8714, -16683, -63827, -29213, -29264, -29035, -91617, -99289, -50422, -50437, -35526, -46320, -75473, -61628, -61204, -15169, -39111, -44514, -10989, 19417, 26534, -24372, -19013, -34884, -29988, -28712, -64107, -39724, -19584, -51164, 2885, -43828, -37161, -58324, -14327, -4667, -12072, -47931, -98064, -76702, -16296, 3603, 24282, -29216, -55905, -37251, -9241, -3881, -41442, -21174, 17872, -14746, -39555, -45629, -9221, -10573, -43407, -4478, -8117, -7097, -10404, 10179, -8424, -38016, -95260, -39691, -48663, -31429, -7897, -67192, -25188, -54537, -50910, 2185, -18784, 11258, 6059, -53198, -59926, 4358, 47125, 1944, -4872, -32524, -56215, -74301, -19641, -27524, -40878, -29285]
10716b9285L307K919n6222L7348m2103L4232C04c6423a4805A628L347d2755j3324
10703e6079K4167L765l6922h121C2105g311L496k1047j4986B0775g45m0651n95
10690d1991J5069j3722A7049b0897o615f101A9175b6868l5209j513k5813a5111
10677i580A7745a0934j9717j8894A6082h771A696J5713h881l5538R687a6391l859
10664b0250d687k1182j7236a8891E0e2092a7436j5287i139F02J3684b9868j7774
10651d7642J4931j0416k2635L1185j0070j1175J7182Q998B0037e0892k290c820
10638A8336b2484m8069J5788j3705q610J4367k2369L3703C834c919n661l8341
10626d7921p929Q385a5762A50J2980B823a9928I003K1189K813e2900j0829B711
$$ y = [-29285, -25978, -23059, -79281, -41933, -84036, -49804, 304, -36423, -14805, 1628, 4975, -42755, -56079, -31912, -28147, -65069, -8121, 32105, -7311, -3815, -24862, -39848, 20775, -745, -41396, -41991, -26922, -40644, 17049, -20897, -27512, -6101, 19175, -26868, -62077, -63590, -89403, -15111, -9580, 17745, -10934, -30651, -49545, 16082, -8771, 1696, 17409, -8881, -44419, -34732, -16391, -20250, -4687, -25869, -43105, -18891, 50, -52092, -17436, -32723, -9139, 602, 14286, -29868, -47642, -32711, -43127, -65762, -34577, -44647, -55822, -38640, -29642, 20037, -50892, -53182, -3820, 18336, -22484, -70553, -54765, -68470, -77080, -62713, -85082, -51379, 3834, -3919, -9580, -47921, -55850, -47465, -15762, 150, 13130, 2823, -19928, 9003, 30192, 33005, -52900, -63729, 2711]
10612e6350l4704L5973K0971B0804n710L016e8337Q310p616a219k3555j0949l2095
10599f7818c2659a2226F017d7673J9906I261J0173E035a6217m638C817c782j1426
10586a5208j7775a3739j5364L928l9066K9771k7926b5544P495j3060M058n4964
10574h2015a2139k7919G407L008d3758J3430j0986l9118K5554k9442a1764N560
10562f204A0536a6412k1388a5787E2973g874j780P31j2056k1130n58l4384L5803
10549d1248J2840j0656n951m2476c2852a5870m6031J7954q842j2546j6198a7667
10536C9697d665B3341f4138g046f1B6228d6667g028j5322n4091c6523r421l7601
10523h3545g044j7204M239m591C3103j4814c7256c018m8025j0532K8403A119d7706
$$ y = [-56350, -91054, -55081, -34110, 20804, 15094, 18110, -58337, -50027, -57643, -1219, -24774, -35723, -67818, -32659, -12226, 6017, -47673, -27767, 9261, 19434, 5035, -16217, -20855, 3817, -3782, -15208, -32983, -13739, -29103, -25175, -64241, -34470, -62396, -25544, -18049, -31109, -27051, -82015, -12139, -40058, 7407, 10415, -43758, -30328, -41314, -80432, -54878, -84320, -11764, -6204, 10536, -16412, -37800, -15787, 52973, -7874, -9654, -8923, -20979, -42109, -42667, -77051, -41248, -28408, -39064, -45015, -87491, -32852, -15870, -61901, -43947, -52789, -65335, -81533, -17667, 39697, -4665, 23341, -64138, -7046, -61, 26228, -46667, -7028, -22350, -76441, -36523, -45944, -83545, -7044, -24248, -20009, -24600, 33103, 18289, -37256, -3018, -51043, -61575, -33172, 1119, -47706]
10509c8151a0241p545B1304d0690n807j271M727m2916L1268G20e2725a4503j5014
10496b9517a1952j3706B4093i207r60B258d6453o340J2026m896C8834D676d7145
10482h5451b9014N1k6325k7745M638K5341k2037L583c1878a3308m455k265B1578
10468f9443R510b0777G232a0314d300j8412D5782H499R567c0927d082H861M711
10455A3572L9529b5663P355l091k27J0483n787j3102m2237c5495N909N432k0364
10442d4518a3513J682l4847k6391J5577K7823l2924a1014o214E267O256a1504
10429e8819e203A6143a01612M9057b5476n695j8343J7970m413k1269a310D4921
10416c4490g804o509e843j4159J545d771o956r408p410k1876i027k6617J1696
$$ y = [-38151, -10241, -17786, 21304, -40690, -46497, -47768, -43041, -85957, -54689, 720, -52725, -14503, -29517, -11952, -25658, 24093, -9207, -10167, 2258, -46453, -52793, -40767, -45663, 38834, 4676, -47145, -85451, -29014, -28963, -55288, -83033, -78395, -53054, -75091, -71508, -31878, -13308, -17763, -20028, 21578, -69443, -59933, -20777, 7232, -10314, -4300, -22712, 45782, 8499, 18066, -30927, -4082, 8861, 13572, 53101, -25663, -18308, -21399, -21626, -11143, -16930, -30032, -72269, -35495, -29586, -24154, -44518, -13513, -11831, -46678, -73069, -57492, -29669, -62593, -11014, -17228, 5267, 11523, -11504, -58819, -5203, 16143, -101612, -52555, -25476, -31171, -49514, -31544, -35957, -57226, -1310, 44921, -34490, -7804, -14313, -5843, -20002, -18457, -4771, -11727, -21135, -28545, -50421, -9027, -35644, -23948]
10403b3948k5411F768d9647m9202M1326K1774k7040b0434j3521m125E9974C94
10390b7983Q608q796D2904B0410E698b3285H707a1087l195j1256k5411C7281e9058
10376b2135B1771c0480F017e492n897o325l1498j949a6411l5837e831m3752l951
10363e3534A6412r10c4412j312H282M789K4006e6084m5644M3308e268n4299i312
10349B1130b5038j7622A2433e0899P255a0936q086k997K685O883A9968K4073h147
10335B2460d2907C1450e7251j6823K9921b0761n892l3442K6484k0712a1398j1375
10323b2773A0287b6375l8209q981c1061P382C8636e6510a7838a49B4286J453c229
10309a5221B17c6811k9040b0628j4047q7598e1310g965k3593a1262l2847J8485
$$ y = [-23948, -49359, 6768, -49647, -98849, -57523, -35749, -62789, -20434, -33955, -38080, 59974, 394, -27983, -19375, -28171, 42904, 20410, 5698, -23285, 8707, -11087, -14282, -25538, -50949, 37281, -59058, -22135, 21771, -30480, 6017, -5492, -11389, -17714, -49212, -51161, -16411, -52248, -5831, -49583, -53534, 16412, 15502, -34412, -35724, 8282, 13071, 37077, -56084, -101728, -58420, -5268, -59567, -9312, 21130, -25038, -42660, 12433, -50899, -43644, -10936, -19022, -22019, -19334, -12451, 19968, 44041, -8147, 22460, -42907, 31450, -57251, -74074, -44153, -20761, -26653, -60095, -33611, -54323, -11398, -22773, 10287, -26375, -64584, -73565, -31061, -23679, 38636, -56510, -17838, -149, 24286, 25739, -3229, -15221, 217, -36811, -65851, -20628, -34675, -122273, -51310, -7965, -31558, -11262, -44109, -25624]
10297b5624K958j9094m0444L1369J0160a7760k9193m72A0466L1070b6807e102
10284c0845j3719j4460K085b5348D2727e154G677K533e6872K1946o948m8989K4478
10271f6385b0633r790B9084e7328K7938m8569H619L859g731H619O050L6084h135
10257a568o5524l526b5305l7091a9643A0311a7427j009A4960E711a02296K4638
10245g7658b3639p1894a5225k6762a9897j2187n9248c1325n589a730o0336K7182
10233c4884k130p326l1949O732J8200M564a3325A4650K2690a8486k0476j5431
10221e4393K3989k4459l3626L086L5261b937R64j6387j7663J4717n7527a5688
10208A2884j399h2954a9318j7491a0461B7228D05P797e0831C7548c6345m386l0002
$$ y = [-25624, -22666, -41760, -82204, -50835, -40675, -17760, -46953, -47425, 10466, 41536, -26807, -5102, -30845, -44564, -59024, -56939, -25348, 42727, -5154, 7677, 10210, -56872, -34926, -41874, -90863, -66385, -20633, -30423, 29084, -57328, -29390, -77959, 8619, 12478, -7731, 8619, 14669, 50753, -8135, -1568, -67092, -70618, -25305, -62396, -19643, 10311, -17427, -18436, 14960, 5711, -102296, -77658, -23639, -95533, -15225, -41987, -19897, -32084, -91332, -31325, -36914, -1730, -62066, -34884, -37014, -44340, -76289, -69557, -51357, -46793, -13325, 14650, 37340, -18486, -38962, -54393, -30404, -54863, -88489, -85403, -50142, -2937, -1973, -18360, -36023, -21306, -78833, -15688, 12884, 11485, -82954, -19318, -36809, -10461, 27228, 405, 8202, -50831, 37548, -36345, -40731, -70733]
10195g0733K7148a4372k7976k9796c5080B7038c061q423j9802l928J3959h221
10182a6814C871a9271k3694J3660a3452F74i5703K5622K2981a8842j7170J1121
10170b4891J348l986A9441b3979k3780n4364c4443j9328K527N408a7461l508j157
10157b2126C7505a1413j9609l8197b1856n021D0432a0624B9773F791l049d7535
10144e7601N736b4691l5875q472c2307k5240i287k2815R904M723k7558H478b9175
10130A0270e7092J1995a1206H083c5295i544k032b058j1711H087b1833n0020L0251
10117d1602J1315c577k6673l230K054b30n9461K0650l1317J5527K5428B7901g2958
10103g0435j2989K0518J6657J0908k7544a2997k6659J7013N063j6722J350l1675
$$ y = [-70733, -43585, -14372, -42348, -72144, -35080, 27038, -3061, -11484, -31286, -35214, -21255, -8221, -16814, 3871, -19271, -42965, -29305, -13452, 674, -95703, -70081, -47100, -18842, -36012, -24891, -23543, -27529, 19441, -23979, -47759, -102123, -34443, -53771, -51244, -45836, -17461, -20969, -22126, 37505, -11413, -31022, -69219, -21856, -26877, 40432, -10624, 29773, 6791, 3742, -47535, -57601, -51865, -24691, -60566, -69038, -32307, -57547, -9287, -32102, -22198, -17475, -45033, 8478, -29175, 10270, -57092, -45097, -11206, 8083, -35295, -9544, -11576, -2058, -13769, 8087, -21833, -71853, -41602, -30287, -3577, -30250, -33480, -31426, -230, -59691, -39041, -70358, -54831, -29403, 27901, -72958, -70435, -83424, -62906, -46249, -35341, -62885, -12997, -39656, -22643, -17580, -34302, -32952, -64627]
10091f4627K3174p283J8746j2880o92j3839K3441p019B2523J5656a6817j6005
10079c2822l2726A7672a2298m3700c610k4024k5221b5504m3926K9669a3022k8530
10067d1552J6796j3528R193P918C629K7681m263b1249l8634l6320M1587l0774
10055h5390J8115K6153c039l747j9364F493c2237J3039p280k4148L59p392K905
10042e4754l9200b6421n1815L6772J3060k6699a6955B4132b8878N987J146E689
10029c2434h712j0898k4760q063b1747n510M777c960j721p059j52d73l659l1183
10015c5315a0130j6977b028k6078j8909p470B3133a7463A3646c2802l2608J179
10003f4231J7331b886E286a1843j3987j2023J1084G035a5014j5688N998j0427
$$ y = [-64627, -41453, -48736, -29990, -42870, -43562, -57401, -33960, -40979, 22523, 38179, -16817, -32822, -65548, 17672, -12298, -55998, -3610, -27634, -52855, -25504, -69430, -39761, -13022, -41552, -24756, -38284, -29091, -21173, 3629, 31310, 27047, -21249, -59883, -96203, -54616, -85390, -67275, -41122, -3039, -6786, -26150, 6493, -32237, -19198, -26478, -50626, -50267, -57659, -54754, -93954, -26421, -78236, -41464, -28404, -55103, -16955, 24132, -28878, -22891, -21745, 5689, -32434, -8712, -19610, -44370, -52433, -21747, -27257, -22480, -3960, -5681, -12740, -12892, -473, -4132, -35315, -10130, -27107, -2028, -28106, -47015, -54485, 23133, -17463, 13646, -32802, -65410, -64231, -46900, -2886, 5286, -11843, -25830, -37853, -26769, 7035, -15014, -30702, -24704, -35131]
9991c5131k579E82a0007j764gk2047A0465g2519b0805i660l5779G164J2411c3241
9976c5949C2218d6673a6224A9896b1676n1313c0361k1458J5402M157c632j4233
9964a7865j0875l4333K0021J4358D7265M2151B9606b8457K763g283k7188p505
9952d1976a9879D199c9387q860l301m574l053A7244b5908A1712a5773p278r089
9939c2140j0050A3840J9997j4568a9091j0244A7964c4559J2279G011r6d1971b84
9925a3838B9992b2132n250l3209b3728J026l4858J0392A5499j795b2637j1242
9913c3879C4542J5952B4816b9954F536e4186J6519a3546j050l5001J4557A6479
9900b3706e066j5943f41k5816q0131b9077k7358m1674c958j5874P783m1139a3780
$$ y = [-35131, -37710, 582, -10007, -11771, -7, -22054, 10465, -72519, -20805, -9660, -45439, 7164, 19575, -33241, -35949, 32218, -46673, -16224, 19896, -21676, -72989, -30361, -51819, -36417, -32260, -3632, -17865, -28740, -63073, -43052, -28694, 47265, 89416, 29606, -28457, -25694, -7283, -34471, -41976, -19879, 4199, -39387, -48247, -51548, -56122, -59175, 17244, -25908, 11712, -15773, -23051, -32140, -42190, 13840, 33837, 19269, -19091, -29335, 17964, -34559, -22280, 7011, 6915, -41971, -284, -13838, 29992, -22132, -27382, -60591, -23728, -22702, -57560, -47168, 15499, 13704, -22637, -33879, 34542, 50494, 24816, -29954, 6536, -54186, -37667, -13546, -14596, -49597, -35040, 16479, -23706, -5066, -21009, -641, -26457, -106588, -29077, -56435, -98109, -3958, -19832, -12049, -53188, -13780]
9886g792j0897B9397a3598L699j4786j0909Q311A5620a1733o6128K6901L972Q449
9873c8539a2131j8279o495a7101n4422E285k179M1947H240b117A1572b3797q049
9860c1846a3491m7804j2161c2924m1250J3334K1905j121q853f815j1802j0601
9848b9218E659J9192b1791B757f3103K2316a9888B7781d179j3441j8091a2953
9835B0940h623K398m5308b1614j0243m981J3291k9825A8987i765n1814K8488k7772
9822f0863a3396p017j6000j7790j7602a5474n6276j2545f65p4520b85n7155j2077
9809f9517e305n7983l1631j7995b8567N690A9150k305i57l0537a2937f82D5407
9795a332p689j9698f663m9663a2826A1491c8042M083a1969j0672n2422j3295P214
$$ y = [-7792, -18689, 29397, -13598, -9899, -24685, -35594, -27283, 15620, -11733, -77861, -50960, -46988, -38539, -12131, -30410, -36905, -17101, -71523, 5285, 3106, 45053, 8240, -2117, 11572, -23797, -31846, -13491, -61295, -73456, -32924, -74174, -60840, -38935, -40056, -48909, -6815, -18617, -29218, 5659, 24851, -21791, 2757, -63103, -40787, -19888, 27781, -4179, -17620, -35711, -12953, 20940, -8623, -6225, -51533, -21614, -31857, -36838, -23547, -53372, 18987, -9765, -61579, -33091, -60863, -13396, -20413, -36413, -54203, -71805, -15474, -71750, -84295, -665, -75185, -285, -57440, -69517, -5305, -63288, -94919, -112914, -28567, -22877, 19150, 16845, -957, -31494, -12937, -682, 45407, -1332, -9021, -28719, -6663, -56326, -12826, 11491, -38042, -33959, -11969, -22641, -75063, -88358, -81144]
9782h1144A2656a4024l5858a179l0467C219a4757k5082C72b76C0245j2939f4171
9768b5379j0668a3300K945k0272J4435B5001a7562A5412M664G920c4798a6504
9755e3533n0775K5115P458L0728J7654l2888K6117r431j702k0453F463c6885R956
9742b6929E0093A9265f341B794L9128C776d6429B440a9635M614A8958C19K0621
9729B0940M264b1956A3892b0177k617i999B517R849K8216f3525b6220A8681K4944
9716D3625b4527o197m107o9538M8797I403B928f9208b3474A8133d9279A296d8895
9702B1178c6433a994n4018r036k40k116O572m321e168l4108l473N146J8037l8249
9688e7815Q7b8643C2524a0432k5457j168j0125m758J3928B2011e4279q818K0681
$$ y = [-81144, 12656, -14024, -49882, -1179, -31646, 3219, -14757, -39839, 372, -276, 30245, 17306, -64171, -25379, -36047, -13300, -10355, -30627, -16192, 25001, -17562, 15412, 20076, 7920, -34798, -16504, -53533, -104308, -79193, -71735, -41007, -23353, -56241, -30124, -39555, -41257, -61710, 6463, -36885, -26929, 50093, 19265, -6341, 2794, 41922, 3776, -46429, 2440, -19635, -15021, 18958, 319, 20940, 25204, -21956, 13892, -20177, -22794, -9999, 2517, 12366, 40582, -63525, -26220, 18681, 43625, -24527, -30724, -34831, -104369, -55572, 9403, 2928, -69208, -23474, 18133, -49279, 1296, -48895, 21178, -36433, -1994, -56012, -65048, -65288, -67404, -60832, -65153, -5168, -39276, -42749, -37603, -19566, -57815, -57728, -28643, 32524, -10432, -35889, -37057, -47182, -51940, -38012, 22011, -54279, -63097, -42416]
9675d2416J8587h066j6119n3177J5998K0401j6559a1727r015q8723b781p069k6497
9662c6347j9642b1390L614o9622M1380n2797K1505c6373j0529P582J4630K15A7856
9648B578b8070o945k3595j0446d615n3628O701j2542a1279D6888j6626e4336J4210
9635d0126n405n2851K8855n273J257m3563a676n3507l647K1680m849C5136a8378
9621I574b4169g749c412j9483k1227I472A048L4168E71R363L332b2173q053d343
9606a3307B5608D447J0951f6398J7776M078M018J5010K386q846p038A2080a1245
9592f81k3092N19k3963J932J1327P047O225e339q545q654H558f1161q545b9146
9577B7589j3012b2377Q562j478M548G879a8242n742A1781b2016L990B5609c542
$$ y = [-42416, -23829, -8066, -24185, -77362, -61364, -40963, -57522, -11727, -20742, -109465, -2781, -9850, -36347, -55989, -21390, -17776, -87398, -46018, -98815, -77310, -36373, -46902, -39320, -24690, -24475, 17856, 2578, -28070, -35015, -58610, -69056, -4615, -58243, -51542, -64084, -11279, 46888, 30262, -54336, -40126, -45531, -98382, -69527, -74800, -73543, -117106, -1676, -55183, -58830, -37150, -41999, 35136, -18378, 9574, -24169, -7749, -3412, -22895, -44122, 9472, 1048, 35216, 571, 9934, 13266, -22173, -30226, -4343, -13307, 25608, 4447, 15398, -66398, -48622, -44544, -40526, -25516, -23130, -31976, -39014, 12080, -11245, -681, -23773, -23254, -47217, -45285, -33958, -26911, -20686, -5339, -13884, -22538, 8558, -61161, -69706, -29146, 27589, 14577, -22377, -13815, -15293, -10745, 7879, -18242, -23984, 11781, -22016, -18026, 25609, -3542]
9563b2357L029j8247A3520d7282A9706J5689d1677j1912K0388C4934d1331B0808
9550I707f8303b6506j9420I426d3286M347b526b29l88l0464k5766p9l2219a9401
9535A5370H32f158j0065l9733J0651k7855b9341k6517J2039a1695m0153r916J577
9522f0187K7548C2966c3403l553k1124m076b277k0117n8945K1131c935F398f2165
9508d5125a8435k6043B6322f6299a7641F989N849c652B2214c0884e187C5616d4563
9494c9960J5699G852J1817h517k7100D742j481J5400a0745C0675b5156F07i7669
9480b1049o3487J5033g18B1512a2724o871K201A2703b3622j9060J8223N629m0615
9467e9445J3379f202m1230f416o9169c2857j306p348a9869n0855A6234J1342j1654
$$ y = [-22357, -19328, -37575, 13520, -47282, 19706, 35395, -41677, -53589, -33201, 34934, -41331, 20808, 9707, -68303, -26506, -45926, 9426, -43286, -38939, -2526, -229, -617, -31081, -56847, -56926, -89145, -19401, 15370, 832, -6158, -16223, -55956, -45305, -73160, -29341, -55858, -43819, -11695, -51848, -61764, -60187, -32639, 32966, -33403, -36956, -58080, -62156, -2277, -22394, -81339, -60208, -3935, 6398, -62165, -45125, -18435, -44478, 26322, -66299, -17641, 6989, 12838, -3652, 22214, -30884, -5187, 35616, -44563, -39960, -24261, 7852, 19669, -8517, -35617, 4742, 3261, 18661, -10745, 30675, -25156, 607, -97669, -21049, -84536, -69503, -718, 21512, -12724, -19595, -17394, 12703, -23622, -42682, -24459, -18830, -59445, -46066, -6202, -47432, -6416, -75585, -32857, -34163, -41511, -19869, -70724, 16234, 27576, 15922]
9454A5922c4363N837j0706j4356a1230p866g050n2945K7598g667A6997G945a4208
9440A201J8983e2007l005J075J7327j2637a496A2654a6609m84l5677B702a1885
9426A853i417l7960A426a7737E006a8480j8744P130l012a3039H528i027l6700
9413d5727O119j1858l758A2995f289C3920q825a2139l4675a1307l1692j6078B7715
9399c7629k3594b9900f602M10B9601a241j9856m008A6964Q938b046m5000i889
9385g4806J2282a5990a839j4495c105p676o403h178l1689i855j6592G456N755
9372A3211L2218e2795j1813b9877a3252a675k0593l8544b2082B657n26b5312P619
9359a7693M195j5959J3213E3912K0231C302L110N8561A4741N286Q522A1709a4513
$$ y = [15922, -34363, -28526, -39232, -53588, -11230, -19096, -7050, -59995, -32397, -7667, 16997, 7945, -14208, 1201, 20184, -52007, -55012, -53937, -36610, -49247, -1496, 12654, -16609, -17093, -52770, 2702, -11885, 1853, -9417, -47377, 1426, -17737, 5006, -18480, -37224, -30094, -33106, -13039, 8528, -9027, -45727, -39608, -51466, -55224, 12995, -6289, 33920, 25095, -12139, -46814, -11307, -42999, -59077, 27715, -37629, -61223, -29900, -6602, -6192, 29601, -1241, -21097, -25105, 16964, 25902, -2046, -47046, -9889, -74806, -62524, -15990, -1839, -16334, -3105, -10781, -17184, -8178, -39867, -9855, -26447, 7456, 13211, 45429, -52795, -64608, -29877, -13252, -1675, -22268, -60812, -22082, 2657, 2131, -25312, -17693, -13498, -29457, -16244, 53912, 74143, 3302, 6412, 64973, 14741, 20027, 28549, 11709, -14513]
9345e3906J1248j1694a7457j3883r528k4742a7961l357n686j2763J9263A6880
9332F500c9505B3488b560j7186p683J3656E6719A9238e5221b3014D737j915c0543
9318a4204A270g7171K9023g016l003j525B7160B970L6779d27q7681a0019n8565
9305f8584D1259I407c5033j3525a8857l3689J6610A4496Q466J1715J9132B2330
9292c175a213n3899a0747o098o946r928j3681R228J493j5823b1576g251o3014
9279g0265P210f998m9888b3945m00M218j236k0363k8611b4868C3619c6564a0158
9265b2286E08f2955J6020K623K270a1574p2740a9640j6387g369n4823b9936k7439
9252e7375a2984A206Q947d8945B0540d9044g852k7435f143m3685a5537m9727b4301
$$ y = [-53906, -42658, -54352, -17457, -31340, -40868, -65610, -17961, -21318, -27004, -39767, -20504, 16880, 6500, -39505, 23488, -2560, -19746, -27429, -13773, 56719, 19238, -55221, -23014, 4737, 2822, -30543, -14204, 1270, -77171, -48148, -7016, -10019, -11544, 27160, 2970, 39749, -427, -88108, -10019, -68584, 41259, 9407, -35033, -48558, -18857, -52546, -35936, 14496, 22962, 34677, 53809, 22330, -3175, -1213, -55112, -10747, -16845, -23791, -33719, -47400, -38172, -36679, -52502, -21576, -7251, -70265, -63055, -6998, -56886, -23945, -24345, -20127, -21363, -41726, -70337, -24868, 33619, -36564, -10158, -22286, 508, -62955, -46935, -44312, -42042, -11574, -84314, -19640, -36027, -7369, -62192, -29936, -57375, -12984, 1206, 10153, -48945, 20540, -49044, -7852, -35287, -6143, -49828, -15537, -65264, -24301]
9238a23D619a8480k8190J4676B0345b0787l3195i955q068C0008o953c9076k7035
9225f6111b1653K192k2961g422B6678b1676j2057M222A2394N5476c0114n1966
9213h2080b3366G9974e4634a6467C1080j1939c596k9783J4039B9430d8828j4115
9201f2943Q720J3705A1726J7549A1326a4430p569A6241b5401e385D0540c7402
9188d3171J5472B9812J7778q53j0331J1220a1140E5441B7464K552f756k517k775
9175a2048L602C3140a0100A3502B017d0562J3037J1291n1625B9067e4791j942
9163e6733b2844j1845E006g277C5257f0483j685E3688g32m4378a5637r192B9043
9149b333L60o7041r545c7708p939n56r321i643C194c3960A646N769a4236F278
$$ y = [-123, 4619, -18480, -46670, -31994, 20345, -20787, -53982, -9955, -18023, 30008, 23055, -39076, -66111, -21653, -19461, -42422, -7422, 26678, -21676, -33733, -29511, 12394, 67870, -30114, -82080, -23366, 79974, -54634, -16467, 31080, 19141, -3596, -33379, -19340, 29430, -48828, -62943, -54223, -40518, 11726, 29275, 11326, -14430, -21999, 16241, -25401, -5385, 40540, -37402, -43171, -27699, 29812, 47590, 46737, 36406, 47626, -11140, 55441, 27464, 30016, -6756, -9273, -12048, -8446, 33140, -10100, 13502, 2017, -40562, -27525, -16234, -67859, 29067, -54791, -56733, -22844, -34689, 5006, -7277, 35257, -60483, -62168, 53688, -732, -45110, -15637, -24829, 29043, -2333, -1973, -69014, -78559, -37708, -45647, -46203, -55524, -9643, 3194, -33960, 1646, 7415, -14236, 6278]
9134b4009k0263J1536e764m1435J4788j9161a997n1432A1242J2937a8981p331
9122b6312N560j4734J659a4466a926K9k3362Q212l2323J3607B1257e9033A0937
9108C9788J3570c589j0732j7402F4055A1626e2560b1710H505b1009n0382b0739
9095i298q055j6408n509m946k527F934c631k2537l0063E6549r024e520k9253J2097
9081b2676L626P293k1140C3423j3271G884b6060C305P014J6948I229K6276D846
9067A8291q906J1927J3143b3754J828A6586k549a2161N139H455C732f057A9153
9053g246B3265F240m28M88c794j9943A4863b1921n908n008c547o1212C2115j945
9039C0170j1499Q460A2928c370A6353c518m2430K783i500j1752E0780C258L4423
$$ y = [-24009, -44272, -32736, -5764, -47199, -32411, -51572, -1997, -53429, 11242, 24179, -18981, -26312, -20752, -35486, -33827, -14466, -1926, -1897, -25259, -17047, -49370, -35763, 21257, -59033, 10937, 39788, 53358, -3589, -14321, -31723, 64055, 11626, -52560, -21710, 8505, -21009, -71391, -20739, -9298, -17353, -33761, -39270, -44216, -46743, 6934, -3631, -26168, -56231, 56549, 47525, -5520, -34773, -22676, -19050, -11757, -32897, 33423, 20152, 7884, -26060, 3305, 10319, 27267, 9229, 35505, 4846, 18291, 9385, 21312, 34455, -23754, -21926, 16586, 14037, -12161, -7022, 8455, 3732, -6057, 19153, -7246, 23265, 6240, 5812, 6300, -3794, -23737, 14863, -21921, -27829, -32837, -3547, -64759, 32115, 30170, 18671, 27131, 12928, -3370, 16353, -3518, -45948, -43165, -9500, -21252, 50780, 3258, 37681]
9026C7681L4832g664q442D85c2031Q651K233k0770l632b323B3123d9563a9114
9012B8021o478d928D6586e2736L213f776k448p0980L7949J7170j3872a1561j4558
8999b6119b084k125D1233l111o852a0618A1369C225K1981R513K0309e699A8284
8985C953J836J2817l505K524H407c1685B5678e4323j346k9210c1909g388j445
8972h833k8311c10A3505l068c0070D0203A1761L3001A7595D791a3412q15M288
8959i939o7296J9502j217k404J9476o1948L7409a5403k5911L588a6581o977N515
8946a8043o7266J859b9260K123C0574b6091L93n6316K7222K1131c532C8198A032
8932A6243i209n901p0836e041k6824B2543b2576A2815d9023E1202c8563d576H925
$$ y = [37681, 72513, -7664, -16106, 485, -32031, -23380, -21147, -41917, -45549, -2323, 23123, -49563, -19114, 28021, 21543, -4928, 46586, -52736, -49523, -6776, -9224, -80204, -42255, -25085, -38957, -11561, -26119, -2084, -4209, 41233, 38122, 31270, -10618, 11369, 3225, 25206, 34719, 55028, -5699, 18284, 3953, 5789, 18606, 15101, 17625, 8407, -31685, 25678, -54323, -55669, -84879, -31909, -7388, -8833, -37144, -310, 13505, 10437, -30070, 40203, 11761, 44762, 17595, 4791, -13412, -14227, -9939, -77235, -57733, -58950, -61354, -41878, -103826, -66417, -15403, -41314, -37726, -16581, -23558, -18043, -85309, -83450, -29260, -27137, 30574, -26091, -25698, -82014, -54792, -33661, -3532, 38198, 1032, 16243, -9209, -15110, -85946, -5041, -31865, 22543, -22576, 12815, -49023, 51202, -38563, -4576, 8925]
8918E609c2404A8683H720K4938D502K0149F321J2294Q272K6887L057n265A674
8904D1365j5050q862J1723J1040j4995b1549I686B64J657J0701M9563A5057b8421
8890e1195A4869b741l680A6400L4142k3489i753C257J8640e1498a1915l6768b185
8876G916a0985j0499J0626R55E984b2733l6448N725a269l6297n635J0187m27A503
8861c7310N434K460j0906n161K0282l4616k1082b9497J4394I504N4609j6787A4859
8847A6980J7860K4573c519o564j5783K0n439l74p667J3776B1268a4019f112B5736
8832E1713k2211e4692A0254b548k9239J2121m5636l985b3694l8506J9059M147
8820c8994l2327a6876o154l0740J2710m3843M2363f768A358P394a9412l868a1543
$$ y = [5609, -32404, 18683, 8720, 33658, 4502, 24651, 6321, 18615, 26887, 53774, 56831, 51566, 1674, 41365, 26315, 17453, 29176, 40216, 25221, -21549, 9686, 264, 1921, 12622, 62185, 15057, -28421, -51195, 14869, -2741, -6421, 16400, 50542, 27053, -9753, 3257, 21897, -51498, -11915, -48683, -2185, 7916, -10985, -21484, -10858, -9903, 5984, -22733, -59181, -53456, -1269, -37566, -43201, -33014, -33441, 1503, -37310, -31876, -29416, -40322, -45483, -25201, -59817, -80899, -29497, -15103, 9504, 64113, 47326, 14859, 16980, 34840, 59413, -3519, -10083, -25866, -25846, -31285, -31659, -39326, -25550, 21268, -14019, -6112, 25736, 51713, 29502, -54692, 10254, -2548, -31787, -19666, -65302, -69287, -23694, -62200, -43141, -38994, -71321, -16876, -23030, -53770, -41060, -84903, -42540, -6768, 1358, 8752, -19412, -23280, -11543]
8806c5248n181I963L3808b800A1188J1534a9573q702a3968B6000B277b11m88F2245
8791C175L9762G415c6662j5145J9550j5255B9466d050k7036a284q8528P415i837
8777B635K0915J5233K3217j5406j9966b3013D018O4698b0859e532C7792h256A962
8763a6403n5589j427b9146e583p578c03D358b9509D871Q785a1389b708D2951A9294
8748E7809B8154c9118e311l0074H641j830b5571B4718B362L2118g427C2282G845
8734E6946A7953f470j2065H821b4756j5497J6787J1395j0363d657E453O6970B8948
8720B3694g623A5008K8351D598K6481Q706A2511N9314A7938J0485L2179B8345
8707E4122A726R472C894d0136e346C1442c5908f683D7830a086p8861J2974K6342
$$ y = [-35248, -40429, 9963, 43771, -2800, 11188, 22722, -19573, -28275, -13968, 26000, 2277, -211, -699, 62245, 3175, 42937, 7415, -36662, -51807, -32257, -47512, 29466, -4050, -31086, -1284, -89812, -82397, -9837, 2635, 23550, 38783, 62000, 46594, 26628, -23013, 4018, 68716, -20859, -5532, 37792, -8256, 1962, -16403, -71992, -73419, -29146, -5583, -13161, -303, 4358, -29509, 4871, 13656, -11389, -2708, 42951, 19294, 57809, 28154, -39118, -5311, -35385, 8641, 6811, -25571, 24718, 2362, 34480, -7427, 32282, 7845, 56946, 17953, -6470, -18535, 8821, -24756, -40253, -23466, -12071, -22434, -4657, 5453, 72423, 28948, 23694, -7623, 15008, 43359, 4598, 31079, 39785, 12511, 71825, 17938, 28423, 60602, 28345, 54122, 1726, 11198, 3894, -40136, -5346, 31442, -35908, -6683, 47830, -1086, -79947, -66973, -40631]
8694d0631A0388a4385e686m5739K5103Q362N009n217A2452e181l5002j4064g023
8680B6920b0907O160l1066k0169j3507R731F842P9281B7534c5504l7781O856a6545
8666D8081j0735j4002B403R904b0492q843l4985K8408I66b1288K9l0885a1767
8652a7029A4386L1485j1590j1103n712J705f2099E837b9503a105j2988k3346l5055
8639g2494K6697j5393A4146B012K690J1243D477b5475A2939d9365J7278J5118
8627a6969D0942j6366A1221a2304C5030J6611A9379h889o625F3023k2640Q0947
8615A21330m8907k1778J4282m419B3398b8907I826j929g540G7123C6939A7455
8602E20P8627B5712h4143L2314k4174C0871j2067p229L8047a729B1088n589J5132
$$ y = [-40631, 10388, -14385, -5686, -51425, -26322, -17960, -12951, -18168, 12452, -5181, -40183, -54247, -7023, 26920, -20907, -14747, -45813, -65982, -79489, -69758, 6842, 86123, 27534, -35504, -73285, -66429, -16545, 48081, 37346, 23344, 2403, 12307, -20492, -29335, -64320, -35912, 966, -21288, -21259, -52144, -11767, -17029, 14386, 45871, 34281, 23178, 17466, 19171, -62099, 5837, -29503, -1105, -14093, -37439, -72494, -45797, -61190, 14146, 2012, 4702, 15945, 4477, -25475, 12939, -49365, -32087, -16969, 40942, 24576, 11221, -12304, 35030, 51641, 19379, -8889, -15514, 63023, 40383, 121330, 72423, 50645, 64927, 60508, 23398, -28907, 9826, 7897, -7540, 77123, 36939, 17455, 520, 79147, 25712, -84143, -51829, -76003, 30871, 18804, 11575, 49622, -1729, 21088, 15499, 30631]
8589C0631j910J8665E732g755j0969D1559J8995k2238L0821A7473L4133J436n555
8576D7487B998K3598a3322c222I092K7425Q948J2055H216O531a0867l4649a4264
8562a3937N782q29j7367A6082G301J3814G317b3961E8887J3031k7859A4443K3457
8549C7900A7721B468a4720B4648J7985a8610g001A6649L9138C223J1933L720R659
8536B8535H964K9172B986A302N9764p2k4765K928b1586A0012k213K5997q343E157
8521a4248k4645j2534o368K3533K777j1392A7397e306o03n804m860A8160b323
8507d053g0E633a8661o109E978c6101M331h163m5531k5765d12B9945C306L0806
8493C4112J6734L2696i074f14G2366p586B8556a2460B7075O4923D3252A9497L0890
$$ y = [30631, 28721, 47386, 5732, -7755, -18724, 41559, 60554, 38316, 69137, 17473, 51606, 53042, 47487, 2998, 26596, -13322, -3222, 9092, 36517, 45465, 57520, 8216, 14747, -10867, -45516, -14264, -13937, -8155, -8984, -26351, 16082, 7301, 21115, 7317, -23961, 58887, 71918, 44059, 14443, 37900, 17721, 2468, -14720, 24648, 42633, -18610, -7001, 16649, 55787, 3223, 15156, 18876, 28535, 8964, 38136, 2986, 1302, 61066, 60994, 36229, 39157, -21586, 10012, 7799, 33796, 25453, 5157, -14248, -38893, -51427, -57795, -34262, -31485, -42877, 17397, -5306, -5909, -11713, -16573, 18160, -2323, -4053, -70, 5633, -18661, -24770, 5978, -36101, -31770, -8163, -53694, -79459, -412, 29945, 3306, 34112, 50846, 83542, -9074, -614, 72366, 64780, 28556, -12460, 27075, 91998, 43252, 19497, 50387]
8480E0387J0878a898B4435G855L5934j2859j0805n51L1778a0393C9177i563M297
8467e266l9342C9568b936E5435l530B1805c3829A1085P0680A4305Q35M9665j8700
8454D6105C595a7032j6671f041D4430I488O1497M0792B9304J9356G766a025H5348
8440A8600J3831A5087L6442j1823a3025j7095j8490a9281K623j2163J1528P152
8428a0141M021B2213h920l7303J6085G173A952a1717F2356A994J1877P2732b6355
8414A7445a0565F152R8897M892C4911p710c347j3969e455j38k1310j6931D1324
8400c8624e478C1647j2112J233K0743j4210j349b1611i093E67L0028c2382J2594
8387a9788D3497D05P505b739j6405h929B2350d2088a3914k0936G384d1715a2820
$$ y = [50387, 61265, -1898, 24435, 7855, 43789, 30930, 20125, 19574, 51352, -10393, 39177, -9563, -5266, -44608, 39568, -2936, 55435, 51905, 21805, -33829, 11085, 81765, 14305, 15140, 64805, 46105, 3595, -17032, -33703, -6041, 44430, 9488, 70985, 111777, 29304, 48660, 7766, -1025, 85348, 18600, 32431, 15087, 51529, 39706, -13025, -30120, -48610, -19281, -16658, -28821, -17293, -10141, -6120, 22213, -8920, -46223, -30138, 7173, 1952, -11717, 62356, 1994, 13871, 86603, -26355, 17445, -10565, 6152, 105049, 109941, 34911, 27201, -3347, -17316, -5455, -5593, -26903, -43834, 41324, -38624, -5478, 31647, 19535, 20768, 41511, 27301, 25952, -21611, -9093, 567, 30595, -32382, -19788, 43497, 405, 7910, -2739, -19144, -8929, 22350, -42088, -13914, -34850, 7384, -41715, -12820]
8373C7550r37j3579j1074Q833b7845P224I690e6756b4609j9093J0573k0560b0650
8359d2556J1965J3286l5063K3a9220C3126l783i433A4775a7672C3389J3111A8274
8345g421i36B6674J2309J5345k54h88j1959C055M3374q097M896k358j2150h729
8330A5014a3246n333g23k6866D5150a982E265L3963a0764p200l9308A1586J1602
8317B3188a1804F766J4822O0412B6261I883a3723F443P988M0993r928b6020A866
8303A5624e21m2410B0374K2812f305k345b03C3470l871D176L7881A1363D042J0333
8289A4375J3165l003F33K8446c1094D7451e6A0944J4294N523a1507N526o471B7265
8274d0931f565l1549I977N767i441B8702H417J2448b8394l6921A5545L0849J5759
$$ y = [37550, 36613, 23034, 11960, 20793, -27845, -20621, 9690, -56756, -24609, -43702, -33129, -53689, -20650, -42556, -30591, -17305, -52368, -52345, -19220, 33126, 29343, -9433, 14775, -17672, 33389, 46500, 18274, -7421, -936, 26674, 38983, 54328, 54074, -888, -12847, 3055, 46429, 38332, 43228, 40870, 28720, -8729, 15014, -13246, -18579, -723, -27589, 45150, -1982, 5265, 39228, -10764, -17964, -57272, 11586, 23188, -11804, 6766, 21588, 82000, 26261, 9883, -13723, 6443, 14431, 55424, 45496, -26020, 1866, 15624, -521, -42931, 20374, 43186, -6305, -8650, -203, 33470, 29599, 4176, 42057, 11363, 4042, 14375, 27540, 24537, 633, 29079, -31094, 47451, -56, 10944, 25238, 30761, -11507, -5981, -12452, 27265, -40931, -6565, -38114, 9977, 15744, -9441, 28702, 8417, 20865, -28394, -65315, 15545, 46394, 62153]
8261F2153J1376k3976k2732c5362h843d283A5989A297a6673l1397m3430d1066
8248b9776B657J9501B67O3357J7289l3142J2500J4951k2077a8002l3000a9857
8235A8987K6525A6037J2973B484P174K5247b2687C8868G42J8136r261J8964L8810
8222F7391m627k2562j6813A483g319j662K669r456d62D6633G453a296o992l2750
8208d1038B8505A0903M0480M613K8719C7370P784N1489C1051R535a0569E1935
8195b0043A4149d891E5238B4625F401f666D9516h523o959M576o4912K0245a7208
8181I003P176L0146b828A8332c46D8945j5790a224A6627e944j6882E6776k0064
8168C6712l170A5475E607c9554A26i231j8578D3193Q878M4761k1656k6234r450
$$ y = [62153, 73529, 49553, 26821, -35362, -8843, -4283, 15989, 1297, -16673, -48070, -91500, -41066, -29776, 2657, 22158, 267, 63624, 80913, 47771, 60271, 75222, 53145, -18002, -51002, -19857, 18987, 45512, 16037, 29010, 2484, 9658, 34905, -22687, 38868, 742, 18878, 9617, 28581, 67391, 62764, 40202, 23389, 1483, -7319, -8981, -6312, -15768, -462, 46633, 7453, -1296, -8288, -41038, 28505, 10903, 51383, 55996, 84715, 37370, 45154, 96643, 31051, 40586, -10569, 51935, -20043, 14149, -4891, 55238, 24625, 6401, -6666, 49516, -8523, -15482, -10906, -75818, -55573, -17208, 9003, 16179, 46325, -2828, 18332, -346, 48945, 33155, -1224, 16627, -5944, -22826, 56776, 36712, 33542, 15475, 5607, -39554, 126, -9231, -27809, 43193, 52071, 96832, 75176, 48942, 39492]
8155C9492K868R088B0916N3766j4334M716k8856q891N27a940o6654b3328B4559
8141b4065A0222K9348c915F3024J5078k8430J2059J9967m0365j0627D016b2713
8128A4835b07B5652J1502j7976L3731k3237L8457Q7942B8645a3044j1091K582
8116b1553D8402K0064l2722I368K6400a4742F6805L024j2345B986M2527Q932K5282
8103G9727l424A7617E998N6490B4537L5654n342H136N5358A0008a0399A4908A409
8089a5745f590L162B9560a7064E963L5050A3016o41b4573f704o808C6348I059
8075D4903a0734k0023M613c479j1151B5802L7329A1739L0049L2965j206d011B5737
8061C0732N2019k4549B0497k939K0236j8065H20P3367B7050J0857a0006n174A2866
$$ y = [39492, 42360, 51448, 20916, 74682, 60348, 65064, 36208, 27317, 27844, -1940, -68594, -23328, 24559, -24065, 10222, 39570, -3915, 63024, 78102, 49672, 61731, 81698, 41333, 30706, 4016, -22713, 14835, -207, 25652, 37154, 19178, 52909, 29672, 68129, 156071, 28645, -13044, -24135, -21553, 48402, 68466, 35744, 9368, 35768, -14742, 66805, 69829, 57484, 2986, 45513, 54445, 79727, 76303, 17617, 5998, 62488, 24537, 60191, 54849, 8136, 63494, 10008, -10399, 14908, 1409, -15745, -6590, -3428, 29560, -17064, 5963, 41013, 13016, 12375, -24573, -6704, -13512, 36348, 9059, 44903, -10734, -30757, -26144, -3479, -14630, 25802, 63131, 11739, 41788, 74753, 73547, -4011, 25737, 30732, 82751, 58202, 20497, 17558, 37794, 19729, 820, 74187, 27050, 37907, -10006, -15180, 12866]
8047D894J0352b5411A4370A572M4586r673q632j1925a6141F0693A0374M1745d049
8033H6306Q487k1026J1661m1751A5677L7027k404J443L1168L7592j0381k1711
8021H8411C0699J1505K5566M3355l9171P39j5095J3887B7434b216o6288F7590
8008B6330A0172Q8652m3520A5075M520J2656L7225j0390K8974l9274B221K4026
7996B6247I953M7938g094E7452M4744l7727A9428M0731M7259l7855L4627A2792
7983D3757j3497J7170A6526J5847L1716B3106J8831C050Q6773l442D2806j3422
7971B9384M9118B6355J4213J9337g159F1623j4138A5744M0987p025P2501k156
7959A20051K0134B0973L5775a634F2855k0985A2385J8497P749E153a4556A9405
$$ y = [4894, 15246, -25411, 14370, 1572, 46158, 36485, 27853, 15928, -16141, 60693, 10374, 52119, -4049, 86306, 94793, 73767, 85428, 43677, 15677, 52704, 50300, 51743, 82911, 120503, 110122, 88411, 30699, 42204, 67770, 111125, 71954, 72693, 57598, 71485, 27434, -2216, -68504, 67590, 26330, 10172, 98824, 55304, 15075, 19595, 32251, 69476, 59086, 88060, 48786, 2221, 26247, 9953, 57891, -7094, 57452, 102196, 64469, 19428, 60159, 107418, 69563, 104190, 12792, 43757, 30260, 47430, 16526, 32373, 64089, 23106, 41937, 3050, 89823, 86381, 42806, 29384, 78502, 26355, 40568, 59905, -7159, 61623, 47485, 15744, 56731, 49706, 122207, 120051, 140185, 20973, 56748, -1634, 62855, 41870, 12385, 30882, 38631, 5153, -14556, 19405]
7946A6782J970L4314L7940C5842O0565D4061B41J5706K4483J9318A5728P361A0795
7932D6158A6818J4392L575P205Q546A7320c1004l948E0442j5802J8275g1855C4467
7918I2157j4424k6687A4877K3000a4290B4573K230f472l152j4499j2556A9958
7905F279a8191C0174J5150r316J2127O5253E3802o371P49K9259K9098r539m7141
7892D9857J2743j1454N892j2648B0762J7816J0551g291C5721j4107b2829E705
7879a1342M489D8702L1059B0348g19C1520j2123J5823j4858M7890l1713K2883
7867E9422q838K6743j8888j2744P250F497L0291K4419P824B8258M2692j3103j6595
7854D1252j6566M2907p664e901m082H465L4918c7389C3959A1270D30J1942i1k9911
$$ y = [16782, 18752, 53066, 91006, 35842, 96407, 44061, 241, 15947, 40430, 59748, 15728, 23089, 10795, 46158, 16818, 31210, 34785, 41990, 50536, 17320, -31004, -34952, 50442, 34640, 52915, -71855, 34467, 92157, 77733, 51046, 14877, 37877, -14290, 24573, 26803, -6472, -9624, -24123, -36679, 19958, 6279, -18191, 30174, 45324, 36008, 48135, 113388, 53802, 47431, 48180, 77439, 106537, 96998, 49857, 62600, 51146, 57038, 44390, 20762, 38578, 49129, -7291, 35721, 21614, -22829, 5705, -11342, -6853, 48702, 79761, 20348, -719, 31520, 19397, 35220, 20362, 68252, 36539, 59422, 50584, 77327, 58439, 45695, 52945, 6497, 36788, 61207, 69031, 28258, 70950, 57847, 41252, 24686, 67593, 59929, -5901, -9983, 8465, 43383, -37389, 33959, 11270, 430, 12372, -91, -30002]
7840c0002A7628J3946N8378l1238A6248F634L8157m581j8760K3389M4493D63M7720
7827D8183K9408l2563j5553J7960b181A1600m708M4237i238D255c9781A7691a9098
7813a169k5936n9031e483j1503A5297e2277C429J3721J9789k333f6035J1200H862
7799D5648p331A5161B680K3656b3219n0384b857G1378A9967L4283B1394D053J1557
7786A5610R5566m2178l2700A0946M3768d743m5817b331A8448J9107R836o470E52
7772e667l6126j3245K2706F386N1494j6833K9812L4116C7192a7655k5946g337
7759D5220B1048c3115R443l796I09b9841j7749b31D5200b6385D8759j2387J110
7746C7482K2250k9601j0543D969a0380k3118f301C6174D452a2062E0835j8495
$$ y = [-30002, 17628, 31574, 89952, 58714, 16248, 6634, 44791, 40210, 21450, 44839, 89332, 463, 48183, 77591, 45028, 29475, 47435, -2181, 11600, 6892, 51129, -9238, 4255, -39781, 17691, -19098, -1169, -27105, -86136, -5483, -16986, 15297, -52277, 3429, 17150, 36939, 34606, -66035, -54835, 8862, 45648, 38317, 15161, 2680, 26336, -23219, -73603, -2857, 71378, 19967, 54250, 21394, 4053, 15610, 111176, 68998, 36298, 10946, 54714, -4743, -50560, -2331, 18448, 37555, 47391, 40921, 552, -5667, -41793, -55038, -32332, 6386, 57880, 41047, 70859, 104975, 37192, -17655, -43601, -7337, 45220, 21048, -33115, -23672, -27468, 909, -29841, -47590, -231, 45200, -26385, 48759, 36372, 37482, 59732, 30131, 19588, 4969, -10380, -33498, -6301, 36174, 4452, -12062, 50835, 32340]
7734C2340D618L8876K1184A8925J5189M7372C5954l251O7360l2128k1478K7505
7722G3962j3040Q794k0496K7282l447B5990M9229a0292k285D3796H563N7350J2645
7709G8558l3054j4230K5370q370A87b6073a0191l0060H39a9037P6C8322b5812
7695e5759D7991k463O283K659k3012k195N5227K6116m6054j5189P910E03L510
7682D013d9174A3351R2264H843K3686a0511A7806J2315K3990M6877r123J2808
7670A04673q219I926N0229Q8855j0086K28245j01680m6758k2363l5112n4112J6594
7658A23738o452j2711m9090K0841p159l3033j6520K5747O21j1707J2072P694R498
7645F3539H746M2767a032p959k9185N015J077o101i117R42o512k7271B3808N913
$$ y = [32340, 4618, 43494, 64678, 18925, 34114, 81486, 35954, 32703, 100063, 67935, 46457, 73962, 60922, 69716, 49220, 76502, 73055, 25990, 75219, -10292, -12577, 43796, 8563, 65913, 78558, 45504, 31274, 56644, 48274, 187, -26073, -10191, -40251, 839, -19037, -18961, 38322, -25812, -55759, 47991, 45528, 51811, 54470, 31458, 29263, 84490, 110606, 64552, 49363, 57273, 503, 4013, -49174, 13351, 105615, 8843, 32529, -10511, 17806, 30121, 54111, 100988, 91865, 104673, 96454, 9926, 60155, 149010, 138924, 367169, 265489, 218731, 196368, 161256, 107144, 123738, 117286, 104575, 55485, 76326, 69167, 36134, 19614, 45361, 45982, 34275, 46347, 54041, 63539, 8746, 51513, -1032, -8991, -38176, -33161, -32084, -38185, -9117, -8175, -14687, -41958, 23808, 29721]
7631B9721J4447J4026k6152f079l0166e777C1654J3170N1216k6402l871L078A0575
7617B8661b6231E397a15B5629L2961q885d8643A6770J1918F652e984l6655D225
7603b0103C0806M0954o347A3281c297A5154n76b822m7497g323l1288A3212K3601
7590C6813a98B14K1556l211K6744P3145K4296m6316l0126J9681C0484j5030a4126
7576c6250B7183b5259k6561b3223k8966C2432J1024K0168j55k7263L0007j4302
7564E1911j7077P1510J9388k6131B4781M4097k1113j3021A118L2344L8856k8954
7552D3364R226K5244J5532m181j2334m687a3611C5804j7287Q521M9869N181C7139
7538I7904l0127A7933a0511l4647g799A6879O575c5214q444a7259j7412h111B6222
$$ y = [29721, 44168, 58194, 32042, -6079, -36245, -5777, 31654, 44824, 96040, 69638, 65767, 68845, 10575, 28661, -26231, 5397, -115, 25629, 58590, 49705, -48643, 16770, 28688, 6652, -5984, -42639, 4225, -20103, 30806, 71760, 65413, 13281, -3297, 15154, 14578, -2822, -50319, -7323, -38611, 13212, 36813, -198, 214, 21770, 18559, 45303, 118448, 142744, 96428, 66302, 85983, 30484, 15454, -14126, -36250, 27183, -25259, -51820, -23223, -52189, 32432, 43456, 63624, 63469, 36206, 66213, 51911, 34834, 106344, 125732, 99601, 24781, 68878, 47765, 34744, 1118, 33462, 72318, 43364, 52590, 77834, 93366, 89185, 76851, 72164, -13611, 35804, 18517, 27038, 76907, 82088, 37139, 97904, 67777, 17933, -10511, -45158, -7799, 16879, 23454, -35214, -43658, -17259, -34671, -8111, 26222]
7524E4973j8699M5927n390O7165J4985m8718j2507j1430b3570E99N9984R355k5961
7511D3977B110J9785G201Q5716B6105M7128h663m4628g286H885B992M1219J671
7498D5882N076j2492J8380L1498C7308J1813J9618P2q699J8960a4772e808D9225
7484f8308K1295j8298B2381c2794a1750A9718c4872a0585A3127f0379b5599Q141
7472a7458A2538f5036A052O6622c0040n3178k181l967M4446r74k8491a5668k9816
7459d5484L336O770M816J3361M152C8533O9412l1478l0724j1431L7539a3937H888
7445f0058A9732b539j220H8381B8563J4678p25K8268L0672D4002L7850l0964M58
7432E1346J4826I836A015h146A6341J4359E123h442j4518G3011O7216l0814L523
$$ y = [54973, 36274, 82201, 76811, 143976, 158961, 110243, 97736, 86306, -23570, 599, 60583, 69938, 43977, 2110, 21895, 7201, 92917, 26105, 73233, -8663, -53291, -7286, 8885, 2992, 44211, 45882, 50958, 38466, 56846, 88344, 37308, 49121, 68739, 68811, 60112, 79072, -14772, -5808, 49225, -68308, -47013, -65311, 22381, -32794, -11750, 19718, -34872, -10585, 13127, -60379, -25599, -17458, 12538, -65036, 1052, 67674, -30040, -83218, -85399, -89366, -44920, -45894, -74385, -15668, -45484, -42148, -35378, -30562, -17201, -13049, 38533, 107945, 76467, 45743, 34312, 71851, -13937, 8888, -60058, 19732, -2539, -3759, 88381, 28563, 43241, 42516, 70784, 101456, 44002, 81852, 50888, 51346, 66172, 9836, 1015, -8146, 16341, 30700, 5123, -8442, -22960, 73011, 140227, 109413, 112936]
7419A12936J5823j0451k513k1031R888j0454j2937B2740j0089l129L4637M0719
7407H4878c1594e373l6119j5798A4998J8303K3321J7346R952C4530j3874N2794
7395G3450k4435r016L3933L4103n3117F18O1554J5398o52J3060J01393J12635
7383C04006L12308M71318m67340k99504j11536k3998l167J0322j6471p3477L2316
7372A34777j4057k2139Q976C4138K6123q131q875c6687q1339K9955I916J3936
7360B3852g7082G973b2432r538C8455I573L2069j2045M7285M4694m9733j2785
7348E9058k3850f534E7956A0341e8467K3305j1393a1358m4587p878J6331H970
7335C7602G9J624D57d9939K0366A7304J9207l315c6105F179J1719i533B0438K5642
$$ y = [112936, 128759, 118308, 115795, 94764, 104652, 94198, 81261, 22740, 12651, 9522, 44159, 84878, -31594, -5373, -41492, -57290, 14998, 33301, 56622, 73968, 83920, 34530, 20656, 73450, 49015, 39999, 73932, 108035, 54918, 618, 62172, 77570, 76918, 89978, 191371, 304006, 616314, 1087632, 620292, 320788, 209252, 185254, 182087, 192409, 175938, 102461, 134777, 120720, 98581, 107557, 34138, 60261, 52130, 43255, -36687, -118026, -88071, 9916, 23852, -77082, 7973, -22432, -31970, 38455, 9573, 41642, 29597, 76882, 121576, 71843, 59058, 35208, -6534, 57956, 10341, -58467, -35162, -46555, -11358, -55945, -63823, -47492, 8970, 37602, 79, 1703, 457, -49939, -29573, 17304, 36511, 33196, -36105, 6179, 17898, -9533, 20438, 46080]
7321D6080L7219c913d20j14153L2808J974K0734f897B4735A2021c0428A0204O365
7308A6569a8526B3803N1087k7755G920d1151j6702J08R511k0578L1383B7375N9587
7295H6962o421n696l4069K6723L116k4385P1000k1881J7817m415C0668L8551l0106
7282C9113K563n852N0660k5376M040J2137i984l1409I025N6906k578j1672A8107
7268H3765O665C6630b8240A3463C811b4989A3230K8031j8876J4642j6059K4329
7256D5297j0916O3566k4104c6318B386J12041k790M460r624E2069O9664n6824
7244F4909C1805P6511Q15J9071l1155J2359k9156B8315Q2796R5760G8400j6800
7232F1600J8319J8053l0202A9244I32c5731k3050N255a4807D2326j414n833N061
$$ y = [46080, 83299, -3913, -420, -114573, -81765, -79791, -59057, -6897, 24735, 12021, -30428, 10204, 16569, -18526, 23803, 74890, 47135, 7920, -41151, -57853, -57745, -48234, -68812, -37429, 27375, 86962, 80541, 74845, 40776, 67499, 70615, 46230, 117230, 95349, 113166, 108751, 30668, 69219, 39113, 41676, 35824, 86484, 61108, 65148, 77285, -9984, -41393, 9025, 65931, 63353, 51681, 18107, 83765, 90430, 36630, -28240, 13463, 3811, -24989, 13230, 41261, 22385, 37027, 20968, 45297, 34381, 97947, 73843, -36318, 2386, 114427, 111637, 116097, 106473, 52069, 121733, 64909, 31805, 108316, 109131, 128202, 97047, 109406, 80250, 28315, 111111, 206871, 78400, 61600, 79919, 97972, 67770, 19244, 932, -35731, -58781, -53526, -14807, 42326, 40912, 35079, 40140]
7219D0140j4930q742c018j4974e100G7516j5639L5218k2454j4079L027L5533A5455
7205H4425p037j1291B5565a4853D2625j484e1259J1918a0540j9436B6362a1149
7192H4097l3334j8511J1797J252A8424a6822E789d5018L496a3887C6972H757i242
7178B0658b6997F702c5668a4036F5165L6551j2121m306B4166F490P968M873e1584
7164h2443i605D4512r531k404A5897B222L0735d4029h243m0441C5994d626G2161
7150I6467j7914J4573M6666k4672m6302B5951d5318l7996b6823H8277Q1860q4046
7138H6091B7266C995O985b851k8315M053B6753R8705r124L0951C0280O233b3p7204
7124g7227j4099N936m034M4680C176R140a0272A8021J3577l310J9901e341m1536
$$ y = [40140, 25210, 16468, -3018, -17992, -5100, 77516, 61877, 97095, 74641, 60562, 63589, 99122, 15455, 84425, 77388, 66097, 25565, -14853, 42625, 41141, -51259, -39341, -10540, -29976, 26362, -11149, 84097, 50763, 32252, 44049, 45301, 18424, -16822, 5789, -45018, -41522, -13887, 36972, 8757, -9242, 20658, -26997, 6702, -35668, -14036, 65165, 101716, 89595, 85289, 24166, 6490, 14458, 19331, -51584, -82443, -9605, 44512, 34981, 32577, 15897, 2222, 32957, -44029, -8243, -48684, 35994, -4626, 72161, 96467, 78553, 93126, 139792, 115120, 68818, 25951, -45318, -83314, -26823, 88277, 170137, 86091, 27266, 3995, 10980, -2851, -31166, -27113, 26753, 125458, 116334, 147285, 30280, 36513, -23, -77227, -91326, -85390, -89424, -44744, 3176, 12316, -10272, 18021, 31598, 28288, 48189, -5341, -46877]
7111d6877k0667a233F0547N3927n6473J9406k382A3701J5469a8322A7120O6790
7099H3910K1256F056a8787F405J9705F723e1023J5572H3033M7001k7311H764d0598
7085B6934j008j578R2658M7024K9939n7398k6318D3657D451L7634j3933o652f807
7071e0691r672K208K2662D582a23852K0058c3392j4263p6402j3985d4216a6558
7058D8597A0944P945J9889J4452A4740a1226j3346G394J11556n8170k8264M3302
7046G5818l7110R332J2762K5807P739O1890F6536I511b1327d42A7479d2510b0472
7032h1492j4596l15J4899B4814L0677L86A9960K8148J9819j6979K0981j5300k8108
7019B8521L1684B430M0390B0599O175F695b3419Q257A7704c177A1479l07l669
$$ y = [-46877, -67544, -1233, 60547, 114474, 58001, 77407, 75025, 13701, 29170, -18322, 17120, 83910, 105166, 6056, -18787, 6405, 26110, 6723, -51023, -35451, 83033, 130034, 102723, 8764, -40598, 26934, 25926, 24348, 117006, 164030, 193969, 136571, 110253, 43657, 4451, 42085, 28152, 21500, -6807, -50691, -60363, -58155, -35493, 4582, -123852, -103794, -33392, -47655, -124057, -138042, -44216, -16558, 48597, 10944, 18889, 38778, 53230, 14740, -11226, -24572, 7394, 118950, 60780, 32516, 75818, 38708, 48040, 60802, 86609, 94348, 156238, 66536, 9511, -21327, -442, 17479, -42510, -20472, -81492, -96088, -96403, -81504, 24814, 55491, 55877, 19960, 48108, 67927, 50948, 71929, 56629, 28521, 60205, 2430, 42820, 20599, 26774, 6695, -23419, -15162, 17704, -3177, 11479, 11172, 7503]
7006G503a901B4135g511B1523g6011j9767N19c1493A0564d6001b0820j2666o1973
6993i5459n4264K0075n7327J4029k6301g2997L0703q746a8303I223P9930l3643
6981E5510l964j8450d95D3567J7647a8549B4055I446L5607b3220m1377o709m7955
6968a19261a7331B7327e0783A5683Q2219o288D2589a2912r7990a9605B265K6396
6956B8661c420C133b1408r9172p374M3158b9991F758a7970r655A3912g5897c5810
6942g1704p627m4240l2552j9450Q157M1440b0760Q038k6371a3157E7233B957h1211
6928C6763J01344L774j8775K3682Q792L8619j1976p2314B2801I713d5025k1291
6916f6316q8859j3976K7374O3254n5730j7275j6503b2012G5194N288k5883A6280
$$ y = [7503, -1901, 24135, -7511, 21523, -76011, -95778, -95259, -31493, 10564, -46001, -20820, -33486, -95459, -149723, -129648, -186975, -172946, -199247, -72997, -42294, -51040, -18303, 9223, 89153, 55510, 51546, 33096, -495, 43567, 61214, -18549, 24055, 9446, 45053, -23220, -64597, -71306, -119261, -17331, 27327, -50783, 15683, 97902, 91614, 42589, -12912, -110902, -19605, 2265, 28661, -3420, 3133, -21408, -120580, -127954, -84796, -29991, 6758, -17970, -27625, 13912, -75897, -35810, -71704, -79331, -123571, -156123, -175573, -167416, -125976, -20760, -12722, -39093, -13157, 57233, 2957, -81211, 36763, 138107, 141881, 123106, 146788, 155580, 194199, 182223, 109909, 22801, 9713, -45025, -66316, -155175, -169151, -141777, -78523, -134253, -151528, -168031, -22012, 75194, 80482, 54599, 16280]
6903d0165A5328E214a9728o2164J4733q320m3970e6659a7930A2849a142j2034
6891a3176C3851c1934B8364R1332j3978N7863J813K1983m2746N4513O8538n7816
6879B09866p728q2378o700b4634o3286J9313b8144l3601m3674M077l1810K7e6808
6865e4870J2657j5280a4905C2598J0013N1626J10352p0638E5610a6626I4249k9948
6853F4301J6530l0532K8583d3538l7490a6943j0194q6264L5043J4063a5174C1450
6840A14531K7878J2182m1175P371n8288L5774K2784n1246M6497m9170j7514E392
6827f4249m3309d2378f518m7102j5511j7952p6853O4294o476m117L6309j7376
6815i1302M2485C2143l149c5861Ab1950k4202l7287a7317A0776K4481N4773j4623
$$ y = [-40165, 15328, 5214, -19728, -81892, -67159, -75479, -119449, -56659, -17930, 12849, -1142, -13176, 33851, -31934, 28364, 119696, 105718, 163581, 165394, 187377, 144631, 199144, 267682, 209866, 202138, 119760, 113060, -24634, -87920, -68607, -28144, -61745, -105419, -101342, -133152, -133125, -56808, -54870, -42213, -57493, -14905, 32598, 42611, 94237, 204589, 133951, 55610, -16626, 94249, 64301, 80831, 50299, 78882, -43538, -81028, -16943, -27137, -113401, -78358, -64295, -15174, 31450, 114531, 142409, 154591, 113416, 120787, 62499, 98273, 121057, 69811, 116308, 67138, 49624, 5392, -64249, -107558, -42378, -6518, -53620, -69131, -87083, -163936, -99642, -106118, -110235, -73926, -91302, -48817, 32143, 28994, -35861, 1, -21950, -46152, -83439, -17317, 10776, 35257, 90030, 75407]
6802G5407n279M0621D9834L8246j9830J2372k5981G903k777L3666K7589M0473
6790A06854j9993k2628J0609k225O8717l7508g2186C712O4161A3214a4954p4840
6778h9794n2393c8396J8344l6949R434m8801m0194l4332g7700K895d578D2172
6765F0350O1198R173j581m5767N8828l0328O574l1126b361n266j1195A5205e2753
6751G698C296N9467l0073J0729O445K7404R2579G3295N2102l8811M7201E0745
6738G0026J0319O4430o0758P6360k2336m8593j435C9289a0384l2674E095R6742
6726A01837l0843A9160M9517M0364R4085j7782n9166p401O22m3298B5316M7778
6714G3094B5779p947c9433j3965j1387A6629m995a8246D1461J20907n5936j9633
$$ y = [75407, 70128, 110749, 49834, 88080, 68250, 80622, 54641, 7903, 5126, 38792, 66381, 106854, 86861, 64233, 74842, 72617, 141334, 103826, -72186, 3712, 67873, 13214, -14954, -89794, -142187, -38396, -20052, -57001, -47567, -96368, -136562, -170894, -77700, -74805, -4578, 42172, 60350, 121548, 130721, 129140, 83373, 142201, 111873, 118447, 87321, -2361, -7627, -18822, 15205, -52753, 7698, 3296, 62763, 32690, 43419, 49864, 77268, 169847, 73295, 125397, 86586, 133787, 50745, 70026, 80345, 144775, 84017, 160377, 138041, 89448, 88013, 39289, -10384, -43058, 5095, 101837, 70994, 19160, 68677, 109041, 203126, 185344, 126178, 118777, 119399, 76101, 25316, 73094, 25779, 17832, -39433, -53398, -64785, 16629, 11634, -18246, 41461, 162368, 106432, 86799]
6702H6799P3096M6567l0777m5321D0209D797I6J41676J9319M540J246L3511I5243
6688C8351A4467L6598P8961o4906k5821a9732A1732K8466J26R771J3316J17138
6676A80549L2947M7483N2171N66n7368l7954J2041j103R7996J17161Q4995J70525
6664G00009N00458P81668j55806p67428l68896j89903j55981n9493l5011L205
6654B52822N4612P7542o6304j1972m418n7864o4416P632L2508J8005j15787M195
6642A26555n7053A9933n59O4499J9535M4234P3737k2689n628L6723P9034L0604
6630C39423L0764P6987J08989q467m727J44873K06523O16339N55465o64420o56891
6619G44858k08177j64990j46417j0645p8598O3487P0974L047K1865k4131m7143
$$ y = [86799, 159895, 206462, 175685, 130364, 40209, 4797, 96, 141772, 161091, 165631, 166877, 200388, 95243, 38351, 14467, 51065, 130026, 65120, 39299, -19732, 11732, 40198, 40324, 50095, 63411, 180549, 213496, 260979, 313150, 313716, 256348, 218394, 230435, 229332, 327328, 444489, 529484, 700009, 1200467, 1982135, 1826329, 1058901, 690005, 500102, 344121, 284628, 249617, 252822, 307434, 384976, 318672, 306700, 302282, 244418, 180002, 187634, 220142, 238147, 122360, 126555, 69502, 19933, 19374, 83873, 103408, 147642, 221379, 198690, 193062, 229785, 308819, 339423, 370187, 447174, 556163, 547696, 542969, 687842, 894365, 1510704, 2066169, 1401749, 744858, 536681, 371691, 225274, 214629, 136031, 199518, 270492, 273539, 295404, 271273, 224130]
6608B24130l8654l8535O212M8958O9012j06843m0143j2400P5574N3785Q646n361
6596B44381l8166P458r4611C1949J8699N2187K7696J79693j3366K838m5283m8265
6584B06148m0720m357j5619J10127R329r4614k6881k8108D7089J2659D78J42846
6572A43324J00710M8695m4876q4523N3340r0057E9408J1523N3014L3539k5763
6561A31721m4223O4698J282J5117o2914m1871K0509P698l0388R4205E8614Q3170
6549A41784j7568L4332R543O393P8634k528n1959P6809O0270j27362n5433J4278
6537A67193J07563J8397R9295J38239J88468M83425P65112M3318p64659l17973
6527I28378k19677j85815p4769K2657N9371j28190j16215j14682H4140J5729D0694
$$ y = [224130, 185476, 146941, 153153, 202111, 271123, 164280, 124137, 111737, 187311, 241096, 249742, 244381, 206215, 213673, 119062, 31949, 50648, 102835, 130531, 310224, 296858, 299696, 254413, 206148, 165428, 161071, 145452, 255579, 264908, 170294, 143413, 115305, 47089, 59748, 478, 143324, 244034, 292729, 247853, 163330, 216670, 126613, 59408, 70931, 123945, 157484, 131721, 87498, 152196, 153478, 168595, 105681, 63810, 84319, 92017, 61629, 155834, 58614, 141784, 124216, 158548, 168091, 174484, 253118, 250590, 198631, 275440, 335710, 208348, 152915, 167193, 274756, 293153, 392448, 530687, 719155, 1202580, 1967692, 2011010, 1246351, 928378, 708701, 522886, 448117, 470774, 530145, 401955, 285740, 171058, 84140, 99869, 40694]
6515E0570e207E7309o438B961M5486d0514O756O975E8299N8073N6645N2508l6302
6502A89223q4316J03728l4590m9174J03772N1458Q3780M4554J88786J09051K40336
6491I46608N11588O19965n16824o36787l93310k28542j31372O4689J1860Q0305
6481C28180o6204J1348p1092j8915J1182m2069r27M7451M21N7426o5639p383n1770
6468A32009L9319L0552O4254l8951L4436j7261j03700L4133m3187P5844j6241
6457A91207N5401q242L4924M2009l4902j1674l6510k3163L278M8821N6287p9851
6445B37585q6632l8317P6947k1144K1929O4692J53833Q2698q219r528J03152J42635
6433G19631J03072K99015J14058J62636J14582J02320M7917M4773m6549j34252
$$ y = [50570, -5207, 57309, 50871, 2961, 48447, -40514, -33758, -26783, 58299, 116372, 173017, 225525, 189223, 104907, 208635, 174045, 124871, 228643, 280101, 363881, 408435, 597221, 706272, 946608, 1458196, 2078161, 1561337, 924550, 531240, 302698, 171326, 236015, 247875, 328180, 261976, 273324, 202232, 183317, 194499, 152430, 151503, 198954, 199375, 256801, 191162, 183779, 132009, 171328, 201880, 266134, 227183, 261619, 244358, 140658, 174791, 131604, 207448, 191207, 246608, 238366, 273290, 315299, 280397, 268723, 232213, 209050, 212328, 261149, 317436, 237585, 150953, 112636, 189583, 168439, 190368, 255060, 408893, 491591, 483372, 473844, 576996, 719631, 822703, 1121718, 1235776, 1398412, 1512994, 1615314, 1663231, 1708004, 1661455, 1527203]
6423A527203j92486k33729o7836r1146j20683j54600n9182m9791m2677o6722o3611
6412C84740m6566l3132K6730m3174N070k2166m6329m088l8878Q3224N260m8631
6400B22060N2591R9983Q3190j00781q7753j14468J8745N6525J53862J76276O9157
6389F29387J3893k9391q4288l3510j1225n496L4237M1940Q826Q6013N8208L6423
6377G45017Q3595J28757M0735K41130L90756J159709Q00743j080414q77789n28042
6367A104197l10337j35252j29395L053K8425O3178m2766L4913l8519n1661m4264
6356D81572J0436m1904P150k3699P3154R9787O7085M5638m7692r4107l8252q0407
6344D58761N3699l2087J8952P1450L874J8468Q7911l4368O1760P3657J96316M32430
$$ y = [1527203, 1334717, 1100988, 1033152, 942006, 821323, 666723, 607541, 557750, 515073, 448351, 384740, 338174, 305042, 331772, 288598, 293668, 271502, 225173, 221085, 182207, 265431, 270691, 222060, 274651, 374634, 457824, 357043, 269290, 154822, 173567, 230092, 383954, 560230, 629387, 643280, 613889, 529601, 496091, 484866, 479370, 513607, 555547, 564373, 650386, 708594, 745017, 828612, 957369, 998104, 1239234, 1629990, 2789699, 3590442, 2510028, 1632239, 1104197, 793860, 658608, 529213, 532266, 560691, 623869, 581103, 616016, 577497, 525836, 481572, 492008, 450104, 457254, 433555, 506709, 606496, 673581, 719219, 671527, 577420, 539168, 458761, 512460, 480373, 499325, 570775, 574649, 593117, 681028, 646660, 708420, 782077, 978393, 1410823]
6332A410823O44598J372871j51051r19912r03328m71439j62826j58254j15220
6323E46262Q8451J60481k006j6579l615j5292N443P4816M0290J6525K6779P4047
6311I95602N2964j16455l1046j6977J57117J65247J40131r5701m1334J49969M9456
6300A408973J36721R8375J28960J68176N1840L5634o5237K130m2973r2556j69507
6289A660536q4659j14194j97271n9597j7534K706p1983K1401n8097n0961k9096
6278A001251p8411K3538O9180N432J12610J2437k2029J01611J7471j34089n5106
6267A053895O2735J13549J06626o1930j01504O2990J19406J61686Q3258N5327
6257A656038N1175J5502N0871j08982r7024p3036R8213K28825N7958P6834P130
$$ y = [1410823, 2055421, 3428292, 3277241, 2357329, 1454001, 982562, 819736, 661482, 546262, 634713, 795194, 793188, 776609, 772994, 757702, 763145, 837961, 878251, 894776, 921555, 995602, 1048566, 932111, 901065, 884088, 1041205, 1206452, 1346583, 1250882, 1209548, 1359517, 1408973, 1545694, 1644069, 1773029, 1941205, 1993045, 2028679, 1963442, 1965572, 1922599, 1830043, 1660536, 1575877, 1461683, 1264412, 1204815, 1187281, 1189987, 1118004, 1139405, 1081308, 1030347, 1001251, 922840, 946378, 1015558, 1020990, 1133600, 1146037, 1124008, 1225619, 1243090, 1109001, 1053895, 1116630, 1230179, 1336805, 1274875, 1173371, 1236361, 1355767, 1517453, 1600711, 1656038, 1707213, 1722715, 1773586, 1664604, 1567580, 1494544, 1592757, 1821582, 1879540, 1956374, 1963504]
6246A963504P8762J10585K01148J12232K38472L65612R20084J149097q60569q79379
6236C399548n26622j06524k2947M3416J61580J50551K19624J97520J67030K37337
6226C920513L92472L78614M17213M63816P41373R58631J068354J494810J822490
6217A1658286K451658L520471M936971P895593J3625146K5433045N5572484J34638295
6209B59731949J32551537j43584093A18628701n4801448k4006208j2127998o711712
6202B0981335l746553k230705j188976R2148l29434j164856r60687o57761n15304
6193A0279207p25498r73226p25686n73399n00912l34496j54876p9990J40263J82257
6183F533644K97875O04284N86214Q27011J182752J431155J933291K770152M096343
$$ y = [1963504, 2042266, 2152851, 2353999, 2466231, 2704703, 3070315, 3990399, 5139496, 4278927, 3399548, 2872926, 2766402, 2743455, 2786871, 2948451, 3099002, 3318626, 3516146, 3683176, 3920513, 4312985, 4691599, 5108812, 5572628, 6314001, 7272632, 8340986, 9835796, 11658286, 14109944, 17630415, 22567386, 30462979, 44088125, 69521170, 125093654, 259731949, 392283486, 248699393, 118628701, 63827253, 39821045, 27693047, 20981335, 17234782, 15004077, 13815101, 13907249, 13577815, 12412959, 11452272, 10794511, 10279207, 9553709, 8580483, 7854797, 7281398, 6780486, 6445990, 6291114, 6211124, 6351387, 6533644, 6831519, 7435803, 8022017, 8849028, 10031780, 11462935, 13396226, 16166378, 20262721]
6174B0262721O094696J0317163J8000472L4955082Q1566490J63390040J0859606
6167C45446270j66830958H8280808l7767677j7672362r447118n297347l210855
6160A4885449k383100j752210j135240o79871m09182p8401L942N2226k06012m28555
6150G869046o00236o28498o05440n28631n08153o04544m46853m17141l53990m00192
6140B775368l72454l64073j45923k34492j60428m0084J00447o8780J8764q0805
6130A427540q2211p3162R5060J907O229k0625j42585j37090j22172o9017L0897
6119I14771J23624J22080Q3970K48050J53757n0706j01283J43286K55227J04219
6109A996995K7381n2477J0730K2243p6171K7794Q5277K76710Q1366K11540m1337
$$ y = [20262721, 26357417, 36674580, 54675052, 89630134, 171196624, 334586664, 345446270, 178615312, 88280808, 50513131, 32840769, 23393651, 18096304, 14885449, 12502349, 10750139, 9614899, 8935028, 8525846, 8447445, 8451387, 8503613, 8297601, 7869046, 7268810, 6640312, 6034872, 5506241, 4998088, 4393544, 3946691, 3529550, 3175560, 2775368, 2402914, 2038841, 1892918, 1658426, 1497998, 1457914, 1558361, 1489581, 1508345, 1427540, 1345329, 1272167, 1367227, 1369134, 1375363, 1354738, 1212153, 1075063, 952891, 883874, 914771, 1038395, 1160475, 1244445, 1492495, 1646252, 1595546, 1494263, 1637549, 1892776, 1996995, 2024376, 1971899, 1982629, 2004872, 1928701, 1956495, 2041772, 2318482, 2399848, 2611388, 2570051]
6098B570051J22643J12853K30525M15402M82040M49628N02129N55975P14353P91455
6088F947054J068730J400222J842045K424190L442913M659495P330712J2370829
6080D1486190K2380637M6441681J09004360J48058206q5984176A39807510o6007388
6073G3800122k9124296j4434653p825507m664498k964021k154465j418131q12665
6065A0401886l23262j7349K3056n2172l74236n59846o19068o45501n94116m40122
6055F799270k06275M199M6684J02694M04483P68430J168038J614843J705354O68683
6045A3076403R74527K436478L827652N594273R245164J6174665L0276498O7155403
6037A48761063J44917477O9530936j54469327A02272316m5468996k0836973j0945654
$$ y = [2570051, 2692694, 2805547, 3036072, 3451474, 3933514, 4383142, 4885271, 5441246, 6155599, 6947054, 8015784, 9416006, 11258051, 13682241, 17125154, 21784649, 29115361, 41486190, 63866827, 110308508, 219312868, 367371074, 281386898, 139807510, 73800122, 44675826, 30241173, 22415666, 17751168, 14787147, 12632682, 11214551, 10401886, 10078624, 10061275, 10084331, 10032159, 9657923, 9098077, 8479009, 7833508, 7239392, 6799270, 6592995, 6597194, 6643878, 6746572, 7151055, 7919485, 9087523, 10702366, 12407720, 13076403, 14050930, 16487408, 20315060, 25909333, 35154497, 51329162, 81605660, 148761063, 293678540, 363209476, 208740149, 102272316, 56803320, 35966347, 25020693]
6030B5020693o250666l798418k728778k024971j441870q42279l93909p516J81478
6021G713764J73797R9609N3184k17129n23720p24935n21326n00902p02804o19232
6011D230306m61250k39550J5932M13200L41979j12865j318984r51068l76567k39246
6001A301887j37581M6639R05p3810n345j6294O6479j7928O7586p5924j41016j02009
5989I13589n5763l3779N4374M2841M7827Q2162J00412j25848j39241n3674J49113
5978I82013J15799O2184j6600l2122N3800J85129p4842o9786j9174M1284k0766
5967A206919r7776j87397o5414m0703n3077K8655m3727M9731O1720M6229l7947
5956H67213N8470J13441K2264P6575k4610k4490o8080m3167r2145P762k7420l0682
$$ y = [25020693, 18770027, 14971609, 12242831, 10217860, 8775990, 7933711, 7539802, 7532286, 7713764, 7887561, 7987170, 8040354, 7823225, 7299505, 6574570, 6053244, 5552342, 4849538, 4230306, 3769056, 3529506, 3545438, 3958638, 4300617, 4187752, 2868768, 1917700, 1541133, 1301887, 1164306, 1210945, 1211850, 1138040, 1132695, 1116401, 1182880, 1164952, 1232538, 1156614, 1015598, 913589, 857826, 824047, 878421, 921262, 969089, 1051251, 1151663, 1025815, 886574, 832900, 982013, 1097812, 1159996, 1143396, 1111274, 1165074, 1350203, 1275361, 1205575, 1186401, 1227685, 1206919, 1109143, 921746, 856332, 815629, 762552, 791207, 747480, 797211, 858931, 905160, 867213, 925683, 1039124, 1061388, 1137963, 1113353, 1088863, 1020783, 977616, 885471, 893233, 865813, 835131]
5944H35131j4867L4850N1164j01475l6114J9907J06566J09707L9227j61188m4794
5933H38114J30207p396L9123L8902J11042Q5245J9511m0326J34243L9211N5714
5922A443590K05982J83094J5632J71755K10375M97325P33615P07593k58040r01638
5912C009283k18395J03971K09471L16566K27738J26768q1477j70493k46390l44296
5902B932746l24215j77966j16479q0318q8883p2549O8476J03473K35751K07757
5892B687793L57153L83544K13250K24572K80456J88892J58883J28201m2201n7996
5882D522547J10710M8907l1180R4989K29074M35189Q76293R48871M54519q29808
5872F860111n67739o5198J14825L82340L65174N03104O71973Q55322Q50945Q68863
$$ y = [835131, 820264, 855114, 906278, 804803, 768689, 788596, 895162, 1004869, 1044096, 882908, 838114, 968321, 960925, 1000048, 1038950, 1149992, 1235237, 1254748, 1214422, 1348665, 1387876, 1443590, 1649572, 1832666, 1848298, 2020053, 2230428, 2727753, 3461368, 4168961, 3910921, 3009283, 2790888, 2894859, 3104330, 3420896, 3648634, 3775402, 3693925, 3523432, 3277042, 2932746, 2608531, 2430565, 2314086, 2233768, 2144885, 2072336, 2140812, 2244285, 2480036, 2687793, 3044946, 3428490, 3641740, 3866312, 4146768, 4335660, 4494543, 4622744, 4580543, 4522547, 4633257, 4682164, 4650984, 4745973, 4975047, 5410236, 6286529, 7235400, 7689919, 6860111, 6292372, 6227174, 6341999, 6724339, 7089513, 7592617, 8264590, 9119912, 9970857, 10839720]
5862A0839720P35717O66693R97662J771121M596230J5374898N092781j6886212
5854B3188610n339725j006590J02959M78026N15178N63669N14663O28030N38350
5845B0183170M72192K29250j29308l00674m45048o51589q09432r40808j029308
5836A6578445r96804r61363q80098q31721p46358p69771p01693o58758n59279
5827I472600m25424n02687l88701m23861k06438m25206l58708k91774j37587j43672
5817F168542n0599m9408J65937O48193J430150M557987J5715390J768932A3336503
5807G609400j902372q26124m48324k32655k18826j78886p0472j65346k26058p6772
5797C263565M4184p2994j2797j9647K4179j27450m7290j3844J13470J07202J95106
$$ y = [10839720, 11575437, 12242130, 13239792, 15010913, 19607143, 34982041, 40074822, 23188610, 17848885, 16842295, 16945254, 17423280, 17938458, 18502127, 19016790, 19644820, 20183170, 20655362, 20884612, 20755304, 20454630, 20009582, 19357993, 18548561, 17607753, 16578445, 15581641, 14620278, 13740180, 12908459, 12162101, 11392330, 10690637, 10031879, 9472600, 9047176, 8544489, 8155788, 7731927, 7525489, 7100283, 6741575, 6449801, 6312214, 6168542, 6117943, 6068535, 6234472, 6882665, 8312815, 12870802, 28586192, 30355124, 13336503, 7609400, 5707028, 4880904, 4432580, 4199925, 3981099, 3802213, 3731741, 3566395, 3340337, 3263565, 3307749, 3234755, 3221958, 3202311, 3226490, 3099040, 3051750, 3037906, 3151376, 3258578, 3453684]
5786C453684L6630Q9113O3385L377j23978o6277p9610j0295M9595n8872O0561
5775C417313J7745n5617q5473R6696K6139N0608M5077M1784K8243L760Q0354J22121
5763C788750J21724J87827J71334J40350J57704K09527J46152J91288J36167P2691
5753E323514R1605R1124J56786J89078K78832L37160O21426J044718J81755m98816
5743G817182j64157L4659J88094K53118K90044L30476K54153K62699L26855L43242
5733I936365L87481N00219N70377N06423O05499O16586O19876O94367O06859O05613
5723A5649665N18342N10880N87535L89140J73326P9955M6292j58637l95044l63644
5713A7037810m49404n50684o77554p48395p82494p12652n20357j49208j44786
$$ y = [3453684, 3490314, 3579427, 3642812, 3646189, 3522211, 3455934, 3376324, 3366029, 3415624, 3356752, 3417313, 3435058, 3379441, 3293968, 3390664, 3416803, 3467411, 3512488, 3554272, 3582515, 3586275, 3666629, 3788750, 3910474, 4098301, 4269635, 4409985, 4567689, 4777216, 4923368, 5114656, 5250823, 5323514, 5415119, 5506243, 5663029, 5852107, 6130939, 6468099, 7089525, 8134243, 8315998, 7817182, 7653025, 7687684, 7875778, 8128896, 8418940, 8749416, 9003569, 9266268, 9593123, 9936365, 10323846, 10824065, 11394442, 11900865, 12506364, 13122950, 13742826, 14437193, 15044052, 15649665, 16168007, 16678887, 17266422, 17655562, 17828888, 17908843, 17955135, 17796498, 17401454, 17037810, 16588406, 16037722, 15360168, 14611773, 13829279, 13116627, 12596270, 12447062, 12302276]
5704A2302276j131789j317072q82465p11590m76404o71414m25871l25748l03060
5695F056863k42381k70513l87607j88588l22756k77020j83107k03053k45829j23750
5685C612259j23126q9028m1072j0953j07050k02353j01943k05463j89466k8753
5675B513052p3308p6902l7879O6857N353m8732j37938o8374p6691j05877n4902
5664A904659O035N0062o2969m3588K3352q9698j18666Q366Q2806J06144R7122
5653A963625L827J13347K3550l5755j7546J78154j36304l1515R3285J01632p7202
5642B179098O5688K4445J60437K4873Q4576o4116Q3711N0485J3433J45577J23209
5631B891416J90457L23819L40901L72551N88878N13850N04225L14897j03753m07464
$$ y = [12302276, 11170487, 9853415, 8970950, 8259360, 7782956, 7111542, 6685671, 6359923, 6056863, 5814482, 5543969, 5156362, 4967774, 4645018, 4367998, 4184891, 3981838, 3736009, 3612259, 3489133, 3400105, 3359033, 3348080, 3241030, 3038677, 2936734, 2731271, 2541805, 2513052, 2439744, 2362842, 2324963, 2391820, 2397173, 2348441, 2210503, 2142129, 2065438, 1959561, 1904659, 1910694, 1960756, 1897787, 1854199, 1877551, 1787853, 1669187, 1677553, 1760359, 1866503, 1963625, 1967452, 2080799, 2104349, 2068594, 2051048, 2229202, 2092898, 2061383, 2154668, 2256300, 2179098, 2244786, 2269231, 2429668, 2454541, 2539117, 2475001, 2558712, 2609197, 2622630, 2768207, 2891416, 3081873, 3405692, 3746593, 4119144, 4708022, 5221872, 5726097, 6040994, 5937241, 5529777]
5621E529777o59198o45291o15704m32765j97120J55074L52514O94877K18271o00019
5611C800416k81255p6768J85319L94118L21460K91737K99183l1681j44818k25025
5601D532686n03500n31449k38673l57209l08763k05302j70557p8620j11373o0144
5591A967096M0432M0854N8300J61163Q651J41214L84107N04628N64373N28130
5581D398948M42249L64652l2522l91059n02680l91293j94244K34823M38713m28314
5571C939273p11459l52931j12416J62709K17000J71012K06072L23482K84071L14066
5561D440879L00248r0955j35257K5524l25212m11034l03088l15370k67443j30782
5551B787510j02458l5426q670n2414j44054j29622j41588m1075K3100q653k8692
$$ y = [5529777, 4870579, 4225288, 3609584, 3176819, 2979699, 3134773, 3487287, 4182164, 4400435, 3800416, 3519161, 3442393, 3627712, 4021830, 4343290, 4635027, 4934210, 4902529, 4757711, 4532686, 4029186, 3497737, 3259064, 2901855, 2593092, 2387790, 2217233, 2138613, 2027240, 1967096, 2007528, 2048382, 2106682, 2267845, 2276496, 2417710, 2801817, 3306445, 3870818, 4398948, 4841197, 5205849, 5173327, 4782268, 4279588, 3888295, 3694051, 3928874, 4367587, 3939273, 3227814, 2874883, 2762467, 2925176, 3142176, 3313188, 3519260, 3842742, 4126813, 4440879, 4741127, 4650172, 4514915, 4540439, 4215227, 3804193, 3501105, 3185735, 2918292, 2787510, 2685052, 2649626, 2640956, 2588542, 2444488, 2314866, 2173278, 2132203, 2155303, 2146650, 2117958]
5540B117958J4407J49407p9356Q1129Q5269J17712p9218M3333N0882N223O4147
5529B570893K2136J0432M5985l0705O0692l9151N8808O110J1414P532p0999P6636
5517B729783J02962J20507J31509P5011R1898J81603J52230K27707J14761J96324
5507D124295J03375J26215J29344J69833L37545L29494k354j64643j15209o3111
5497D974784j86533Q52K02840K19234L18495L48212K98987M13071L67647L42412
5487G300001L59265L31296M02692L62200M38356O38844R21820J024538R67772
5478A2746784R15749J153853J350560J474879J471669J818902K678939M067595
5470B7678930O701771J1792982K2068757L5599337M6287418O6431200P2016474
$$ y = [2117958, 2132365, 2281772, 2202416, 2283545, 2368814, 2486526, 2407308, 2450641, 2501523, 2506746, 2570893, 2593029, 2603461, 2649446, 2618741, 2679433, 2640282, 2699090, 2705200, 2716614, 2724146, 2653147, 2729783, 2832745, 2953252, 3084761, 3159772, 3251670, 3433273, 3585503, 3813210, 3927971, 4124295, 4227670, 4353885, 4483229, 4653062, 4990607, 5320101, 5317747, 5153104, 5037895, 4974784, 4788251, 4789103, 4991943, 5211177, 5529672, 5877884, 6176871, 6589942, 6957589, 7300001, 7659266, 7990562, 8393254, 8755454, 9193810, 9832654, 10754474, 11779012, 12746784, 13662533, 14816386, 16166946, 17641825, 19113494, 20932396, 23611335, 27678930, 34380701, 46173683, 68242440, 103841777, 150129195, 216560395, 288576869]
5463B88576869N3405407L3855166p153103l6024887p3587099o7899207n8290339
5456A32882807m5645386k5211271j2132591m977755m29147M083383J1340663K0673589
5448H0584292K5491888L5091864M9839788L4173186L2992405M1112541J772328
5441C01058292j5816634n736131l9745000n0476413l0940783m0438882l5022102
5434H2882347k0235186j5263029r573424m691107j910856p0034J196298L277125
5426C5612134O315092J1388759K1805970L5108151M6110431O5826535O9861558
5419B92028630N0604614L1941016r872384l7959464p3661886o6436796n7619618
5412A29024112m5370090k3995567j1437940m597127k34830M567710J2270465K2278030
$$ y = [288576869, 341982276, 375837442, 368684339, 332659452, 259072353, 191173146, 132882807, 87237421, 62026150, 49893559, 44915804, 44486657, 48570040, 59910703, 80584292, 106076180, 141168044, 191007832, 225181018, 258173423, 299285964, 301058292, 285241658, 279505527, 239760527, 189284114, 158343331, 117904449, 82882347, 62647161, 47384132, 37810708, 33119601, 31208745, 31138711, 32335009, 35612134, 41927226, 53315985, 75121955, 110230106, 156340537, 222167072, 292028630, 342633244, 374574260, 364701876, 326742412, 253080526, 186643730, 129024112, 83654022, 59658455, 48220515, 43623388, 43388558, 47956268, 60226733, 82504763]
5404H2504763K5776595L5215484M9071065L0455811L1842086L9604513k832932
5397B91637385j6720828o764938m2539095n0220271l1329024m1233226l4480965
5390F8349038k0397218j5563287j0315140n807667l240445j881438j285075q27427
5382I031341n26605n78125o09563m74997m95259n72239l67935k99055k31877R1513
5372D967199K06765J81341J58545J8211L5287J3378N5877M8568J87183M63743
5362F336097J004204J354600Q07552j26242o46384m65178J29449L97734O98461
5353I490293R49130J274733J370437J679731K377333L311263M447331O097904
5345C0998155Q687079J2322522J7605816K4318388K9321903K4414900L697125
$$ y = [82504763, 108281358, 143496842, 192567907, 223023718, 254865804, 294470317, 291637385, 274916557, 268151619, 225612524, 175392253, 144063229, 102830003, 68349038, 47951820, 32388533, 22073393, 16265726, 13025281, 11143843, 9858768, 9031341, 8504736, 7926611, 7317048, 6842051, 6346792, 5774553, 5406618, 5107563, 4875686, 4967199, 5173964, 5355305, 5513850, 5532061, 5567348, 5580726, 5636603, 5685171, 5872354, 6336097, 7340301, 8694901, 9502453, 9376211, 8729827, 8264649, 8394098, 8791832, 9490293, 10439423, 11714156, 13084593, 14764324, 17141657, 20452920, 24900251, 30998155, 39685234, 52007756, 69613572, 93931960, 123253863, 147668763, 151365888]
5338A51365888j9216602k8068221k4938163j8713937j3350339r458262o805737
5331C0814627m965715l670291k917783k169575j701811j171618r46959n60985
5323A2709890n16865l38810k97338k77836k24534j17360J39951K90838M44341
5314A1812277O39722O92596J006098J099035J261527J570348J924248K179966
5306B2185817K905139L756360M850011O491865Q693711J1574101J5711743K1296315
5298I7465062K7363419K9273071J8196994o288702k6050711l0555197k5915538
5291H3488398j9625545j4373137j0288108p630505n439393m021390k987508k250594
5283A6872218j692498j181909q35493q99632p94877p76614j044519j095858r10373
$$ y = [151365888, 132149286, 104081065, 79142902, 60428965, 47078626, 37620364, 30814627, 25848912, 22178621, 19260838, 17091263, 15389452, 14217834, 13270875, 12709890, 12193025, 11854215, 11556877, 11279041, 11054507, 10937147, 11077098, 11367936, 11812277, 12451999, 13144595, 14150693, 15249728, 16511255, 18081603, 20005851, 22185817, 25090956, 28847316, 33697327, 40189192, 48882903, 60457004, 76168747, 97465062, 124828481, 154101552, 172298546, 166009844, 139959133, 109403936, 83488398, 63862853, 49489716, 39201608, 31571103, 26131710, 22110320, 19122812, 16872218, 15179720, 13997811, 13162318, 12262686, 11467809, 10691195, 9646676, 8550818, 7640445]
5274G640445q33203o72580m17936l29434j46345j22181o5616O1980K16149K24914
5264E556193L74211M90821Q26441R60339J052275J524633J747018J858105K126927
5255A6516963K220356K381527K256621J595366K54520j603711k988297l442460
5247A7190885l336946k638951k069027j523986j178292p30728l56106l17785l17992
5238D721072k43507j13185k23126l93343l56031n26720n07452m40426m11895l39523
5228A165864k29657k29059k27719j37115l6380k2167k0091m94O5651p3174m3214
5217B12445P1875L2760j006N943l5714o7036q4767Q4931l6058K3324m1987K4833
5205A89543H0115k4942o189K8705b0180C2155O1900J26178n656p5767n5672O2427
$$ y = [7640445, 6807242, 6134662, 5716726, 5387292, 5240947, 5118766, 5053150, 5115130, 5331279, 5556193, 5930404, 6421225, 7247666, 8208005, 9260280, 10784913, 12531931, 14390036, 16516963, 18737319, 21118846, 23375467, 24970833, 25225353, 23621642, 20633345, 17190885, 13853939, 11214988, 9145961, 7621975, 6443683, 5712955, 5356849, 5039064, 4721072, 4477565, 4364380, 4141254, 3747911, 3391880, 2865160, 2357708, 1917282, 1505387, 1165864, 936207, 707148, 479429, 342314, 305934, 283767, 263676, 263182, 328833, 255659, 212445, 284320, 317080, 316074, 322017, 286303, 219267, 134500, 219431, 183373, 206697, 164710, 189543, 80115, 55173, 48984, 77689, -20180, 32155, 94055, 220233, 214577, 138810, 83138, 145565]
5193A45565m8459m3017j4225K2659L8761K857P3416R7172K80898J30345J3900
5182F99872R8460L14783m5266K9306J45346l525j92886j95220j60949j13700o9970
5171E06251r9111M8326o4397n0312k6471k7830o1489l5640N3402K5226L5233l3486
5159B69702k5139q5797j6106k1641m9860J405J23787L722j7091K8572K5055r524
5147B27085K9994N0664Q3903K09905N8365O9984K22150K11528k4423M9718L04421
5136A493294K03860M776n5153j80929k68714k82832j90424j62864k5537q5966
5126D49511j06164n996L675K5214O148J18919j2929p8809j3533J6077p0019M4412
5114C76506k9315j3819P2107n2967o0549n1746m85o5544H4366L8203R5530J55956
$$ y = [145565, 97106, 54089, 39864, 62523, 101284, 104141, 177557, 274729, 555627, 685972, 699872, 798332, 1113115, 1067849, 1097155, 1242501, 1238976, 1046090, 850870, 689921, 576221, 506251, 407140, 455466, 391069, 340757, 314286, 286456, 224967, 189327, 242729, 267955, 303188, 269702, 244563, 158766, 142660, 121019, 71159, 72564, 196351, 200073, 182982, 211554, 236609, 227085, 257079, 307743, 391646, 601551, 659916, 729900, 952050, 1163578, 1139155, 1188873, 1493294, 1697154, 1701930, 1646777, 1465848, 1197134, 914302, 723878, 561014, 535477, 449511, 343347, 337351, 341026, 366240, 372388, 491307, 478378, 399569, 386036, 402113, 332094, 376506, 347191, 333372, 405479, 352512, 291963, 240217, 239732, 174188, 84366, 122569, 218099, 374055]
5102C74055M4135N442J05414J9699P0447M0487J0555J02407j0055M8092M3635
5091H54313m5082k9801k9757P5170j41442j28954J7670L4484o6j6477j4180n8505
5079E17373o998q1683k3620r0525P11p5940L905p1613j8213J1251k5457o4741
5067G4450B3142I058L2561j3534K8115K1829M5861E5236n461E647K615b1408k5960
5054d7368O468b0313k5919E066K3539A1940c4116J2770q2644r9264j6062j065
5042b20381Q2492L3350M2428B0878J56626m1744k8063l7869B9572c2756r7729
5031a30485m54f5058m431J0948o0808m5203P4020L6275K5059I9918L1694J21836
5019B53448N9037k8081M077M0701M0723O9664L4128K36610L41318K92863M65608
$$ y = [374055, 418190, 423632, 529046, 548745, 619192, 659679, 670234, 772641, 762586, 810678, 854313, 809231, 779430, 749673, 824843, 683401, 554447, 572117, 606601, 606535, 590058, 575878, 517373, 510375, 428692, 405072, 314547, 315258, 239318, 243223, 171610, 153397, 164648, 139191, 74450, 23142, 9058, 41619, 28085, 56200, 78029, 123890, 55236, 49775, 5647, 8262, -21408, -47368, -40900, -20313, -46232, 5066, 28605, 11940, -34116, -21346, -103990, -203254, -219316, -220381, -137889, -104539, -62111, 20878, 177504, 135760, 107697, 69828, 29572, -32756, -130485, -130939, -65058, -69489, -58541, -119349, -164552, -90532, -54257, -29198, 99918, 131612, 253448, 312485, 284404, 288481, 329182, 369905, 439569, 473697, 710307, 1051625, 1344488, 1810096]
5008A810096J47743R7894j74108k06077m07766k57822j45043j22624j34062J28666
4998G36897R0860J05194J21226K34183M06961M88579L73945N12753N60902P89522
4988D421022J001573R71323J213602J158617O41254k08964r15087j523954j424405
4979E334981j066395r11890o85816m49596j84273k95520k57157j56487l2643n8350
4969A236854J27180J20030K24863K70020K69411K73728K6299j21047l94933l71262
4959A661143l31851j83079j73374m7902K3214J9154P2364J72859K03029L57146
4949A772703L72974N18947P56010O11799R42106J075116J106938J191715R46047
4940I294355J91072q77233j303718j562502j384652j010720p36610n24926m38841
$$ y = [1810096, 1957839, 2055733, 1881625, 1675548, 1267782, 1009960, 864917, 742293, 608231, 736897, 827757, 932951, 1054177, 1288360, 1695321, 2183900, 2557845, 3070598, 3631500, 4421022, 5422595, 6393918, 7607520, 8766137, 9407391, 9198427, 8283340, 6759386, 5334981, 4268586, 3356696, 2670880, 2221284, 2037011, 1741491, 1484334, 1327847, 1295204, 1236854, 1364034, 1484064, 1708927, 1978947, 2248358, 2522086, 2548385, 2427338, 2032405, 1661143, 1329292, 1146213, 972839, 924937, 948151, 967305, 1039669, 1212528, 1415557, 1772703, 2145677, 2664624, 3420634, 4032433, 4974539, 6049655, 7156593, 8348308, 9294355, 9485427, 8608194, 7304476, 5741974, 4357322, 3346602, 2609992, 2085066, 1646225]
4931A646225k81221k44478j72189j90823k5908j45428p8374n9108m1366l2661
4921C74669M3953p3250p6496n4490K5952m474m3724l5807m6886A8691g3163m1956
4909a15119n2972P826r127L6131k0621f7876D6782N9196L8017l7589L1998L4238
4897A72642M1455A06795C305i7595a4804C6245N1639k9693J42953Q0840J10543
4886C92527O1738l3311o5966k5867N1563p4764j07672j3225p592m124n1001r026
4874A13280E1760e254m6755m5623J5502k0115l0888o7196R888L4294O1971c7877
4861A06605K8730P8280j6553P0094Q1201p2635k930K6395N77j01460O5458m3200
4849B20562j0771J6500j0805R9679R297J06751J67356K1593P9074q0093m0590
$$ y = [1646225, 1365004, 1120526, 948337, 757514, 731606, 586178, 507804, 448696, 407330, 374669, 418622, 345372, 268876, 214386, 240338, 235864, 192140, 156333, 109447, 18691, -73163, -115119, -168091, -160265, -169392, -133261, -153882, -67876, 46782, 105978, 143995, 106406, 138404, 172642, 214097, 106795, 3305, -97595, -14804, 36245, 87884, 58191, 201144, 281984, 392527, 454265, 420954, 354988, 329121, 380684, 305920, 198248, 185023, 177431, 173307, 122306, 113280, 51760, -5254, -52009, -97632, -82130, -102245, -133133, -200329, -190441, -156147, -94176, -37877, 106605, 135335, 213615, 197062, 267156, 348357, 275722, 272792, 299187, 299764, 198304, 263762, 220562, 209791, 226291, 215486, 315165, 324462, 431213, 598569, 620162, 699236, 619143, 578553]
4838E78553j03569j03141p5950m6340j20982J8062m0746L3722j7430l7977g531
4826H091O6925k3015g887B4961d5335J9975B8663M6470n625M4918l939Q2936J5694
4813B09117n3002M2079q8460Q6814q2282K2336k0557k3995l6667J5032k5638L4341
4801G9118j9278L5917L6321R459K0896k259K4552q5762N504k4243B0900R8590
4789A19490K8693F5258L5834O7445M3035m3195j067p707m2665r137J4767A5803
4776a778o0811l7263j4630l0379k4480K2439O5593a8976B1075J498L2808O4677
4764A20058K4402k2851j0351K2055l4400k5273k4856P4841C5806M8071B8444O5980
4752I4424J92903L05852B83931A4365d3793K221a5505F081c3039a818G2790L0196
$$ y = [578553, 474984, 371843, 295893, 249553, 128571, 146633, 105887, 139609, 122179, 84202, -7531, 8091, 75016, 52001, -7887, 24961, -45335, -25360, 28663, 75133, 69508, 114426, 110487, 193423, 209117, 156115, 198194, 109734, 196548, 114266, 136602, 116045, 92050, 55383, 70415, 44777, 79118, 59840, 95757, 132078, 141537, 162433, 160174, 184726, 98964, 104468, 80225, 20900, 119490, 148183, 65258, 101092, 168537, 211572, 168377, 167310, 159603, 116938, 107801, 122568, 15803, -1778, -62589, -99852, -114482, -144861, -169341, -146902, -81309, -18976, 21075, 22573, 55381, 120058, 144460, 121609, 111258, 133313, 98913, 73640, 48784, 123625, 35806, 83877, 28444, 94424, 287327, 593179, 283931, 14365, -43793, -41572, -15505, 6081, -33039, -1818, 72790, 102986]
4740A02986J9985L0604J6722J538k421M1300q4150m1327o948N0125l9208l8611
4728E0595h287p7258L1425b2422C7164K7151L8113K7560J9272N2704j6739R4429
4716B79654J6882j8197M8210j7230J3402J9933R264L7558L03128j28964B10489
4704a5893l4236E3609j8401F715d575G4697r919b1918A54164N4392j3434P5671
4692B70793P201m1132N1016L3979l3309m1886k2807m3361l7226j466C5092I295
4679I5682J1727m5827B0082R7938L0404J5587J8087L3703K7868k0248m641K4176
4667B42956k8340p7085L8240k9886k7155p520D4088L2651J9122K5386C2113L1265
4655F3378n055h73j6107A2402c9452L595b537k0894E7918Q5773k4733j8539M7128
$$ y = [102986, 122971, 153575, 170297, 171835, 169414, 210714, 126564, 85237, 78289, 128414, 89206, 50595, -8287, -85545, -54120, -22422, 37164, 64315, 102428, 129988, 149260, 201964, 185225, 279654, 296536, 278339, 326549, 309319, 322721, 342654, 351918, 389476, 692604, 563640, 210489, -15893, -50129, 53609, 35208, 6715, -4575, 74697, 64778, -21918, 154164, 208556, 195122, 270793, 277994, 236862, 287878, 321857, 288548, 246662, 223855, 180494, 143268, 141802, 35092, 9295, 95682, 107409, 61582, 20082, 118020, 148424, 164011, 182098, 215801, 243669, 223421, 218780, 242956, 214616, 137531, 175771, 145885, 118730, 111210, 44088, 76739, 95861, 121247, 32113, 63378, 58323, -873, -16980, 12402, -39452, -35857, -2537, -23431, 57918, 143691, 118958, 100419, 147547]
4642A47547k6559N2897l4203j9172J8047M8167p6279J6079P375D8128q868k55
4630C9005K5387J0120k9054L434j242L7691K5835J6299K2443E0406L7302L5168
4618A22876L6163m0599J3356k3208j4517m6952j439M6166L6773J9412m3686m8719
4606E5626n398J263J1001k9318j1961J3445N144l556I209L1274j054b6216q923
4593c5139n492j1474h555k7683C2846c1010j24778N8080L0567c0162m206a1251
4580I6564k0820k9794B1541J30656o8159C4220A1526f7278J8765f453B5881O034
4568C1915a0463G9415P5045N097J7396K6147L3414K0810j4120q5524n7877M654
4556A04457j9158d017m9301a860l0692l7706c1810j8324l1776J6237K5910J7558
$$ y = [147547, 120988, 173885, 139682, 120510, 138557, 186724, 110445, 126524, 133899, 48128, 39260, 39005, 64392, 74512, 45458, 48892, 47650, 85341, 111176, 127475, 149918, 50406, 87708, 122876, 159039, 118440, 131796, 108588, 94071, 47119, 45680, 91846, 128619, 148031, 104345, 55626, 50228, 51491, 62492, 33174, 21213, 34658, 39802, 36246, 9209, 40483, 39429, -26216, -35139, -40631, -52105, -8555, -36238, 32846, -31010, -155788, -97708, -67141, -30162, -34368, -11251, 96564, 75744, 45950, 21541, 152197, 84038, 34220, 11526, -67278, -48513, -6453, 25881, 31915, -10463, 79415, 154460, 159557, 176953, 203100, 236514, 257324, 243204, 157680, 99803, 104457, 85299, -4017, -53318, -1860, -32552, -70258, -31810, -50134, -81910, -65673, -39763, -22205]
4544b2205j3680a7920k2624B1686K435M3151A9340E101Q1909k8735k6877d5581
4531a09400d2100J1701N579A7709b2510N967A4831f454A6055J120b4447E3787
4518A12691k8368J14471k6209L507n5035N2374K2446H6428J7275L1145K1184K3527
4506A79559N488L5078q2543F1213L4909k2693M7071n9281a6243o475l9882K1635
4494d0965Q102a0920C5322I183p43L5680p027g575G3131L5553D0833A0461J1762
4481B2223b9630J4611p119E6485A4416j77B662O1656B7309a6039E826L9918d4940
4467E9196p523K471M16Q0339J4219q83k9606j9503B7740E125O591J4590d269j0930
4453a5199E2387K4763C0547b0353j9394j9625l4938A2592L1084J09702m5005L224
$$ y = [-22205, -35885, -17920, -40544, 21686, 24121, 67272, 19340, 5101, 87010, 58275, 31398, -45581, -109400, -42100, -30399, -24820, 17709, -22510, -16543, 14831, -6454, 16055, 17175, -24447, 53787, 112691, 84323, 198794, 172585, 176092, 121057, 173431, 195877, 86428, 103703, 134848, 156032, 179559, 185047, 220125, 137582, 61213, 96122, 73429, 120500, 61219, -16243, -22718, -62600, -40965, -32863, -10920, 35322, 9183, 8440, 44120, 37093, -7575, 73131, 108684, 40833, 10461, 22223, -29630, -15019, -22138, 56485, 14416, 14239, 2662, 64318, 27309, -16039, 5826, 45744, -44940, 59196, 51673, 54144, 54560, 134899, 149118, 148235, 118629, 99126, 27740, 5125, 11716, 26306, -4269, -15199, 52387, 77150, 30547, -20353, -39747, -59372, -94310, 12592, 43676, 153378, 108373, 111597]
4441A11597m1642f212j3036D8989o645K2336l0273j404j3848b5397L981p0513
4429i1929p478d0470l7423K4619o329J7805k8964G865P1319j0778B7701O3970
4417I1671A6233J808L0649B1165O2461j6288p2g368r883D2307K5334L515L3799
4404A04955j3551j5157P92E527R8295M967k6938k729J2937L1380l8421C128a7923
4390F3793c0758m0987c2112a1420D1947E357P8279D0481a8759F1678J7549b1919
4377H505K1295k444O9775k0829J0112K0207n1973f877B9509J6933k202K288J906
4364D8434r305O9465K1683J5448n0739Q945A3459N0372N5205j3578l8119l0702
4352C6637j0680K9532N9566D6106N1227m3643r436A2825M2312Q6925J4597j9892
$$ y = [111597, 69955, -6212, -19248, 48989, 42344, 64680, 34407, 33003, 19155, -25397, -21416, -91929, -99407, -40470, -77893, -53274, -59603, -41798, -70762, 7865, 79184, 68406, 27701, 91671, 16233, 18041, 48690, 21165, 83626, 67338, 67266, -7368, -17251, 42307, 67641, 71156, 104955, 91404, 76247, 77039, 5527, 103822, 108789, 81851, 79122, 92059, 123439, 85018, 3128, -17923, 63793, -30758, -71745, -32112, -11420, 41947, 5357, 83636, 40481, -18759, 61678, 79227, -21919, 8505, 29800, 27356, 97131, 76302, 86414, 106621, 54648, -6877, 29509, 46442, 44240, 46528, 48434, 39129, 108594, 130277, 145725, 94986, 103931, 13459, 63831, 119036, 105458, 67339, 36637, 25957, 55489, 115055, 46106, 97333, 53690, 44254, 12825, 55137, 142062, 156659, 136767]
4340A36767k2602l4817j8463K6016g69j352j1168q769j6697e660B4773C487N9045
4327F2532A9310J8171E246b2008D3634J1946L7410k3439j4293J1375R160C5473
4314A03957j0407j6514A6775K5192K4533B484K4646M3114m484M6766C5406q528
4302B6878A1747J06663Q1130q0057l4190K5705n1147Q3257E7318k2466M1227K5100
4290A01179j6867P3464j6107p014k5605k8672l7643k0458l445p09k781b9152D4668
4276E4420B4799M5375J2510C0075L4085M875e215O21F5911k5647b7167a2982o642
4263a9624f527l7519m982j1646p643O539j5531n2346f0325A0011d5084P065p764
4250d5783a6580A01258k3050C3248J9736A6099c8398e528A01702l0802j9212r288
$$ y = [136767, 114165, 79348, 60885, 86901, -769, -2121, -13289, -22058, -38755, -5660, 24773, 3487, 62532, 19310, 37481, 5246, -22008, 43634, 55580, 92990, 69551, 55258, 66633, 75793, 35473, 103957, 93550, 77036, 16775, 41967, 66500, 2484, 27130, 70244, 65760, 112526, 35406, 26878, 11747, 118410, 199540, 119483, 85293, 110998, 59851, 143108, 57318, 34852, 76079, 101179, 84312, 157776, 141669, 134655, 109050, 80378, 42735, 22277, 18832, 18123, 15342, -29152, 44668, 54420, 24799, 70174, 82684, 30075, 64160, 69035, -5215, -4594, 65911, 40264, -27167, -12982, -19624, -6527, -44046, -49028, -60674, -68317, -61778, -77309, -129655, -60325, 10011, -45084, -38019, -45783, -16580, 101258, 78208, 33248, 52984, 16099, -38398, -5528, 101702, 70900, 51688, 42400]
4238D2400A5430O773J0996b552j2660r6940J5114M7253o0731M2445K1899J7194
4226b8978k6507J2141J4066E2043b2486o371k0018k9365R22k9654J5404k5992
4214a17560M6694n09o662J1154l7546k8299N4831c0481E9360Q414j6907m458R20
4201D7329N6426B7586g139D2608g4n0035q793K7183Q64I982d3853D1209G59c8072
4186a08253k5401O0358A998K4365J0789R062j9217a5764A4236b6585m1166K2745
4174d5006cp907j8369c027l9497a693D1921b9781F1492K9827l2654J236c1520
4160b6868F3960K4015k71K9164J1048k1936D3575A9012g215B8804r73J7994A7414
4146A4145d434A6253a3069f074B3235r603J0294b4274J1542D5895L0474e8333
$$ y = [42400, 15430, 22203, 33199, -2552, -15212, -112152, -97038, -49785, -110516, -68071, -46172, -28978, -55485, -43344, -29278, 52043, -22486, -28857, -48875, -78240, -77318, -106972, -91568, -117560, -70866, -71375, -78037, -66883, -104429, -132728, -77897, -30481, 59360, 67774, 50867, 46409, 47329, 103755, 27586, -7139, 42608, -74, -50109, -58902, -31719, -30855, 9982, -43853, 41209, 759, -38072, -108253, -133654, -73296, 1998, 26363, 37152, 46214, 26997, -15764, 14236, -26585, -67751, -45006, -3, -7910, -26279, -3027, -42524, -1693, 41921, -29781, 61492, 91319, 58665, 59901, -31520, -26868, 63960, 87975, 87704, 116868, 127916, 105980, 43575, 19012, -7215, 28804, 27831, 45825, 17414, 14145, -4434, 16253, -13069, -6074, 23235, 13632, 23926, -24274, -12732, 45895, 76369, -58333]
4133e0645J4597l7799k2328c9377j1335R455J0942k5735j8046n665P668j445K899
4120g0639p1289J3197N9885J3680a6605l7511o304a8202r515k545n222A7475J4132
4107C1607d396C910J5569E22J7153g8680c2914n0053d1424l0302J9274c18l9871
4094d0189c99k2299j8506L971o841k1287b897n6937F240a7271B5387N874m31c4827
4079d2646J681H961a0711o925E4962j7777H228J7106E640J911M6313k2398j4709
4066A6757N070m64a6599A8289a1875n4984E860e4748K2857A3948f434k8775D963
4052d808k5689j1500q952p5894J1803L6080K2811o5080e0293r351K1611A2352
4039i284E4360p933Q0708k4011k1873q117p301K4341A5969J9414M0631a8732C2355
$$ y = [-50645, -36048, -73847, -96175, -39377, -50712, -41257, -30315, -56050, -74096, -79761, -72093, -73538, -70639, -141928, -128731, -68846, -55166, -16605, -54116, -60420, -18202, -27717, -30262, -35484, 17475, 31607, -4396, 3910, 19479, 522, 17675, -78680, -32914, -82967, -41424, -71726, -52452, -318, -40189, -399, -22698, -41204, -37233, -44074, -65361, -2897, -59834, 6240, -17271, 25387, 31261, 30830, -34827, -42646, -40965, 8961, -10711, -17636, 54962, 37185, 8228, 25334, 5640, 7551, 53864, 31466, 16757, 21827, 21363, -16599, 18289, -11875, -66859, 5860, -54748, -31891, 13948, -6434, -35209, 4963, -4808, -30497, -41997, -50949, -126843, -115040, -78960, -56149, -121229, -50293, -59644, -38033, 12352, -9284, 54360, 46427, 127135, 103124, 81251, 73134, 65833, 90174, 15969, 35383, 76014, -18732, 32355]
4025b4881j905P293N126A4722L2472k3492L2547J8879p328J4078B7987O3410j9795
4012G1602p294j2690j7333o9m822c10j9344n1712K6333j593p4934j927o1158L2288
3998a52357N0102p921J9351b5246B0642k640b2291O696C6696F269d426D089K2360
3985B6449e0415b2360H362J5870c2799J4060o1966r381o204d0416j5692L680N294
3972d7134B2910L4741p389j3410O0464o540L1254k9705B9235a1798L699m8818
3960e6917k0478K1411K184m6640J5897a1547l2417i249m2322n5199b1948M942
3948a7006A5763d277m1932J1565a3985n119j0810F8866C0509A3617d3528J1193
3936c2335I2058d823l9343m0581K2699A0156c3928H686a44r161o3140j3277J4200
$$ y = [-24881, -26786, -19493, -14367, 14722, 47194, 23702, 56249, 75128, 67800, 81878, 27987, 91397, 71602, 64308, 51618, 34285, 34216, 29394, -310, -19654, -71366, -45033, -46626, -121560, -123487, -184645, -152357, -102255, -110176, -90825, -25246, 20642, 18002, -22291, -15595, 36696, 6269, -4426, 4089, 26449, -50415, -22360, 8362, 24232, -32799, -18739, -80705, -90086, -96290, -40416, -56108, -52428, -47134, 22910, 57651, 50262, 36852, 97316, 90776, 122030, 92325, 29235, -11798, -8099, -56917, -77395, -55984, -53800, -100440, -84543, -11547, -43964, -9249, -51571, -106770, -21948, -17006, 15763, -4277, -46209, -34644, -13985, -19104, -29914, 68866, 30509, 13617, -43528, -32335, 92058, -4823, -44166, -84747, -62048, 10156, -33928, 8686, -144, -9305, -72445, -85722, -71522]
3923g1522a5311j001p848E8146O535I433K9243j3606b1275D7197b3732A5555e0212
3909A9460L8362B3633g692A659a106A6362d1924j3768M673l3473K4943K2938A4400
3895A645M736d8104b3389C0286A4197J5054M7317B9183c7635b013o5400J1672
3883e5741j0415j9406j1969o4300e9114r72J2764r829a899E1959A6003J1368K5929
3870E3300K5572M071m0679a8449k1229D8097b865F309K8857j1099N97b8085R3
3857b7992n6955K8048a4049A9756b8595C7662P104J0037B0913C905K8542L2390
3845F4837c0935a2543Q59F623f0981b3805a115m8033K2105A9751g3234o9584d1206
3831i4889d6115p932k0059K9822a6007O253o947b127A7353a371k2268o67K027
$$ y = [-71522, -15311, -16312, -24160, 58146, 64681, 9433, 38676, 25070, -21275, 47197, -23732, 15555, -50212, 19460, 57822, 23633, -7692, 1659, -1106, 16362, -41924, -55692, -51019, -84492, -59549, -36611, 14400, 1645, 6381, -48104, -23389, 30286, 14197, 29251, 76568, 29183, -37635, -2013, -67413, -55741, -66156, -85562, -97531, -161831, -59114, -60086, -47322, -57151, -1899, 51959, 16003, 27371, 53300, 78872, 82943, 42264, -18449, -39678, 48097, -2865, 6309, 35166, 24067, 24664, -28085, -27992, -84947, -56899, -14049, 19756, -28595, 37662, 44766, 54803, 20913, 3905, 32447, 64837, -30935, -12543, -11684, 6623, -60981, -23805, -1115, -49148, -27043, 19751, -73234, -142818, -41206, -94889, -46115, -54047, -74106, -44284, -16007, -9754, -16701, -2127, 17353, -1371, -23639, -24306, -22279]
3818b2279k507J1702p844A1512k124b4590h170o4266J9692N888j4650f328C8999
3804B3810g3450b1618p231m46L441a017m5521D927b8697R744G31a8535p5684K6643
3790f7576B5086d0911b0128m0026k1501c6591j837a5212O043l6752o1161L7078
3778g0004K8795n8208l6830K7269L2077l3959K9824j0459c6352k4888j1493m5199
3766a17932M0311j152a3501n2688K6146l3395j4812l1129M3235l2608k200k9422
3754a40374L5600j3253L7712j2980k1726M2342a7488p4628K5922J8082b2420j1795
3742c4215k0309K4143R088O277j0892b601j5991p5923j3559K0422p7688L9128
3730a26212k021j3172e5404j9037K3875q937a6285b51k8218m5414l8254M3971
$$ y = [-22279, -24786, -13084, -20928, 11512, 9388, -24590, -8170, -72436, -52744, -46856, -61506, -6328, 38999, 23810, -73450, -21618, -28849, -29295, -25854, -1017, -46538, 4927, -28697, -18953, 731, -18535, -94219, -67576, 25086, -40911, -20128, -60154, -81655, -36591, -38428, -15212, -9169, -45921, -107082, -70004, -41209, -99417, -136247, -108978, -76901, -110860, -81036, -91495, -36352, -61240, -72733, -117932, -77621, -78773, -13501, -66189, -40043, -73438, -88250, -119379, -76144, -108752, -110952, -140374, -104774, -118027, -80315, -93295, -115021, -72679, -17488, -92116, -66194, -48112, -22420, -34215, -54524, -30381, -21293, -15016, -25908, -2601, -18592, -94515, -108074, -87652, -165340, -126212, -128233, -141405, -55404, -74441, -50566, -59503, -16285, -251, -28469, -73883, -112137, -68166]
3718f8166q1398f8473k0811o478j1652j06428N1740m5301j1610O0134M1341K9562
3706h7976d768I260M0756C888N057a23009K8327J151J9377c0427h13D0798f371
3692C615e113j7873j7484m0983J7266n444P510G118c8212J1928a1802I044e7718
3678h4414L2619C525d6397m2870l6078K6421J3430K4259j21834J4165L2804N7447
3666g8653k936k5447N381j0595O984c6334C568e194n4543j1055j4927K3652p561
3653f9628n7176N921J2599N3050m4103J3701p1578M6837L8412j8689M88p994J0969
3640h7191j4699j7815L737L8480C985b1836m408k5287Q835j8356m1393j4826L4200
3627h3071j9493l6918e3945N992k0m3109l3638e9028b0891o3217k4230N0644K2824
$$ y = [-68166, -149564, -68473, -89284, -95762, -107414, -213842, -162102, -207403, -219013, -158879, -117538, -87976, -4768, 9260, 50016, 3888, 8945, -123009, -94682, -93531, -74154, -30427, -813, 40798, -6371, 3615, -5113, -22986, -40470, -81453, -64187, -69631, -62121, 7118, -38212, -26284, -11802, 9044, -57718, -84414, -51795, 3525, -46397, -89267, -125345, -98924, -85494, -61235, -183069, -168904, -136100, -78653, -81589, -107036, -101655, -112250, -105266, -36334, 3568, -5194, -59737, -70792, -85719, -62067, -69628, -126804, -120883, -108284, -55234, -99337, -85636, -157214, -110377, -71965, -90654, -90166, -98160, -87191, -101890, -119705, -115968, -77488, 3985, -21836, -26244, -51531, -42696, -61052, -102445, -117271, -83071, -102564, -139482, -53945, -47953, -47973, -91082, -124720, -59028, -20891, -84108, -108338, -57694, -34870]
3614c4870n3669q1982L5941N2117p6759k4263P104L7098J4265j0388j2896g1082
3601d0476j4009J7073o7038M942k3807J0444Q291k7811L0094k1292m2489P0244
3589i5834m8033k051K5409k7119M1304k1384N6509m5091L7115R106j8322J535
3577h6856k6002c3632n0270J1268m5211J8713L9345n6270K7307j5612l3831o987
3565a45180O4939K5063n2975K5899b1081n9220P352J6296a211k9220m6584M46
3553g6569K1077o2356J2144N1627p0562L1880J7829k61l2360h938k732j9091n7814
3540h8575K8559K6142k604p6447j1677j9563K8933L1285K1032j5156R121K4908
3528d4042m8177M0252m2152L2084J5569a643n7429B2989e6053K4519l0392k3481
$$ y = [-34870, -88539, -170521, -134580, -82463, -159222, -183485, -176381, -139283, -125018, -135406, -148302, -71082, -40476, -54485, -37412, -104450, -99508, -123315, -112871, -104580, -132391, -102297, -123589, -166078, -95834, -143867, -145918, -120509, -147628, -106324, -127708, -71199, -116290, -79175, -70069, -88391, -86856, -112858, -33632, -83902, -72634, -117845, -99132, -59787, -116057, -88750, -104362, -138193, -145180, -80241, -55178, -108153, -82254, -21081, -80301, -72949, -56653, -1211, -30431, -77015, -76569, -55492, -117848, -105704, -54077, -124639, -92759, -74930, -75191, -107551, -8938, -11670, -30761, -88575, -60016, -33874, -36478, -112925, -124602, -144165, -115232, -83947, -62915, -78071, -68950, -44042, -92219, -51967, -94119, -62035, -46466, -1643, -59072, 22989, -56053, -31534, -61926, -85407]
3516h5407o1824K6928j3738m101K7181p978c7985r9894M9423L9293k2900J1056
3504f1007K4378M687p6105b2124A1809h8336c9306j4937a6676k6781k8219J8503
3492e3173J5114m445l4590n1367c2128J0120k8927k8116K373a0807k1015k1909
3480e3731j8716j0380b2538j7052n7753c3892r7087j1766d9538j13340J1563M1491
3468a09824d6050k3009M732o613J3541r2338J1238l7552L2836k972M0245r047
3456a14989L2800A386f7380l523J0317l8419L8254m5257n5102O7444L375k3599
3444a13890j7754N0202l8598b3851k4145q4609e1065k0402J6772K3422b157j44093
3432a46250e8165N707L049j8518b5809m1016b6492j0553j1728b1008k4138G053
$$ y = [-85407, -147231, -120303, -134041, -138142, -110961, -118939, -37985, -137879, -88456, -49163, -72063, -61007, -36629, -31942, -108047, -22124, 11809, -88336, -39306, -54243, -16676, -43457, -71676, -53173, -38059, -42504, -77094, -128461, -32128, -22008, -50935, -79051, -76678, -10807, -31822, -53731, -72447, -82827, -22538, -39590, -97343, -33892, -130979, -142745, -49538, -162878, -151315, -109824, -46050, -69059, -64327, -70940, -57399, -149737, -138499, -176051, -143215, -146187, -105942, -114989, -82189, 1386, -67380, -70903, -60586, -99005, -60751, -106008, -161110, -93666, -90291, -113890, -131644, -81442, -120040, -23851, -47996, -132605, -51065, -71467, -54695, -31273, -2157, -146250, -58165, -52458, -49409, -67927, -25809, -66825, -26492, -37045, -48773, -21008, -45146, 7053]
3419E418c1590j0081J1948f46m4069O473p899a8560m8443k3843K6544j8961K0181
3406f3082b0887p5309b5168l2929k3134b0414o3951b6749p189a5332l2880p0229
3394a18441M1572j196j6431J3576K1089m128K0402J4580l4598a7992p404A4568
3381A418a3147q4860c4008a70j5077A9556P442L4449c7995N795J2154m665K59
3368b4452l7258j7381b3070p8254K3968c0604l2113J6465J7708Q168A9344b3137
3355g0062a2867k1366A3913c9823A2100d8738d771B2526b2360M949p0419L5723
3343e2107n5996b2655m2769K3650p2920M1167a9874q9414a8771m4615d915j1206
3331a6121n6079n7606N9509J2705p147j0558f637k846B103a2276m0167L769m5852
$$ y = [5418, -31590, -41671, -29723, -646, -44715, -38242, -46141, -18560, -67003, -90846, -64302, -83263, -63082, -20887, -96196, -25168, -58097, -81231, -20414, -84365, -26749, -33938, -15332, -48212, -118441, -76869, -78065, -94496, -80920, -59831, -63959, -43557, -28977, -63575, -17992, -25396, 14568, 1418, -13147, -98007, -34008, -170, -15247, 19556, 26998, 61447, -37995, -32200, -20046, -24711, -24452, -61710, -79091, -23070, -101324, -77356, -30604, -62717, -46252, -28544, -20376, 19344, -23137, -70062, -12867, -34233, 13913, -39823, 12100, -48738, -4771, 22526, -22360, -17411, -87830, -52107, -108103, -22655, -65424, -41774, -114694, -73527, -19874, -109288, -18771, -63386, -4915, -16121, -72200, -129806, -70297, -57592, -64739, -75297, -6637, -9483, 2103, -12276, -52443, -48674, -94526]
3318i4526O635L6809P799A149h5603J9201j4621K7171k0654n1621M7084c7385
3305f6608k2927j7465L0941k3152O937J3440K0192m565N760o680b2675P931m7602
3292f2346k9063J1097K1741k2290K8139J6835L837p169K169l4111J6917n0265
3280a04509J7317K8813o507b9468p5374l9955N6573K1093a7308l0017j103a1199
3267c1272j4157f26l8142j0144p0463d7165j8007J6743K3912J888l8760l7234
3255i8623g533k8639n1676J3996o0566j174J4484O170R225L5235L4724o2746M2607
3242e5893b7057j4850M717r4453N3292M376j7703k7800L8441n3558K8511j0485
3230a16569e4754I980f2807a4254D619a3985r7310K0956n239M127M259l2750o355
$$ y = [-94526, -87891, -51082, -43283, 1149, -85603, -66402, -81023, -53852, -74506, -126127, -79043, -37385, -66608, -89535, -107000, -76059, -99211, -92274, -78834, -58642, -63207, -57447, -64127, -22675, -14744, -62346, -91409, -80312, -58571, -80861, -52722, -35887, -32050, -39219, -37050, -71161, -54244, -104509, -87192, -58379, -64886, -29468, -104842, -144797, -88224, -67131, -17308, -47325, -48428, -11199, -31272, -45429, -626, -38768, -48912, -119375, -47165, -65172, -48429, -24517, -22629, -61389, -98623, -7533, -36172, -87848, -73852, -134418, -135592, -121108, -114938, -105713, -70478, -35754, -98500, -55893, -27057, -41907, -37190, -131643, -78351, -73975, -91678, -119478, -81037, -134595, -106084, -116569, -54754, 9980, -62807, -14254, 4619, -13985, -111295, -90339, -95578, -91451, -87192, -119942, -126297]
3217a26297N872K2302J0268K5324K4644k6880r974r98j7746L8969M299o0483J3878
3204i6822b8352p6400r919J2322j0160e4757m1232K5861o6338N6295L1882N826
3192d2463J077n1769P987l1880L5941k8792L6972m7800c1975m442j9025j4775
3180g0217c1828J3411q8931N812j9385e1384j6566r3201N6679k6017e8528q1867
3168a40395J2638n4607N8289J44c2939O064k8976o868K8700l1098k7985j0998
3156a04100M4642Q113R175m8129m0188R994K2960K2481q38j7934n9943g2142l3720
3143a05862c9659j36023g5927l989o2727O5613J0282l5964c1693J4075m6444m4605
3131a08667o5493N4905L4845J764l2880J2981l070c3119R166l8663J0657L006
$$ y = [-126297, -120425, -98123, -87855, -62531, -37887, -64767, -74741, -75739, -93485, -54516, -50217, -110700, -96822, -28352, -104752, -114671, -102349, -112509, -54757, -95989, -70128, -136466, -80171, -48289, -42463, -41386, -93155, -85168, -117048, -81107, -109899, -72927, -120727, -31975, -36417, -55442, -70217, -31828, -18417, -107348, -101536, -120921, -51384, -67950, -161151, -104472, -130489, -58528, -140395, -127757, -182364, -124075, -123931, -32939, -26875, -55851, -62719, -34019, -65117, -93102, -104100, -59458, -51345, -42170, -90299, -130487, -120493, -97533, -75052, -75890, -93824, -153767, -72142, -105862, -39659, -175682, -75927, -79916, -142643, -77030, -66748, -102712, -31693, -17618, -64062, -108667, -174160, -119255, -84410, -82646, -115526, -102545, -105615, -33119, -23953, -62616, -51959, -48953]
3119d8953e494m1042J3645C0414i9452d6718K0879l9490l8809d1741a162C886
3106A3687d8819J8373l0763K2673B3834i9621K8004l4241R345k3223L3819a7131
3093b3921l7910N987n0423P142L8896m1825J8470k716m6930J6534m1179P5529
3081h2346m6147K0129K8754L5492j535P748o5893r0802M2306j5848N5967J7692
3069i4483J396L2365p414j820m948j7534q395c9123A4551e3471l4808J530L8619
3056d8130A8303e4129l4084L639K4727j2254P102O2n2850M2191L5725Q05j3487
3043e2553A7580d0997R488Q554k6325F7087A4286f8619J0856J6647r0047L4191
3031i6972L3M8350c248p2575B7203A176J5436d6153p8951m174j9878L1410J1465
$$ y = [-48953, -5494, -46536, -32891, 30414, -99452, -46718, -25839, -65329, -104138, -41741, -1162, 3886, 13687, -48819, -30446, -61209, -38536, 23834, -99621, -71617, -105858, -96513, -119736, -85917, -17131, -23921, -61831, -55844, -106267, -99125, -60229, -102054, -83584, -86300, -133230, -116696, -157875, -82346, -128493, -108364, -79610, -44118, -45653, -37905, -103798, -194600, -152294, -168142, -112175, -94483, -93087, -60722, -68136, -69956, -74904, -92438, -100833, -39123, 14551, -53471, -88279, -86749, -48130, 18303, -54129, -88213, -84574, -59847, -72101, -64999, -64937, -117787, -75596, -39871, -39066, -52553, 17580, -40997, -31509, -22955, -49280, 67087, 14286, -68619, -57763, -41116, -131163, -96972, -96939, -48589, -3248, -75823, 27203, 1176, 16612, -46153, -125104, -129278, -149156, -117746, -106281]
3018a06281d4096j4044f418l1234A362g1651B8634e3573H679h8153M1948m0650
3006h6855N806J1446j5923b5696o9475J3801c8193j165k9379n6281K7566J9431
2994g8021O108n3229L7299Q134K3925b5264J673r929Q653j17660O2818k5106d1354
2980A450c1905m8518l4155m1657g6308J0999M541j1973g041n6212F363K4234b8203
2966e8356N43k7172N045K3497k4701n7866O0333b2831R082A661O798d4494i899
2952e3425j6578m442K8642o32Q723F75c1446m7616k2473M0395b7817j5067b0464
2938C086d492n0264j6633J544L3680B759f0723J5636j8516j9064N681J277b2470
2924c4074B9147b7854p9476R898K7697L1949l2697r350P784k6433J4031r5122
$$ y = [-106281, -44096, -58140, -6418, -37652, 1362, -71651, 28634, -53573, 8679, -88153, -46205, -86855, -81049, -69603, -85526, -25696, -95171, -81370, -38193, -39358, -68737, -125018, -97452, -78021, -71913, -125142, -87843, -79709, -55784, -25264, -23591, -33520, -24867, -142527, -79709, -104815, -41354, 1450, -31905, -80423, -114578, -156235, -76308, -65309, -60768, -72741, -7041, -63253, 6363, 30597, -28203, -58356, -57813, -84985, -79940, -56443, -81144, -139010, -78677, -22831, -13749, 1661, 8459, -44494, -9899, -53425, -70003, -74445, -45803, -46435, -37712, 675, -31446, -79062, -101535, -61140, -27817, -42884, -20464, 3086, -4492, -54756, -71389, -69845, -36165, 2759, -60723, -45087, -63603, -82667, -76986, -75709, -22470, -34074, 29147, -27854, -107330, -97432, -69735, -37786, -70483, -79833, -72049, -98482, -84451, -179573]
2912a79573O7518L1810b0460P91k3086n6236j2800m470l2842L5585e6321K806
2900e3515n5334J1921c3453j9614q8931K1070K4672L8385j1070J6320o458J2867
2888d6212k0713k2534k1940N857d5011j409j6512K81L0811o4760j3435L7798J0106
2875f2131l9614L2734p185J1901g669q3290m705L420d6068K1332p4175J6145a2037
2861a035l4111j40187Q239M4448G633g3025O591k7941R677j3101e694j1635D5798
2847c1176A9799c1449a4n3482R204J033r026J3195l6551J2678k1630L0869n3033
2834a06757L0947j6417r075n249R193K706M4060j5485J6828m1779l8113k5622
2822a54763O2087b9280A2222f9403b5506a2517o291q6988c9262j7650P515C4703
$$ y = [-179573, -112055, -80245, -20460, -19669, -42755, -98991, -111791, -116261, -149103, -113518, -56321, -53515, -108849, -96928, -33453, -53067, -141998, -120928, -96256, -57871, -68941, -52621, -59079, -46212, -66925, -89459, -111399, -105542, -45011, -46420, -62932, -62651, -31840, -96600, -110035, -72237, -62131, -101745, -69011, -76196, -64295, -7669, -90959, -95664, -92244, -46068, -24736, -98911, -82766, -12037, -1035, -35146, -175333, -167094, -122646, 7633, -73025, -66434, -94375, -84698, -97799, -5694, -17329, 45798, -31176, 19799, -31449, -14, -53496, -44292, -43259, -52285, -39090, -75641, -62963, -84593, -53724, -106757, -75810, -92227, -101302, -106551, -97358, -94652, -50592, -66077, -49249, -91028, -129141, -154763, -92676, -29280, 12222, -69403, -25506, -12517, -18808, -105796, -39262, -56912, -49397, 34703]
2809a6704n0081L0417j406q970b050j7513A357b1737l0203a2252l3079L635Q75
2796d0821a4004k9552k5759l4030J6028K916L0140J6012J4017o2966L8450b3999
2783d4276J3787l5220J7219o7681o801k2567N8104p572J9356k4877j9873M7109
2771g3292Q462K0715B118d38l8479M535l8990J0206b0848n513j8828o1835Q845
2758i8179g17j0453l9491l973b3402j2216a5736E3116k475e5052l0885a0666j8828
2745b9494m9841L6908n2265K281n4909N1804K8085k0117m6083M0027L0210f879
2732g974B7951d6802j1417k3910j3050j5308j8329d9878K2217l4886P247J8453
2720c6847n8509F126N014K841P7710b2005j9061m017o827Q718g318k1559j3295
$$ y = [-16704, -66785, -36368, -37774, -46744, -2050, -19563, 1357, -21737, -51940, -12252, -45331, -41696, -40821, -14004, -43556, -69315, -103345, -87317, -84401, -54261, -38249, -24232, -87198, -48748, -23999, -44276, -30489, -65709, -48490, -116171, -122972, -145539, -87435, -95007, -75651, -100528, -120401, -73292, -64830, -44115, 2118, -438, -38917, -34382, -73372, -63166, -20848, -26361, -45189, -107024, -98179, -717, -11170, -50661, -54634, -23402, -35618, -15736, 53116, 50641, -55052, -85937, -10666, -29494, -79335, -42427, -94692, -92411, -147320, -95516, -67431, -87548, -133631, -93604, -63394, -6879, -7974, 27951, -46802, -58219, -82129, -95179, -110487, -128816, -49878, -27661, -62547, -55300, -36847, -95356, 6126, 11140, 13981, 91691, -22005, -41066, -45083, -51910, -43192, -7318, -28877, -42172]
2707d2172f835o6524l4946e1489C3643a3774l7518m8798d4895l3621Q74O700c0706
2693b9226a3073j6338E6605a6801l5278J6911k9668o3L953q055K1175i899l4412
2680d4311J2608m0974L4320Q145l921p614O18j1080b3960A8021R382h317j7257
2667b5574j4037f599m6991m077j4428a0213M989l9816J7051L433A0080b0960Q192
2654a2768r2561l1201M9378k1482b9458o2930M93c3996k3075m2678d3719A9428
2641c1466q321k7587o7259e416I202Q183c6414l9325J2960k504l5292d3751k3668
2628f7419j7827M2595a5487o4065K1469l2880a2146A3644J062c0680l7902j9518
2616h8100O682c4077a5258D9132a5184k4003R781h109k3455k9200K3914p1231
$$ y = [-42172, -6835, -73359, -108305, -51489, 33643, -13774, -51292, -100090, -44895, -78516, -77642, -70942, -30706, -29226, -13073, -29411, 56605, -16801, -52079, -35168, -64836, -64899, -60946, -69001, -47826, -9899, -44311, -31703, -72677, -38357, -30212, -34133, -41747, -41129, -52209, -23960, 18021, 27403, -8317, -25574, -39611, -6599, -53590, -57667, -72095, -10213, -5224, -45040, -27989, -24556, 10080, -20960, -12768, -105329, -136530, -87152, -108634, -29458, -92388, -91895, -33996, -57071, -99749, -43719, 19428, -31466, -39787, -67374, -134633, -5416, 9202, 17385, -36414, -75739, -62779, -65283, -100575, -43751, -67419, -85246, -42651, -15487, -79552, -58083, -90963, -12146, 13644, 14706, -30680, -68582, -88100, -81418, -34077, -15258, 49132, -15184, -39187, -29406, -8109, -31564, -60764, -36850, -108081]
2604a08081K7957k075m4872K5597j330j6981b4951a0294p4401c5313a183j5086
2592a6269j9163a0500l9922B1405b3121o7041B4845a0718l4863l034j0819A2935
2579a290j6463k6870o771K0051k8404j07638K5104O5075l132k0262j2478e2910
2566a10925j4193M6590f819o3669K130E2222d489B2001d0663A8042h2614n8907
2554a41521K7001L9602c0395A1254f435p3089J625J197A7383h9283K4544l571
2542f8310Q853K0800O988l5438b4095q031k6704j1840N054n096A6478g084m9232
2529e6316j757i343j8390h442k9718M595o293B4792m644a1622C4639Q6731J52141
2516B73511j0564C8031c0474g554C5345j1943r971d6925j0395K0080Q475n8341
$$ y = [-108081, -80124, -82199, -127071, -101474, -102804, -119785, -24951, -10294, -84695, -35313, -1183, -16269, -35432, -10500, -50422, 21405, -23121, -90162, 24845, -10718, -45581, -48615, -59434, 12935, -1290, -17753, -44623, -51394, -31343, -59747, -167385, -142281, -77206, -80338, -100600, -113078, -52910, -110925, -125118, -78528, -6819, -70488, -68358, 52222, -4489, 22001, -40663, 18042, -82614, -141521, -114520, -74918, -30395, 11254, -6435, -79524, -77899, -76702, 17383, -89283, -64739, -68310, -59457, -38657, -31669, -67107, -24095, -32126, -58830, -70670, -65616, -70712, 16478, -7084, -56316, -58073, -9343, -27733, -8442, -38160, -33565, -39858, 24792, 20148, -11622, 34639, 121370, 273511, 262947, 38031, -30474, -7554, 35345, 23402, 13431, -46925, -57320, -37240, -28765, -87106]
2504h7106J9700b1938m0410M230j59O450j7800K7478j0514a0164r76j4311j4388
2491c9839E672b5229e591m2489J765B9259M3067d1327j4019n1670e3022j9068
2479g2090b8751j0816m2979B7171m9f8049F7836O4990n9487c1368J2450P489l464
2466a4893j400j7704O562m7576K6411d655k0288o9180c7709A9628P451b2238k2692
2453d4930k2180K937K4989r867m2309d0051o682D3573d8105j3411p8959f9136
2440d0575J9580n9770f301l1548d225m2622q013j6325K8986F449g099q001n3655
2427f8755L0759K763m1485K0970j0548b6681m9910K2560m0209l7363K8386L5967
2415f7250K760J5946n823j0749m0535d1872J7768p6942q334M0488l6004L9303
$$ y = [-87106, -67406, -21938, -62348, -58118, -58277, -51827, -69627, -42149, -52663, -10164, -11140, -25451, -39839, 5672, -25229, -5591, -48080, -46315, 29259, 72326, -41327, -55346, -107016, -53022, -72090, -28751, -39567, -82546, 27171, 27122, -68049, 67836, 132826, 73339, -31368, -18918, -11429, -14893, -16293, -33997, -27435, -75011, -48600, -4655, -24943, -94123, -37709, 19628, 27079, -22238, -44930, -67110, -64173, -39184, -49051, -91360, -40051, -46733, 43573, -48105, -61516, -140475, -69136, -40575, -20995, -80765, -6301, -37849, -4225, -46847, -54860, -71185, -42199, 6449, -7099, -15100, -68755, -37996, -35233, -76718, -55748, -66296, -26681, -76591, -54031, -94240, -131603, -103217, -67250, -64490, -48544, -54367, -65116, -105651, -41872, -24104, -101046, -109380, -68892, -104896, -65593]
2403f5593p9K2671n4389a5751B2015r419K3606J700a2997d694p380B3396A30f0717
2388a08990M3473J3797a5677j5649j1877o8601R909L2566K6794p585b1945m1728
2376f3673k4589J933j3568g613o3734J7171D3844c7690a7616o14k1006l3100k735
2363g5071A3612f4292j7465l7474L4439L4905K622J6861n639a3806n4845i188
2350c9282l9808l946k5774M1885O960J4481b0559d181B8256c3086m7811A9574
2337b6102J1866B9168b4405k4731j0554b4811J0006j4033O54n4596c6593M83h624
2323c8140f145m8113R489C2851P136a0372F142L3550a6776k726o3537a3739Q21
2310a2918q2027A893c1326r3997M513j2412N1753J4686k5724L3983J228k7997
$$ y = [-65593, -65672, -43001, -97390, -15751, 22015, 12596, 36202, 37902, -12997, -4694, -12074, 23396, 130, -60717, -108990, -65517, -51720, -15677, -31326, -43203, -111804, -101895, -69329, -42535, -50120, -21945, -63673, -88262, -86329, -99897, -7613, -71347, -54176, 43844, -37690, -17616, -18230, -39236, -72336, -75071, 13612, -64292, -81757, -119231, -84792, -49887, -47265, -30404, -36043, -13806, -68651, -9188, -39282, -79090, -83036, -108810, -66925, -59965, -45484, -20559, -4181, 28256, -33086, -80897, 19574, -26102, -14236, 29168, -24405, -49136, -59690, -24811, -14805, -28838, -28184, -82780, -36593, -36110, -8624, -38140, -6145, -54258, -44769, 32851, 39987, -10372, 6142, 39692, -16776, -19502, -83039, -13739, -12918, -94945, 1893, -31326, -125323, -120810, -133222, -81469, -66783, -92507, -58524, -57296, -85293]
2298h5293L8765k5048j5810J8098k1125B9441a4847m800k848q231l2593j1379
2286g4698c2786A5168a8890a996k796k7009k5557m2385j046K6314b7818l7119
2274f4937m2215q379A5880d662J468n0455l4700K6556L0463m1323j8403c7471
2261a15792p153j2383L3050M6438n9467J7622n0272M7832M4657l8659c0508B6820
2248f3801P572j69n747a7739c55B478R6467C577f5607b120C8406J3520B5649K9109
2234E4758f0951n0655L2947L2501i71l9015l9371m4514J1129N1740b4120l5742
2222e9862n0156d3849a8100h525K321F968Q2523l8026P0133J66638q8322I0364
2209d6636B0893d4538k8851m4590e2339M639J8075r3835N1898j1221b7532o4268
$$ y = [-85293, -46528, -71576, -87386, -69288, -90413, 29441, -14847, -19647, -22495, -30726, -63319, -74698, -32786, 15168, -18890, -1996, -4792, -31801, -57358, -99743, -100789, -74475, -27818, -64937, -107152, -115531, 15880, -4662, -3194, -53649, -88349, -61793, -31330, -72653, -91056, -37471, -115792, -122945, -135328, -102278, -55840, -115307, -97685, -147957, -100125, -55468, -94127, -30508, 26820, -63801, -56229, -56398, -62145, -17739, -355, 2478, 98945, 3577, -65607, -2120, 38406, 51926, 25649, 54758, -60951, -111606, -78659, -46158, -971, -39986, -79357, -123871, -112742, -61002, -24120, -59862, -110018, -43849, -18100, -8525, -6204, 6968, 89491, 51465, 121598, 288236, 199914, 90364, -46636, 20893, -44538, -73389, -117979, -52339, -47700, -29625, -123460, -71562, -82783, -27532, -91800]
2197i1800a5980I222f0924K5299J2066F7013B3317a9255K977l0212l3908K9747
2185e0651L789J3528A8582b0486q066m1663c70k557k77n379E346c2308F0K5950
2171B6010b5866E233j571K0471M4665a676j266E6187L1315R530J4028P4804D7937
2157B0665c891A9533b8197J2061A2705m272c6151P127I067f633B6893d7218k5703
2144g2921j4288b244k5819H531c7845q4208K5589J5454a3396A0501P55g3448j4947
2131h8395m9983L5674J2035J0340b3541D3488a4268C9653b3013k3046D167b2572
2118d7973a3796j5009o6186b1198k6755j5109b2182k2716r1087O2016b2385o6222
2106h8607j9200H30i412p020q684p250C0047K1390K7841a2523j6443g186E5006
$$ y = [-91800, -15980, 9222, -60924, -35625, -23559, 67013, 23317, -19255, -16278, -46490, -80398, -50651, -46862, -33334, 18582, -20486, -28552, -70215, -370, -2927, -3204, -8583, 5346, -32308, 60, 26010, -25866, 5233, 3662, 24133, 68798, -1676, -2942, 56187, 87502, 97032, 111060, 185864, 47937, 20665, -3891, 19533, -28197, -16136, 12705, 8433, -36151, -29024, 9067, -6633, 26893, -47218, -72921, -87209, -2244, -28063, 8531, -37845, -122053, -96464, -81010, -13396, 10501, 11256, -73448, -88395, -138378, -102704, -90669, -80329, -23541, 43488, -14268, 39653, -23013, -46059, 4167, -22572, -47973, -13796, -28805, -94991, -21198, -47953, -63062, -22182, -44898, -135985, -73969, -22385, -88607, -107807, 830, -9412, -16432, -25116, -32366, 30047, 51437, 79278, -12523, -28966, -7186, 55006]
2092C4206a5344K298D4830a0401n955r155j2266C4629b593j1333A9522J5315c526
2078C7115b6120J0628G754d0712j2018P336k8260N931b6144m6205L3110J7845
2066b1394j9181j2715l6291C344b6176j7111k2476K5682g313j4648P121C277O062
2053I339b8177C715d2556J2003n489n816k2547j1805L7034r11j6738g50k7833
2040b8583j991k7644B6127K6620f2100B6542A2668f1716P76j5971K6564b1443
2027d2264k447a7063B9151e975l0293k5681K0284j7225p1276D7358j5827b7778
2014C243f7990R004q8193O9976b7813b13o2075M553B314J5196O664j0724a2699
2000c7382j2939j4803K1128R047P057N19d498p5341P035j3204K1922B549b757
$$ y = [34206, -15344, -13046, 44830, -10401, -16356, -25511, -37777, 34629, -2593, -13926, 19522, 34837, -3526, 37115, -26120, -15492, 7754, -40712, -52730, -45394, -73654, -67723, -26144, -72349, -39239, -21394, -40575, -53290, -89581, 3344, -26176, -43287, -65763, -40081, -7313, -21961, -14840, 3277, 9339, -28177, 3715, -42556, -30553, -36042, -41858, -64405, -76210, -39176, -40087, -56825, -750, -28583, -30574, -58218, 26127, 52747, -62100, 26542, 12668, -61716, -60940, -76911, -50347, -21443, -42264, -44711, -17063, 29151, -5975, -36268, -61949, -41665, -58890, -130166, 47358, 31531, -27778, 3243, -67990, -58986, -147179, -77203, -27813, -213, -62288, -57735, 2314, 17510, 24174, 13450, -12699, -37382, -50321, -65124, -43996, -34949, -27892, -27373, -4498, -79839, -72804, -86008, -64086, 2549, -2757]
1986g0268a4056b531A4659b2486k1720A3020c5895o0839c406j2048F833a7729
1973c3732j1235A271b7428D541a8198j3729k5439j2300B1862E082c1015a1490
1960A4367c1461o9765c7257J8017C8934c0050J1177F708j795A619c1389h124E2414
1946H2035Q0857M8700m5324J33311J28342O2690K5945r5262l0559n2536j39061
1935A99138o7919F90d0458a0055n5897K3140J3613B7053d830n1729b0903Q903
1923a2000C2707G576a7975b985k2751f229C9578K3741j0392P011k9358c7342l8570
1910g5912c5051f62j0179o812D9373a1432l454o3253c2388P418D068a9693m9269
1897f8962L4331a2051n128B0914i26q1424C6928a6263c37F140e4781b5327k1176
$$ y = [-70268, -14056, -2531, 14659, -22486, -44206, 13020, -35895, -96734, -3406, -15454, 6833, -17729, -33732, -44967, 1271, -27428, 4541, -18198, -31927, -57366, -69666, 21862, 5082, -31015, -11490, 14367, -31461, -101226, -37257, -19240, 38934, -30050, -18873, 6708, 4913, 1619, -31389, -8124, 52414, 82035, 162892, 211592, 166268, 299579, 427921, 490611, 516556, 421294, 390735, 338199, 199138, 131219, 690, -40458, -10055, -65952, -42812, -29199, 27053, -4830, -56559, -20903, -12000, 32707, 7576, -17975, -2985, -25736, -6229, 39578, 63319, 52927, 59938, 30580, -37342, -75912, -35051, -662, -10841, -17653, 49373, -11432, -14886, -78139, -32388, -24970, 4068, -19693, -68962, -34631, -12051, -17179, 20914, -926, -82350, 36928, -16263, -337, 6140, -54781, -25327, -46503]
1884d6503k4676J2243a7396k6759A2501b7923N626k3697o606k7213L9662m2957
1872h3108L8969J2343A8625d1086j922J5913m348C263h626a524o0669j3694c7869
1858d6020a2684q0032c4700j10471A5776N329K9352J0985j7686k675F312f1380
1845b1644a821j18867L8803J563a6353c406j8921C6434a0857E0321L8031b6452
1832c3631o526a8203E687e7930r12d323j1949j10699f2776k1497L5727M507k9062
1819g3101b4744C8772c077k8358B3253d4697l2629c128A1787J6715K9248j9372
1807C8378e552l7271B2513L543a4161C8347o299J2728A5838L630C850M501b8261
1793A8483a843j678D2110A299K5790a7868p165j402j0284l0641a2265n7089L2937
$$ y = [-46503, -71179, -58936, -17396, -44155, 12501, -27923, -22297, -45994, -52600, -79813, -40151, -83108, -44139, -31796, 18625, -41086, -43008, -27095, -31443, 3263, -8626, -1524, -62193, -75887, -37869, -46020, -12684, -92716, -34700, -145171, 15776, 21105, 50457, 61442, 43756, 41081, 6312, -61380, -21644, -1821, -120688, -81885, -80322, -16353, -3406, -22327, 36434, -10857, 50321, 88352, -26452, -33631, -40157, -18203, 5687, -57930, -58842, -4323, -16272, -126971, -62776, -84273, -48546, -44039, -73101, -24744, 38772, -3077, -31435, 23253, -44697, -77326, -3128, 11787, 28502, 57750, 38378, -5552, -42823, 22513, 26056, -14161, 38347, 32048, 44776, 15838, 19468, 3850, 8351, -28261, 18483, -1843, -3521, 42110, 1299, 27089, -17868, -25033, -26435, -36719, -67360, -12265, -69354, -36417]
1780c6417j3407Q717A4812b1721A3608E031c3322n4006a1883q9863M6125K3647
1768c1974D7438k3034b5686n3078J8951O633j1591H351J4358a5789q5745c2673
1755B1948a2590C3759K298a14584N1203b0640o1083i517A5310b8236R11j8775
1743d6100a4353E7149J0384j8855k3058n061M5095H755K8049K2807J6842B7291
1730b6965l4042a2390q4683K5321J2790Q366a3168p262N402P458l5674R062G147
1716a540j2960B7527K4336j7582L1862J2N2040D3380R898j6167M7410l946N1737
1703A32312B7238a5698M261C1427K2818B1928O6344j3522k444M4283k3517M0414
1691A33486J37235J60470N09585J047024I81283m83549B01620G8678j7222J7291
$$ y = [-36417, -49824, -41107, 14812, -21721, 13608, 5031, -33322, -87328, -11883, -101746, -55621, -31974, 47438, 24404, -25686, -78764, -59813, -53180, -64771, 8351, 22709, -15789, -101534, -32673, 21948, -12590, 33759, 36057, -114584, -63381, -20640, -81723, -9517, 15310, -28236, -27325, -46100, -14353, 57149, 67533, 48678, 25620, 20559, 65654, 8755, 36804, 59611, 76453, 27291, -26965, -61007, -12390, -97073, -71752, -58962, -50596, -13168, -20430, -15028, -7570, -43244, -34182, 7147, -1540, -14500, 27527, 51863, 34281, 66143, 66155, 118195, 43380, 53278, 37111, 84521, 80575, 132312, 27238, -15698, -11437, 31427, 54245, 21928, 88272, 74750, 72306, 116589, 93072, 133486, 270721, 431191, 940776, 1987800, 981283, 497734, 201620, 78678, 61456, 78747]
1681G8747k1491J6462K6698l4288k009J993Q795j1800q569R0427F9818C4547O4425
1668I8972m4658L3172j9529O9303o0103k1292A4766J5646L4119j5569O8068B9737
1655F452O0466k6939p241K8040a5525j5523L184B8813N8913m3427L5043C32L3885
1642C4217a4972B4678b2355E7842L6328J3062r495p876K2826B1688J1562L4278
1630F7528K2667C8268K8498l2476f811k6501c049D3666P3852j5972I692R0131
1618I9823J4440m6952Q563K8422l8699k3710M6888k2967Q221P7217r599k4076
1606A17571D7670M3741m2546F226J6383L0167J01371l4717N3450N5803k2863E2933
1593F3107J00275m6700R1091o0507q465n926J6180j2681n0564J31314m1089k1339
$$ y = [78747, 57256, 73718, 100416, 66128, 64119, 66112, 74907, 63107, 54538, 144965, 69818, 34547, 98972, 54314, 87486, 67957, 137260, 77157, 55865, 14766, 30412, 64531, 48962, 117030, 29737, 6452, 66918, 39979, 32738, 60778, -15525, -31048, -27864, 28813, 87726, 44299, 79342, 332, 34217, -14972, 24678, -22355, 57842, 94170, 107232, 97737, 89861, 112687, 21688, 33250, 67528, 90195, 38268, 66766, 34290, -6811, -33312, -3049, 43666, 117518, 101546, 9692, 99823, 114263, 67311, 75874, 104296, 65597, 41887, 88775, 65808, 74029, 151246, 141647, 117571, 47670, 91411, 48865, 6226, 22609, 52776, 154147, 119430, 172880, 228683, 205820, 52933, 63107, 163382, 116682, 207773, 147266, 138801, 132875, 149055, 136374, 85810, 217124, 176035, 154696]
1581A54696m2262j9490O3732l6178K9960M8527k1900K7370j9749O3489J6557K782
1569B67534p7498o8316L0784J32305m196q045R61N0638j0642J00620J0023k5322
1557C98846L7115N2204J8146P6765J44422K11137O30745K265690K641871B696855
1546A406683l10825j56992p3723J04762L7957J60793K35189J84347K98746L41516
1536B228453O67194J143618J414971J152598J207285J483251L679659P708212
1528B0685241J8190123P0185898J46155234A10061767C8450660A8437712p484216
1521A0953496l363697j504350l00842o97657j091503j224370j093233m14954k45585
1512A017305k03727p8065o2495j10262p3500k03P9227K61976O84617L010134O85866
$$ y = [154696, 112434, 92944, 156676, 120498, 150458, 198985, 177085, 204455, 184706, 248195, 264752, 267534, 190036, 121720, 152504, 284809, 280613, 272568, 273529, 324167, 313525, 414145, 424168, 398846, 435961, 488165, 506311, 583076, 727498, 938635, 1569380, 3835070, 6476941, 2696855, 1406683, 1095858, 938866, 865143, 969905, 1007862, 1168655, 1403844, 1588191, 1886937, 2228453, 2895647, 4039265, 5454236, 6606834, 7814119, 9297370, 12977029, 20685241, 38875364, 109061262, 255216496, 110061767, 38450660, 18437712, 10953496, 7589799, 6085449, 5784607, 5086950, 3995447, 2771077, 1677844, 1262890, 1017305, 813578, 735513, 673018, 562756, 489256, 489053, 568280, 830256, 1514873, 4525007, 5210873]
1501E210873A782965G48989l06512j98360j05629J3244M485l1575D4597N0954
1491I5551b2878K682a55j0109A6534a8359f23j6049H9758H687d9296k9275K4739
1478e3832j12835M102L1635K6559K8835j8028b4384j2674k3666J6364k8557L0016
1466d2901a02j10767M3473J2353n218j8836K2631A8942a5887e168p9248K5628
1454e8788m3791m9160J230M9832J314c3382j7577Q623N226a5336n324b867k0531
1441b3398k5229K1598P8q3607m31c3087q163m9834c4965J3970C197f5344h806
1427D2394K4781j376b3021E2502c0743l6969j8979j5769M3312b9497q058J3377
1415b4178b774m8241Q951c188l3302D920b4790B4171M0770b6659g657p7398K1358
$$ y = [5210873, 1782965, 748989, 442477, 244117, 138488, 151732, 156217, 124642, 44597, 95551, -22878, -20196, -155, -10264, 16534, -18359, -623, -16672, 89758, 8687, -49296, -78571, -53832, -166667, -162565, -130930, -104371, -75536, -93564, -24384, -37058, -60724, -44360, -72917, -42901, -102, -110869, -67396, -55043, -60261, -79097, -56466, 18942, -15887, -5168, -84416, -58788, -102579, -151739, -150509, -100677, -99363, -33382, -50959, -42336, -37110, -15336, -20660, -2867, -23398, -48627, -27029, -26951, -110558, -110989, -33087, -41250, -91084, -34965, -20995, 3197, -65344, -8806, 42394, 67175, 65799, -23021, 52502, -30743, -67712, -86691, -102460, -59148, -29497, -37555, -24178, -2774, -51015, -42064, -3188, -36490, 4920, -24790, 24171, 64941, -26659, -7657, -85055, -63697]
1402f3697E4141k299j5858J013D841a6442E2279C124c0155n687R958j6045E154
1388a9701b296j0603F030g8508l69k120c7275k2719l7592M4719h943o5838D03
1374a5888F8001A4471M0624k306Q7153o6723P7501O3877K70678N44088N55881
1363A585244o50156C03433A24078A0888c2031B6536K6977A7851a4487d830o0502
1352f5332N073a6036k1892j3446j1657q1655J4866a2749b395r3446d2217a9061
1339F118c0908k6918j7157J9970C262M215c0064A5653c3601f146j2795H85O2380
1326F3265L9140l5103j500B2438c9210A5110c7673k3428O959A5224e8340B4467
1313A5260L4147c6900k7393A8758Q0577B3429a8985B8019a5959A6441i4399h144
$$ y = [-63697, 54141, 51842, 35984, 36997, 4841, -16442, 52279, 3124, -30155, -35842, -25884, -41929, 5154, -19701, -2296, -12899, 6030, -78508, -78877, -80997, -37275, -59994, -97586, -52867, -8943, -74781, 403, -15888, 68001, 14471, 55095, 52789, 139942, 73219, 150720, 214597, 485275, 1029363, 1585244, 935088, 303433, 124078, 10888, -32031, 26536, 53513, 17851, -14487, -4830, -65332, -60259, -16036, -37928, -51374, -63031, -144686, -129820, -12749, -2395, -95841, -42217, -19061, 6118, -30908, -57826, -74983, -55013, 3262, 7477, -30064, 15653, -33601, -6146, -18941, 885, 63265, 102405, 67302, 65802, 22438, -39210, 15110, -37673, -61101, -54142, 15224, -58340, 24467, 15260, 49407, -36900, -64293, 18758, 99335, 23429, -18985, 28019, -15959, 16441, -94399, -8144]
1300C9611K6500C427K8316A335g356l0116a7371C9397c2612f367B3468a9260F336
1286C8739N170K2176I788M3880g839C9831j3802R527g5045b2760j0073a4962p544
1273b2506J1172B7749R03q046r896a3089D6583L118c6665a3797I984f2947B6570
1259B1117b7701d20n4075K4214A0949h439j5253f418r786E521M3041j3331O2625
1246I7856m6300E103b7472j1368D2972e4908E309M1525b4392B4568J9271a2329
1233H539J5235E17d454k2089b577A1339M6271b0252k852R833K081B5221L8748
1220F3969m391A9664L708A192O1773k5661a841o0653J1385D7979a2414q527A7463
1206B1457h129j8375H8069p412M292A3756L6594C12L4033R640A3632L4871c0170
$$ y = [39611, 66111, 3427, 31743, 1335, -7356, -37472, -17371, 39397, -32612, -6367, 23468, -19260, 6336, 38739, 43909, 66085, 9788, 53668, -7839, 39831, 26029, 35556, -75045, -22760, -32833, -14962, -22506, -11334, 27749, 28652, 20606, 10710, -13089, 46583, 49701, -36665, -13797, 9984, -62947, 26570, 21117, -27701, -420, -54495, -30281, 10949, -8439, -23692, -6418, -16204, 5521, 48562, 35231, 97856, 51556, 5103, -27472, -38840, 42972, -54908, 5309, 46834, -24392, 24568, 43839, -12329, 8539, 23774, 517, -4454, -26543, -2577, 11339, 57610, -20252, -23104, -13271, -11190, 25221, 63969, 59578, 19664, 23372, 1192, 62965, 37304, -1841, -62494, -51109, 47979, -12414, -20941, 17463, 21457, -8129, -26504, 88069, 80657, 84949, 13756, 50350, 312, 34345, 43985, 13632, 48503, -30170]
1192A9866O2162K8100D1930A6774J4268K923I538K4954M8694j0999l2079L081
1180D3189K1278L774j9998N857j6870M8662D0880d8804a5920B5878O304K9185
1168F1367j4000j8566K285b402j999q219c851D2800L8116k2762A9488b9874q547
1155c8421L056J2228I075b6700j1525n1982K1270K7260F1265c1015D5584j7934
1143B7650A0277d0502E7465b3537m9487K5535j1609J3842A107R382D342O4454
1131F8796B6374r442L0163M341j3716M788j7812a6919H074R879J3995n775N1268
1118G7441M4480l8805G413b0591B9724b7773C6823N4717l1271B2626P3853M7266
1106A43745M2768J82125J40307J8772m7983n8848j55824j21491p1279B9063M0885
$$ y = [19866, 82028, 110128, 41930, 16774, 31042, 33965, 9538, 34492, 83186, 72187, 40108, 43189, 64467, 68241, 48243, 54100, 37230, 85892, 40880, -48804, -15920, 25878, 32182, 61367, 47367, 28801, 31086, -2402, -4401, -12620, -3851, 42800, 80916, 58154, 19488, -29874, -38421, -35365, -23137, 9075, -26700, -38225, -90207, -68937, -41677, 61265, -31015, 45584, 27650, 10277, -40502, 57465, -23537, -73024, -47489, -59098, -45256, 1107, 10489, 4342, 68796, 26374, 16932, 47095, 51436, 37720, 42508, 24696, -16919, 8074, 17953, 31948, 26173, 77441, 121921, 83116, 7413, -20591, 29724, -27773, 36823, 91540, 60269, 22626, 96479, 143745, 186513, 368638, 508945, 527717, 479734, 420886, 265062, 143571, 72292, 29063, 69948]
1095F9948k755N6026l658L6231D8885d9136l0238B2675D397O8729r161j3401A4128
1081b6323a574A4294J5571j2535c4669j7031b1761F7942A7593J4471j1656b9019
1068i306D2846j1642c1971g69l8658J8771p6261d1421j9723K87l315b944C6305
1054A25384o1006k5743e1642a0198G8131a387k5578G982c635D715j236K1409Q6494
1041A11382E1749n907B2598N7142O797F343O332O079N668k271Q974p100b7257
1027b9310D2355c5774i581B5513e9115a5867M176A5271J1972C409L224K0783d487
1013i488L248E4244B7089P961a5052G5541l2662O7537E1879e0959m064J3100E0489
999D3279b1227A2186J0090M8948B4097L545a2903D31c2944J2660E4604K5053k4118
$$ y = [69948, 67193, 123219, 119561, 155792, 48885, -49136, -79374, 22675, 4397, 73126, 63965, 50564, 14128, -26323, -1574, 14294, 29865, 17330, -34669, -51700, -21761, 67942, 17593, 32064, 20408, -29019, -9306, 42846, 31204, -31971, -769, -39427, -20656, -96917, -41421, -61144, -60857, -64172, -2944, 36305, 125384, 64378, 38635, -51642, -10198, 78131, -1387, -26965, 7982, -3635, 4715, 3479, 24888, 111382, 51749, 45842, 22598, 79740, 86537, 6343, 12675, 18754, 24422, 22151, 31125, 24025, -27257, -29310, 42355, -35774, -9581, 25513, -59115, -15867, -11691, 15271, 27243, 3409, 6633, 27416, -4487, -9488, -6240, 54244, 27089, 35050, -15052, 75541, 42879, 110416, 51879, -50959, -55023, -41923, 50489, 43279, -21227, 12186, 22276, 71224, 24097, 27642, -12903, 431, -32944, -20284, 54604, 79657, 55539]
986E5539K4265B0078O1566B0551J0400N9420M2851J5440C4511e9724n6260L5180
974h0804A6801C50c0988G330N1616B6378M9297A9309e7077A4388M0436a914E9870
960D7265j1545M4635l3318d292n9759C0792j2717d3861m8566c0452j6583b2571
947A8618a346j9953F1320A2104g05G8614A2462J2504a582C2312L3971C3098J9137
934E2235Q03k5177L6568k6050A6044B548J8260J7884L791N7061K2949J1240n9170
921G4563L9554m6518l202A4191c7599C7837A3203R355g013j7650B3938J3832c9554
907A4454P3819j8503l1611a7704j2201h117j4887B899b9077K006g739A8707H436
893C2298i880G7188j3189n314j6045A4095J7821d728D3602k1387L4608K7699A4277
$$ y = [55539, 79804, 20078, 81644, 20551, 30951, 90371, 133222, 148662, 34511, -59724, -115984, -80804, 16801, 350, -30988, 7330, 58946, 26378, 75675, 19309, -57077, 14388, 54824, -1914, 59870, 47265, 35720, 80355, 47037, -4292, -64051, 30792, 18075, -43861, -92427, -30452, -47035, -22571, 18618, -1346, -21299, 61320, 12104, -705, 78614, 12462, 24966, -1582, 32312, 66283, 33098, 52235, 53038, 27861, 64429, 38379, 16044, 2548, 20808, 38692, 42483, 99544, 122493, 133733, 74563, 114117, 67599, 64397, 14191, -37599, 37837, 13203, 22558, -7013, -24663, 23938, 37770, -39554, 14454, 88273, 69770, 38159, -17704, -29905, -8117, -23004, 2899, -29077, -27071, -7739, 18707, 8436, 32298, -9880, 77188, 63999, 58685, 42640, 14095, 31916, -4728, 43602, 22215, 56823, 84522, 14277]
879a1672B8968M2487b063E3833O4921m7535J1866j8446j570G701c260E535K2858
866B8393M8115F837O4215A2670J0503Q3553k6719A6752a3252C9178k979P7948
854A14147G361a9660D638Q5419Q800j8629j2943q646B0282r944j911a2188B3424
840g9608c9149a8548A6001P0018B0755L927a0523C4383a5998A4483e067K212D9509
826G7205k9951O695A5485M9176p236J7231N1087j6923B4871F202O791K50a1229
812a6366m3420a8838A1494K5364o192Q8995n1352i741B186K424K1851m698K7849
799D9612H206N1849k7432H551J4821J6716A8680e1842B7182Q6275n2981j906B4311
785C201N0844B0042M335P2479l4432A703P5039A1416P4472j5124q30k5630d0339
$$ y = [-11672, 28968, 71455, -2063, 53833, 118754, 71219, 83085, 64639, 63069, 7701, -3260, 5535, 28393, 76508, 6837, 71052, 12670, 23173, 106726, 80007, 16752, -13252, 39178, 36199, 114147, 7361, -19660, 4638, 90057, 98857, 80228, 67285, 58639, 20282, 10338, 8427, -12188, 23424, -79608, -39149, -18548, 16001, 86019, 20755, 24682, -10523, 34383, -15998, 14483, -5067, -2855, 49509, 77205, 47254, 53949, 15485, 64661, 57425, 74656, 125743, 108820, 24871, 6202, 12993, 13243, -11229, -16366, -59786, -18838, 11494, 36858, 30666, 119661, 68309, -9741, 2186, 4610, 26461, 21763, 49612, 8206, 60055, 32623, 8551, 23372, 40088, 18680, -51842, 27182, 113457, 60476, 58570, 24311, 3201, 54045, 20042, 24377, 96856, 62424, 1703, 76742, 11416, 85888, 70764, 69934, 44304, -40339]
771c2699D2277B731e002j8381n9055e937C1562a4637j131D3684j2562J00764F3832
757b4825J1037I1813J8825R600l2165k60A3211J5296N2449k9330J6667p268B0626
743a9675k6843A2029K9431g2096c1864D333L1366J7265A2782K1978c728A5924
730a4077A7531L773J8567c3412D9255j0264e08H2788j434O323Q1049D9736M360
717E4096k3872h9882a3724D711Q396m590b2252R650A6003R4361C5297K6952P6702
704A38951F0370j0359K0193K2891l7960j8598J1955A1399L7067J4788r042O511
692F0723B1744a6269A8599n437L1265j702Q7410k6526G900O475K832M3872B977
678a652A6569J6659p828L2745j0468M2895C488c1752E4755k1464N5731C2905J019
$$ y = [-32699, 42277, 2731, -5002, -23383, -82438, -5937, 31562, -14637, -15768, 43684, 31122, 131886, 63832, -24825, -13788, 91813, 110638, 120238, 88073, 87813, 13211, 28507, 80956, 51626, 68293, 61025, 20626, -19675, -46518, 12029, 41460, -72096, -31864, 4333, 35699, 52964, 12782, 34760, -3728, 15924, -14077, 17531, 21304, 39871, -33412, 49255, 38991, -508, 82788, 81354, 87677, 168726, 49736, 54096, 30224, -89882, -13724, 4711, 13107, 8517, -22252, -12602, 16003, 110364, 35297, 62249, 138951, 60370, 50011, 70204, 93095, 55135, 36537, 48492, 11399, 48466, 63254, 54212, 60723, 21744, -16269, 18599, 13162, 44427, 42725, 130135, 103609, 7900, 14375, 17207, 61079, 2977, -1652, 16569, 33228, 25400, 58145, 47677, 90572, 3488, -31752, 54755, 33291, 89022, 32905, 33924]
665C3924J2989m551J5761A7086c9051F9936B9314K008L1673k6707b1803N740d60
651g0E2449K6759J5841l5191J8529q189k8092N244K1062k9602f3665A1838N7793
638F9631A2669N783L9081I165J1815K338O615P50A472K8824R0376n5599B4854
624E2491b641A7231B718c4063j219A155K8119g670A2450n194d1635d607C3288
610G2969L6130l6468j6886j8547B029K9160i673A6722J6944N2195K7569K4631
598A38061F2520e253D4686A7049d245I7969B6007L3350K0747a5175b417A4964
585C5460J2580J7023L8421B0225L2611k5432L1834k358A5515M237A607N2164P2175
572A25946K54k8297l405m2249H979P255O1429L9399J6470D5979j9487O101j2943
$$ y = [33924, 46913, 42362, 58123, 17086, -39051, 69936, 29314, 31322, 62995, 36288, -21803, -16063, -460, -70, 52449, 79208, 95049, 59858, 78387, 70198, 42106, 47350, 68412, 38810, -63665, 11838, 69631, 12669, 18452, 57533, 9165, 20980, 23318, 29933, 30683, 1472, 30296, 120672, 65073, 24854, 52491, -2641, 17231, 2718, -34063, -35282, 1155, 29274, -7670, 12450, 7256, -41635, -4607, 33288, 72969, 109099, 72631, 55745, 37198, 2029, 31189, -9673, 16722, 33666, 85861, 113430, 138061, 62520, -5253, 44686, 17049, -4245, 97969, 26007, 59357, 80104, -15175, -2417, 14964, 35460, 48040, 65063, 103484, 20225, 52836, 27404, 59238, 56880, 15515, 19752, 1607, 53771, 125946, 126200, 97903, 94498, 52249, 8979, 16234, 77663, 117062, 133532, 45979, 26492, 32593, 19650]
559A9650b7743E10b3657E6489j4593A9143k85L9789O7508m0842j6587r827k9351
546B9548d3737E1782j7259N3015C9738J8234J0309l0468J3439N9333D4336a9462
533B0601L7292A6405L4815L1795l8500J8472k79k1477A4537N0014L6497K5663
$$ y = [19650, -27743, 510, -23657, 56489, 41896, 19143, 18858, 58647, 126155, 85313, 68726, 58899, 29548, -43737, 51782, 34523, 87538, 39738, 57972, 68281, 37813, 51252, 110585, 44336, -19462, 20601, 57893, 16405, 51220, 83015, 44515, 62987, 62708, 41231, 14537, 64551, 101048, 126711]
$$ [...]
##END NTUPLES=NMR SPECTRUM
##END=
