##TITLE=	Document 29
##JCAMP-DX=	6.0	$$ MestReNova 15.0.0-34764
##DATA TYPE=	LINK
##BLOCKS=	3    
##ORIGIN=	Mestrelab Research S.L.
##OWNER=	PC
##$MNOVA/METADATA=	(DOCUMENT,BASE64)
ewogICAgIm5hbWUiOiAiRG9jdW1lbnQgMjkiLAogICAgInBhZ2VzIjogWwogICAgICAgIHsKICAgICA
gICAgICAgIml0ZW1zIjogWwogICAgICAgICAgICAgICAgIjIiLCAgICAgICAgICAgICAgICAgICAgIC
AgICAgICAgICAgICAgICAKICAgICAgICAgICAgICAgICIxIiAgICAgICAgICAgICAgICAgICAgICAgI
CAgICAgICAgICAgICAKICAgICAgICAgICAgXQogICAgICAgIH0KICAgIF0KfQo=
##TITLE=	H NMR calculated spectrum
##JCAMP-CS=	3.7	$$ MestReNova 15.0.0-34764
##BLOCK_ID=	1
##ORIGIN=	Mestrelab Research S.L.
##OWNER=	PC
##$MNOVA/METADATA=	(ITEM,BASE64)
ewogICAgImFuZ2xlIjogMCwKICAgICJwb2ludHMiOiBbCiAgICAgICAgewogICAgICAgICAgICAieCI
6IDU1MTIsCiAgICAgICAgICAgICJ5IjogNjQxMgogICAgICAgIH0sCiAgICAgICAgewogICAgICAgIC
AgICAieCI6IDYzNDAuNTEwOTUzNTAxNjE4LAogICAgICAgICAgICAieSI6IDY0MTIKICAgICAgICB9L
AogICAgICAgIHsKICAgICAgICAgICAgIngiOiA2MzQwLjUxMDk1MzUwMTYxOCwKICAgICAgICAgICAg
InkiOiA2OTQwLjA0MDEzMDQwMTEzOAogICAgICAgIH0sCiAgICAgICAgewogICAgICAgICAgICAieCI
6IDU1MTIsCiAgICAgICAgICAgICJ5IjogNjk0MC4wNDAxMzA0MDExMzgKICAgICAgICB9LAogICAgIC
AgIHsKICAgICAgICAgICAgIngiOiA1NTEyLAogICAgICAgICAgICAieSI6IDY0MTIKICAgICAgICB9C
iAgICBdLAogICAgInoiOiAxCn0K
##NAMES=	H NMR calculated spectrum
##ATOMLIST=	
$$ AN	AS	NH
	1	Cl	 
	2	C	2
	3	C	2
	4	S	 
	5	C	2
	6	C	2
	7	C	2
	8	S	 
	9	C	2
	10	C	2
	11	Cl	 
##BONDLIST=	
$$ AN1	AN2	BT
	1	2	S
	2	3	S
	3	4	S
	4	5	S
	5	6	S
	6	7	S
	7	8	S
	8	9	S
	9	10	S
	10	11	S
##MAXRASTER=	32768
##XY_RASTER=	
$$ AN	X	Y	Z
	1	1719	1176	0
	2	5853	1176	0
	3	7935	4707	0
	4	12069	4707	0
	5	14151	8357	0
	6	18284	8357	0
	7	20336	11888	0
	8	24500	11888	0
	9	26552	15539	0
	10	30686	15539	0
	11	32768	19069	0
##END=		$$ JCAMP-CS
##TITLE=	
##JCAMP-DX=	6.0	$$ MestReNova 15.0.0-34764
##DATA TYPE=	NMR SPECTRUM
##DATA CLASS=	XYDATA
##BLOCK_ID=	2
##ORIGIN=	Mnova: Peaks
##OWNER=	PC
##NUMDIM=	1
##$MNOVA/METADATA=	(ITEM,BASE64)
ewogICAgImFuZ2xlIjogMCwKICAgICJheGVzIjogewogICAgICAgICJ4IjogewogICAgICAgICAgICA
ibWF4IjogMjAuMDAwMTUwMDAxMTI1MDEsCiAgICAgICAgICAgICJtaW4iOiAtNC45OTk2NTYwMjc2OT
M2NDU1CiAgICAgICAgfSwKICAgICAgICAieSI6IHsKICAgICAgICAgICAgIm1heCI6IDAuMTQ2OTczM
Tc0OTk2Njc0MDYsCiAgICAgICAgICAgICJtaW4iOiAtMC4wMTMzNjExOTc4OTYzMDE3NDYKICAgICAg
ICB9CiAgICB9LAogICAgInBvaW50cyI6IFsKICAgICAgICB7CiAgICAgICAgICAgICJ4IjogNTMyMSw
KICAgICAgICAgICAgInkiOiA1ODM1CiAgICAgICAgfSwKICAgICAgICB7CiAgICAgICAgICAgICJ4Ij
ogODcyMiwKICAgICAgICAgICAgInkiOiA1ODM1CiAgICAgICAgfSwKICAgICAgICB7CiAgICAgICAgI
CAgICJ4IjogODcyMiwKICAgICAgICAgICAgInkiOiA4MjA4CiAgICAgICAgfSwKICAgICAgICB7CiAg
ICAgICAgICAgICJ4IjogNTMyMSwKICAgICAgICAgICAgInkiOiA4MjA4CiAgICAgICAgfSwKICAgICA
gICB7CiAgICAgICAgICAgICJ4IjogNTMyMSwKICAgICAgICAgICAgInkiOiA1ODM1CiAgICAgICAgfQ
ogICAgXSwKICAgICJ6IjogMAp9Cg==
##.OBSERVE FREQUENCY=	400.12699902499997506
##.OBSERVE NUCLEUS=	^Unknown
##.SOLVENT NAME=	
##.PULSE SEQUENCE=	
##.ACQUISITIONMODE=	SIMULTANEOUS
##$ORIGINAL FORMAT=	MNova
##$MNOVA/SCALES_VERSION=	9
##$PARAMETER FILE=	(originalData.xml, ASCII, , 0)
$$ <?xml version="1.0" encoding="UTF-8"?>
$$ <MnovaSpectrumParams>
$$     <itemId>{679e557d-de71-4a2d-8130-15b5a54aab04}</itemId>
$$     <spectrumIndex>0</spectrumIndex>
$$     <DataFileName/>
$$     <Title>
$$         <dim0>Simulated Unknown NMR Spectrum</dim0>
$$     </Title>
$$     <Comment/>
$$     <Origin>
$$         <dim0>Mnova: Spin Simulation</dim0>
$$     </Origin>
$$     <Owner/>
$$     <Site/>
$$     <Instrument/>
$$     <Author/>
$$     <Solvent/>
$$     <Temperature/>
$$     <PulseSequence/>
$$     <Experiment>
$$         <dim0>1D</dim0>
$$     </Experiment>
$$     <Probe/>
$$     <NumberofScans/>
$$     <ReceiverGain/>
$$     <RelaxationDelay/>
$$     <PulseWidth/>
$$     <PresaturationFrequency/>
$$     <AcquisitionTime/>
$$     <AcquisitionDate/>
$$     <ModificationDate/>
$$     <Class/>
$$     <Purity>
$$         <dim0>100</dim0>
$$     </Purity>
$$     <SpectrumQuality>
$$         <dim0>-0.717715099280616</dim0>
$$     </SpectrumQuality>
$$     <Version/>
$$     <Algorithm/>
$$     <UseDB/>
$$     <GMMXCycles/>
$$     <LineWidth>
$$         <dim0>0</dim0>
$$     </LineWidth>
$$     <SpectrometerFrequency>
$$         <dim0>400.13</dim0>
$$     </SpectrometerFrequency>
$$     <SpectralWidth>
$$         <dim0>10003.25</dim0>
$$     </SpectralWidth>
$$     <LowestFrequency>
$$         <dim0>-2000.65</dim0>
$$     </LowestFrequency>
$$     <Nucleus>
$$         <dim0>Unknown</dim0>
$$     </Nucleus>
$$     <AcquiredSize/>
$$     <SpectralSize>
$$         <dim0>65536</dim0>
$$     </SpectralSize>
$$     <DigitalResolution>
$$         <dim0>0.152637481689453</dim0>
$$     </DigitalResolution>
$$     <AbsoluteReference/>
$$ </MnovaSpectrumParams>
$$ 
##$PARAMETER FILE=	(parameters, ASCII, , 0)
$$ <MnovaSpectrumParams>
$$ <SpecCount>1</SpecCount>
$$ <Dimensions>1</Dimensions>
$$ <Origin>Mnova: Peaks</Origin>
$$ <Window Dim="f1">
$$ <Nucleus>Unknown</Nucleus>
$$ <Points>65536</Points>
$$ <Width>10003.25</Width>
$$ <MHz>400.126999024999975</MHz>
$$ <Hz>-2000.65000000000009</Hz>
$$ </Window>
$$ <Window Dim="f0">
$$ <Points>1</Points>
$$ </Window>
$$ </MnovaSpectrumParams>
##$PARAMETER FILE=	(title, ASCII, , 0)
$$ 
##XUNITS=	HZ
##YUNITS=	ARBITRARY UNITS
##FIRSTX=	8002.6000000000003638
##LASTX=	-2000.4973625183106378
##DELTAX=	-0.152637481689453125
##XFACTOR=	1
##YFACTOR=	6.2217925285264029964E-11
##FIRSTY=	2.7543858305278945409E-09
##MINY=	0
##MAXY=	0.13361197710037231445
##NPOINTS=	65536
##XYDATA=	(X++(Y..Y))
$$ [...]
2641A008%J%%%J%%%%J%%%J%%%%J%%%J%%%J%%%%J%%%J%%%%J%%%J%%%%J%%%J%%%J%%%%J%%%J
2631A024%%%%J%%%J%%%J%%%%J%%%J%%%%J%%%J%%%J%%%%J%%%J%%%J%%%%J%%%J%%%J%%%J%%%
2620A039%J%%%J%%%J%%%%J%%%J%%%J%%%J%%%%J%%%J%%%J%%%J%%%%J%%%J%%%J%%%J%%%J%%%
2610A055%J%%%J%%%J%%%J%%%J%%%J%%%%J%%%J%%%J%%%J%%%J%%%J%%%J%%%%J%%%J%%%J%%%J
2599A072%%%J%%%J%%%J%%%J%%%J%%%J%%%J%%%J%%%J%%%J%%%J%%%%J%%%J%%%J%%%J%%%J%%%
2589A088J%%%J%%%J%%%J%%%J%%J%%%J%%%J%%%J%%%J%%%J%%%J%%%J%%%J%%%J%%%J%%%J%%%J
2579A106%%%J%%J%%%J%%%J%%%J%%%J%%%J%%%J%%%J%%J%%%J%%%J%%%J%%%J%%%J%%J%%%J%%%
2568A123J%%%J%%%J%%J%%%J%%%J%%%J%%%J%%J%%%J%%%J%%%J%%J%%%J%%%J%%%J%%J%%%J%%%
$$ plain form
2641 1008 1008 1009 1009 1009 1009 1010 1010 1010 1010 1010 1011 1011 1011 1011 1012 1012 1012 1012 1012 1013 1013 1013 1013 1014 1014 1014 1014 1015 1015 1015 1015 1015 1016 1016 1016 1016 1017 1017 1017 1017 1017 1018 1018 1018 1018 1019 1019 1019 1019 1019 1020 1020 1020 1020 1021 1021 1021 1021 1022 1022 1022 1022 1022 1023 1023 1023 1023 1024
2631 1024 1024 1024 1024 1024 1025 1025 1025 1025 1026 1026 1026 1026 1027 1027 1027 1027 1027 1028 1028 1028 1028 1029 1029 1029 1029 1029 1030 1030 1030 1030 1031 1031 1031 1031 1032 1032 1032 1032 1032 1033 1033 1033 1033 1034 1034 1034 1034 1035 1035 1035 1035 1035 1036 1036 1036 1036 1037 1037 1037 1037 1038 1038 1038 1038 1039 1039 1039 1039
2620 1039 1039 1040 1040 1040 1040 1041 1041 1041 1041 1042 1042 1042 1042 1042 1043 1043 1043 1043 1044 1044 1044 1044 1045 1045 1045 1045 1046 1046 1046 1046 1046 1047 1047 1047 1047 1048 1048 1048 1048 1049 1049 1049 1049 1050 1050 1050 1050 1050 1051 1051 1051 1051 1052 1052 1052 1052 1053 1053 1053 1053 1054 1054 1054 1054 1055 1055 1055 1055
2610 1055 1055 1056 1056 1056 1056 1057 1057 1057 1057 1058 1058 1058 1058 1059 1059 1059 1059 1060 1060 1060 1060 1061 1061 1061 1061 1061 1062 1062 1062 1062 1063 1063 1063 1063 1064 1064 1064 1064 1065 1065 1065 1065 1066 1066 1066 1066 1067 1067 1067 1067 1068 1068 1068 1068 1068 1069 1069 1069 1069 1070 1070 1070 1070 1071 1071 1071 1071 1072
2599 1072 1072 1072 1072 1073 1073 1073 1073 1074 1074 1074 1074 1075 1075 1075 1075 1076 1076 1076 1076 1077 1077 1077 1077 1078 1078 1078 1078 1079 1079 1079 1079 1080 1080 1080 1080 1081 1081 1081 1081 1082 1082 1082 1082 1083 1083 1083 1083 1083 1084 1084 1084 1084 1085 1085 1085 1085 1086 1086 1086 1086 1087 1087 1087 1087 1088 1088 1088 1088
2589 1088 1089 1089 1089 1089 1090 1090 1090 1090 1091 1091 1091 1091 1092 1092 1092 1092 1093 1093 1093 1094 1094 1094 1094 1095 1095 1095 1095 1096 1096 1096 1096 1097 1097 1097 1097 1098 1098 1098 1098 1099 1099 1099 1099 1100 1100 1100 1100 1101 1101 1101 1101 1102 1102 1102 1102 1103 1103 1103 1103 1104 1104 1104 1104 1105 1105 1105 1105 1106
2579 1106 1106 1106 1106 1107 1107 1107 1108 1108 1108 1108 1109 1109 1109 1109 1110 1110 1110 1110 1111 1111 1111 1111 1112 1112 1112 1112 1113 1113 1113 1113 1114 1114 1114 1114 1115 1115 1115 1116 1116 1116 1116 1117 1117 1117 1117 1118 1118 1118 1118 1119 1119 1119 1119 1120 1120 1120 1120 1121 1121 1121 1122 1122 1122 1122 1123 1123 1123 1123
2568 1123 1124 1124 1124 1124 1125 1125 1125 1125 1126 1126 1126 1127 1127 1127 1127 1128 1128 1128 1128 1129 1129 1129 1129 1130 1130 1130 1130 1131 1131 1131 1132 1132 1132 1132 1133 1133 1133 1133 1134 1134 1134 1134 1135 1135 1135 1136 1136 1136 1136 1137 1137 1137 1137 1138 1138 1138 1138 1139 1139 1139 1140 1140 1140 1140 1141 1141 1141 1141
2558A141J%%J%%%J%%%J%%%J%%J%%%J%%%J%%J%%%J%%%J%%J%%%J%%%J%%J%%%J%%%J%%J%%%J%
2547A160%J%%%J%%%J%%J%%%J%%J%%%J%%%J%%J%%%J%%J%%%J%%%J%%J%%%J%%J%%%J%%J%%%J%
2537A179%J%%%J%%J%%%J%%J%%%J%%%J%%J%%%J%%J%%J%%%J%%J%%%J%%J%%%J%%J%%%J%%J%%%
2527A198J%%J%%%J%%J%%J%%%J%%J%%%J%%J%%%J%%J%%J%%%J%%J%%%J%%J%%J%%%J%%J%%J%%%
2516A218J%%J%%J%%%J%%J%%J%%%J%%J%%J%%%J%%J%%J%%%J%%J%%J%%%J%%J%%J%%%J%%J%%J%
2506A239%J%%%J%%J%%J%%J%%%J%%J%%J%%J%%%J%%J%%J%%J%%%J%%J%%J%%J%%J%%%J%%J%%J%
2496A260%J%%J%%%J%%J%%J%%J%%J%%J%%%J%%J%%J%%J%%J%%J%%J%%%J%%J%%J%%J%%J%%J%%J
2485A282%%J%%%J%%J%%J%%J%%J%%J%%J%%J%%J%%J%%J%%J%%%J%%J%%J%%J%%J%%J%%J%%J%%J
$$ plain form
2558 1141 1142 1142 1142 1143 1143 1143 1143 1144 1144 1144 1144 1145 1145 1145 1145 1146 1146 1146 1147 1147 1147 1147 1148 1148 1148 1148 1149 1149 1149 1150 1150 1150 1150 1151 1151 1151 1151 1152 1152 1152 1153 1153 1153 1153 1154 1154 1154 1154 1155 1155 1155 1156 1156 1156 1156 1157 1157 1157 1157 1158 1158 1158 1159 1159 1159 1159 1160 1160
2547 1160 1160 1161 1161 1161 1161 1162 1162 1162 1162 1163 1163 1163 1164 1164 1164 1164 1165 1165 1165 1166 1166 1166 1166 1167 1167 1167 1167 1168 1168 1168 1169 1169 1169 1169 1170 1170 1170 1171 1171 1171 1171 1172 1172 1172 1172 1173 1173 1173 1174 1174 1174 1174 1175 1175 1175 1176 1176 1176 1176 1177 1177 1177 1178 1178 1178 1178 1179 1179
2537 1179 1179 1180 1180 1180 1180 1181 1181 1181 1182 1182 1182 1182 1183 1183 1183 1184 1184 1184 1184 1185 1185 1185 1185 1186 1186 1186 1187 1187 1187 1187 1188 1188 1188 1189 1189 1189 1190 1190 1190 1190 1191 1191 1191 1192 1192 1192 1192 1193 1193 1193 1194 1194 1194 1194 1195 1195 1195 1196 1196 1196 1196 1197 1197 1197 1198 1198 1198 1198
2527 1198 1199 1199 1199 1200 1200 1200 1200 1201 1201 1201 1202 1202 1202 1203 1203 1203 1203 1204 1204 1204 1205 1205 1205 1205 1206 1206 1206 1207 1207 1207 1207 1208 1208 1208 1209 1209 1209 1210 1210 1210 1210 1211 1211 1211 1212 1212 1212 1212 1213 1213 1213 1214 1214 1214 1215 1215 1215 1215 1216 1216 1216 1217 1217 1217 1218 1218 1218 1218
2516 1218 1219 1219 1219 1220 1220 1220 1221 1221 1221 1221 1222 1222 1222 1223 1223 1223 1224 1224 1224 1224 1225 1225 1225 1226 1226 1226 1227 1227 1227 1227 1228 1228 1228 1229 1229 1229 1230 1230 1230 1230 1231 1231 1231 1232 1232 1232 1233 1233 1233 1233 1234 1234 1234 1235 1235 1235 1236 1236 1236 1236 1237 1237 1237 1238 1238 1238 1239 1239
2506 1239 1239 1240 1240 1240 1240 1241 1241 1241 1242 1242 1242 1243 1243 1243 1244 1244 1244 1244 1245 1245 1245 1246 1246 1246 1247 1247 1247 1248 1248 1248 1248 1249 1249 1249 1250 1250 1250 1251 1251 1251 1252 1252 1252 1252 1253 1253 1253 1254 1254 1254 1255 1255 1255 1256 1256 1256 1257 1257 1257 1257 1258 1258 1258 1259 1259 1259 1260 1260
2496 1260 1260 1261 1261 1261 1262 1262 1262 1262 1263 1263 1263 1264 1264 1264 1265 1265 1265 1266 1266 1266 1267 1267 1267 1268 1268 1268 1268 1269 1269 1269 1270 1270 1270 1271 1271 1271 1272 1272 1272 1273 1273 1273 1274 1274 1274 1275 1275 1275 1275 1276 1276 1276 1277 1277 1277 1278 1278 1278 1279 1279 1279 1280 1280 1280 1281 1281 1281 1282
2485 1282 1282 1282 1283 1283 1283 1283 1284 1284 1284 1285 1285 1285 1286 1286 1286 1287 1287 1287 1288 1288 1288 1289 1289 1289 1290 1290 1290 1291 1291 1291 1292 1292 1292 1293 1293 1293 1294 1294 1294 1295 1295 1295 1295 1296 1296 1296 1297 1297 1297 1298 1298 1298 1299 1299 1299 1300 1300 1300 1301 1301 1301 1302 1302 1302 1303 1303 1303 1304
2475A304%%J%%J%%J%%J%%J%%J%%J%%J%%J%%J%%J%%J%%J%%J%%J%%J%%J%%J%%J%%J%%J%%J%%
2464A326J%%J%J%%J%%J%%J%%J%%J%%J%%J%%J%%J%%J%%J%%J%J%%J%%J%%J%%J%%J%%J%%J%J%
2454A350%J%%J%%J%%J%%J%%J%J%%J%%J%%J%%J%%J%%J%J%%J%%J%%J%%J%J%%J%%J%%J%%J%J%
2444A374%J%%J%%J%%J%J%%J%%J%%J%J%%J%%J%%J%J%%J%%J%%J%J%%J%%J%%J%J%%J%%J%%J%J
2433A399%%J%%J%J%%J%%J%%J%J%%J%%J%J%%J%%J%J%%J%%J%J%%J%%J%J%%J%%J%J%%J%%J%J%
2423A424%J%%J%J%%J%J%%J%%J%J%%J%%J%J%%J%J%%J%%J%J%%J%J%%J%%J%J%%J%J%%J%J%%J%
2413A450%J%J%%J%J%%J%J%%J%%J%J%%J%J%%J%J%%J%J%%J%J%%J%J%%J%J%%J%J%%J%J%%J%J%
2402A477%J%J%%J%J%%J%J%%J%J%%J%J%%J%J%%J%J%%J%J%%J%J%J%%J%J%%J%J%%J%J%%J%J%J
$$ plain form
2475 1304 1304 1304 1305 1305 1305 1306 1306 1306 1307 1307 1307 1308 1308 1308 1309 1309 1309 1310 1310 1310 1311 1311 1311 1312 1312 1312 1313 1313 1313 1314 1314 1314 1315 1315 1315 1316 1316 1316 1317 1317 1317 1318 1318 1318 1319 1319 1319 1320 1320 1320 1321 1321 1321 1322 1322 1322 1323 1323 1323 1324 1324 1324 1325 1325 1325 1326 1326 1326
2464 1326 1327 1327 1327 1328 1328 1329 1329 1329 1330 1330 1330 1331 1331 1331 1332 1332 1332 1333 1333 1333 1334 1334 1334 1335 1335 1335 1336 1336 1336 1337 1337 1337 1338 1338 1338 1339 1339 1339 1340 1340 1340 1341 1341 1342 1342 1342 1343 1343 1343 1344 1344 1344 1345 1345 1345 1346 1346 1346 1347 1347 1347 1348 1348 1348 1349 1349 1350 1350
2454 1350 1350 1351 1351 1351 1352 1352 1352 1353 1353 1353 1354 1354 1354 1355 1355 1355 1356 1356 1357 1357 1357 1358 1358 1358 1359 1359 1359 1360 1360 1360 1361 1361 1361 1362 1362 1362 1363 1363 1364 1364 1364 1365 1365 1365 1366 1366 1366 1367 1367 1367 1368 1368 1369 1369 1369 1370 1370 1370 1371 1371 1371 1372 1372 1372 1373 1373 1374 1374
2444 1374 1374 1375 1375 1375 1376 1376 1376 1377 1377 1377 1378 1378 1379 1379 1379 1380 1380 1380 1381 1381 1381 1382 1382 1383 1383 1383 1384 1384 1384 1385 1385 1385 1386 1386 1387 1387 1387 1388 1388 1388 1389 1389 1389 1390 1390 1391 1391 1391 1392 1392 1392 1393 1393 1393 1394 1394 1395 1395 1395 1396 1396 1396 1397 1397 1397 1398 1398 1399
2433 1399 1399 1399 1400 1400 1400 1401 1401 1402 1402 1402 1403 1403 1403 1404 1404 1404 1405 1405 1406 1406 1406 1407 1407 1407 1408 1408 1409 1409 1409 1410 1410 1410 1411 1411 1412 1412 1412 1413 1413 1413 1414 1414 1415 1415 1415 1416 1416 1416 1417 1417 1418 1418 1418 1419 1419 1419 1420 1420 1421 1421 1421 1422 1422 1422 1423 1423 1424 1424
2423 1424 1424 1425 1425 1425 1426 1426 1427 1427 1427 1428 1428 1429 1429 1429 1430 1430 1430 1431 1431 1432 1432 1432 1433 1433 1433 1434 1434 1435 1435 1435 1436 1436 1437 1437 1437 1438 1438 1438 1439 1439 1440 1440 1440 1441 1441 1442 1442 1442 1443 1443 1443 1444 1444 1445 1445 1445 1446 1446 1447 1447 1447 1448 1448 1449 1449 1449 1450 1450
2413 1450 1450 1451 1451 1452 1452 1452 1453 1453 1454 1454 1454 1455 1455 1456 1456 1456 1457 1457 1457 1458 1458 1459 1459 1459 1460 1460 1461 1461 1461 1462 1462 1463 1463 1463 1464 1464 1465 1465 1465 1466 1466 1467 1467 1467 1468 1468 1469 1469 1469 1470 1470 1471 1471 1471 1472 1472 1473 1473 1473 1474 1474 1475 1475 1475 1476 1476 1477 1477
2402 1477 1477 1478 1478 1479 1479 1479 1480 1480 1481 1481 1481 1482 1482 1483 1483 1483 1484 1484 1485 1485 1485 1486 1486 1487 1487 1487 1488 1488 1489 1489 1489 1490 1490 1491 1491 1491 1492 1492 1493 1493 1493 1494 1494 1495 1495 1496 1496 1496 1497 1497 1498 1498 1498 1499 1499 1500 1500 1500 1501 1501 1502 1502 1502 1503 1503 1504 1504 1505
2392A505%%J%J%%J%J%%J%J%J%%J%J%%J%J%J%%J%J%%J%J%J%%J%J%J%%J%J%%J%J%J%%J%J%J%
2381A533%J%J%J%%J%J%%J%J%J%%J%J%J%%J%J%J%%J%J%J%J%%J%J%J%%J%J%J%%J%J%J%%J%J%
2371A562J%J%%J%J%J%%J%J%J%J%%J%J%J%J%%J%J%J%J%%J%J%J%J%%J%J%J%J%%J%J%J%J%%J%
2361A592J%J%J%J%%J%J%J%J%J%%J%J%J%J%J%%J%J%J%J%J%%J%J%J%J%J%J%%J%J%J%J%J%J%%
2350A623J%J%J%J%J%J%%J%J%J%J%J%J%J%J%%J%J%J%J%J%J%J%J%%J%J%J%J%J%J%J%J%J%%J%
2340A655J%J%J%J%J%J%J%J%J%J%J%J%%J%J%J%J%J%J%J%J%J%J%J%J%J%J%J%J%J%J%%J%J%J%
2330A688J%J%J%J%J%J%J%J%J%J%J%J%J%J%J%J%J%J%J%J%J%J%J%J%J%J%J%J%J%J%J%J%J%J%
2319A722JJ%J%J%J%J%J%J%J%J%J%J%J%J%J%J%J%J%J%J%JJ%J%J%J%J%J%J%J%J%J%J%J%JJ%J
$$ plain form
2392 1505 1505 1505 1506 1506 1507 1507 1507 1508 1508 1509 1509 1509 1510 1510 1511 1511 1512 1512 1512 1513 1513 1514 1514 1514 1515 1515 1516 1516 1517 1517 1517 1518 1518 1519 1519 1519 1520 1520 1521 1521 1522 1522 1522 1523 1523 1524 1524 1525 1525 1525 1526 1526 1527 1527 1527 1528 1528 1529 1529 1530 1530 1530 1531 1531 1532 1532 1533 1533
2381 1533 1533 1534 1534 1535 1535 1536 1536 1536 1537 1537 1538 1538 1538 1539 1539 1540 1540 1541 1541 1541 1542 1542 1543 1543 1544 1544 1544 1545 1545 1546 1546 1547 1547 1547 1548 1548 1549 1549 1550 1550 1551 1551 1551 1552 1552 1553 1553 1554 1554 1554 1555 1555 1556 1556 1557 1557 1557 1558 1558 1559 1559 1560 1560 1560 1561 1561 1562 1562
2371 1562 1563 1563 1564 1564 1564 1565 1565 1566 1566 1567 1567 1567 1568 1568 1569 1569 1570 1570 1571 1571 1571 1572 1572 1573 1573 1574 1574 1575 1575 1575 1576 1576 1577 1577 1578 1578 1579 1579 1579 1580 1580 1581 1581 1582 1582 1583 1583 1583 1584 1584 1585 1585 1586 1586 1587 1587 1587 1588 1588 1589 1589 1590 1590 1591 1591 1591 1592 1592
2361 1592 1593 1593 1594 1594 1595 1595 1596 1596 1596 1597 1597 1598 1598 1599 1599 1600 1600 1601 1601 1601 1602 1602 1603 1603 1604 1604 1605 1605 1606 1606 1606 1607 1607 1608 1608 1609 1609 1610 1610 1611 1611 1611 1612 1612 1613 1613 1614 1614 1615 1615 1616 1616 1617 1617 1617 1618 1618 1619 1619 1620 1620 1621 1621 1622 1622 1623 1623 1623
2350 1623 1624 1624 1625 1625 1626 1626 1627 1627 1628 1628 1629 1629 1629 1630 1630 1631 1631 1632 1632 1633 1633 1634 1634 1635 1635 1636 1636 1637 1637 1637 1638 1638 1639 1639 1640 1640 1641 1641 1642 1642 1643 1643 1644 1644 1645 1645 1645 1646 1646 1647 1647 1648 1648 1649 1649 1650 1650 1651 1651 1652 1652 1653 1653 1654 1654 1654 1655 1655
2340 1655 1656 1656 1657 1657 1658 1658 1659 1659 1660 1660 1661 1661 1662 1662 1663 1663 1664 1664 1665 1665 1666 1666 1667 1667 1667 1668 1668 1669 1669 1670 1670 1671 1671 1672 1672 1673 1673 1674 1674 1675 1675 1676 1676 1677 1677 1678 1678 1679 1679 1680 1680 1681 1681 1682 1682 1683 1683 1684 1684 1685 1685 1685 1686 1686 1687 1687 1688 1688
2330 1688 1689 1689 1690 1690 1691 1691 1692 1692 1693 1693 1694 1694 1695 1695 1696 1696 1697 1697 1698 1698 1699 1699 1700 1700 1701 1701 1702 1702 1703 1703 1704 1704 1705 1705 1706 1706 1707 1707 1708 1708 1709 1709 1710 1710 1711 1711 1712 1712 1713 1713 1714 1714 1715 1715 1716 1716 1717 1717 1718 1718 1719 1719 1720 1720 1721 1721 1722 1722
2319 1722 1723 1724 1724 1725 1725 1726 1726 1727 1727 1728 1728 1729 1729 1730 1730 1731 1731 1732 1732 1733 1733 1734 1734 1735 1735 1736 1736 1737 1737 1738 1738 1739 1739 1740 1740 1741 1741 1742 1742 1743 1744 1744 1745 1745 1746 1746 1747 1747 1748 1748 1749 1749 1750 1750 1751 1751 1752 1752 1753 1753 1754 1754 1755 1755 1756 1757 1757 1758
2309A758%J%J%J%J%J%J%J%JJ%J%J%J%J%J%J%JJ%J%J%J%J%J%J%JJ%J%J%J%J%J%JJ%J%J%J%J
2298A794%J%JJ%J%J%J%J%JJ%J%J%J%J%JJ%J%J%J%J%JJ%J%J%J%JJ%J%J%J%JJ%J%J%J%JJ%J%
2288A831J%J%JJ%J%J%JJ%J%J%J%JJ%J%J%JJ%J%J%JJ%J%J%JJ%J%J%JJ%J%J%JJ%J%J%JJ%J%J
2278A870%JJ%J%JJ%J%J%JJ%J%J%JJ%J%JJ%J%J%JJ%J%JJ%J%JJ%J%JJ%J%J%JJ%J%JJ%J%JJ%J
2267A910%JJ%J%JJ%J%JJ%J%JJ%J%JJ%J%JJ%J%JJ%J%JJ%JJ%J%JJ%J%JJ%J%JJ%JJ%J%JJ%J%J
2257A951J%JJ%J%JJ%J%JJ%JJ%J%JJ%JJ%J%JJ%JJ%J%JJ%JJ%JJ%J%JJ%JJ%J%JJ%JJ%JJ%J%JJ
2246A994%JJ%JJ%J%JJ%JJ%JJ%JJ%JJ%J%JJ%JJ%JJ%JJ%JJ%J%JJ%JJ%JJ%JJ%JJ%JJ%JJ%JJ%J
2236B038J%JJ%JJ%JJ%JJ%J%JJ%JJ%JJJ%JJ%JJ%JJ%JJ%JJ%JJ%JJ%JJ%JJ%JJ%JJ%JJ%JJJ%JJ
$$ plain form
2309 1758 1758 1759 1759 1760 1760 1761 1761 1762 1762 1763 1763 1764 1764 1765 1765 1766 1767 1767 1768 1768 1769 1769 1770 1770 1771 1771 1772 1772 1773 1773 1774 1775 1775 1776 1776 1777 1777 1778 1778 1779 1779 1780 1780 1781 1781 1782 1783 1783 1784 1784 1785 1785 1786 1786 1787 1787 1788 1788 1789 1790 1790 1791 1791 1792 1792 1793 1793 1794
2298 1794 1794 1795 1795 1796 1797 1797 1798 1798 1799 1799 1800 1800 1801 1801 1802 1803 1803 1804 1804 1805 1805 1806 1806 1807 1807 1808 1809 1809 1810 1810 1811 1811 1812 1812 1813 1813 1814 1815 1815 1816 1816 1817 1817 1818 1818 1819 1820 1820 1821 1821 1822 1822 1823 1823 1824 1825 1825 1826 1826 1827 1827 1828 1828 1829 1830 1830 1831 1831
2288 1831 1832 1832 1833 1833 1834 1835 1835 1836 1836 1837 1837 1838 1839 1839 1840 1840 1841 1841 1842 1842 1843 1844 1844 1845 1845 1846 1846 1847 1848 1848 1849 1849 1850 1850 1851 1852 1852 1853 1853 1854 1854 1855 1856 1856 1857 1857 1858 1858 1859 1860 1860 1861 1861 1862 1862 1863 1864 1864 1865 1865 1866 1866 1867 1868 1868 1869 1869 1870
2278 1870 1870 1871 1872 1872 1873 1873 1874 1875 1875 1876 1876 1877 1877 1878 1879 1879 1880 1880 1881 1881 1882 1883 1883 1884 1884 1885 1886 1886 1887 1887 1888 1888 1889 1890 1890 1891 1891 1892 1893 1893 1894 1894 1895 1896 1896 1897 1897 1898 1899 1899 1900 1900 1901 1901 1902 1903 1903 1904 1904 1905 1906 1906 1907 1907 1908 1909 1909 1910
2267 1910 1910 1911 1912 1912 1913 1913 1914 1915 1915 1916 1916 1917 1918 1918 1919 1919 1920 1921 1921 1922 1922 1923 1924 1924 1925 1925 1926 1927 1927 1928 1928 1929 1930 1930 1931 1931 1932 1933 1933 1934 1935 1935 1936 1936 1937 1938 1938 1939 1939 1940 1941 1941 1942 1942 1943 1944 1944 1945 1946 1946 1947 1947 1948 1949 1949 1950 1950 1951
2257 1951 1952 1952 1953 1954 1954 1955 1955 1956 1957 1957 1958 1958 1959 1960 1960 1961 1962 1962 1963 1963 1964 1965 1965 1966 1967 1967 1968 1968 1969 1970 1970 1971 1972 1972 1973 1973 1974 1975 1975 1976 1977 1977 1978 1979 1979 1980 1980 1981 1982 1982 1983 1984 1984 1985 1985 1986 1987 1987 1988 1989 1989 1990 1991 1991 1992 1992 1993 1994
2246 1994 1994 1995 1996 1996 1997 1998 1998 1999 1999 2000 2001 2001 2002 2003 2003 2004 2005 2005 2006 2007 2007 2008 2009 2009 2010 2010 2011 2012 2012 2013 2014 2014 2015 2016 2016 2017 2018 2018 2019 2020 2020 2021 2021 2022 2023 2023 2024 2025 2025 2026 2027 2027 2028 2029 2029 2030 2031 2031 2032 2033 2033 2034 2035 2035 2036 2037 2037 2038
2236 2038 2039 2039 2040 2041 2041 2042 2043 2043 2044 2045 2045 2046 2047 2047 2048 2048 2049 2050 2050 2051 2052 2052 2053 2054 2055 2055 2056 2057 2057 2058 2059 2059 2060 2061 2061 2062 2063 2063 2064 2065 2065 2066 2067 2067 2068 2069 2069 2070 2071 2071 2072 2073 2073 2074 2075 2075 2076 2077 2077 2078 2079 2079 2080 2081 2082 2082 2083 2084
2226B084%JJ%JJ%JJ%JJJ%JJ%JJ%JJ%JJ%JJJ%JJ%JJ%JJJ%JJ%JJ%JJJ%JJ%JJ%JJJ%JJ%JJ%JJ
2215B131J%JJ%JJJ%JJ%JJJ%JJ%JJJ%JJ%JJJ%JJ%JJJ%JJJ%JJ%JJJ%JJ%JJJ%JJJ%JJJ%JJ%JJ
2205B180J%JJJ%JJJ%JJ%JJJ%JJJ%JJJ%JJJ%JJJ%JJJ%JJJ%JJJ%JJJ%JJJ%JJJ%JJJ%JJJ%JJJ
2195B231%JJJJ%JJJ%JJJ%JJJ%JJJJ%JJJ%JJJ%JJJJ%JJJ%JJJJ%JJJ%JJJJ%JJJJ%JJJ%JJJJ%
2184B283JJJJ%JJJJ%JJJ%JJJJ%JJJJ%JJJJ%JJJJ%JJJJJ%JJJJ%JJJJ%JJJJ%JJJJJ%JJJJ%JJ
2174B338JJJ%JJJJ%JJJJJ%JJJJJ%JJJJJ%JJJJJ%JJJJJ%JJJJJ%JJJJJ%JJJJJ%JJJJJJ%JJJJ
2163B395JJ%JJJJJ%JJJJJJ%JJJJJJ%JJJJJJJ%JJJJJJ%JJJJJJJ%JJJJJJJ%JJJJJJJ%JJJJJJ
2153B454JJ%JJJJJJJ%JJJJJJJJJ%JJJJJJJJ%JJJJJJJJJ%JJJJJJJJJJ%JJJJJJJJJJ%JJJJJJ
$$ plain form
2226 2084 2084 2085 2086 2086 2087 2088 2088 2089 2090 2090 2091 2092 2093 2093 2094 2095 2095 2096 2097 2097 2098 2099 2099 2100 2101 2101 2102 2103 2104 2104 2105 2106 2106 2107 2108 2108 2109 2110 2111 2111 2112 2113 2113 2114 2115 2115 2116 2117 2118 2118 2119 2120 2120 2121 2122 2122 2123 2124 2125 2125 2126 2127 2127 2128 2129 2129 2130 2131
2215 2131 2132 2132 2133 2134 2134 2135 2136 2137 2137 2138 2139 2139 2140 2141 2142 2142 2143 2144 2144 2145 2146 2147 2147 2148 2149 2149 2150 2151 2152 2152 2153 2154 2154 2155 2156 2157 2157 2158 2159 2160 2160 2161 2162 2162 2163 2164 2165 2165 2166 2167 2167 2168 2169 2170 2170 2171 2172 2173 2173 2174 2175 2176 2176 2177 2178 2178 2179 2180
2205 2180 2181 2181 2182 2183 2184 2184 2185 2186 2187 2187 2188 2189 2189 2190 2191 2192 2192 2193 2194 2195 2195 2196 2197 2198 2198 2199 2200 2201 2201 2202 2203 2204 2204 2205 2206 2207 2207 2208 2209 2210 2210 2211 2212 2213 2213 2214 2215 2216 2216 2217 2218 2219 2219 2220 2221 2222 2222 2223 2224 2225 2225 2226 2227 2228 2228 2229 2230 2231
2195 2231 2231 2232 2233 2234 2235 2235 2236 2237 2238 2238 2239 2240 2241 2241 2242 2243 2244 2244 2245 2246 2247 2248 2248 2249 2250 2251 2251 2252 2253 2254 2254 2255 2256 2257 2258 2258 2259 2260 2261 2261 2262 2263 2264 2265 2265 2266 2267 2268 2268 2269 2270 2271 2272 2272 2273 2274 2275 2276 2276 2277 2278 2279 2279 2280 2281 2282 2283 2283
2184 2283 2284 2285 2286 2287 2287 2288 2289 2290 2291 2291 2292 2293 2294 2294 2295 2296 2297 2298 2298 2299 2300 2301 2302 2302 2303 2304 2305 2306 2306 2307 2308 2309 2310 2310 2311 2312 2313 2314 2315 2315 2316 2317 2318 2319 2319 2320 2321 2322 2323 2323 2324 2325 2326 2327 2327 2328 2329 2330 2331 2332 2332 2333 2334 2335 2336 2336 2337 2338
2174 2338 2339 2340 2341 2341 2342 2343 2344 2345 2345 2346 2347 2348 2349 2350 2350 2351 2352 2353 2354 2355 2355 2356 2357 2358 2359 2360 2360 2361 2362 2363 2364 2365 2365 2366 2367 2368 2369 2370 2370 2371 2372 2373 2374 2375 2375 2376 2377 2378 2379 2380 2380 2381 2382 2383 2384 2385 2385 2386 2387 2388 2389 2390 2391 2391 2392 2393 2394 2395
2163 2395 2396 2397 2397 2398 2399 2400 2401 2402 2402 2403 2404 2405 2406 2407 2408 2408 2409 2410 2411 2412 2413 2414 2414 2415 2416 2417 2418 2419 2420 2421 2421 2422 2423 2424 2425 2426 2427 2427 2428 2429 2430 2431 2432 2433 2434 2434 2435 2436 2437 2438 2439 2440 2441 2441 2442 2443 2444 2445 2446 2447 2448 2448 2449 2450 2451 2452 2453 2454
2153 2454 2455 2456 2456 2457 2458 2459 2460 2461 2462 2463 2463 2464 2465 2466 2467 2468 2469 2470 2471 2472 2472 2473 2474 2475 2476 2477 2478 2479 2480 2480 2481 2482 2483 2484 2485 2486 2487 2488 2489 2489 2490 2491 2492 2493 2494 2495 2496 2497 2498 2499 2499 2500 2501 2502 2503 2504 2505 2506 2507 2508 2509 2509 2510 2511 2512 2513 2514 2515
2143B515JJJJJJ%JJJJJJJJJJJJ%JJJJJJJJJJJJJJ%JJJJJJJJJJJJJJJJ%JJJJJJJJJJJJJJJJ
2132B579JJJ%JJJJJJJJJJJJJJJJJJJJJJJJJJJJ%JJJJJJJJJJJJJJJJJJJJJJJJJJJJJJJJJJJ
2122B645JJJJJJJJJJJJJJJJJJJJJJJJJJJJJJJJJJJJJJJJJJJJJJJJJJJJJJKJJJJJJJJJJJJJ
2112B714JJJJJJJJJJJJJJKJJJJJJJJJJJJJJJJJJJKJJJJJJJJJJJJJJJKJJJJJJJJJJJJJKJJJ
2101B786JJJJJJJJKJJJJJJJJJJJKJJJJJJJJJKJJJJJJJJJKJJJJJJJJKJJJJJJJJKJJJJJJJKJ
2091B861JJJJJJKJJJJJJKJJJJJJJKJJJJJJKJJJJJJKJJJJJKJJJJJKJJJJJJKJJJJJKJJJJJKJ
2080B939JJJKJJJJJKJJJJKJJJJJKJJJJKJJJJKJJJJKJJJJKJJJJKJJJJKJJJKJJJJKJJJKJJJJ
2070C020KJJJKJJJJKJJJKJJJKJJJKJJJKJJJKJJJKJJJKJJJKJJJKJJJKJJKJJJKJJJKJJKJJJK
$$ plain form
2143 2515 2516 2517 2518 2519 2520 2521 2521 2522 2523 2524 2525 2526 2527 2528 2529 2530 2531 2532 2533 2533 2534 2535 2536 2537 2538 2539 2540 2541 2542 2543 2544 2545 2546 2547 2547 2548 2549 2550 2551 2552 2553 2554 2555 2556 2557 2558 2559 2560 2561 2562 2563 2563 2564 2565 2566 2567 2568 2569 2570 2571 2572 2573 2574 2575 2576 2577 2578 2579
2132 2579 2580 2581 2582 2582 2583 2584 2585 2586 2587 2588 2589 2590 2591 2592 2593 2594 2595 2596 2597 2598 2599 2600 2601 2602 2603 2604 2605 2606 2607 2608 2609 2610 2610 2611 2612 2613 2614 2615 2616 2617 2618 2619 2620 2621 2622 2623 2624 2625 2626 2627 2628 2629 2630 2631 2632 2633 2634 2635 2636 2637 2638 2639 2640 2641 2642 2643 2644 2645
2122 2645 2646 2647 2648 2649 2650 2651 2652 2653 2654 2655 2656 2657 2658 2659 2660 2661 2662 2663 2664 2665 2666 2667 2668 2669 2670 2671 2672 2673 2674 2675 2676 2677 2678 2679 2680 2681 2682 2683 2684 2685 2686 2687 2688 2689 2690 2691 2692 2693 2694 2695 2696 2697 2698 2699 2701 2702 2703 2704 2705 2706 2707 2708 2709 2710 2711 2712 2713 2714
2112 2714 2715 2716 2717 2718 2719 2720 2721 2722 2723 2724 2725 2726 2727 2728 2730 2731 2732 2733 2734 2735 2736 2737 2738 2739 2740 2741 2742 2743 2744 2745 2746 2747 2748 2749 2751 2752 2753 2754 2755 2756 2757 2758 2759 2760 2761 2762 2763 2764 2765 2766 2768 2769 2770 2771 2772 2773 2774 2775 2776 2777 2778 2779 2780 2781 2783 2784 2785 2786
2101 2786 2787 2788 2789 2790 2791 2792 2793 2794 2796 2797 2798 2799 2800 2801 2802 2803 2804 2805 2806 2807 2809 2810 2811 2812 2813 2814 2815 2816 2817 2818 2820 2821 2822 2823 2824 2825 2826 2827 2828 2829 2831 2832 2833 2834 2835 2836 2837 2838 2839 2841 2842 2843 2844 2845 2846 2847 2848 2849 2851 2852 2853 2854 2855 2856 2857 2858 2860 2861
2091 2861 2862 2863 2864 2865 2866 2867 2869 2870 2871 2872 2873 2874 2875 2877 2878 2879 2880 2881 2882 2883 2884 2886 2887 2888 2889 2890 2891 2892 2894 2895 2896 2897 2898 2899 2900 2902 2903 2904 2905 2906 2907 2909 2910 2911 2912 2913 2914 2916 2917 2918 2919 2920 2921 2922 2924 2925 2926 2927 2928 2929 2931 2932 2933 2934 2935 2936 2938 2939
2080 2939 2940 2941 2942 2944 2945 2946 2947 2948 2949 2951 2952 2953 2954 2955 2957 2958 2959 2960 2961 2962 2964 2965 2966 2967 2968 2970 2971 2972 2973 2974 2976 2977 2978 2979 2980 2982 2983 2984 2985 2986 2988 2989 2990 2991 2992 2994 2995 2996 2997 2998 3000 3001 3002 3003 3005 3006 3007 3008 3009 3011 3012 3013 3014 3016 3017 3018 3019 3020
2070 3020 3022 3023 3024 3025 3027 3028 3029 3030 3031 3033 3034 3035 3036 3038 3039 3040 3041 3043 3044 3045 3046 3048 3049 3050 3051 3053 3054 3055 3056 3058 3059 3060 3061 3063 3064 3065 3066 3068 3069 3070 3071 3073 3074 3075 3076 3078 3079 3080 3081 3083 3084 3085 3087 3088 3089 3090 3092 3093 3094 3095 3097 3098 3099 3101 3102 3103 3104 3106
2060C106JJJKJJKJJJKJJKJJKJJJKJJKJJKJJJKJJKJJKJJKJJKJJJKJJKJJKJJKJJKJJKJJKJJK
2049C195JJKJJKJJKJKJJKJJKJJKJJKJKJJKJJKJJKJKJJKJJKJKJJKJJKJKJJKJKJJKJKJJKJKJ
2039C288JKJKJJKJKJJKJKJKJJKJKJJKJKJKJJKJKJKJKJJKJKJKJJKJKJKJKJKJJKJKJKJKJKJK
2029C386JKJJKJKJKJKJKJKJKJKJKJKJKJKJKJKJKJKJKJKJKJKJKJKJKJKJKJKJKKJKJKJKJKJK
2018C488JKKJKJKJKJKJKKJKJKJKJKKJKJKJKKJKJKJKKJKJKKJKJKKJKJKJKKJKJKKJKKJKJKKJ
2008C595KJKKJKKJKJKKJKKJKKJKJKKJKKJKKJKKJKKJKJKKJKKJKKJKKKJKKJKKJKKJKKJKKJKK
1997C708KJKKJKKKJKKJKKKJKKJKKKJKKJKKKJKKKJKKKJKKKJKKKJKKKJKKKJKKKKJKKKJKKKKJ
1987C826KKKJKKKKJKKKKJKKKKJKKKKKJKKKKKJKKKKJKKKKKKJKKKKKJKKKKKKJKKKKKKKJKKKK
$$ plain form
2060 3106 3107 3108 3109 3111 3112 3113 3115 3116 3117 3118 3120 3121 3122 3124 3125 3126 3128 3129 3130 3131 3133 3134 3135 3137 3138 3139 3141 3142 3143 3144 3146 3147 3148 3150 3151 3152 3154 3155 3156 3158 3159 3160 3162 3163 3164 3165 3167 3168 3169 3171 3172 3173 3175 3176 3177 3179 3180 3181 3183 3184 3185 3187 3188 3189 3191 3192 3193 3195
2049 3195 3196 3197 3199 3200 3201 3203 3204 3205 3207 3208 3210 3211 3212 3214 3215 3216 3218 3219 3220 3222 3223 3224 3226 3227 3229 3230 3231 3233 3234 3235 3237 3238 3239 3241 3242 3244 3245 3246 3248 3249 3250 3252 3253 3255 3256 3257 3259 3260 3261 3263 3264 3266 3267 3268 3270 3271 3273 3274 3275 3277 3278 3280 3281 3282 3284 3285 3287 3288
2039 3288 3289 3291 3292 3294 3295 3296 3298 3299 3301 3302 3303 3305 3306 3308 3309 3311 3312 3313 3315 3316 3318 3319 3320 3322 3323 3325 3326 3328 3329 3330 3332 3333 3335 3336 3338 3339 3341 3342 3343 3345 3346 3348 3349 3351 3352 3353 3355 3356 3358 3359 3361 3362 3364 3365 3367 3368 3369 3371 3372 3374 3375 3377 3378 3380 3381 3383 3384 3386
2029 3386 3387 3389 3390 3391 3393 3394 3396 3397 3399 3400 3402 3403 3405 3406 3408 3409 3411 3412 3414 3415 3417 3418 3420 3421 3423 3424 3426 3427 3429 3430 3432 3433 3435 3436 3438 3439 3441 3442 3444 3445 3447 3448 3450 3451 3453 3454 3456 3457 3459 3460 3462 3463 3465 3466 3468 3469 3471 3473 3474 3476 3477 3479 3480 3482 3483 3485 3486 3488
2018 3488 3489 3491 3493 3494 3496 3497 3499 3500 3502 3503 3505 3506 3508 3510 3511 3513 3514 3516 3517 3519 3520 3522 3524 3525 3527 3528 3530 3531 3533 3535 3536 3538 3539 3541 3542 3544 3546 3547 3549 3550 3552 3554 3555 3557 3558 3560 3562 3563 3565 3566 3568 3569 3571 3573 3574 3576 3577 3579 3581 3582 3584 3586 3587 3589 3590 3592 3594 3595
2008 3595 3597 3598 3600 3602 3603 3605 3607 3608 3610 3611 3613 3615 3616 3618 3620 3621 3623 3625 3626 3628 3629 3631 3633 3634 3636 3638 3639 3641 3643 3644 3646 3648 3649 3651 3653 3654 3656 3657 3659 3661 3662 3664 3666 3667 3669 3671 3672 3674 3676 3678 3679 3681 3683 3684 3686 3688 3689 3691 3693 3694 3696 3698 3699 3701 3703 3704 3706 3708
1997 3708 3710 3711 3713 3715 3716 3718 3720 3722 3723 3725 3727 3728 3730 3732 3734 3735 3737 3739 3740 3742 3744 3746 3747 3749 3751 3752 3754 3756 3758 3759 3761 3763 3765 3766 3768 3770 3772 3773 3775 3777 3779 3780 3782 3784 3786 3787 3789 3791 3793 3794 3796 3798 3800 3801 3803 3805 3807 3809 3810 3812 3814 3816 3817 3819 3821 3823 3825 3826
1987 3826 3828 3830 3832 3833 3835 3837 3839 3841 3842 3844 3846 3848 3850 3851 3853 3855 3857 3859 3860 3862 3864 3866 3868 3870 3871 3873 3875 3877 3879 3881 3882 3884 3886 3888 3890 3891 3893 3895 3897 3899 3901 3903 3904 3906 3908 3910 3912 3914 3915 3917 3919 3921 3923 3925 3927 3928 3930 3932 3934 3936 3938 3940 3942 3943 3945 3947 3949 3951
1977C951KKKJKKKKKKKKJKKKKKKKKKKJKKKKKKKKKKKKJKKKKKKKKKKKKKKKKKKJKKKKKKKKKKKK
1966D082KKKKKKKKKKKKKKKKKKKKKKKKKKKKKKKKKKKKKLKKKKKKKKKKKKKKKKKKLKKKKKKKKKKK
1956D220LKKKKKKKKKLKKKKKKKKLKKKKKKKLKKKKKKLKKKKKLKKKKKLKKKKKLKKKKKLKKKKLKKKK
1945D366LKKKLKKKKLKKKLKKKKLKKKLKKKLKKKLKKLKKKLKKKLKKLKKKLKKLKKLKKLKKKLKKLKKL
1935D521KKLKKLKKLKLKKLKKLKKLKLKKLKKLKLKKLKLKKLKLKKLKLKLKKLKLKLKLKKLKLKLKLKLK
1925D684KLKLKLKLKLKLKLKLKLKLKLKLKLKLLKLKLKLKLKLLKLKLKLKLLKLKLLKLKLKLLKLLKLKL
1914D857LKLKLLKLLKLLKLLKLKLLKLLKLLLKLLKLLKLLKLLLKLLKLLLKLLLKLLLKLLLKLLLKLLLK
1904E040LLLLKLLLLKLLLLKLLLLLKLLLLLKLLLLLLKLLLLLLLKLLLLLLLLLKLLLLLLLLLLLLLLKL
$$ plain form
1977 3951 3953 3955 3957 3958 3960 3962 3964 3966 3968 3970 3972 3974 3975 3977 3979 3981 3983 3985 3987 3989 3991 3993 3995 3996 3998 4000 4002 4004 4006 4008 4010 4012 4014 4016 4018 4020 4021 4023 4025 4027 4029 4031 4033 4035 4037 4039 4041 4043 4045 4047 4049 4051 4053 4055 4057 4058 4060 4062 4064 4066 4068 4070 4072 4074 4076 4078 4080 4082
1966 4082 4084 4086 4088 4090 4092 4094 4096 4098 4100 4102 4104 4106 4108 4110 4112 4114 4116 4118 4120 4122 4124 4126 4128 4130 4132 4134 4136 4138 4140 4142 4144 4146 4148 4150 4152 4154 4156 4159 4161 4163 4165 4167 4169 4171 4173 4175 4177 4179 4181 4183 4185 4187 4189 4191 4193 4195 4198 4200 4202 4204 4206 4208 4210 4212 4214 4216 4218 4220
1956 4220 4223 4225 4227 4229 4231 4233 4235 4237 4239 4241 4244 4246 4248 4250 4252 4254 4256 4258 4260 4263 4265 4267 4269 4271 4273 4275 4277 4280 4282 4284 4286 4288 4290 4292 4295 4297 4299 4301 4303 4305 4308 4310 4312 4314 4316 4318 4321 4323 4325 4327 4329 4331 4334 4336 4338 4340 4342 4344 4347 4349 4351 4353 4355 4358 4360 4362 4364 4366
1945 4366 4369 4371 4373 4375 4378 4380 4382 4384 4386 4389 4391 4393 4395 4398 4400 4402 4404 4406 4409 4411 4413 4415 4418 4420 4422 4424 4427 4429 4431 4433 4436 4438 4440 4443 4445 4447 4449 4452 4454 4456 4458 4461 4463 4465 4468 4470 4472 4474 4477 4479 4481 4484 4486 4488 4491 4493 4495 4498 4500 4502 4504 4507 4509 4511 4514 4516 4518 4521
1935 4521 4523 4525 4528 4530 4532 4535 4537 4539 4542 4544 4547 4549 4551 4554 4556 4558 4561 4563 4565 4568 4570 4573 4575 4577 4580 4582 4584 4587 4589 4592 4594 4596 4599 4601 4604 4606 4608 4611 4613 4616 4618 4620 4623 4625 4628 4630 4633 4635 4637 4640 4642 4645 4647 4650 4652 4655 4657 4659 4662 4664 4667 4669 4672 4674 4677 4679 4682 4684
1925 4684 4686 4689 4691 4694 4696 4699 4701 4704 4706 4709 4711 4714 4716 4719 4721 4724 4726 4729 4731 4734 4736 4739 4741 4744 4746 4749 4751 4754 4757 4759 4762 4764 4767 4769 4772 4774 4777 4779 4782 4785 4787 4790 4792 4795 4797 4800 4802 4805 4808 4810 4813 4815 4818 4821 4823 4826 4828 4831 4833 4836 4839 4841 4844 4847 4849 4852 4854 4857
1914 4857 4860 4862 4865 4867 4870 4873 4875 4878 4881 4883 4886 4889 4891 4894 4897 4899 4902 4904 4907 4910 4912 4915 4918 4920 4923 4926 4929 4931 4934 4937 4939 4942 4945 4947 4950 4953 4955 4958 4961 4964 4966 4969 4972 4974 4977 4980 4983 4985 4988 4991 4994 4996 4999 5002 5005 5007 5010 5013 5016 5018 5021 5024 5027 5029 5032 5035 5038 5040
1904 5040 5043 5046 5049 5052 5054 5057 5060 5063 5066 5068 5071 5074 5077 5080 5082 5085 5088 5091 5094 5097 5099 5102 5105 5108 5111 5114 5116 5119 5122 5125 5128 5131 5134 5136 5139 5142 5145 5148 5151 5154 5157 5159 5162 5165 5168 5171 5174 5177 5180 5183 5186 5188 5191 5194 5197 5200 5203 5206 5209 5212 5215 5218 5221 5224 5227 5230 5232 5235
1894E235LLLLLLLLLLLLLLLLLLLLLLLLLLLLLLLLLMLLLLLLLLLLLLLMLLLLLLLLLMLLLLLLLMLL
1883E443LLLMLLLLLMLLLLLMLLLLMLLLMLLLLMLLLMLLLMLLMLLLMLLLMLLMLLMLLMLLMLLMLLML
1873E664LMLLMLMLLMLMLLMLMLLMLMLMLLMLMLMLMLMLMLLMLMLMLMLMMLMLMLMLMLMLMMLMLMLM
1862E900MLMLMMLMMLMLMMLMMLMMLMMLMMLMMLMMLMMMLMMLMMMLMMMLMMMMLMMMMLMMMMLMMMMM
1852F153LMMMMMMLMMMMMMMLMMMMMMMMMMMMMMMLMMMMMMMMMMMMMMMNMMMMMMMMMMMMMMNMMMMM
1842F423MMMNMMMMMMNMMMMNMMMMNMMMMNMMMNMMMNMMMNMMNMMNMMNMMNMMNMMNMMNMNMMNMNMM
1831F713NMNMNMNMNMMNMNMNMNMNNMNMNMNMNNMNMNMNNMNMNNMNNMNNMNNMNNMNNNMNNMNNNMNN
1821G026NNMNNNNMNNNNMNNNNNNMNNNNNNNNNMNNNNNNNNNNNNNNNNNNNNNNNNONNNNNNNNNONNN
$$ plain form
1894 5235 5238 5241 5244 5247 5250 5253 5256 5259 5262 5265 5268 5271 5274 5277 5280 5283 5286 5289 5292 5295 5298 5301 5304 5307 5310 5313 5316 5319 5322 5325 5328 5331 5334 5338 5341 5344 5347 5350 5353 5356 5359 5362 5365 5368 5371 5374 5377 5381 5384 5387 5390 5393 5396 5399 5402 5405 5408 5412 5415 5418 5421 5424 5427 5430 5433 5437 5440 5443
1883 5443 5446 5449 5452 5456 5459 5462 5465 5468 5471 5475 5478 5481 5484 5487 5490 5494 5497 5500 5503 5506 5510 5513 5516 5519 5523 5526 5529 5532 5535 5539 5542 5545 5548 5552 5555 5558 5561 5565 5568 5571 5575 5578 5581 5584 5588 5591 5594 5597 5601 5604 5607 5611 5614 5617 5621 5624 5627 5631 5634 5637 5641 5644 5647 5651 5654 5657 5661 5664
1873 5664 5667 5671 5674 5677 5681 5684 5688 5691 5694 5698 5701 5705 5708 5711 5715 5718 5722 5725 5728 5732 5735 5739 5742 5746 5749 5752 5756 5759 5763 5766 5770 5773 5777 5780 5784 5787 5791 5794 5797 5801 5804 5808 5811 5815 5818 5822 5825 5829 5833 5836 5840 5843 5847 5850 5854 5857 5861 5864 5868 5871 5875 5879 5882 5886 5889 5893 5896 5900
1862 5900 5904 5907 5911 5914 5918 5922 5925 5929 5933 5936 5940 5943 5947 5951 5954 5958 5962 5965 5969 5973 5976 5980 5984 5987 5991 5995 5998 6002 6006 6009 6013 6017 6020 6024 6028 6032 6035 6039 6043 6046 6050 6054 6058 6061 6065 6069 6073 6076 6080 6084 6088 6092 6095 6099 6103 6107 6111 6114 6118 6122 6126 6130 6133 6137 6141 6145 6149 6153
1852 6153 6156 6160 6164 6168 6172 6176 6180 6183 6187 6191 6195 6199 6203 6207 6211 6214 6218 6222 6226 6230 6234 6238 6242 6246 6250 6254 6258 6262 6266 6270 6274 6277 6281 6285 6289 6293 6297 6301 6305 6309 6313 6317 6321 6325 6329 6333 6337 6342 6346 6350 6354 6358 6362 6366 6370 6374 6378 6382 6386 6390 6394 6398 6403 6407 6411 6415 6419 6423
1842 6423 6427 6431 6435 6440 6444 6448 6452 6456 6460 6464 6469 6473 6477 6481 6485 6490 6494 6498 6502 6506 6511 6515 6519 6523 6527 6532 6536 6540 6544 6549 6553 6557 6561 6566 6570 6574 6578 6583 6587 6591 6596 6600 6604 6609 6613 6617 6622 6626 6630 6635 6639 6643 6648 6652 6656 6661 6665 6669 6674 6678 6683 6687 6691 6696 6700 6705 6709 6713
1831 6713 6718 6722 6727 6731 6736 6740 6745 6749 6754 6758 6762 6767 6771 6776 6780 6785 6789 6794 6798 6803 6808 6812 6817 6821 6826 6830 6835 6839 6844 6849 6853 6858 6862 6867 6871 6876 6881 6885 6890 6894 6899 6904 6908 6913 6918 6922 6927 6932 6936 6941 6946 6950 6955 6960 6964 6969 6974 6979 6983 6988 6993 6997 7002 7007 7012 7016 7021 7026
1821 7026 7031 7036 7040 7045 7050 7055 7060 7064 7069 7074 7079 7084 7088 7093 7098 7103 7108 7113 7118 7122 7127 7132 7137 7142 7147 7152 7157 7162 7167 7171 7176 7181 7186 7191 7196 7201 7206 7211 7216 7221 7226 7231 7236 7241 7246 7251 7256 7261 7266 7271 7276 7281 7286 7291 7297 7302 7307 7312 7317 7322 7327 7332 7337 7342 7348 7353 7358 7363
1811G363NNNONNNNONNNNONNNONNNONNONNNONNONONNONNONONNONONONNONONONONONONOONON
1800G727ONOONONOONOONOONOONOONOOONOOONOOOONOOOOONOOOOOOONOOOOOOOOOOOOOOOOOOO
1790H122OOOOOOOPOOOOOOPOOOOOPOOOOPOOOPOOPOOPOOPOOPOOPOPOOPOPOPOPOPOPOPOPOPOP
1779H551OPPOPPOPOPPOPPPOPPOPPPOPPPPOPPPPPPOPPPPPPPPPPPPPPPPPPPPPPPPPPPQPPPPP
1769I018QPPPPQPPPQPPQPPPQPQPPQPPQPQPQPQPQPQPQPQPQPQQPQQPQQPQQPQQPQQQQPQQQQPQ
1759I529QQQQQQQQQQPQQQQRQQQQQQQQQQRQQQQRQQQQRQQRQQRQQRQQRQRQRQRQRQRQRQRQRRQR
1748A0090QRRQRRRQRRRQRRRRQRRRRRRRRRRRRRRRRRRRRRRRJ0RRRRRJ0RRJ0RRRJ0RRJ0RJ0RR
1739A0640J0RJ0RJ0RJ0RJ0RJ0J0RJ0RJ0J0RJ0J0J0RJ0J0J0RJ0J0J0J0RJ0J0J0J0J0J0J0J0
$$ plain form
1811 7363 7368 7373 7378 7384 7389 7394 7399 7404 7410 7415 7420 7425 7430 7436 7441 7446 7451 7457 7462 7467 7472 7478 7483 7488 7494 7499 7504 7509 7515 7520 7525 7531 7536 7542 7547 7552 7558 7563 7568 7574 7579 7585 7590 7595 7601 7606 7612 7617 7623 7628 7633 7639 7644 7650 7655 7661 7666 7672 7677 7683 7688 7694 7699 7705 7711 7716 7722 7727
1800 7727 7733 7738 7744 7750 7755 7761 7766 7772 7778 7783 7789 7795 7800 7806 7812 7817 7823 7829 7834 7840 7846 7851 7857 7863 7869 7874 7880 7886 7892 7897 7903 7909 7915 7921 7926 7932 7938 7944 7950 7956 7961 7967 7973 7979 7985 7991 7997 8003 8008 8014 8020 8026 8032 8038 8044 8050 8056 8062 8068 8074 8080 8086 8092 8098 8104 8110 8116 8122
1790 8122 8128 8134 8140 8146 8152 8158 8164 8171 8177 8183 8189 8195 8201 8207 8214 8220 8226 8232 8238 8244 8251 8257 8263 8269 8275 8282 8288 8294 8300 8307 8313 8319 8326 8332 8338 8345 8351 8357 8364 8370 8376 8383 8389 8395 8402 8408 8415 8421 8427 8434 8440 8447 8453 8460 8466 8473 8479 8486 8492 8499 8505 8512 8518 8525 8531 8538 8544 8551
1779 8551 8557 8564 8571 8577 8584 8591 8597 8604 8610 8617 8624 8630 8637 8644 8651 8657 8664 8671 8677 8684 8691 8698 8704 8711 8718 8725 8732 8738 8745 8752 8759 8766 8773 8780 8786 8793 8800 8807 8814 8821 8828 8835 8842 8849 8856 8863 8870 8877 8884 8891 8898 8905 8912 8919 8926 8933 8940 8947 8954 8961 8968 8975 8983 8990 8997 9004 9011 9018
1769 9018 9026 9033 9040 9047 9054 9062 9069 9076 9083 9091 9098 9105 9113 9120 9127 9134 9142 9149 9157 9164 9171 9179 9186 9193 9201 9208 9216 9223 9231 9238 9246 9253 9261 9268 9276 9283 9291 9298 9306 9313 9321 9328 9336 9344 9351 9359 9367 9374 9382 9390 9397 9405 9413 9420 9428 9436 9443 9451 9459 9467 9475 9482 9490 9498 9506 9514 9521 9529
1759 9529 9537 9545 9553 9561 9569 9577 9585 9593 9601 9609 9616 9624 9632 9640 9648 9657 9665 9673 9681 9689 9697 9705 9713 9721 9729 9737 9746 9754 9762 9770 9778 9787 9795 9803 9811 9819 9828 9836 9844 9853 9861 9869 9878 9886 9894 9903 9911 9919 9928 9936 9945 9953 9962 9970 9979 9987 9996 10004 10013 10021 10030 10038 10047 10055 10064 10073 10081 10090
1748 10090 10098 10107 10116 10124 10133 10142 10151 10159 10168 10177 10186 10194 10203 10212 10221 10230 10238 10247 10256 10265 10274 10283 10292 10301 10310 10319 10328 10337 10346 10355 10364 10373 10382 10391 10400 10409 10418 10427 10436 10445 10455 10464 10473 10482 10491 10500 10510 10519 10528 10538 10547 10556 10565 10575 10584 10593 10603 10612 10622 10631 10640
1739 10640 10650 10659 10669 10678 10688 10697 10707 10716 10726 10735 10745 10755 10764 10774 10783 10793 10803 10812 10822 10832 10842 10851 10861 10871 10881 10890 10900 10910 10920 10930 10939 10949 10959 10969 10979 10989 10999 11009 11019
1733A1019J0J0J0J0J0J0J0J0J0J1J0J0J0J0J0J1J0J0J0J1J0J0J1J0J0J1J0J1J0J0J1J0J1J0
1728A1367J1J0J1J1J0J1J0J1J1J0J1J1J0J1J1J1J1J0J1J1J1J1J1J0J1J1J1J1J1J1J1J1J1J1
1723A1734J2J1J1J1J1J1J1J2J1J1J1J2J1J1J2J1J1J2J1J2J1J2J1J2J1J2J1J2J1J2J2J1J2J2
1717A2122J1J2J2J1J2J2J2J2J1J2J2J2J2J2J2J2J2J2J2J2J2J2J2J3J2J2J2J2J3J2J2J2J3J2
1712A2530J2J3J2J3J2J3J2J3J2J3J2J3J2J3J3J2J3J3J2J3J3J3J3J2J3J3J3J3J3J3J3J3J3J3
1707A2962J3J3J3J3J4J3J3J3J3J4J3J3J4J3J3J4J3J4J3J4J3J4J3J4J3J4J4J3J4J4J4J3J4J4
1702A3419J4J4J4J3J4J4J4J4J4J4J5J4J4J4J4J4J5J4J4J4J5J4J4J5J4J5J4J5J4J5J4J5J5J4
1697A3903J5J5J4J5J5J5J5J4J5J5J5J5J5J5J5J5J5J5J6J5J5J5J5J6J5J5J6J5J6J5J6J5J6J5
$$ plain form
1733 11019 11029 11039 11049 11059 11069 11079 11089 11099 11109 11120 11130 11140 11150 11160 11170 11181 11191 11201 11211 11222 11232 11242 11253 11263 11273 11284 11294 11305 11315 11325 11336 11346 11357 11367
1728 11367 11378 11388 11399 11410 11420 11431 11441 11452 11463 11473 11484 11495 11505 11516 11527 11538 11549 11559 11570 11581 11592 11603 11614 11624 11635 11646 11657 11668 11679 11690 11701 11712 11723 11734
1723 11734 11746 11757 11768 11779 11790 11801 11812 11824 11835 11846 11857 11869 11880 11891 11903 11914 11925 11937 11948 11960 11971 11983 11994 12006 12017 12029 12040 12052 12063 12075 12087 12098 12110 12122
1717 12122 12133 12145 12157 12168 12180 12192 12204 12216 12227 12239 12251 12263 12275 12287 12299 12311 12323 12335 12347 12359 12371 12383 12395 12408 12420 12432 12444 12456 12469 12481 12493 12505 12518 12530
1712 12530 12542 12555 12567 12580 12592 12605 12617 12630 12642 12655 12667 12680 12692 12705 12718 12730 12743 12756 12768 12781 12794 12807 12820 12832 12845 12858 12871 12884 12897 12910 12923 12936 12949 12962
1707 12962 12975 12988 13001 13014 13028 13041 13054 13067 13080 13094 13107 13120 13134 13147 13160 13174 13187 13201 13214 13228 13241 13255 13268 13282 13295 13309 13323 13336 13350 13364 13378 13391 13405 13419
1702 13419 13433 13447 13461 13474 13488 13502 13516 13530 13544 13558 13573 13587 13601 13615 13629 13643 13658 13672 13686 13700 13715 13729 13743 13758 13772 13787 13801 13816 13830 13845 13859 13874 13889 13903
1697 13903 13918 13933 13947 13962 13977 13992 14007 14021 14036 14051 14066 14081 14096 14111 14126 14141 14156 14171 14187 14202 14217 14232 14247 14263 14278 14293 14309 14324 14340 14355 14371 14386 14402 14417
1691A4417J6J5J6J6J5J6J6J6J5J6J6J6J6J6J6J6J6J6J6J6J6J7J6J6J6J7J6J6J7J6J7J6J7J6
1686A4963J7J6J7J7J6J7J7J7J6J7J7J7J7J7J7J7J7J7J7J8J7J7J7J8J7J7J8J7J7J8J7J8J8J7
1681A5544J8J8J7J8J8J8J8J7J8J8J8J8J8J8J9J8J8J8J8J9J8J8J9J8J9J8J9J8J9J9J8J9J9J9
1676A6164J8J9J9J9J9J9J9J9J9K0J9J9J9K0J9J9K0J9K0J9K0J9K0K0J9K0K0K0K0K0K0K0K0K0
1671A6825K0K0K0K1K0K0K1K0K0K1K0K1K1K0K1K1K0K1K1K1K1K1K1K1K1K1K1K2K1K1K2K1K1K2
1666A7532K1K2K2K1K2K2K2K1K2K2K2K2K2K3K2K2K2K2K3K2K3K2K3K2K3K2K3K3K3K3K3K3K3K3
1660A8290K3K3K3K3K4K3K3K4K3K4K3K4K4K3K4K4K4K4K4K4K4K4K4K4K5K4K5K4K4K5K5K4K5K5
1655A9103K5K4K5K5K5K5K6K5K5K5K6K5K6K5K6K5K6K6K6K5K6K6K6K6K7K6K6K6K7K6K7K6K7K6
$$ plain form
1691 14417 14433 14448 14464 14480 14495 14511 14527 14543 14558 14574 14590 14606 14622 14638 14654 14670 14686 14702 14718 14734 14750 14767 14783 14799 14815 14832 14848 14864 14881 14897 14914 14930 14947 14963
1686 14963 14980 14996 15013 15030 15046 15063 15080 15097 15113 15130 15147 15164 15181 15198 15215 15232 15249 15266 15283 15301 15318 15335 15352 15370 15387 15404 15422 15439 15456 15474 15491 15509 15527 15544
1681 15544 15562 15580 15597 15615 15633 15651 15669 15686 15704 15722 15740 15758 15776 15794 15813 15831 15849 15867 15885 15904 15922 15940 15959 15977 15996 16014 16033 16051 16070 16089 16107 16126 16145 16164
1676 16164 16182 16201 16220 16239 16258 16277 16296 16315 16334 16354 16373 16392 16411 16431 16450 16469 16489 16508 16528 16547 16567 16586 16606 16626 16645 16665 16685 16705 16725 16745 16765 16785 16805 16825
1671 16825 16845 16865 16885 16906 16926 16946 16967 16987 17007 17028 17048 17069 17090 17110 17131 17152 17172 17193 17214 17235 17256 17277 17298 17319 17340 17361 17382 17404 17425 17446 17468 17489 17510 17532
1666 17532 17553 17575 17597 17618 17640 17662 17684 17705 17727 17749 17771 17793 17815 17838 17860 17882 17904 17926 17949 17971 17994 18016 18039 18061 18084 18106 18129 18152 18175 18198 18221 18244 18267 18290
1660 18290 18313 18336 18359 18382 18406 18429 18452 18476 18499 18523 18546 18570 18594 18617 18641 18665 18689 18713 18737 18761 18785 18809 18833 18857 18882 18906 18931 18955 18979 19004 19029 19053 19078 19103
1655 19103 19128 19152 19177 19202 19227 19252 19278 19303 19328 19353 19379 19404 19430 19455 19481 19506 19532 19558 19584 19609 19635 19661 19687 19713 19740 19766 19792 19818 19845 19871 19898 19924 19951 19977
1650A9977K7K7K7K7K7K7K7K7K7K7K8K7K7K8K8K7K8K8K7K8K8K8K8K8K9K8K8K9K8K8K9K9K8K9
1645B0920K9K9K9K9K9K9K9L0K9K9L0L0K9L0L0K9L0L0L0L0L1L0L0L1L0L1L0L1L1L0L1L1L1L2
1640B1939L1L1L1L2L1L2L1L2L2L2L2L2L2L2L2L2L3L2L3L2L3L3L3L3L3L3L3L3L3L4L3L4L3L4
1634B3041L4L4L4L4L4L4L5L4L4L5L5L4L5L5L5L5L5L5L6L5L6L5L6L6L5L6L6L6L7L6L6L7L6L7
1629B4238L7L7L7L7L7L7L7L8L7L8L7L8L8L8L8L8L8L9L8L9L8L9L9L9L9L9L9M0L9M0L9M0M0M0
1624B5541M0M0M0M0M1M0M1M1M1M1M1M1M1M2M1M2M2M2M2M2M2M2M2M3M3M2M3M3M3M3M4M3M4M3
1619B6962M4M4M4M4M4M5M4M5M5M4M5M5M6M5M5M6M6M5M6M6M7M6M6M7M7M6M7M7M8M7M7M8M8M8
1614B8519M8M8M8M8M9M9M8M9M9M9N0M9N0N0N0N0N0N0N0N1N1N1N1N1N1N2N1N2N2N2N2N2N3N3
$$ plain form
1650 19977 20004 20031 20058 20085 20112 20139 20166 20193 20220 20247 20275 20302 20329 20357 20385 20412 20440 20468 20495 20523 20551 20579 20607 20635 20664 20692 20720 20749 20777 20805 20834 20863 20891 20920
1645 20920 20949 20978 21007 21036 21065 21094 21123 21153 21182 21211 21241 21271 21300 21330 21360 21389 21419 21449 21479 21509 21540 21570 21600 21631 21661 21692 21722 21753 21784 21814 21845 21876 21907 21939
1640 21939 21970 22001 22032 22064 22095 22127 22158 22190 22222 22254 22286 22318 22350 22382 22414 22446 22479 22511 22544 22576 22609 22642 22675 22708 22741 22774 22807 22840 22873 22907 22940 22974 23007 23041
1634 23041 23075 23109 23143 23177 23211 23245 23280 23314 23348 23383 23418 23452 23487 23522 23557 23592 23627 23662 23698 23733 23769 23804 23840 23876 23911 23947 23983 24019 24056 24092 24128 24165 24201 24238
1629 24238 24275 24312 24349 24386 24423 24460 24497 24535 24572 24610 24647 24685 24723 24761 24799 24837 24875 24914 24952 24991 25029 25068 25107 25146 25185 25224 25263 25303 25342 25382 25421 25461 25501 25541
1624 25541 25581 25621 25661 25701 25742 25782 25823 25864 25905 25946 25987 26028 26069 26111 26152 26194 26236 26278 26320 26362 26404 26446 26488 26531 26574 26616 26659 26702 26745 26788 26832 26875 26919 26962
1619 26962 27006 27050 27094 27138 27182 27227 27271 27316 27361 27405 27450 27495 27541 27586 27631 27677 27723 27768 27814 27860 27907 27953 27999 28046 28093 28139 28186 28233 28281 28328 28375 28423 28471 28519
1614 28519 28567 28615 28663 28711 28760 28809 28857 28906 28955 29004 29054 29103 29153 29203 29253 29303 29353 29403 29453 29504 29555 29606 29657 29708 29759 29811 29862 29914 29966 30018 30070 30122 30175 30228
1608C0228N2N3N3N4N3N4N3N4N4N4N5N4N5N5N4N6N5N5N6N6N6N6N6N6N7N7N7N7N7N7N8N8N8N8
1603C2111N8N8N9N9N9N9N9O0N9O0O0O0O1O0O1O1O1O1O2O2O1O3O2O2O3O3O3O3O3O4O4O4O4O4
1598C4193O5O4O5O5O6O5O6O6O6O7O6O7O7O7O8O7O8O8O9O8O9O9O9O9P0P0P0P0P0P1P1P1P1P2
1593C6505P2P2P2P3P2P3P4P3P4P4P4P4P5P5P5P5P6P6P6P6P7P7P7P7P8P8P8P8P9P9P9Q0P9Q0
1588C9082Q1Q0Q1Q1Q1Q2Q2Q2Q2Q3Q3Q3Q4Q4Q4Q4Q5Q5Q5Q6Q5Q7Q6Q7Q7Q7Q8Q8Q8Q8Q9Q9R0R0
1583D1969R0R0R1R1R1R2R2R2R3R3R3R4R4R4R4R5R6R5R6R7R6R7R8R7R8R9R8J00R9J00J00J01
1578D5015J00J02J01J02J03J02J04J03J04J04J05J05J05J06J06J07J07J07J08J08J09J09J09
1574D7431J10J10J11J11J11J12J12J13J13J14J14J14J15J16J15J16J17J17J18J18J18J19J19
$$ plain form
1608 30228 30280 30333 30386 30440 30493 30547 30600 30654 30708 30762 30817 30871 30926 30981 31035 31091 31146 31201 31257 31313 31369 31425 31481 31537 31594 31651 31708 31765 31822 31879 31937 31995 32053 32111
1603 32111 32169 32227 32286 32345 32404 32463 32522 32582 32641 32701 32761 32821 32882 32942 33003 33064 33125 33186 33248 33310 33371 33434 33496 33558 33621 33684 33747 33810 33873 33937 34001 34065 34129 34193
1598 34193 34258 34322 34387 34452 34518 34583 34649 34715 34781 34848 34914 34981 35048 35115 35183 35250 35318 35386 35455 35523 35592 35661 35730 35799 35869 35939 36009 36079 36149 36220 36291 36362 36433 36505
1593 36505 36577 36649 36721 36794 36866 36939 37013 37086 37160 37234 37308 37382 37457 37532 37607 37682 37758 37834 37910 37986 38063 38140 38217 38294 38372 38450 38528 38606 38685 38764 38843 38923 39002 39082
1588 39082 39163 39243 39324 39405 39486 39568 39650 39732 39814 39897 39980 40063 40147 40231 40315 40399 40484 40569 40654 40740 40825 40912 40998 41085 41172 41259 41347 41435 41523 41611 41700 41789 41879 41969
1583 41969 42059 42149 42240 42331 42422 42514 42606 42698 42791 42884 42977 43071 43165 43259 43353 43448 43544 43639 43735 43832 43928 44025 44123 44220 44318 44417 44515 44615 44714 44814 44914 45015
1578 45015 45115 45217 45318 45420 45523 45625 45729 45832 45936 46040 46145 46250 46355 46461 46567 46674 46781 46888 46996 47104 47213 47322 47431
1574 47431 47541 47651 47762 47873 47984 48096 48208 48321 48434 48548 48662 48776 48891 49007 49122 49238 49355 49472 49590 49708 49826 49945 50064
1571E0064J20J20J21J21J22J22J23J23J23J24J25J25J25J26J27J27J27J28J29J29J30J30J30
1567E2941J31J32J32J33J33J33J35J35J35J36J36J37J38J38J38J40J39J41J41J41J42J43J43
1564E6093J44J45J45J45J46J47J48J48J48J50J50J50J51J52J53J53J54J54J55J56J56J57J58
1560E9558J58J59J60J60J61J62J63J63J64J64J66J66J66J68J68J69J69J71J71J72J73J73J74
1557F3378J75J76J76J78J78J78J80J80J82J82J83J83J85J85J86J87J88J89J90J90J91J93J93
1553F7606J94J94J96J97J97J99J99K00K02K02K03K04K05K06K07K08K09K09K11K12K13K14K15
1550G2302K15K17K18K19K20K21K22K24K24K25K27K27K29K30K30K32K34K34K35K37K38K38K41
1546G7539K41K42K44K45K46K47K49K50K51K52K53K55K56K58K59K60K61K63K64K65K67K68K70
$$ plain form
1571 50064 50184 50304 50425 50546 50668 50790 50913 51036 51159 51283 51408 51533 51658 51784 51911 52038 52165 52293 52422 52551 52681 52811 52941
1567 52941 53072 53204 53336 53469 53602 53735 53870 54005 54140 54276 54412 54549 54687 54825 54963 55103 55242 55383 55524 55665 55807 55950 56093
1564 56093 56237 56382 56527 56672 56818 56965 57113 57261 57409 57559 57709 57859 58010 58162 58315 58468 58622 58776 58931 59087 59243 59400 59558
1560 59558 59716 59875 60035 60195 60356 60518 60681 60844 61008 61172 61338 61504 61670 61838 62006 62175 62344 62515 62686 62858 63031 63204 63378
1557 63378 63553 63729 63905 64083 64261 64439 64619 64799 64981 65163 65346 65529 65714 65899 66085 66272 66460 66649 66839 67029 67220 67413 67606
1553 67606 67800 67994 68190 68387 68584 68783 68982 69182 69384 69586 69789 69993 70198 70404 70611 70819 71028 71237 71448 71660 71873 72087 72302
1550 72302 72517 72734 72952 73171 73391 73612 73834 74058 74282 74507 74734 74961 75190 75420 75650 75882 76116 76350 76585 76822 77060 77298 77539
1546 77539 77780 78022 78266 78511 78757 79004 79253 79503 79754 80006 80259 80514 80770 81028 81287 81547 81808 82071 82335 82600 82867 83135 83405
1543H3405K70K73K73K75K77K78K79K81K82K84K86K86K89K89K92K93K94K96K98K99L01L02L04
1539I0006L05L08L09L10L12L14L16L17L19L21L23L24L26L28L30L32L33L35L37L39L41L43L45
1536I7473L46L49L50L53L54L57L58L61L62L65L67L69L71L73L75L78L79L82L84L86L89L91L93
1532A05965L95L98M00M02M05M07M10M12M14M17M20M22M24M28M29M33M34M38M40M43M46M48
1529A15230M51M54M57M59M62M66M68M71M74M77M80M83M86M89M92M95M98N02N05N08N11N15
1525A25833N18N21N24N28N32N35N38N42N45N49N53N56N60N64N68N71N75N79N82N87N91N94
1522A38045N99O03O07O11O15O19O24O28O32O36O41O46O50O54O59O64O68O74O77O83O87O93
1519A52215O97P02P08P12P18P22P28P34P38P44P50P55P60P66P72P77P83P89P95Q01Q07Q13
$$ plain form
1543 83405 83675 83948 84221 84496 84773 85051 85330 85611 85893 86177 86463 86749 87038 87327 87619 87912 88206 88502 88800 89099 89400 89702 90006
1539 90006 90311 90619 90928 91238 91550 91864 92180 92497 92816 93137 93460 93784 94110 94438 94768 95100 95433 95768 96105 96444 96785 97128 97473
1536 97473 97819 98168 98518 98871 99225 99582 99940 100301 100663 101028 101395 101764 102135 102508 102883 103261 103640 104022 104406 104792 105181 105572 105965
1532 105965 106360 106758 107158 107560 107965 108372 108782 109194 109608 110025 110445 110867 111291 111719 112148 112581 113015 113453 113893 114336 114782 115230
1529 115230 115681 116135 116592 117051 117513 117979 118447 118918 119392 119869 120349 120832 121318 121807 122299 122794 123292 123794 124299 124807 125318 125833
1525 125833 126351 126872 127396 127924 128456 128991 129529 130071 130616 131165 131718 132274 132834 133398 133966 134537 135112 135691 136273 136860 137451 138045
1522 138045 138644 139247 139854 140465 141080 141699 142323 142951 143583 144219 144860 145506 146156 146810 147469 148133 148801 149475 150152 150835 151522 152215
1519 152215 152912 153614 154322 155034 155752 156474 157202 157936 158674 159418 160168 160923 161683 162449 163221 163998 164781 165570 166365 167166 167973 168786
1515A68786Q19Q25Q32Q38Q44Q50Q58Q63Q71Q77Q84Q90Q98R05R11R19R26R34R41R48R56R63
1512A88338R71R79R87R95J002J011J019J027J036J044J053J062J070J079J088J097J107J115
1509B07080J125J134J144J154J164J173J183J194J204J214J225J235J246J257J268J279J290
1507B27569J302J313J325J337J349J360J373J386J398J410J424J436J450J463J476J490J504
1504B51365J517J532J547J561J575J590J606J621J636J652J668J683J701J716J733J751J767
1501B79221J785J802J820J838J857J875J894J913J932J952J972J992K012K033K053K075K097
1499C12123K118K141K163K186K209K232K256K280K305K329K355K380K406K432K459K486K513
1496C51373K541K570K598K627K657K687K717K748K780K811K844K876K910K944K979L013L049
$$ plain form
1515 168786 169605 170430 171262 172100 172944 173794 174652 175515 176386 177263 178147 179037 179935 180840 181751 182670 183596 184530 185471 186419 187375 188338
1512 188338 189309 190288 191275 192270 193272 194283 195302 196329 197365 198409 199462 200524 201594 202673 203761 204858 205965 207080
1509 207080 208205 209339 210483 211637 212801 213974 215157 216351 217555 218769 219994 221229 222475 223732 225000 226279 227569
1507 227569 228871 230184 231509 232846 234195 235555 236928 238314 239712 241122 242546 243982 245432 246895 248371 249861 251365
1504 251365 252882 254414 255961 257522 259097 260687 262293 263914 265550 267202 268870 270553 272254 273970 275703 277454 279221
1501 279221 281006 282808 284628 286466 288323 290198 292092 294005 295937 297889 299861 301853 303865 305898 307951 310026 312123
1499 312123 314241 316382 318545 320731 322940 325172 327428 329708 332013 334342 336697 339077 341483 343915 346374 348860 351373
1496 351373 353914 356484 359082 361709 364366 367053 369770 372518 375298 378109 380953 383829 386739 389683 392662 395675 398724
1494C98724L084L122L159L196L235L274L314L354L395L437L479L522L566L611L655L702L749
1491D56578L796L844L894L944L994M047M099M153M207M263M320M377M436M495M556M618M681
1488E28302M744M811M876M944N014N083N155N228N303N378N455N534N614N696N780N864N951
1486F18732O040O130O221O316O411O509O609O711O814O921P028P140P252P367P485P606P728
1483G35020P854P982Q114Q247Q384Q525Q667Q814Q964R117R273R434R598R766R938J0113J0294
1481H88104J0478J0668J0860J1059J1262J1470J1683J1902J2126J2356J2592J2833J3081J3336
1478A053810J3597J3865J4140J4422J4713J5011J5317J5631J5955J6287J6628J6980J7341
1476A253697J7713J8095J8489J8894J9311J9740K0184K0638K1109K1593K2092K2607K3138
$$ plain form
1494 398724 401808 404930 408089 411285 414520 417794 421108 424462 427857 431294 434773 438295 441861 445472 449127 452829 456578
1491 456578 460374 464218 468112 472056 476050 480097 484196 488349 492556 496819 501139 505516 509952 514447 519003 523621 528302
1488 528302 533046 537857 542733 547677 552691 557774 562929 568157 573460 578838 584293 589827 595441 601137 606917 612781 618732
1486 618732 624772 630902 637123 643439 649850 656359 662968 669679 676493 683414 690442 697582 704834 712201 719686 727292 735020
1483 735020 742874 750856 758970 767217 775601 784126 792793 801607 810571 819688 828961 838395 847993 857759 867697 877810 888104
1481 888104 898582 909250 920110 931169 942431 953901 965584 977486 989612 1001968 1014560 1027393 1040474 1053810
1478 1053810 1067407 1081272 1095412 1109834 1124547 1139558 1154875 1170506 1186461 1202748 1219376 1236356 1253697
1476 1253697 1271410 1289505 1307994 1326888 1346199 1365939 1386123 1406761 1427870 1449463 1471555 1494162 1517300
1474A517300K3685K4251K4835K5437K6060K6703K7368K8054K8764K9499L0259L1045L1860
1472A875120L2703L3575L4481L5419L6391L7399L8447L9533M0661M1832M3050M4316M5632
1470B378559M7001M8426M9910N1456N3067N4746N6498N8326O0234O2228O4311O6490O8770
1468C120022P1155P3654P6272P9019Q1899Q4924Q8100R1440R4954R8651J02546J06652J10985
1467D280273J15556J20389J25497J30905J36634J42706J49151J55998J63277J71026J79284
1465E870696J88092J97500K07560K18331K29877K42273K55597K69944K85412L02119L20193
1463H587594L39779L61048L84183M09404M36956M67125N00238N36674N76873O21356O70723
1461A3891953P25690P87104Q55975R33515J021183J120758J234418J364851J515400J690271
$$ plain form
1474 1517300 1540985 1565236 1590071 1615508 1641568 1668271 1695639 1723693 1752457 1781956 1812215 1843260 1875120
1472 1875120 1907823 1941398 1975879 2011298 2047689 2085088 2123535 2163068 2203729 2245561 2288611 2332927 2378559
1470 2378559 2425560 2473986 2523896 2575352 2628419 2683165 2739663 2797989 2858223 2920451 2984762 3051252 3120022
1468 3120022 3191177 3264831 3341103 3420122 3502021 3586945 3675045 3766485 3861439 3960090 4062636 4169288 4280273
1467 4280273 4395829 4516218 4641715 4772620 4909254 5051960 5201111 5357109 5520386 5691412 5870696
1465 5870696 6058788 6256288 6463848 6682179 6912056 7154329 7409926 7679870 7965282 8267401 8587594
1463 8587594 8927373 9288421 9672604 10082008 10518964 10986089 11486327 12023001 12599874 13221230 13891953
1461 13891953 14617643 15404747 16260722 17194237 18215420 19336178 20570596 21935447 23450847 25141118
1460B5141118J894798K135827K422243K765729L181871L691776M324511N120888O139386P465746
1458F4283893R228940J1628576J4983290J9819571K7039349L8243772N6352478Q6650885J37459443
1457D65690197K12665216K66032079J45961944j32702654k46001299j88457117j09945563
1456D13242803n3933488j5118764J6543397M9438622R2205446J56753013K60063751M10760841
1455A329955621N23304822K94223204k75026602n22001346m15260197k62966007j57254944
1454E14974551r0562180m5492089r427479K7282854P4351238J41558418K20704525K18574656
1452A051964494k380744k33995250k47507452j72630602j09751747p0486226m7005756l2665739
1451A35540978k3575147j7583282j3488252j0597702q498591o935827n746752m824519m097080
$$ plain form
1460 25141118 27035916 29171743 31593986 34359715 37541586 41233362 45557873 50678761 56818147 64283893
1458 64283893 73512833 85141409 100124699 119944270 146983619 185227391 241579869 328230754 465690197
1457 465690197 678355413 944387492 1090349436 957646782 711645483 523188366 413242803
1456 413242803 359309315 344190551 360733948 410172570 502378016 659131029 919194780 1329955621
1455 1329955621 1853260443 2147483647 1872457045 1350455699 935195502 672229495 514974551
1454 514974551 424412371 378920282 369492803 396775657 471126895 612685313 833389838 1051964494
1452 1051964494 1049583750 815588500 568081048 395450446 285698699 215212473 168206717 135540978
1451 135540978 111965831 94382549 80894297 70296595 61798004 54862177 49115425 44290906 40193826
1450D0193826l514648l042081k654066k332072k062287j834273j640038j473389j329464j204413
1448A9107095j095160r99220r14566q39549p72796p13171o59724o11652n68285n29041m93434
1447A0910497m61041m31498m04494l79754l57041l36148l16892k99112k82667k67432k53294
1445G121124k40158k27930k16537k05903j95967j86672j77966j69801j62137j54935j48159
1443E034959j41780j35765j30093j24735j19672j14884j10350j06055j01983r8119r4451r0964
1441C666108q7651q4496q1494p8633p5907p3306p0824o8454o6189o4024o1954n9972n8075
1439B735129n6258n4516n2846n1244m9707m8232m6814m5451m4142m2884m1671m0506l9383
1438B121475l8302l7260l6257l5288l4354l3454l2584l1745l0935l0151k9394k8663k7956
$$ plain form
1450 40193826 36679178 33637097 30983031 28650959 26588672 24754399 23114361 21640972 20311508 19107095
1448 19107095 18011935 17012715 16098149 15258600 14485804 13772633 13112909 12501257 11932972 11403931 10910497
1447 10910497 10449456 10017958 9613464 9233710 8876669 8540521 8223629 7924517 7641850 7374418 7121124
1445 7121124 6880966 6653036 6436499 6230596 6034629 5847957 5669991 5500190 5338053 5183118 5034959
1443 5034959 4893179 4757414 4627321 4502586 4382914 4268030 4157680 4051625 3949642 3851523 3757072 3666108
1441 3666108 3578457 3493961 3412467 3333834 3257927 3184621 3113797 3045343 2979154 2915130 2853176 2793204 2735129
1439 2735129 2678871 2624355 2571509 2520265 2470558 2422326 2375512 2330061 2285919 2243035 2201364 2160858 2121475
1438 2121475 2083173 2045913 2009656 1974368 1940014 1906560 1873976 1842231 1811296 1781145 1751751 1723088 1695132
1436A695132k7271k6610k5969k5349k4749k4168k3604k3058k2529k2017k1519k1036k0568
1434A386685k0114j9674j9245j8829j8426j8033j7652j7282j6921j6572j6230j5900j5577
1432A156230j5264j4959j4661j4372j4091j3816j3549j3288j3035j2787j2547j2311j2082
1430I79468j1859j1640j1428j1221j1017j0820j0628j0438j0255j0075r900r728r560r397
1427H31502r237r081q928q779q632q490q349q214q079p949p820p696p572p453p335p221p107
1425F93560o997o890o783o680o578o479o381o286o191o101o010n921n836n750n667n586n506
1422E87918n426n350n275n200n127n056m986m916m850m783m717m654m591m529m469m409m351
1420E05229m293m237m181m127m073m020l969l918l868l819l771l723l676l630l585l541l497
$$ plain form
1436 1695132 1667861 1641251 1615282 1589933 1565184 1541016 1517412 1494354 1471825 1449808 1428289 1407253 1386685
1434 1386685 1366571 1346897 1327652 1308823 1290397 1272364 1254712 1237430 1220509 1203937 1187707 1171807 1156230
1432 1156230 1140966 1126007 1111346 1096974 1082883 1069067 1055518 1042230 1029195 1016408 1003861 991550 979468
1430 979468 967609 955969 944541 933320 922303 911483 900855 890417 880162 870087 860187 850459 840899 831502
1427 831502 822265 813184 804256 795477 786845 778355 770006 761792 753713 745764 737944 730248 722676 715223 707888 700667 693560
1425 693560 686563 679673 672890 666210 659632 653153 646772 640486 634295 628194 622184 616263 610427 604677 599010 593424 587918
1422 587918 582492 577142 571867 566667 561540 556484 551498 546582 541732 536949 532232 527578 522987 518458 513989 509580 505229
1420 505229 500936 496699 492518 488391 484318 480298 476329 472411 468543 464724 460953 457230 453554 449924 446339 442798 439301
1417D39301l454l412l370l329l289l249l210l172l134l097l060l024k989k954k919k886k852
1414C85901k819k787k756k724k693k662k633k603k574k545k518k489k462k435k408k382k356
1412C42055k331k306k280k257k232k209k185k162k139k117k095k073k051k030k009j989j968
1409C05622j948j929j908j890j870j852j833j814j797j779j761j744j727j709j693j677j660
1407B75031j645j628j613j597j582j567j552j538j522j509j494j481j466j453j439j427j413
1404B49105j399j388j374j362j349j338j325j313j301j290j278j267j256j244j233j223j212
1401B26953j201j191j180j170j160j149j140j130j121j110j102j092j082j074j064j055j047
1399B07885j038j029j020j012j004r95r87r79r71r63r55r47r40r31r25r17r09r02q95q88q81
$$ plain form
1417 439301 435847 432435 429065 425736 422447 419198 415988 412816 409682 406585 403525 400501 397512 394558 391639 388753 385901
1414 385901 383082 380295 377539 374815 372122 369460 366827 364224 361650 359105 356587 354098 351636 349201 346793 344411 342055
1412 342055 339724 337418 335138 332881 330649 328440 326255 324093 321954 319837 317742 315669 313618 311588 309579 307590 305622
1409 305622 303674 301745 299837 297947 296077 294225 292392 290578 288781 287002 285241 283497 281770 280061 278368 276691 275031
1407 275031 273386 271758 270145 268548 266966 265399 263847 262309 260787 259278 257784 256303 254837 253384 251945 250518 249105
1404 249105 247706 246318 244944 243582 242233 240895 239570 238257 236956 235666 234388 233121 231865 230621 229388 228165 226953
1401 226953 225752 224561 223381 222211 221051 219902 218762 217632 216511 215401 214299 213207 212125 211051 209987 208932 207885
1399 207885 206847 205818 204798 203786 202782 201787 200800 199821 198850 197887 196932 195985 195045 194114 193189 192272 191363 190461 189566 188678 187797
1396A87797q73q67q60q53q46q40q33q27q20q13q08q01p94p89p83p76p71p65p59p53p47p42
1392A70077p36p30p25p20p14p09p03o98o93o88o83o78o72o68o63o58o53o48o44o39o34o30
1389A55091o25o21o16o11o08o03n98n95n90n86n82n77n74n69n66n61n58n53n50n46n42n39
1386A42321n34n31n28n23n20n17n13n09n06n02m99m96m92m89m85m83m79m76m72m70m66m63
1382A31368m60m57m54m51m48m45m42m39m36m33m31m28m24m22m20m16m14m11m09m06m03m00
1379A21919l98l96l93l90l88l85l83l80l78l76l73l71l68l67l63l62l59l57l55l52l50l48
1376A13727l46l44l42l39l37l35l34l31l29l27l24l23l21l19l17l15l13l11l10l07l05l04
1372A06594l02l00k98k96k94k93k91k89k87k86k84k82k80k79k77k76k73k73k70k69k67k66
$$ plain form
1396 187797 186924 186057 185197 184344 183498 182658 181825 180998 180178 179365 178557 177756 176962 176173 175390 174614 173843 173078 172319 171566 170819 170077
1392 170077 169341 168611 167886 167166 166452 165743 165040 164342 163649 162961 162278 161600 160928 160260 159597 158939 158286 157638 156994 156355 155721 155091
1389 155091 154466 153845 153229 152618 152010 151407 150809 150214 149624 149038 148456 147879 147305 146736 146170 145609 145051 144498 143948 143402 142860 142321
1386 142321 141787 141256 140728 140205 139685 139168 138655 138146 137640 137138 136639 136143 135651 135162 134677 134194 133715 133239 132767 132297 131831 131368
1382 131368 130908 130451 129997 129546 129098 128653 128211 127772 127336 126903 126472 126044 125620 125198 124778 124362 123948 123537 123128 122722 122319 121919
1379 121919 121521 121125 120732 120342 119954 119569 119186 118806 118428 118052 117679 117308 116940 116573 116210 115848 115489 115132 114777 114425 114075 113727
1376 113727 113381 113037 112695 112356 112019 111684 111350 111019 110690 110363 110039 109716 109395 109076 108759 108444 108131 107820 107510 107203 106898 106594
1372 106594 106292 105992 105694 105398 105104 104811 104520 104231 103944 103658 103374 103092 102812 102533 102256 101980 101707 101434 101164 100895 100628 100362
1369A00362k64k62k61k60k57k57k54k54k51k51k48k48k45k45k43k41k40k39k37k36k34k33
1365I4902k32k30k29k28k26k25k24k22k21k20k18k17k16k15k13k12k11k10k08k07k06k05k04
1362H9903k02k02k00j99j97j97j96j94j93j92j91j90j89j88j86j86j84j83j83j81j80j79j79
1358H5532j77j76j75j74j73j72j71j70j69j68j67j66j66j64j63j62j62j60j60j58j58j57j56
1355H1708j55j54j53j52j52j50j50j49j48j47j46j45j45j43j43j42j41j41j39j39j38j37j36
1351G8363j36j34j34j34j32j31j31j30j30j28j28j27j26j26j24j24j24j22j22j21j21j19j19
1348G5440j19j17j17j16j16j14j14j14j12j13j11j11j10j09j09j08j07j07j06j05j05j04j04
1344G2892j03j02j01j01j01r9j00r8r8r7r7r6r6r4r5r3r3r3r2r1r1r0r0q9q8q8q7q7q6q6q5
$$ plain form
1369 100362 100098 99836 99575 99315 99058 98801 98547 98293 98042 97791 97543 97295 97050 96805 96562 96321 96081 95842 95605 95369 95135 94902
1365 94902 94670 94440 94211 93983 93757 93532 93308 93086 92865 92645 92427 92210 91994 91779 91566 91354 91143 90933 90725 90518 90312 90107 89903
1362 89903 89701 89499 89299 89100 88903 88706 88510 88316 88123 87931 87740 87550 87361 87173 86987 86801 86617 86434 86251 86070 85890 85711 85532
1358 85532 85355 85179 85004 84830 84657 84485 84314 84144 83975 83807 83640 83474 83308 83144 82981 82819 82657 82497 82337 82179 82021 81864 81708
1355 81708 81553 81399 81246 81094 80942 80792 80642 80493 80345 80198 80052 79907 79762 79619 79476 79334 79193 79052 78913 78774 78636 78499 78363
1351 78363 78227 78093 77959 77825 77693 77562 77431 77301 77171 77043 76915 76788 76662 76536 76412 76288 76164 76042 75920 75799 75678 75559 75440
1348 75440 75321 75204 75087 74971 74855 74741 74627 74513 74401 74288 74177 74066 73956 73847 73738 73630 73523 73416 73310 73205 73100 72996 72892
1344 72892 72789 72687 72586 72485 72384 72285 72185 72087 71989 71892 71795 71699 71603 71509 71414 71321 71228 71135 71043 70952 70861 70771 70681 70592 70504 70416 70329 70242 70156 70070 69985
1340F9985q5q4q3q3q2q2q1q1q0q0p9p9p8p7p7p7p6p5p5p5p4p3p3p2p2p2p1p0p0o9o9o9o8o7
1334F7407o7o7o6o5o5o5o4o4o3o2o3o1o2o1o0o0n9n9n9n8n8n7n7n6n6n5n5n5n4n3n4n2n3n2
1329F5390n1n1n1n0n0m9m9m9m8m7m8m6m7m6m5m6m4m5m4m3m3m3m2m2m2m1m1m0m0l9m0l8l9l8
1324F3873l7l7l7l7l6l5l5l5l5l4l4l3l3l2l3l1l2l1l1l0l0k9l0k8k9k8k8k7k7k7k6k6k5k6
1319F2809k4k5k4k4k3k3k3k2k2k2k1k1k0k0k0k0j9j9j8j8j8j7j7j7j6j6j6j5j5j5j4j4j3j4
1314F2164j3j2j2j2j2j1j1j0j1rj0rrqrpqppoooonnmmmmllkkkkjj%j%JJJJKKKLLMLMNMNON
1305F1962OPOPQPQQRRRJ0J0J0J0J1J1J2J2J2J2J3J3J4J4J4J4J5J5J5J6J6J7J6J7J8J7J8J9
1299F2437J8J9K0J9K0K0K1K1K1K2K2K2K2K3K4K3K4K4K5K5K5K5K6K6K7K7K7K8K7K9K8K9K9L0
$$ plain form
1340 69985 69900 69816 69733 69650 69568 69486 69405 69324 69244 69164 69085 69006 68928 68851 68774 68697 68621 68546 68471 68396 68322 68249 68176 68104 68032 67960 67889 67819 67749 67680 67611 67542 67474 67407
1334 67407 67340 67273 67207 67142 67077 67012 66948 66884 66821 66759 66696 66635 66573 66512 66452 66392 66333 66274 66215 66157 66099 66042 65985 65929 65873 65818 65763 65708 65654 65601 65547 65495 65442 65390
1329 65390 65339 65288 65237 65187 65137 65088 65039 64990 64942 64895 64847 64801 64754 64708 64663 64617 64573 64528 64484 64441 64398 64355 64313 64271 64229 64188 64147 64107 64067 64028 63988 63950 63911 63873
1324 63873 63836 63799 63762 63725 63689 63654 63619 63584 63549 63515 63481 63448 63415 63383 63350 63319 63287 63256 63225 63195 63165 63136 63106 63078 63049 63021 62993 62966 62939 62912 62886 62860 62835 62809
1319 62809 62785 62760 62736 62712 62689 62666 62643 62621 62599 62577 62556 62535 62515 62495 62475 62455 62436 62417 62399 62381 62363 62346 62329 62312 62296 62280 62264 62249 62234 62219 62205 62191 62178 62164
1314 62164 62151 62139 62127 62115 62103 62092 62081 62071 62060 62051 62041 62032 62023 62015 62006 61999 61991 61984 61977 61971 61965 61959 61953 61948 61943 61939 61935 61931 61927 61924 61921 61919 61917 61915 61913 61912 61911 61911 61910 61910 61911 61912 61913 61914 61916 61918 61920 61923 61926 61930 61933 61937 61942 61946 61951 61957 61962
1305 61962 61968 61975 61981 61988 61996 62003 62011 62019 62028 62037 62046 62056 62066 62076 62086 62097 62108 62120 62132 62144 62156 62169 62182 62196 62210 62224 62238 62253 62268 62283 62299 62315 62332 62348 62365 62383 62400 62418 62437
1299 62437 62455 62474 62494 62513 62533 62553 62574 62595 62616 62638 62660 62682 62704 62727 62751 62774 62798 62822 62847 62872 62897 62922 62948 62974 63001 63028 63055 63083 63110 63139 63167 63196 63225 63255
1294F3255K9L1L0L1L1L2L1L3L2L3L3L4L4L4L4L5L6L5L6L6L7L7L7L8L8L8L9L9L9M0M0M0M1M1
1289F4459M1M2M2M3M3M3M3M4M4M5M5M5M6M6M6M7M7M8M7M9M8M9M9N0N0N0N1N1N1N2N2N3N3N3
1283F6067N4N4N4N5N5N6N6N6N7N7N7N8N8N9N9N9O0O0O0O1O2O1O2O3O3O3O4O4O4O5O5O6O6O6
1278F8106O7O8O7O8O9O9O9P0P0P0P1P2P1P3P2P3P4P4P4P5P5P6P6P6P7P7P8P8P9P9Q0Q0Q0Q1
1273G0614Q1Q2Q2Q3Q3Q3Q4Q5Q5Q5Q6Q6Q7Q7Q8Q8Q9Q9R0R0R0R1R2R2R2R3R4R4R4R5R6R6R6R7
1268G3639R7R8R9R9R9J00J01J00J02J02J03J03J03J04J05J05J06J06J07J07J08J09J09J09
1264G6120J10J11J11J12J12J13J13J14J15J15J15J17J17J17J18J19J19J19J21J21J21J22J23
1261G8795J24J24J24J25J26J27J27J27J28J29J30J30J31J31J33J32J34J34J34J36J36J36J38
$$ plain form
1294 63255 63284 63315 63345 63376 63407 63439 63470 63503 63535 63568 63601 63635 63669 63703 63737 63772 63808 63843 63879 63915 63952 63989 64026 64064 64102 64140 64179 64218 64257 64297 64337 64377 64418 64459
1289 64459 64500 64542 64584 64627 64670 64713 64756 64800 64844 64889 64934 64979 65025 65071 65117 65164 65211 65259 65306 65355 65403 65452 65501 65551 65601 65651 65702 65753 65804 65856 65908 65961 66014 66067
1283 66067 66121 66175 66229 66284 66339 66395 66451 66507 66564 66621 66678 66736 66794 66853 66912 66971 67031 67091 67151 67212 67274 67335 67397 67460 67523 67586 67650 67714 67778 67843 67908 67974 68040 68106
1278 68106 68173 68241 68308 68376 68445 68514 68583 68653 68723 68793 68864 68936 69007 69080 69152 69225 69299 69373 69447 69522 69597 69673 69749 69825 69902 69979 70057 70135 70214 70293 70373 70453 70533 70614
1273 70614 70695 70777 70859 70942 71025 71108 71192 71277 71362 71447 71533 71619 71706 71793 71881 71969 72058 72147 72237 72327 72417 72508 72600 72692 72784 72877 72971 73065 73159 73254 73350 73446 73542 73639
1268 73639 73736 73834 73933 74032 74131 74231 74332 74432 74534 74636 74739 74842 74945 75049 75154 75259 75365 75471 75578 75685 75793 75902 76011 76120
1264 76120 76230 76341 76452 76564 76676 76789 76902 77016 77131 77246 77361 77478 77595 77712 77830 77949 78068 78187 78308 78429 78550 78672 78795
1261 78795 78919 79043 79167 79292 79418 79545 79672 79799 79927 80056 80186 80316 80447 80578 80711 80843 80977 81111 81245 81381 81517 81653 81791
1257H1791J38J39J39J40J41J41J42J43J43J45J44J46J46J47J48J49J49J50J50J52J52J52J54
1254H5141J54J55J56J57J57J58J59J60J60J61J62J63J63J65J65J66J67J67J68J70J70J70J72
1250H8886J73J73J74J75J76J77J77J79J79J81J81J82J83J83J85J86J86J87J89J89J90J91J92
1247I3074J93J94J95J96J97J97J99K00K01K01K03K04K04K06K07K08K08K10K11K12K13K14K15
1243I7762K16K18K18K19K21K21K23K24K25K26K27K29K29K31K32K33K34K35K37K37K39K40K42
1240A03018K42K44K45K47K47K49K50K51K53K54K55K57K58K59K60K62K63K65K66K67K69K70
1236A08651K72K72K75K76K77K78K80K82K83K84K86K88K89K91K92K93K95K97K98L00L02L03
1233A14964L04L07L08L09L11L13L15L16L18L20L21L23L25L27L28L30L32L34L36L37L40L41
$$ plain form
1257 81791 81929 82068 82207 82347 82488 82629 82771 82914 83057 83202 83346 83492 83638 83785 83933 84082 84231 84381 84531 84683 84835 84987 85141
1254 85141 85295 85450 85606 85763 85920 86078 86237 86397 86557 86718 86880 87043 87206 87371 87536 87702 87869 88036 88204 88374 88544 88714 88886
1250 88886 89059 89232 89406 89581 89757 89934 90111 90290 90469 90650 90831 91013 91196 91379 91564 91750 91936 92123 92312 92501 92691 92882 93074
1247 93074 93267 93461 93656 93852 94049 94246 94445 94645 94846 95047 95250 95454 95658 95864 96071 96279 96487 96697 96908 97120 97333 97547 97762
1243 97762 97978 98196 98414 98633 98854 99075 99298 99522 99747 99973 100200 100429 100658 100889 101121 101354 101588 101823 102060 102297 102536 102776 103018
1240 103018 103260 103504 103749 103996 104243 104492 104742 104993 105246 105500 105755 106012 106270 106529 106789 107051 107314 107579 107845 108112 108381 108651
1236 108651 108923 109195 109470 109746 110023 110301 110581 110863 111146 111430 111716 112004 112293 112584 112876 113169 113464 113761 114059 114359 114661 114964
1233 114964 115268 115575 115883 116192 116503 116816 117131 117447 117765 118085 118406 118729 119054 119381 119709 120039 120371 120705 121041 121378 121718 122059
1230A22059L43L45L46L49L51L52L55L56L59L60L63L64L67L68L71L72L75L77L79L81L83L86
1226A30061L88L89L92L95L96L99M01M04M05M08M11M12M15M18M20M22M25M27M30M32M35M38
1223A39123M40M42M45M48M51M53M55M59M61M64M67M69M73M75M78M81M84M87M89M93M96M99
1220A49432N01N05N08N11N14N18N20N24N27N31N33N37N41N43N47N51N54N58N61N64N69N71
1216A61220N76N79N83N87N90N94N98O02O06O10O13O18O22O26O30O34O38O43O46O51O56O60
1213A74782O64O68O73O78O82O87O92O96P01P05P11P15P20P26P30P35P41P45P51P56P61P67
1209A90486P72P77P83P88P94Q00Q05Q12Q16Q23Q29Q35Q40Q47Q53Q60Q65Q72Q78Q85Q91Q98
1206B08809R04R11R18R25R32R39R46R53R60R67R75R83R89R98J005J013J020J029J036J045
$$ plain form
1230 122059 122402 122747 123093 123442 123793 124145 124500 124856 125215 125575 125938 126302 126669 127037 127408 127780 128155 128532 128911 129292 129675 130061
1226 130061 130449 130838 131230 131625 132021 132420 132821 133225 133630 134038 134449 134861 135276 135694 136114 136536 136961 137388 137818 138250 138685 139123
1223 139123 139563 140005 140450 140898 141349 141802 142257 142716 143177 143641 144108 144577 145050 145525 146003 146484 146968 147455 147944 148437 148933 149432
1220 149432 149933 150438 150946 151457 151971 152489 153009 153533 154060 154591 155124 155661 156202 156745 157292 157843 158397 158955 159516 160080 160649 161220
1216 161220 161796 162375 162958 163545 164135 164729 165327 165929 166535 167145 167758 168376 168998 169624 170254 170888 171526 172169 172815 173466 174122 174782
1213 174782 175446 176114 176787 177465 178147 178834 179526 180222 180923 181628 182339 183054 183774 184500 185230 185965 186706 187451 188202 188958 189719 190486
1209 190486 191258 192035 192818 193606 194400 195200 196005 196817 197633 198456 199285 200120 200960 201807 202660 203520 204385 205257 206135 207020 207911 208809
1206 208809 209713 210624 211542 212467 213399 214338 215284 216237 217197 218164 219139 220122 221111 222109 223114 224127 225147 226176 227212 228257
1203B28257J053J061J069J078J086J095J104J112J122J130J139J149J158J167J177J186J196
1200B47339J206J215J226J236J246J256J267J278J288J299J310J321J332J344J355J366J379
1198B69263J390J402J415J427J439J452J464J478J490J504J517J530J544J558J572J587J600
1195B94632J615J630J645J660J675J690J706J723J738J754J771J787J805J821J839J856J874
1193C24221J892J911J928J948J966J986K005K025K045K065K086K106K128K149K170K193K215
1190C59039K237K261K283K307K331K355K380K405K429K456K481K508K534K562K589K617K645
1187D00419K674K703K733K763K793K824K856K887K920K953K986L019L055L089L124L161L197
1185D50156L235L272L310L350L389L429L470L512L553L597L640L685L730L775L822L869L918
$$ plain form
1203 228257 229310 230371 231440 232518 233604 234699 235803 236915 238037 239167 240306 241455 242613 243780 244957 246143 247339
1200 247339 248545 249760 250986 252222 253468 254724 255991 257269 258557 259856 261166 262487 263819 265163 266518 267884 269263
1198 269263 270653 272055 273470 274897 276336 277788 279252 280730 282220 283724 285241 286771 288315 289873 291445 293032 294632
1195 294632 296247 297877 299522 301182 302857 304547 306253 307976 309714 311468 313239 315026 316831 318652 320491 322347 324221
1193 324221 326113 328024 329952 331900 333866 335852 337857 339882 341927 343992 346078 348184 350312 352461 354631 356824 359039
1190 359039 361276 363537 365820 368127 370458 372813 375193 377598 380027 382483 384964 387472 390006 392568 395157 397774 400419
1187 400419 403093 405796 408529 411292 414085 416909 419765 422652 425572 428525 431511 434530 437585 440674 443798 446959 450156
1185 450156 453391 456663 459973 463323 466712 470141 473611 477123 480676 484273 487913 491598 495328 499103 502925 506794 510712
1182E10712L966M016M067M118M171M224M278M333M390M446M505M564M624M685M748M811M876
1180E85534M942N009N077N147N218N290N363N438N515N593N672N753N835N919O005O092O182
1177F79584O272O365O459O556O654O755O857O962P068P177P289P402P518P637P757P882Q007
1175H00201Q137Q268Q403Q541Q682Q825Q973R123R278R434R596R761R930J0102J0279J0460
1172I47993J0645J0835J1029J1228J1432J1641J1856J2075J2299J2531J2767J3010J3259J3514
1170A116114J3777J4045J4322J4605J4896J5195J5503J5818J6142J6476J6818J7171J7534
1168A318416J7906J8290J8685J9091J9509J9940K0385K0841K1312K1798K2299K2815K3348
1166A584635K3897K4464K5050K5653K6278K6923K7590K8278K8990K9727L0489L1278L2094
$$ plain form
1182 510712 514678 518694 522761 526879 531050 535274 539552 543885 548275 552721 557226 561790 566414 571099 575847 580658 585534
1180 585534 590476 595485 600562 605709 610927 616217 621580 627018 632533 638126 643798 649551 655386 661305 667310 673402 679584
1177 679584 685856 692221 698680 705236 711890 718645 725502 732464 739532 746709 753998 761400 768918 776555 784312 792194 800201
1175 800201 808338 816606 825009 833550 842232 851057 860030 869153 878431 887865 897461 907222 917152 927254 937533 947993
1172 947993 958638 969473 980502 991730 1003162 1014803 1026659 1038734 1051033 1063564 1076331 1089341 1102600 1116114
1170 1116114 1129891 1143936 1158258 1172863 1187759 1202954 1218457 1234275 1250417 1266893 1283711 1300882 1318416
1168 1318416 1336322 1354612 1373297 1392388 1411897 1431837 1452222 1473063 1494375 1516173 1538472 1561287 1584635
1166 1584635 1608532 1632996 1658046 1683699 1709977 1736900 1764490 1792768 1821758 1851485 1881974 1913252 1945346
1164A945346L2940L3816L4723L5664L6638L7651L8701L9790M0921M2097M3319M4587M5908
1162B452101M7282M8711N0201N1751N3367N5052N6810N8645O0559O2561O4652O6839O9127
1160C197658P1521P4031P6660P9417Q2309Q5348Q8538R1893R5422R9138J03051J07178J11530
1158D363694J16128J20985J26121J31560J37320J43428J49912J56801J64127J71926J80239
1156E962241J89108J98582K08716K19566K31202K43696K57129K71596K87198L04054L22295
1155H695383L42067L63543L86912M12397M40245M70749N04242N41110N81802O26849O76863
1153A4042162P32575P94853Q64724R43428J032464J133646J249207J381901J535156J713286
1151B5423402J921766K167626K459998K810901L236360L758114M406106N222413O267361P629462
$$ plain form
1164 1945346 1978286 2012102 2046825 2082489 2119127 2156778 2195479 2235269 2276190 2318287 2361606 2406193 2452101
1162 2452101 2499383 2548094 2598295 2650046 2703413 2758465 2815275 2873920 2934479 2997040 3061692 3128531 3197658
1160 3197658 3269179 3343210 3419870 3499287 3581596 3666944 3755482 3847375 3942797 4041935 4144986 4252164 4363694
1158 4363694 4479822 4600807 4726928 4858488 4995808 5139236 5289148 5445949 5610076 5782002 5962241
1156 5962241 6151349 6349931 6558647 6778213 7009415 7253111 7510240 7781836 8069034 8373088 8695383
1155 8695383 9037450 9400993 9787905 10200302 10640547 11111296 11615538 12156648 12738450 13365299 14042162
1153 14042162 14774737 15569590 16434314 17377742 18410206 19543852 20793059 22174960 23710116 25423402
1151 25423402 27345168 29512794 31972792 34783693 38020053 41778167 46184273 51406686 57674047 65303509
1150F5303509R442006J1911364J5367395K0355668K7812042L9400346N8158917Q9587822J42251469
1149D79590538K19279563K70142309J43737174j35842492k50535744j93565281j13556646
1147D19249421n6256664j6686947J5406703M8577471R1595202J56545367K60719501M12868974
1146A332019028N25079155K89322565k83754681n25286681m15013632k62500180j57808996
1145E02056578r2578527m9483139j6393740J5458734N4575946J11092136J89768557K44535862
1144I59032407J27529465j47226023k64524250k11704673j36792707q6155120n6000145l7995950
1143A46163004k6862315j9689851j4885627j1553118r169253p417539o099737n087763m296445
1141D1101356l667706l161015k747482k406149k121527j882008j678762j504989j355385j225775
$$ plain form
1150 65303509 74745515 86656879 102024274 122379942 150191984 189592330 247751247 337339069 479590538
1149 479590538 698870101 969012410 1112749584 976907092 726371348 532806067 419249421
1147 419249421 362992757 346305810 361712513 410289984 501885186 658430553 919150054 1332019028
1146 1332019028 1857098183 2146420748 1862666067 1337379386 922365754 659865574 502056578
1145 502056578 409478051 359994912 343601172 359059906 413635852 524727988 714496545 959032407
1144 959032407 1086561872 939335849 674811599 463106926 326314219 240159099 184158954 146163004
1143 146163004 119300689 99610838 84725211 73172093 64002840 56585301 50485564 45397801 41101356
1141 41101356 37433650 34272635 31525153 29119004 26997477 25115469 23436707 21931718 20576333 19350558
1140A9350558j112831j013886r26773q49724p81294p20269o65652o16600n72403n32460m96257
1138A1062409m63355m33380m06004l80944l57954l36824l17359k99401k82798k67427k53170
1137G263793k39929k27610k16133k05430j95430j86079j77323j69114j61411j54173j47365
1135E183796j40957j34918j29222j23843j18761j13954j09405j05095j01009r7132r3452q9955
1133C826093q6629q3466q0454p7585p4849p2239o9750o7371o5099o2926o0848n8859n6954
1131B909064n5130n3381n1703n0095m8550m7066m5642m4271m2955m1688m0469l9294l8164
1129B310656l7075l6025l5013l4036l3094l2184l1306l0457k9638k8845k8080k7338k6621
1127A900944k5926k5256k4604k3974k3363k2771k2196k1640k1099k0575k0066j9572j9092
$$ plain form
1140 19350558 18237727 17223841 16297068 15447344 14666050 13945781 13280129 12663529 12091126 11558666 11062409
1138 11062409 10599054 10165674 9759670 9378726 9020772 8683948 8366589 8067188 7784390 7516963 7263793
1137 7263793 7023864 6796254 6580121 6374691 6179261 5993182 5815859 5646745 5485334 5331161 5183796
1135 5183796 5042839 4907921 4778699 4654856 4536095 4422141 4312736 4207641 4106632 4009500 3916048 3826093
1133 3826093 3739464 3655998 3575544 3497959 3423110 3350871 3281121 3213750 3148651 3085725 3024877 2966018 2909064
1131 2909064 2853934 2800553 2748850 2698755 2650205 2603139 2557497 2513226 2470271 2428583 2388114 2348820 2310656
1129 2310656 2273581 2237556 2202543 2168507 2135413 2103229 2071923 2041466 2011828 1982983 1954903 1927565 1900944
1127 1900944 1875018 1849762 1825158 1801184 1777821 1755050 1732854 1711214 1690115 1669540 1649474 1629902 1610810
1125A610810j8625j8172j7731j7303j6886j6481j6086j5702j5328j4964j4610j4263j3927
1123A400732j3598j3279j2965j2661j2364j2073j1789j1513j1242j0978j0720j0467j0220
1121A246863r979r742r511r285r063q846q633q425q220q020p824p631p442p256p074o896o719
1118A106297o547o378o210o046n885n726n570n416n264n115m967m823m680m538m400m262m126
1116A016344l993l860l729l600l472l345l221l096k974k852k732k612k494k376k260k144k029
1113I65555j915j801j689j576j465j353j243j132j023r13q03o95n86m78l68k61j52m4O5J73
1110I48296K82L91N00O09P19Q28R40J050J161J273J385J499J612J727J842J958K075K193K312
1107I72652K431K553K674K798K923L048L176L304L435L566L700L835L971M111M251M393M539
$$ plain form
1125 1610810 1592185 1574013 1556282 1538979 1522093 1505612 1489526 1473824 1458496 1443532 1428922 1414659 1400732
1123 1400732 1387134 1373855 1360890 1348229 1335865 1323792 1312003 1300490 1289248 1278270 1267550 1257083 1246863
1121 1246863 1236884 1227142 1217631 1208346 1199283 1190437 1181804 1173379 1165159 1157139 1149315 1141684 1134242 1126986 1119912 1113016 1106297
1118 1106297 1099750 1093372 1087162 1081116 1075231 1069505 1063935 1058519 1053255 1048140 1043173 1038350 1033670 1029132 1024732 1020470 1016344
1116 1016344 1012351 1008491 1004762 1001162 997690 994345 991124 988028 985054 982202 979470 976858 974364 971988 969728 967584 965555
1113 965555 963640 961839 960150 958574 957109 955756 954513 953381 952358 951445 950642 949947 949361 948883 948515 948254 948102 948058 948123 948296
1110 948296 948578 948969 949469 950078 950797 951625 952565 953615 954776 956049 957434 958933 960545 962272 964114 966072 968147 970340 972652
1107 972652 975083 977636 980310 983108 986031 989079 992255 995559 998994 1002560 1006260 1010095 1014066 1018177 1022428 1026821 1031360
1105A031360M685M834M986N139N296N454N617N780N948O118O291O468O647O831P018P208P403
1102A133083P601P804Q010Q222Q438Q657Q884R114R350R591R838J0092J0350J0615J0888J1167
1100A281704J1452J1746J2047J2356J2673J2999J3333J3678J4031J4395J4770J5154J5550
1098A455888J5959J6379J6813J7259J7719J8195J8685J9190J9713K0254K0810K1388K1984
1096A700236K2601K3239K3901K4586K5296K6032K6796K7587K8410K9265L0151L1075L2034
1094B051209L3033L4073L5157L6285L7463L8692L9974M1315M2715M4180M5714M7320M9002
1092B576132N0768N2619N4565N6610N8759O1024O3408O5922O8577P1379P4343P7480Q0801
1090C412387Q4325Q8065R2040R6268J00773J05577J10707J16193J22066J28365J35129J42404
$$ plain form
1105 1031360 1036045 1040879 1045865 1051004 1056300 1061754 1067371 1073151 1079099 1085217 1091508 1097976 1104623 1111454 1118472 1125680 1133083
1102 1133083 1140684 1148488 1156498 1164720 1173158 1181815 1190699 1199813 1209163 1218754 1228592 1238684 1249034 1259649 1270537 1281704
1100 1281704 1293156 1304902 1316949 1329305 1341978 1354977 1368310 1381988 1396019 1410414 1425184 1440338 1455888
1098 1455888 1471847 1488226 1505039 1522298 1540017 1558212 1576897 1596087 1615800 1636054 1656864 1678252 1700236
1096 1700236 1722837 1746076 1769977 1794563 1819859 1845891 1872687 1900274 1928684 1957949 1988100 2019175 2051209
1094 2051209 2084242 2118315 2153472 2189757 2227220 2265912 2305886 2347201 2389916 2434096 2479810 2527130 2576132
1092 2576132 2626900 2679519 2734084 2790694 2849453 2910477 2973885 3039807 3108384 3179763 3254106 3331586 3412387
1090 3412387 3496712 3584777 3676817 3773085 3873858 3979435 4090142 4206335 4328401 4456766 4591895 4734299
1088D734299J50241J58699J67843J77745J88491K00175K12906K26809K42028K58726K77098
1086F995060K97362L19781L44656L72346M03274M37941M76950N21019N71019O28013O93298
1085A2060719P68470Q55519R56938J075873J216337J383519J584160J827176K124472K492217
1083B6345400K952668L537068M290076N276934O595288Q395175J0914194J4541174J9935795
1082A02783772K8259764M1626418O3911007J01589740J60083643K17026861J87068259J8204057
1080I20553521j66616141k20134636j70466514j09118302o8071442m3685246k9109793k0069383
1079I3282064j4220836j0280508p522989n522286m018356k846264j897300j096762l90803
1078D5485960K61810Q95084J539728K226349K988486L866083M909927O187915P794600R866152
$$ plain form
1088 4734299 4884540 5043239 5211082 5388827 5577318 5777493 5990399 6217208 6459236 6717962 6995060
1086 6995060 7292422 7612203 7956859 8329205 8732479 9170420 9647370 10168389 10739408 11367421 12060719
1085 12060719 12829189 13684708 14641646 15717519 16933856 18317375 19901535 21728711 23853183 26345400
1083 26345400 29298068 32835136 37125212 42402146 48997434 57392609 68306803 82847977 102783772
1082 102783772 131043536 172669954 236580961 338170701 498254344 715281205 902349464 920553521
1080 920553521 753937380 533802744 363336230 254217928 186146486 142461240 113351447 93282064
1079 93282064 79061228 68780720 61257731 55735445 51717089 48870825 46973525 45876763 45485960
1078 45485960 45747770 46642854 48182582 50408931 53397417 57263500 62173427 68361342 76155942 86022094
1076H6022094J2605045J6321860K1509187K8976579M0107287N7363361Q5295796J32459323
1075D80660532K13796372L43977785M77329304M22837662P2856342l36582999m91362656l93415090
1074G90097252k50697824j54242999r7918078o4925706m4832328l2046514k3571666j7746029
1073A04116108j3609738j0585893q314651o563858n178731m052806l110223k294794j562764
1071D8842650q77822k07309M81057J222435K058783L044042M251879N787782P808881J0557721
1070H2970099J4421552K0039288K8497970M1691487O2929687R7686752J53042178K27435898
1069G28714911K49159998M1265941k21885976k45659713j72319821j10829735p1363169m7239612
1067A49842824l2372292k2949425j6776789j2600330r689218p605235o077580m933940m061627
$$ plain form
1076 86022094 98627139 114948999 136458186 165434765 205542052 262905413 348201209 480660532
1075 480660532 694456904 1038434689 1515763993 1938601655 2011457997 1674874998 1183512342 790097252
1074 790097252 539399428 385156429 287238351 222312645 177480317 145433803 121862137 104116108
1073 104116108 90506370 79920477 71605826 65041968 59863237 55810431 52700208 50405414 48842650
1071 48842650 47964828 47757519 48238576 49461011 51519794 54563836 58815715 64603497 72412378 82970099
1070 82970099 97391651 117430939 145928909 187620396 250550083 348236835 501279013 728714911
1069 728714911 977874909 1019140850 797254874 551595161 379275340 268445605 197082436 149842824
1067 149842824 117470532 94521107 77744318 65143988 55454770 47849535 41771955 36838015 32776388
1066C2776388l385090k852504k427585k084436j804267j573224j380946j219590j083135r66921
1064A3998690q67293p81365p06829o41838n84889n34754m90433m51087m16026l84673l56538
1063G782965l31212l08344k87636k68833k51717k36097k21809k08710j96677j85598j75380
1061E110952j65939j57198j49093j41565j34563j28038j21952j16266j10946j05962j01289
1059C678141r6901r2776q8893q5236q1786p8531p5453p2544o9789o7179o4704o2355o0124
1057B681870n8003n5986n4066n2236n0493m8829m7242m5726m4276m2890m1565m0295l9080
1055B061183l7914l6797l5725l4696l3708l2758l1847l0969l0124k9313k8530k7776k7051
1053A643975k6350k5675k5024k4395k3789k3202k2636k2089k1559k1048k0553k0074j9610
$$ plain form
1066 32776388 29391298 26538794 24111209 22026773 20222506 18649282 17268336 16048746 14965611 13998690
1064 13998690 13131397 12350032 11643203 11001365 10416476 9881722 9391289 8940202 8524176 8139503 7782965
1063 7782965 7451753 7143409 6855773 6586940 6335223 6099126 5877317 5668607 5471930 5286332 5110952
1061 5110952 4945013 4787815 4638722 4497157 4362594 4234556 4112604 3996338 3885392 3779430 3678141
1059 3678141 3581240 3488464 3399571 3314335 3232549 3154018 3078565 3006021 2936232 2869053 2804349 2741994 2681870
1057 2681870 2623867 2567881 2513815 2461579 2411086 2362257 2315015 2269289 2225013 2182123 2140558 2100263 2061183
1055 2061183 2023269 1986472 1950747 1916051 1882343 1849585 1817738 1786769 1756645 1727332 1698802 1671026 1643975
1053 1643975 1617625 1591950 1566926 1542531 1518742 1495540 1472904 1450815 1429256 1408208 1387655 1367581 1347971
1051A347971j9162j8726j8305j7896j7501j7117j6745j6384j6033j5693j5362j5042j4730
1050A129275j4428j4133j3848j3569j3299j3035j2780j2531j2288j2053j1822j1599j1381
1048I62509j1169j0962j0759j0564j0371j0185j0002r825r651r481r317r155q997q844q693
1045H14534q547q403q263q127p992p862p734p609p487p367p251p135p024o915o807o702o600
1043F86709o499o400o304o210o117o027n937n851n765n682n600n519n441n364n287n214n141
1040E88351n069n000m930m863m797m732m668m606m544m483m425m366m309m253m198m144m091
1037E10873m038l988l936l887l839l790l743l698l651l607l563l520l477l435l394l354l314
1035D48639l274l237l198l161l124l088l053l017k983k950k915k883k851k818k788k756k726
$$ plain form
1051 1347971 1328809 1310083 1291778 1273882 1256381 1239264 1222519 1206135 1190102 1174409 1159047 1144005 1129275
1050 1129275 1114847 1100714 1086866 1073297 1059998 1046963 1034183 1021652 1009364 997311 985489 973890 962509
1048 962509 951340 940378 929619 919055 908684 898499 888497 878672 869021 859540 850223 841068 832071 823227 814534
1045 814534 805987 797584 789321 781194 773202 765340 757606 749997 742510 735143 727892 720757 713733 706818 700011 693309 686709
1043 686709 680210 673810 667506 661296 655179 649152 643215 637364 631599 625917 620317 614798 609357 603993 598706 593492 588351
1040 588351 583282 578282 573352 568489 563692 558960 554292 549686 545142 540659 536234 531868 527559 523306 519108 514964 510873
1037 510873 506835 502847 498911 495024 491185 487395 483652 479954 476303 472696 469133 465613 462136 458701 455307 451953 448639
1035 448639 445365 442128 438930 435769 432645 429557 426504 423487 420504 417554 414639 411756 408905 406087 403299 400543 397817
1032C97817k696k666k638k608k581k552k526k498k471k446k419k394k369k345k319k296k272
1030C55721k249k226k203k180k159k136k116k094k073k052k032k012j993j973j953j935j915
1027C20420j898j879j860j844j825j809j791j774j758j741j725j709j693j677j662j647j632
1024B90496j617j602j588j573j559j546j531j518j505j491j478j465j452j439j427j415j402
1022B64888j391j378j367j355j343j332j321j309j299j288j277j266j256j245j236j225j215
1019B42785j205j195j185j176j167j157j148j138j130j120j112j103j094j085j077j069j060
1017B23564j052j044j036j027j020j012j005r96r89r82r74r67r59r53r45r38r31r25r17r11
1014B03981r04q97q91q84q78q72q65q59q53q46q41q34q29q23q16q12q05q00p94p88p83p78
$$ plain form
1032 397817 395121 392455 389817 387209 384628 382076 379550 377052 374581 372135 369716 367322 364953 362608 360289 357993 355721
1030 355721 353472 351246 349043 346863 344704 342568 340452 338358 336285 334233 332201 330189 328196 326223 324270 322335 320420
1027 320420 318522 316643 314783 312939 311114 309305 307514 305740 303982 302241 300516 298807 297114 295437 293775 292128 290496
1024 290496 288879 287277 285689 284116 282557 281011 279480 277962 276457 274966 273488 272023 270571 269132 267705 266290 264888
1022 264888 263497 262119 260752 259397 258054 256722 255401 254092 252793 251505 250228 248962 247706 246461 245225 244000 242785
1019 242785 241580 240385 239200 238024 236857 235700 234552 233414 232284 231164 230052 228949 227855 226770 225693 224624 223564
1017 223564 222512 221468 220432 219405 218385 217373 216368 215372 214383 213401 212427 211460 210501 209548 208603 207665 206734 205809 204892 203981
1014 203981 203077 202180 201289 200405 199527 198655 197790 196931 196078 195232 194391 193557 192728 191905 191089 190277 189472 188672 187878 187090 186307 185529
1010A85529p72p67p61p57p51p46p40p36p31p26p21p16p11p06p02o97o92o88o83o78o74o70
1007A69704o65o61o57o52o48o44o39o36o31o27o24o19o15o11o08o03o00n96n92n89n85n81
1004A56021n77n74n70n67n63n60n56n53n49n46n43n40n36n33n29n27n23n20n17n14n10n08
1000A44106n05n01m99m96m93m90m87m84m81m78m76m73m70m68m64m62m60m56m54m52m49m46
997A33662m44m41m39m36m34m31m29m26m24m22m19m17m15m12m10m08m06m03m01l99l97l94l92
993A24063l91l88l86l84l81l80l78l75l74l71l70l68l65l64l62l60l58l56l54l52l50l49l47
990A15600l45l43l41l40l37l36l35l32l31l29l28l25l24l23l21l19l17l16l14l13l11l10l08
986A08102l06l05l03l02l00k99k97k96k94k93k92k90k88k87k86k84k83k81k81k78k78k76k74
$$ plain form
1010 185529 184757 183990 183229 182472 181721 180975 180235 179499 178768 178042 177321 176605 175894 175188 174486 173789 173097 172409 171726 171048 170374 169704
1007 169704 169039 168378 167721 167069 166421 165777 165138 164502 163871 163244 162620 162001 161386 160775 160167 159564 158964 158368 157776 157187 156602 156021
1004 156021 155444 154870 154300 153733 153170 152610 152054 151501 150952 150406 149863 149323 148787 148254 147725 147198 146675 146155 145638 145124 144614 144106
1000 144106 143601 143100 142601 142105 141612 141122 140635 140151 139670 139192 138716 138243 137773 137305 136841 136379 135919 135463 135009 134557 134108 133662
997 133662 133218 132777 132338 131902 131468 131037 130608 130182 129758 129336 128917 128500 128085 127673 127263 126855 126449 126046 125645 125246 124849 124455 124063
993 124063 123672 123284 122898 122514 122133 121753 121375 121000 120626 120255 119885 119517 119152 118788 118426 118066 117708 117352 116998 116646 116296 115947 115600
990 115600 115255 114912 114571 114231 113894 113558 113223 112891 112560 112231 111903 111578 111254 110931 110610 110291 109974 109658 109344 109031 108720 108410 108102
986 108102 107796 107491 107188 106886 106586 106287 105990 105694 105400 105107 104815 104525 104237 103950 103664 103380 103097 102816 102535 102257 101979 101703 101429
983A01429k74k72k70k70k68k67k65k64k63k62k60k59k58k57k55k55k53k52k50k50k48k47k46
979I5464k45k43k43k41k40k39k38k37k36k35k33k33k31k30k30k28k27k26k25k24k23k22k21
976I0114k20k19k18k17k16k15k14k13k12k11k10k10k08k07k07k05k05k03k03k02k01k00j99
972H5299j98j98j96j96j94j94j93j93j91j90j90j89j88j87j86j86j85j84j83j82j82j80j80
969H0954j80j78j78j76j76j76j74j74j73j73j71j71j70j70j68j68j67j67j66j65j64j64j63
965G7022j62j62j61j60j59j59j59j57j57j56j56j55j54j54j53j52j52j51j50j50j49j48j48
962G3458j48j46j46j46j45j44j44j43j42j42j41j41j40j40j39j38j38j37j37j36j36j35j34
958G0220j34j33j33j32j32j31j31j30j30j29j28j28j28j27j26j26j25j25j25j23j24j23j22
$$ plain form
983 101429 101155 100883 100613 100343 100075 99808 99543 99279 99016 98754 98494 98235 97977 97720 97465 97210 96957 96705 96455 96205 95957 95710 95464
979 95464 95219 94976 94733 94492 94252 94013 93775 93538 93302 93067 92834 92601 92370 92140 91910 91682 91455 91229 91004 90780 90557 90335 90114
976 90114 89894 89675 89457 89240 89024 88809 88595 88382 88170 87959 87749 87539 87331 87124 86917 86712 86507 86304 86101 85899 85698 85498 85299
972 85299 85101 84903 84707 84511 84317 84123 83930 83737 83546 83356 83166 82977 82789 82602 82416 82230 82045 81861 81678 81496 81314 81134 80954
969 80954 80774 80596 80418 80242 80066 79890 79716 79542 79369 79196 79025 78854 78684 78514 78346 78178 78011 77844 77678 77513 77349 77185 77022
965 77022 76860 76698 76537 76377 76218 76059 75900 75743 75586 75430 75274 75119 74965 74811 74658 74506 74354 74203 74053 73903 73754 73606 73458
962 73458 73310 73164 73018 72872 72727 72583 72439 72296 72154 72012 71871 71730 71590 71450 71311 71173 71035 70898 70761 70625 70489 70354 70220
958 70220 70086 69953 69820 69688 69556 69425 69294 69164 69034 68905 68777 68649 68521 68394 68268 68142 68017 67892 67767 67644 67520 67397 67275
955F7275j22j21j21j21j19j20j19j18j18j18j17j16j16j16j15j15j14j14j13j13j12j12j11
951F4594j11j11j10j10j09j09j08j08j07j08j06j06j06j05j05j05j04j03j04j02j03j02j01
948F2151j02j00j01j00r9r9r9r8r8r8r7r7r6r6r6r5r5r4r4r4r3r3r3r2r2r1r1r1r0r0r0q9
943E9108q9q8q9q7q8q7q7q6q6q6q5q5q5q4q4q3q4q3q2q2q2q2q1q1q1q0q0p9q0p9p8p9p8p7
938E6281p7p7p7p7p6p5p6p5p5p4p4p4p4p3p3p3p2p2p2p1p1p1p1p0p0o9p0o9o9o8o8o8o8o7
932E3825o7o7o6o6o6o6o5o5o5o4o5o3o4o3o3o3o3o2o2o2o1o1o1o1o0o0o0o0n9n9n9n8n8n8
927E1703n8n8n7n7n6n7n6n6n6n5n5n5n5n4n4n4n3n4n3n3n2n3n2n2n1n2n1n1n0n1n0n0n0m9
922D9883m9m9m9m8m8m8m8m8m7m7m7m6m7m6m6m5m6m5m5m4m5m4m4m4m3m4m3m3m2m3m2m2m1m2
$$ plain form
955 67275 67153 67032 66911 66790 66671 66551 66432 66314 66196 66078 65961 65845 65729 65613 65498 65383 65269 65155 65042 64929 64817 64705 64594
951 64594 64483 64372 64262 64152 64043 63934 63826 63718 63611 63503 63397 63291 63185 63080 62975 62870 62766 62663 62559 62457 62354 62252 62151
948 62151 62049 61949 61848 61748 61649 61550 61451 61353 61255 61157 61060 60963 60867 60771 60675 60580 60485 60391 60297 60203 60110 60017 59924 59832 59740 59649 59558 59467 59377 59287 59197 59108
943 59108 59019 58931 58842 58755 58667 58580 58493 58407 58321 58235 58150 58065 57980 57896 57812 57729 57645 57562 57480 57398 57316 57234 57153 57072 56991 56911 56831 56752 56672 56593 56515 56436 56358 56281
938 56281 56204 56127 56050 55973 55897 55822 55746 55671 55596 55522 55448 55374 55300 55227 55154 55081 55009 54937 54865 54794 54723 54652 54581 54511 54441 54372 54302 54233 54164 54096 54028 53960 53892 53825
932 53825 53758 53691 53625 53559 53493 53427 53362 53297 53232 53168 53103 53040 52976 52913 52850 52787 52724 52662 52600 52538 52477 52416 52355 52294 52234 52174 52114 52054 51995 51936 51877 51819 51761 51703
927 51703 51645 51587 51530 51473 51417 51360 51304 51248 51192 51137 51082 51027 50972 50918 50864 50810 50757 50703 50650 50597 50545 50492 50440 50388 50337 50285 50234 50183 50133 50082 50032 49982 49932 49883
922 49883 49834 49785 49736 49688 49640 49592 49544 49496 49449 49402 49355 49309 49262 49216 49170 49125 49079 49034 48989 48945 48900 48856 48812 48768 48725 48681 48638 48595 48553 48510 48468 48426 48385 48343
917D8343m1m1m1m1m0m0m0m0l9l9l9l9l9l8l8l8l8l7l8l7l6l7l6l7l5l6l6l5l5l5l5l4l4l4
912D7065l4l3l4l3l3l3l2l2l2l2l2l1l1l1l1l1l0l0l0l0k9l0k9k9k8k9k8k8k8k8k7k7k7k7
906D6036k7k6k6k6k6k5k6k5k5k4k5k4k4k4k4k3k4k3k2k3k2k3k2k2k1k2k1k1k0k1k0k1j9k0
901D5249k0j9j9j9j9j8j9j8j8j7j8j7j7j7j6j7j6j6j6j6j5j5j5j5j5j4j4j4j4j3j4j3j3j2
896D4701j3j2j2j2j2j1j1j1j1j1j0j0j0j0j0rrrrqrqqpqppppoooononnmnmmmlmlllkkljkj
888D4330kj%j%%%%JJJJJKKKLKLLLMMMMMNNNNOOOOOPPPQQQQQRRRRJ0J0J0J0J1J1J1J1J2J1J2
879D4637J3J2J3J3J3J4J4J4J4J5J5J5J5J6J5J7J6J7J6J8J7J8J8J8J8J9J9J9K0K0K0K0K1K1
874D5200K1K1K2K2K2K3K3K3K3K4K4K4K5K4K6K5K6K6K6K6K7K7K8K7K9K8K8K9L0K9L0L0L1L0
$$ plain form
917 48343 48302 48261 48220 48179 48139 48099 48059 48019 47980 47941 47902 47863 47824 47786 47748 47710 47672 47635 47597 47560 47524 47487 47451 47414 47379 47343 47307 47272 47237 47202 47167 47133 47099 47065
912 47065 47031 46998 46964 46931 46898 46865 46833 46801 46769 46737 46705 46674 46643 46612 46581 46550 46520 46490 46460 46430 46401 46371 46342 46313 46285 46256 46228 46200 46172 46144 46117 46090 46063 46036
906 46036 46009 45983 45957 45931 45905 45880 45854 45829 45804 45780 45755 45731 45707 45683 45659 45636 45612 45589 45567 45544 45522 45499 45477 45455 45434 45412 45391 45370 45350 45329 45309 45288 45269 45249
901 45249 45229 45210 45191 45172 45153 45135 45116 45098 45080 45063 45045 45028 45011 44994 44978 44961 44945 44929 44913 44897 44882 44867 44852 44837 44822 44808 44794 44780 44766 44753 44739 44726 44713 44701
896 44701 44688 44676 44664 44652 44640 44629 44618 44607 44596 44585 44575 44565 44555 44545 44535 44526 44517 44508 44499 44491 44482 44474 44466 44459 44451 44444 44437 44430 44423 44417 44411 44405 44399 44394 44388 44383 44378 44374 44369 44365 44361 44357 44354 44350 44347 44344 44341 44339 44337 44334 44333 44331 44330
888 44330 44328 44327 44327 44326 44326 44326 44326 44326 44327 44328 44329 44330 44331 44333 44335 44337 44340 44342 44345 44348 44351 44355 44359 44363 44367 44371 44376 44381 44386 44391 44397 44403 44409 44415 44421 44428 44435 44442 44450 44458 44466 44474 44482 44491 44500 44509 44518 44528 44538 44548 44558 44569 44580 44591 44602 44614 44625 44637
879 44637 44650 44662 44675 44688 44701 44715 44729 44743 44757 44772 44787 44802 44817 44833 44848 44865 44881 44898 44914 44932 44949 44967 44985 45003 45021 45040 45059 45078 45098 45118 45138 45158 45179 45200
874 45200 45221 45242 45264 45286 45308 45331 45354 45377 45400 45424 45448 45472 45497 45521 45547 45572 45598 45624 45650 45676 45703 45730 45758 45785 45814 45842 45870 45899 45929 45958 45988 46018 46049 46079
869D6079L1L2L1L2L3L2L3L3L4L4L4L5L4L6L5L6L6L7L6L8L7L8L8L9L8M0L9M0M0M1M1M1M1M2
864D7316M3M2M3M4M3M4M5M5M5M6M5M7M6M8M7M8M8M9M8N0N0N0N0N1N1N2N2N3N3N3N4N4N4N5
858D8964N5N6N6N7N7N8N7N9N9N9N9O0O1O1O1O2O2O3O3O4O4O5O5O5O6O6O7O8O8O8O9O9P0P0
853E1093P1P1P2P2P3P3P4P5P4P6P6P6P7P8P8P8P9Q0Q0Q1Q1Q2Q2Q3Q4Q4Q5Q5Q6Q6Q7Q8Q8Q9
848E3797Q9R0R1R1R2R2R3R4R4R5R6R6R7R7R9R8J00J00J01J02J02J03J03J05J05J05J07J07
844E6541J08J08J09J10J11J12J12J13J13J15J15J16J17J17J19J19J20J21J21J23J23J24J25
840E9212J25J27J27J28J29J30J31J32J32J34J34J35J36J37J38J39J40J41J42J42J44J45J45
837F2325J47J47J49J49J51J51J53J54J54J56J57J58J59J60J61J62J63J65J65J67J68J69J70
$$ plain form
869 46079 46110 46142 46173 46205 46238 46270 46303 46336 46370 46404 46438 46473 46507 46543 46578 46614 46650 46687 46723 46761 46798 46836 46874 46913 46951 46991 47030 47070 47110 47151 47192 47233 47274 47316
864 47316 47359 47401 47444 47488 47531 47575 47620 47665 47710 47756 47801 47848 47894 47942 47989 48037 48085 48134 48182 48232 48282 48332 48382 48433 48484 48536 48588 48641 48694 48747 48801 48855 48909 48964
858 48964 49019 49075 49131 49188 49245 49303 49360 49419 49478 49537 49596 49656 49717 49778 49839 49901 49963 50026 50089 50153 50217 50282 50347 50412 50478 50544 50611 50679 50747 50815 50884 50953 51023 51093
853 51093 51164 51235 51307 51379 51452 51525 51599 51674 51748 51824 51900 51976 52053 52131 52209 52287 52366 52446 52526 52607 52688 52770 52852 52935 53019 53103 53188 53273 53359 53445 53532 53620 53708 53797
848 53797 53886 53976 54067 54158 54250 54342 54435 54529 54623 54718 54814 54910 55007 55104 55203 55301 55401 55501 55602 55704 55806 55909 56012 56117 56222 56327 56434 56541
844 56541 56649 56757 56866 56976 57087 57199 57311 57424 57537 57652 57767 57883 58000 58117 58236 58355 58475 58596 58717 58840 58963 59087 59212
840 59212 59337 59464 59591 59719 59848 59978 60109 60241 60373 60507 60641 60776 60912 61049 61187 61326 61466 61607 61749 61891 62035 62180 62325
837 62325 62472 62619 62768 62917 63068 63219 63372 63526 63680 63836 63993 64151 64310 64470 64631 64793 64956 65121 65286 65453 65621 65790 65960
833F5960J71J72J74J75J76J77J78J80J81J82J84J84J86J88J88J90J91J93J94J95J97J98J99
830G0213K01K02K03K05K07K08K09K11K13K13K16K17K18K20K22K23K25K26K28K30K31K33K35
826G5209K36K38K40K42K43K45K47K48K51K52K54K56K58K60K62K63K66K68K69K72K73K76K78
823H1106K79K82K84K86K89K90K93K95K97K99L02L04L06L09L11L13L16L18L21L23L26L28L31
819H8108L33L36L39L41L44L47L49L53L55L58L60L64L66L70L72L76L78L82L84L88L91L94L97
816I6485M01M04M07M10M14M17M21M25M28M31M35M39M42M46M50M54M58M61M66M69M74M77M82
812A06596M86M90M95M98N03N08N12N16N21N26N30N35N40N45N49N55N59N65N70N74N81N85N91
809A18930N96O02O07O13O19O24O31O36O42O48O55O61O67O73O80O86O93P00P06P14P20P27P35
$$ plain form
833 65960 66131 66303 66477 66652 66828 67005 67183 67363 67544 67726 67910 68094 68280 68468 68656 68846 69037 69230 69424 69619 69816 70014 70213
830 70213 70414 70616 70819 71024 71231 71439 71648 71859 72072 72285 72501 72718 72936 73156 73378 73601 73826 74052 74280 74510 74741 74974 75209
826 75209 75445 75683 75923 76165 76408 76653 76900 77148 77399 77651 77905 78161 78419 78679 78941 79204 79470 79738 80007 80279 80552 80828 81106
823 81106 81385 81667 81951 82237 82526 82816 83109 83404 83701 84000 84302 84606 84912 85221 85532 85845 86161 86479 86800 87123 87449 87777 88108
819 88108 88441 88777 89116 89457 89801 90148 90497 90850 91205 91563 91923 92287 92653 93023 93395 93771 94149 94531 94915 95303 95694 96088 96485
816 96485 96886 97290 97697 98107 98521 98938 99359 99784 100212 100643 101078 101517 101959 102405 102855 103309 103767 104228 104694 105163 105637 106114 106596
812 106596 107082 107572 108067 108565 109068 109576 110088 110604 111125 111651 112181 112716 113256 113801 114350 114905 115464 116029 116599 117173 117754 118339 118930
809 118930 119526 120128 120735 121348 121967 122591 123222 123858 124500 125148 125803 126464 127131 127804 128484 129170 129863 130563 131269 131983 132703 133430 134165
805A34165P42P49P56P64P72P79P88P95Q03Q12Q19Q29Q36Q45Q54Q63Q72Q80Q90R00R09R18R28
802A53268R39R48R58R69R79R89J001J011J023J033J046J056J069J080J093J105J117J130J143
799A72957J156J169J183J196J210J225J238J254J268J283J298J314J329J346J362J378J396
796A94562J412J430J447J466J483J503J521J540J560J580J600J621J641J663J685J706J730
794B21150J752J775J799J823J848J873J898J925J951J978K005K033K062K091K121K151K181
791B54416K214K245K278K311K346K380K415K452K489K526K565K604K644K686K727K770K813
788B96881K858K904K951K998L047L097L147L200L254L308L363L422L479L540L601L664L728
786C52442L795L862L932M002M076M150M228M306M387M469M556M642M732M825M920N017N117
$$ plain form
805 134165 134907 135656 136412 137176 137948 138727 139515 140310 141113 141925 142744 143573 144409 145254 146108 146971 147843 148723 149613 150513 151422 152340 153268
802 153268 154207 155155 156113 157082 158061 159050 160051 161062 162085 163118 164164 165220 166289 167369 168462 169567 170684 171814 172957
799 172957 174113 175282 176465 177661 178871 180096 181334 182588 183856 185139 186437 187751 189080 190426 191788 193166 194562
796 194562 195974 197404 198851 200317 201800 203303 204824 206364 207924 209504 211104 212725 214366 216029 217714 219420 221150
794 221150 222902 224677 226476 228299 230147 232020 233918 235843 237794 239772 241777 243810 245872 247963 250084 252235 254416
791 254416 256630 258875 261153 263464 265810 268190 270605 273057 275546 278072 280637 283241 285885 288571 291298 294068 296881
788 296881 299739 302643 305594 308592 311639 314736 317883 321083 324337 327645 331008 334430 337909 341449 345050 348714 352442
786 352442 356237 360099 364031 368033 372109 376259 380487 384793 389180 393649 398205 402847 407579 412404 417324 422341 427458
783D27458N221N326N436N548N664N782N906O032O162O296O435O577O725O877P035P196P365
781E33041P537P717P903Q094Q293Q498Q712Q933R162R400R646R903J0169J0446J0734J1033
778F79221J1346J1670J2009J2362J2731J3117J3519J3939J4381J4841J5326J5832J6366J6924
776H73584J7514J8133J8785J9474K0200K0969K1781K2643K3555K4524K5556K6653K7824K9073
774A190268L0411L1842L3379L5032L6812L8732M0810M3061M5508M8172N1081N4266N7762O1613
772A798749O5868P0585P5833Q1694Q8268R5672J04051J13581J24476J37006J51503J68390
770C075676J88200K11624K39555K73170L14039L64281M26812N05707O06774P38475R13433
768G857746J150996J481713J955446K656535L732827N450932Q290095J3013365K0150028K7003530
$$ plain form
783 427458 432679 438005 443441 448989 454653 460435 466341 472373 478535 484831 491266 497843 504568 511445 518480 525676 533041
781 533041 540578 548295 556198 564292 572585 581083 589795 598728 607890 617290 626936 636839 647008 657454 668188 679221
778 679221 690567 702237 714246 726608 739339 752456 765975 779914 794295 809136 824462 840294 856660 873584
776 873584 891098 909231 928016 947490 967690 988659 1010440 1033083 1056638 1081162 1106718 1133371 1161195 1190268
774 1190268 1220679 1252521 1285900 1320932 1357744 1396476 1437286 1480347 1525855 1574027 1625108 1679374 1737136 1798749
772 1798749 1864617 1935202 2011035 2092729 2180997 2276669 2380720 2494301 2618777 2755783 2907286 3075676
770 3075676 3263876 3475500 3715055 3988225 4302264 4666545 5093357 5599064 6205838 6944313 7857746
768 7857746 9008742 10490455 12445901 15102436 18835263 24286195 32576290 45589655 65739683 92743213
767I2743213K4763146R907668r799040k4581673k6721886j9834502j2706226p991305n152184
765B0627211l427293k339081j621776j127742p72473n05656k96070j23446K6032J62363K93334
764A0895403M25588N65384P19271Q94721J100927J349815J657526K046669K549891L215707
762B5420902M118417N375481P179113R855659J3980161K0596717L1599629N0045252P8120496
761B46291827J04983927R5170450L5892980m1038866r7513653j03492219p5542240m8081168
759A16671038l0289239j9685525j3287742r279251o660825m880966l625532k708614k015816
758B4237528j474037j034724o64274l38269l7867K52627N47531Q61317J210079J613317K096279
756B7269507K693404L453685M449369N790709P651788J0317540J4272186K0369986L0163336
$$ plain form
767 92743213 117506359 127414027 117614987 93033314 66311428 46476926 33770700 25779395 20627211
765 20627211 17199918 14860837 13239061 12111319 11338846 10833190 10537120 10413674 10439706 10602069 10895403
764 10895403 11320991 11886375 12605646 13500367 14601294 15951109 17608635 19655304 22205195 25420902
762 25420902 29539319 34914800 42093913 51949572 65929733 86526450 118126079 168171331 246291827
761 246291827 351275754 446446204 482339184 441300318 343786665 240294446 164752206 116671038
759 116671038 86381799 66696274 53408532 44129281 37468456 32587490 28961958 26253344 24237528
758 24237528 22763491 21728767 21064493 20726224 20688357 20940984 21488515 22349832 23559911 25173228 27269507
756 27269507 29962911 33416596 37865965 43656674 51308462 61626002 75898188 96268174 126431510
755A26431510M6464831P3764450J14958646J52901742J35487913M7400601o3967319j43495729
754D89946645j49186865j07925489o8632275m3365476k8325275j9248611j3561891r851403
753D9849360p336513n572293m295404l344057k615274k041243j575789j186306q48800n44651
751B0489030k58419K3833L15965O33222R93952J421982J950136K625868L520648M746274O484314
749D2946805R041075J2952720J9185189K9472440M6559449P2227537R6214039Q6468925L0558458
748D45626637m2150323r1812009r3903318o7882747m3473041k7716932j8266760j2521849
747D7899658q901317o529130m917592l786822k970275k365259j906315j550418j268453j040170
745A2663907q51061o90388n49884m22842l03432j86142o5200O6057K16070L96352O23578R23133
$$ plain form
755 126431510 172896341 246660791 361619437 514521179 650009092 697409693 633442374 489946645
754 489946645 340759780 232834291 164202016 120836540 92511265 73262654 59700763 49849360
753 49849360 42512847 36940554 32645150 29301093 26685819 24644576 23068787 21882481 21033681 20489030
751 20489030 20230611 20254444 20570409 21203631 22197583 23619565 25569701 28195569 31716217 36462491 42946805
749 42946805 51987880 64940600 84125789 113598229 160157678 232385215 328599254 415068179 445626637
748 445626637 403476314 311664305 217760987 149878240 106405199 78688267 60421507 47899658
747 47899658 38998341 32469211 27551619 23764797 20794522 18429263 16522948 14972530 13704077 12663907
745 12663907 11812846 11122458 10572574 10149732 9846300 9660158 9594958 9661015 9877085 10273437 10897015 11820148
743A1820148J335385J927175K813495M198543O447948J0166744J5946441K2310709K2027494
742I8994082Q190545j2193233k3322280k1494630j4881540r524953o166816m140572k890415
741A2570188k090552j559570j194981r37026p49649o10341n04630m22943l58790l07668k66396
739C567642k32678k04833j81611j62071j45491j31315j19111j08533r9310r1224q4096p7783
737A929586p2164o7143o2638n8581n4912n1586m8559m5796m3270m0950l8816l6849l5031l3346
735A239945l1783l0330k8976k7712k6530k5424k4386k3411k2495k1632k0817k0049j9323j8635
733H98442j7983j7366j6779j6222j5692j5188j4706j4249j3810j3393j2993j2612j2246j1895
731F93308j1560j1238j0929j0633j0347j0074r810r557r312r078q851q632q422q218q022p833
$$ plain form
743 11820148 13155533 15082708 17896203 22094746 28542694 38709438 54655879 76966588 98994082
742 98994082 107184627 94991394 71669114 50174484 35292944 25767991 19601175 15460603 12570188
741 12570188 10479636 8920066 7725085 6788059 6038410 5428069 4923439 4500496 4141706 3834038 3567642
739 3567642 3334964 3130131 2948520 2786449 2640958 2509643 2390532 2281999 2182689 2091465 2007369 1929586
737 1929586 1857422 1790279 1727641 1669060 1614148 1562562 1514003 1468207 1424937 1383987 1345171 1308322 1273291 1239945
735 1239945 1208162 1177832 1148856 1121144 1094614 1069190 1044804 1021393 998898 977266 956449 936400 917077 898442
733 898442 880459 863093 846314 830092 814400 799212 784506 770257 756447 743054 730061 717449 705203 693308
731 693308 681748 670510 659581 648948 638601 628527 618717 609160 599848 590770 581919 573287 564865 556647 548625 540792
728E40792p649p472p301p135o975o820o669o524o383o246o113n985n860n739n622n507n396
726D31396n289n184n082m983m886m793m702m613m527m443m360m281m203m128m053l982l911
723C53976l842l776l711l646l585l524l465l407l350l295l242l188l137l087l037k989k942
721B96753k896k851k807k763k722k680k639k600k561k523k485k450k413k379k344k310k277
718B53053k246k213k182k152k122k093k063k036k008j980j954j928j902j877j852j828j804
715B18813j781j757j735j712j691j669j648j628j607j587j567j548j529j510j492j474j456
713A91422j439j421j404j388j372j355j339j324j309j293j279j263j250j235j221j208j194
710A69128j181j167j155j142j129j117j105j093j081j069j058j047j035j025j014j003r92
$$ plain form
728 540792 533143 525671 518370 511235 504260 497440 490771 484247 477864 471618 465505 459520 453660 447921 442299 436792 431396
726 431396 426107 420923 415841 410858 405972 401179 396477 391864 387337 382894 378534 374253 370050 365922 361869 357887 353976
723 353976 350134 346358 342647 339001 335416 331892 328427 325020 321670 318375 315133 311945 308808 305721 302684 299695 296753
721 296753 293857 291006 288199 285436 282714 280034 277395 274795 272234 269711 267226 264776 262363 259984 257640 255330 253053
718 253053 250807 248594 246412 244260 242138 240045 237982 235946 233938 231958 230004 228076 226174 224297 222445 220617 218813
715 218813 217032 215275 213540 211828 210137 208468 206820 205192 203585 201998 200431 198883 197354 195844 194352 192878 191422
713 191422 189983 188562 187158 185770 184398 183043 181704 180380 179071 177778 176499 175236 173986 172751 171530 170322 169128
710 169128 167947 166780 165625 164483 163354 162237 161132 160039 158958 157889 156831 155784 154749 153724 152710 151707 150715
708A50715r82r72r62r52r42r33r23r14r04q95q86q78q68q60q52q43q35q26q19q10q03p95p87
704A30474p80p72p65p58p50p43p37p29p23p16p09p03o96o90o84o77o71o66o59o53o47o42o36
701A14268o30o24o19o14o08o03n98n92n88n82n77n72n68n62n58n53n49n43n40n34n31n25n22
697A01076n17n13n08n05n00m97m92m88m84m81m76m73m69m65m62m58m54m51m47m43m40m37m34
694I0182m30m26m24m20m17m14m10m08m04m01l99l95l92l90l86l84l81l78l75l73l69l67l65
690H1074l61l59l57l54l51l49l46l44l42l39l36l34l32l30l27l25l23l20l18l16l14l12l09
687G3376l07l06l03l01k99k97k95k93k91k89k88k85k83k82k79k78k76k74k73k70k69k67k65
683F6806k64k62k60k58k57k55k54k52k50k49k47k46k44k42k41k40k38k36k35k34k32k31k29
$$ plain form
708 150715 149733 148761 147799 146847 145905 144972 144049 143135 142231 141336 140450 139572 138704 137844 136992 136149 135314 134488 133669 132859 132056 131261 130474
704 130474 129694 128922 128157 127399 126649 125906 125169 124440 123717 123001 122292 121589 120893 120203 119519 118842 118171 117505 116846 116193 115546 114904 114268
701 114268 113638 113014 112395 111781 111173 110570 109972 109380 108792 108210 107633 107061 106493 105931 105373 104820 104271 103728 103188 102654 102123 101598 101076
697 101076 100559 100046 99538 99033 98533 98036 97544 97056 96572 96091 95615 95142 94673 94208 93746 93288 92834 92383 91936 91493 91053 90616 90182
694 90182 89752 89326 88902 88482 88065 87651 87241 86833 86429 86028 85629 85234 84842 84452 84066 83682 83301 82923 82548 82175 81806 81439 81074
690 81074 80713 80354 79997 79643 79292 78943 78597 78253 77911 77572 77236 76902 76570 76240 75913 75588 75265 74945 74627 74311 73997 73685 73376
687 73376 73069 72763 72460 72159 71860 71563 71268 70975 70684 70395 70107 69822 69539 69257 68978 68700 68424 68150 67877 67607 67338 67071 66806
683 66806 66542 66280 66020 65762 65505 65250 64996 64744 64494 64245 63998 63752 63508 63266 63025 62785 62547 62311 62076 61842 61610 61379 61150
680F1150k28k26k25k24k22k21k20k18k17k16k14k13k12k10k10k08k07k05k05k03k02k00k00
676E6244j98j98j96j95j94j92j92j90j90j88j87j87j85j84j83j82j81j80j79j77j77j76j75
672E1958j74j73j72j71j70j69j69j67j66j66j65j63j63j62j61j60j59j59j57j57j56j55j54
669D8190j54j52j52j51j50j50j49j47j47j47j45j45j44j43j43j42j41j40j40j38j39j37j37
665D4857j36j35j35j34j33j33j32j31j31j30j29j29j28j28j26j27j25j25j24j24j23j23j22
662D1894j21j21j20j19j19j19j17j18j16j16j16j15j14j14j14j13j12j12j11j11j10j09j10
658C9247j08j08j08j07j07j06j05j06j04j04j04j03j03j02j02j02j00j01j00r9r9r9r8r8r7
655C6677r7r7r6r5r5r5r4r4r4r3r2r2r2r2r1r0r1q9r0q9q8q9q8q7q7q7q6q6q6q5q5q5q4q4
$$ plain form
680 61150 60922 60696 60471 60247 60025 59804 59584 59366 59149 58933 58719 58506 58294 58084 57874 57666 57459 57254 57049 56846 56644 56444 56244
676 56244 56046 55848 55652 55457 55263 55071 54879 54689 54499 54311 54124 53937 53752 53568 53385 53203 53022 52842 52663 52486 52309 52133 51958
672 51958 51784 51611 51439 51268 51098 50929 50760 50593 50427 50261 50096 49933 49770 49608 49447 49287 49128 48969 48812 48655 48499 48344 48190
669 48190 48036 47884 47732 47581 47431 47281 47132 46985 46838 46691 46546 46401 46257 46114 45971 45829 45688 45548 45408 45270 45131 44994 44857
665 44857 44721 44586 44451 44317 44184 44051 43919 43788 43657 43527 43398 43269 43141 43013 42887 42760 42635 42510 42386 42262 42139 42016 41894
662 41894 41773 41652 41532 41413 41294 41175 41058 40940 40824 40708 40592 40477 40363 40249 40135 40022 39910 39798 39687 39576 39466 39357 39247
658 39247 39139 39031 38923 38816 38709 38603 38498 38392 38288 38184 38080 37977 37874 37772 37670 37568 37468 37367 37267 37168 37069 36970 36872 36774 36677
655 36677 36580 36483 36387 36292 36197 36102 36008 35914 35820 35727 35635 35543 35451 35359 35268 35178 35087 34998 34908 34819 34731 34642 34554 34467 34380 34293 34207 34121 34035 33950 33865 33780 33696 33612
649C3612q3q3q3q3q2q1q2q1q1q0q0q0p9p9p9p8p8p8p7p7p7p7p6p6p5p5p5p5p4p4p4p3p3p3
644C0961p3p2p2p2p1p1p1p0p1p0o9p0o9o9o8o9o8o7o8o7o7o7o6o7o6o5o6o5o5o5o4o4o4o4
639B8649o3o3o3o3o3o2o2o2o1o2o1o1o0o1o0o0o0n9n9n9n9n9n8n9n7n8n8n7n7n7n7n6n7n6
634B6620n6n5n6n5n5n5n5n4n5n4n4n3n4n3n3n3n3n3n2n2n2n2n2n1n2n1n1n0n1n0n1n0m9n0
629B4828n0m9m9m9m9m9m8m9m8m8m8m7m8m7m7m7m7m7m7m6m6m6m6m6m6m5m6m5m5m5m4m5m4m5
623B3235m4m4m3m4m4m3m3m4m2m3m3m3m2m2m2m2m2m2m2m1m1m2m1m1m0m1m1m0m0m0m0m0m0m0
618B1813l9m0l9l9l9l9l9l8l9l8l9l8l8l8l8l7l8l7l8l7l7l7l7l7l6l7l6l7l6l6l6l6l6l5
613B0537l6l5l6l5l5l5l5l5l4l5l4l5l4l4l4l4l4l4l4l3l4l3l3l4l3l3l2l3l3l3l2l2l3l2
$$ plain form
649 33612 33529 33446 33363 33280 33198 33117 33035 32954 32873 32793 32713 32633 32554 32475 32396 32318 32240 32162 32085 32008 31931 31854 31778 31702 31627 31552 31477 31402 31328 31254 31180 31107 31034 30961
644 30961 30888 30816 30744 30672 30601 30530 30459 30389 30318 30248 30179 30109 30040 29971 29903 29834 29766 29699 29631 29564 29497 29430 29364 29297 29231 29166 29100 29035 28970 28905 28841 28777 28713 28649
639 28649 28586 28523 28460 28397 28334 28272 28210 28148 28087 28025 27964 27903 27843 27782 27722 27662 27602 27543 27484 27425 27366 27307 27249 27190 27133 27075 27017 26960 26903 26846 26789 26733 26676 26620
634 26620 26564 26509 26453 26398 26343 26288 26233 26179 26124 26070 26016 25963 25909 25856 25803 25750 25697 25644 25592 25540 25488 25436 25384 25333 25281 25230 25179 25129 25078 25028 24977 24927 24878 24828
629 24828 24778 24729 24680 24631 24582 24533 24485 24436 24388 24340 24292 24245 24197 24150 24103 24056 24009 23962 23915 23869 23823 23777 23731 23685 23639 23594 23548 23503 23458 23413 23369 23324 23280 23235
623 23235 23191 23147 23104 23060 23016 22973 22930 22886 22844 22801 22758 22715 22673 22631 22589 22547 22505 22463 22421 22380 22339 22297 22256 22215 22175 22134 22093 22053 22013 21973 21933 21893 21853 21813
618 21813 21774 21734 21695 21656 21617 21578 21539 21501 21462 21424 21385 21347 21309 21271 21233 21196 21158 21121 21083 21046 21009 20972 20935 20898 20862 20825 20789 20752 20716 20680 20644 20608 20572 20537
613 20537 20501 20466 20430 20395 20360 20325 20290 20255 20221 20186 20152 20117 20083 20049 20015 19981 19947 19913 19879 19846 19812 19779 19746 19712 19679 19646 19614 19581 19548 19515 19483 19451 19418 19386
608A9386l2l2l2l2l2l1l2l1l2l1l1l1l1l1l1l1l1l0l1l0l0l1l0l0l0l0l0k9l0k9l0k9l0k9
603A8344k9k9k9k9k9k8k9k9k8k9k8k8k8k9k8k8k7k8k8k8k7k8k7k7k8k7k7k7k7k7k7k6k7k7
598A7397k6k7k6k6k7k6k6k6k6k6k6k6k5k6k5k6k5k6k5k5k5k6k5k5k4k5k5k5k4k5k4k5k4k5
592A6533k4k4k4k4k4k4k4k4k4k3k4k3k4k3k4k3k3k4k3k3k3k3k3k3k2k3k3k3k2k3k2k2k3k2
587A5743k2k3k2k2k2k2k2k1k2k2k2k1k2k1k2k1k2k1k1k1k2k1k1k1k1k1k1k0k1k1k0k1k1k0
582A5017k0k1k0k1k0k0k0k0k0k0k0k0k0k0k0j9k0k0j9k0j9k0j9j9k0j9j9j9k0j9j9j9j9j9
577A4348j8j9j9j9j8j9j9j8j9j8j9j8j8j9j8j8j8j8j8j9j8j7j8j8j8j8j8j7j8j8j7j8j7j8
572A3731j7j8j7j7j8j7j7j7j7j8j7j7j7j7j6j7j7j7j7j6j7j7j6j7j6j7j6j7j6j6j7j6j6j7
$$ plain form
608 19386 19354 19322 19290 19258 19226 19195 19163 19132 19100 19069 19038 19007 18976 18945 18914 18883 18852 18822 18791 18761 18731 18700 18670 18640 18610 18580 18550 18521 18491 18462 18432 18403 18373 18344
603 18344 18315 18286 18257 18228 18199 18171 18142 18113 18085 18056 18028 18000 17972 17943 17915 17887 17860 17832 17804 17776 17749 17721 17694 17667 17639 17612 17585 17558 17531 17504 17477 17451 17424 17397
598 17397 17371 17344 17318 17292 17265 17239 17213 17187 17161 17135 17109 17083 17058 17032 17007 16981 16956 16930 16905 16880 16855 16829 16804 16779 16755 16730 16705 16680 16656 16631 16607 16582 16558 16533
592 16533 16509 16485 16461 16437 16413 16389 16365 16341 16317 16294 16270 16247 16223 16200 16176 16153 16130 16106 16083 16060 16037 16014 15991 15968 15946 15923 15900 15877 15855 15832 15810 15788 15765 15743
587 15743 15721 15698 15676 15654 15632 15610 15588 15567 15545 15523 15501 15480 15458 15437 15415 15394 15372 15351 15330 15309 15287 15266 15245 15224 15203 15182 15161 15141 15120 15099 15079 15058 15037 15017
582 15017 14997 14976 14956 14935 14915 14895 14875 14855 14835 14815 14795 14775 14755 14735 14715 14696 14676 14656 14637 14617 14598 14578 14559 14540 14520 14501 14482 14463 14443 14424 14405 14386 14367 14348
577 14348 14330 14311 14292 14273 14255 14236 14217 14199 14180 14162 14143 14125 14107 14088 14070 14052 14034 14016 13998 13979 13961 13944 13926 13908 13890 13872 13854 13837 13819 13801 13784 13766 13749 13731
572 13731 13714 13696 13679 13662 13644 13627 13610 13593 13576 13558 13541 13524 13507 13490 13474 13457 13440 13423 13406 13390 13373 13356 13340 13323 13307 13290 13274 13257 13241 13225 13208 13192 13176 13159
566A3159j6j6j6j6j6j6j6j6j6j6j5j6j6j6j5j6j6j5j6j5j6j5j6j5j5j6j5j5j5j6j5j5j5j5
561A2629j5j5j5j5j5j5j5j4j5j5j5j4j5j5j4j5j4j5j4j5j4j5j4j4j4j5j4j4j4j4j5j4j4j4
556A2135j4j4j4j4j3j4j4j4j4j3j4j4j4j3j4j3j4j3j4j3j4j3j4j3j3j4j3j3j3j4j3j3j3j3
551A1675j3j3j3j3j3j3j3j3j3j3j2j3j3j3j2j3j3j2j3j3j2j3j2j3j2j3j2j2j3j2j2j3j2j2
546A1245j2j3j2j2j2j2j2j2j2j2j2j2j2j2j2j2j2j2j1j2j2j2j1j2j2j1j2j2j1j2j1j2j1j2
540A0842j1j2j1j2j1j1j2j1j1j1j2j1j1j1j1j2j1j1j1j1j1j1j1j1j1j1j1j1j1j0j1j1j1j1
535A0464j0j1j1j0j1j1j0j1j1j0j1j0j1j0j1j0j1j0j1j0j0j1j0j0j1j0j0j0j1j0j0j0j0j1
530A0109j0j0j0j0j0j0j0j0j0j0j0j0j0rj0j0j0j0j0rj0j0j0rj0j0rj0j0rj0rj0j0rj0rj0
$$ plain form
566 13159 13143 13127 13111 13095 13079 13063 13047 13031 13015 12999 12984 12968 12952 12936 12921 12905 12889 12874 12858 12843 12827 12812 12796 12781 12766 12750 12735 12720 12705 12689 12674 12659 12644 12629
561 12629 12614 12599 12584 12569 12554 12539 12524 12510 12495 12480 12465 12451 12436 12421 12407 12392 12378 12363 12349 12334 12320 12305 12291 12277 12263 12248 12234 12220 12206 12192 12177 12163 12149 12135
556 12135 12121 12107 12093 12079 12066 12052 12038 12024 12010 11997 11983 11969 11955 11942 11928 11915 11901 11888 11874 11861 11847 11834 11820 11807 11794 11780 11767 11754 11741 11727 11714 11701 11688 11675
551 11675 11662 11649 11636 11623 11610 11597 11584 11571 11558 11545 11533 11520 11507 11494 11482 11469 11456 11444 11431 11418 11406 11393 11381 11368 11356 11343 11331 11319 11306 11294 11282 11269 11257 11245
546 11245 11233 11220 11208 11196 11184 11172 11160 11148 11136 11124 11112 11100 11088 11076 11064 11052 11040 11028 11017 11005 10993 10981 10970 10958 10946 10935 10923 10911 10900 10888 10877 10865 10854 10842
540 10842 10831 10819 10808 10796 10785 10774 10762 10751 10740 10729 10717 10706 10695 10684 10673 10661 10650 10639 10628 10617 10606 10595 10584 10573 10562 10551 10540 10529 10518 10508 10497 10486 10475 10464
535 10464 10454 10443 10432 10422 10411 10400 10390 10379 10368 10358 10347 10337 10326 10316 10305 10295 10284 10274 10263 10253 10243 10232 10222 10212 10201 10191 10181 10171 10160 10150 10140 10130 10120 10109
530 10109 10099 10089 10079 10069 10059 10049 10039 10029 10019 10009 9999 9989 9979 9970 9960 9950 9940 9930 9920 9911 9901 9891 9881 9872 9862 9852 9843 9833 9823 9814 9804 9795 9785 9775 9766 9756 9747 9737
524I737rj0rrj0rrj0rrj0rrj0rrrrj0rrrrrrrrj0rrrrqrrrrrrrrqrrrrqrrrqrrqrqrrqrqr
515I180qrqrqrqrqqrqrqqrqqqrqqqrqqqqqrqqqqqqqqqqqqqqqqqqqqpqqqqpqqqqpqqpqqpqq
504H623pqqpqpqpqqpqppqpqpqpqppqppqppqpppqpppqpppppqppppppppppppppppppppppppp
494H123opppppopppopppopppoppoppopoppopopopopopopopopopoopoopopooopoopooopooo
483G673pooooopooooooopoooooooooooooooooooonooooooonooooonooonooonooonoonoono
473G264ononoononoonononononononononnononnononnonnonnonnonnnonnnonnnnonnnnonn
462F892nnnnnonnnnnnnnnnnnnnnnnnnnnnnnnnnnnnnnnmnnnnnnnmnnnnmnnnnmnnnnmnnmnnn
452F552mnnmnnmnnmnnmnnmnnmnmnmnnmnmnmnmnnmnmnmnmmnmnmnmnmnmmnmnmmnmnmmnmmnmm
$$ plain form
524 9737 9728 9718 9709 9700 9690 9681 9672 9662 9653 9644 9634 9625 9616 9606 9597 9588 9579 9570 9560 9551 9542 9533 9524 9515 9506 9497 9488 9478 9469 9460 9451 9442 9434 9425 9416 9407 9398 9389 9380 9371 9362 9354 9345 9336 9327 9318 9310 9301 9292 9283 9275 9266 9257 9249 9240 9232 9223 9214 9206 9197 9189 9180
515 9180 9172 9163 9155 9146 9138 9129 9121 9112 9104 9096 9087 9079 9070 9062 9054 9045 9037 9029 9021 9012 9004 8996 8988 8979 8971 8963 8955 8947 8939 8930 8922 8914 8906 8898 8890 8882 8874 8866 8858 8850 8842 8834 8826 8818 8810 8802 8794 8786 8778 8770 8763 8755 8747 8739 8731 8724 8716 8708 8700 8692 8685 8677 8669 8662 8654 8646 8639 8631 8623
504 8623 8616 8608 8600 8593 8585 8578 8570 8563 8555 8547 8540 8532 8525 8518 8510 8503 8495 8488 8480 8473 8465 8458 8451 8443 8436 8429 8421 8414 8407 8399 8392 8385 8378 8370 8363 8356 8349 8341 8334 8327 8320 8313 8306 8298 8291 8284 8277 8270 8263 8256 8249 8242 8235 8228 8221 8214 8207 8200 8193 8186 8179 8172 8165 8158 8151 8144 8137 8130 8123
494 8123 8117 8110 8103 8096 8089 8082 8076 8069 8062 8055 8049 8042 8035 8028 8022 8015 8008 8001 7995 7988 7981 7975 7968 7961 7955 7948 7942 7935 7928 7922 7915 7909 7902 7896 7889 7883 7876 7870 7863 7857 7850 7844 7837 7831 7824 7818 7811 7805 7799 7792 7786 7780 7773 7767 7760 7754 7748 7742 7735 7729 7723 7716 7710 7704 7698 7691 7685 7679 7673
483 7673 7666 7660 7654 7648 7642 7636 7629 7623 7617 7611 7605 7599 7593 7587 7580 7574 7568 7562 7556 7550 7544 7538 7532 7526 7520 7514 7508 7502 7496 7490 7484 7478 7472 7466 7460 7455 7449 7443 7437 7431 7425 7419 7413 7408 7402 7396 7390 7384 7378 7373 7367 7361 7355 7350 7344 7338 7332 7327 7321 7315 7309 7304 7298 7292 7287 7281 7275 7270 7264
473 7264 7258 7253 7247 7242 7236 7230 7225 7219 7214 7208 7202 7197 7191 7186 7180 7175 7169 7164 7158 7153 7147 7142 7136 7131 7125 7120 7114 7109 7104 7098 7093 7087 7082 7077 7071 7066 7060 7055 7050 7044 7039 7034 7028 7023 7018 7012 7007 7002 6996 6991 6986 6981 6975 6970 6965 6960 6954 6949 6944 6939 6934 6928 6923 6918 6913 6908 6902 6897 6892
462 6892 6887 6882 6877 6872 6867 6861 6856 6851 6846 6841 6836 6831 6826 6821 6816 6811 6806 6801 6796 6791 6786 6781 6776 6771 6766 6761 6756 6751 6746 6741 6736 6731 6726 6721 6716 6711 6706 6701 6696 6692 6687 6682 6677 6672 6667 6662 6657 6653 6648 6643 6638 6633 6629 6624 6619 6614 6609 6605 6600 6595 6590 6585 6581 6576 6571 6567 6562 6557 6552
452 6552 6548 6543 6538 6534 6529 6524 6520 6515 6510 6506 6501 6496 6492 6487 6482 6478 6473 6468 6464 6459 6455 6450 6446 6441 6436 6432 6427 6423 6418 6414 6409 6405 6400 6395 6391 6386 6382 6377 6373 6368 6364 6360 6355 6351 6346 6342 6337 6333 6328 6324 6319 6315 6311 6306 6302 6297 6293 6289 6284 6280 6275 6271 6267 6262 6258 6254 6249 6245 6241
441F241nmmnmmmnmmnmmmnmmmnmmmnmmmmmnmmmmnmmmmmmnmmmmmmmmmmnmmmmmmmmmmmmmmmmm
431E954mmmmmmmmmmmmmlmmmmmmmmmmlmmmmmmlmmmmmlmmmmlmmmmlmmmlmmmlmmmlmmmlmmlmm
420E689lmmlmmlmmlmmlmmlmlmmlmmlmlmlmmlmlmlmlmmlmlmlmlmlmlmlmlmllmlmlmlmllmlm
409E444lmllmlmllmlmllmllmllmllmllmllmllmllmlllmlllmlllmlllmlllmllllmllllmlll
399E217lmlllllmlllllllmlllllllmllllllllllllmllllllllllllllllllllllllllllllll
388E005llllllkllllllllllllkllllllllkllllllkllllllklllllkllllkllllkllllklllkl
378D808llklllklllklllkllklllkllkllklllkllkllkllkllklkllkllkllklkllklkllklkll
367D623klkllklklklkllklklklklkllklklklklklklklklklklklkklklklklklkklklklklkk
$$ plain form
441 6241 6236 6232 6228 6223 6219 6215 6211 6206 6202 6198 6193 6189 6185 6181 6176 6172 6168 6164 6159 6155 6151 6147 6142 6138 6134 6130 6126 6122 6117 6113 6109 6105 6101 6096 6092 6088 6084 6080 6076 6072 6067 6063 6059 6055 6051 6047 6043 6039 6035 6031 6027 6022 6018 6014 6010 6006 6002 5998 5994 5990 5986 5982 5978 5974 5970 5966 5962 5958 5954
431 5954 5950 5946 5942 5938 5934 5930 5926 5922 5918 5914 5910 5906 5902 5899 5895 5891 5887 5883 5879 5875 5871 5867 5863 5859 5856 5852 5848 5844 5840 5836 5832 5829 5825 5821 5817 5813 5809 5806 5802 5798 5794 5790 5787 5783 5779 5775 5771 5768 5764 5760 5756 5753 5749 5745 5741 5738 5734 5730 5726 5723 5719 5715 5711 5708 5704 5700 5697 5693 5689
420 5689 5686 5682 5678 5675 5671 5667 5664 5660 5656 5653 5649 5645 5642 5638 5634 5631 5627 5624 5620 5616 5613 5609 5605 5602 5598 5595 5591 5588 5584 5580 5577 5573 5570 5566 5563 5559 5556 5552 5548 5545 5541 5538 5534 5531 5527 5524 5520 5517 5513 5510 5506 5503 5499 5496 5492 5489 5486 5482 5479 5475 5472 5468 5465 5461 5458 5455 5451 5448 5444
409 5444 5441 5437 5434 5431 5427 5424 5420 5417 5414 5410 5407 5403 5400 5397 5393 5390 5387 5383 5380 5377 5373 5370 5367 5363 5360 5357 5353 5350 5347 5343 5340 5337 5333 5330 5327 5323 5320 5317 5314 5310 5307 5304 5301 5297 5294 5291 5288 5284 5281 5278 5275 5271 5268 5265 5262 5258 5255 5252 5249 5246 5242 5239 5236 5233 5230 5226 5223 5220 5217
399 5217 5214 5210 5207 5204 5201 5198 5195 5191 5188 5185 5182 5179 5176 5173 5170 5166 5163 5160 5157 5154 5151 5148 5145 5141 5138 5135 5132 5129 5126 5123 5120 5117 5114 5111 5108 5105 5101 5098 5095 5092 5089 5086 5083 5080 5077 5074 5071 5068 5065 5062 5059 5056 5053 5050 5047 5044 5041 5038 5035 5032 5029 5026 5023 5020 5017 5014 5011 5008 5005
388 5005 5002 4999 4996 4993 4990 4987 4985 4982 4979 4976 4973 4970 4967 4964 4961 4958 4955 4952 4949 4947 4944 4941 4938 4935 4932 4929 4926 4923 4921 4918 4915 4912 4909 4906 4903 4901 4898 4895 4892 4889 4886 4883 4881 4878 4875 4872 4869 4866 4864 4861 4858 4855 4852 4850 4847 4844 4841 4838 4836 4833 4830 4827 4824 4822 4819 4816 4813 4811 4808
378 4808 4805 4802 4800 4797 4794 4791 4789 4786 4783 4780 4778 4775 4772 4769 4767 4764 4761 4759 4756 4753 4750 4748 4745 4742 4740 4737 4734 4732 4729 4726 4723 4721 4718 4715 4713 4710 4707 4705 4702 4699 4697 4694 4691 4689 4686 4684 4681 4678 4676 4673 4670 4668 4665 4662 4660 4657 4655 4652 4649 4647 4644 4642 4639 4636 4634 4631 4629 4626 4623
367 4623 4621 4618 4616 4613 4610 4608 4605 4603 4600 4598 4595 4593 4590 4587 4585 4582 4580 4577 4575 4572 4570 4567 4565 4562 4559 4557 4554 4552 4549 4547 4544 4542 4539 4537 4534 4532 4529 4527 4524 4522 4519 4517 4514 4512 4509 4507 4504 4502 4500 4497 4495 4492 4490 4487 4485 4482 4480 4477 4475 4473 4470 4468 4465 4463 4460 4458 4455 4453 4451
357D451lklkklklklkklkklklkklklkklkklkklklkklkklkklkklkklkkklkklkklkklkkklkkl
346D288kkklkkklkkklkkklkkklkkklkkkklkkklkkkklkkkklkkkklkkkkklkkkkklkkkkkklkk
336D136kkkklkkkkkkklkkkkkkkklkkkkkkkkklkkkkkkkkkkkkklkkkkkkkkkkkkkkkkkkkkkkk
325C993kkkklkkkkkkkkkkkkkjkkkkkkkkkkkkkkkkkkkkkkkkkkkjkkkkkkkkkkkkkjkkkkkkkk
315C857kkkjkkkkkkkkjkkkkkkkjkkkkkkkjkkkkkkjkkkkkjkkkkkkjkkkkjkkkkkjkkkkjkkkk
304C729jkkkkjkkkkjkkkkjkkkjkkkjkkkkjkkkjkkkjkkkjkkkjkkkjkkjkkkjkkjkkkjkkjkkk
294C608jkkjkkkjkkjkkjkkjkkjkkjkkkjkkjkkjkkjkjkkjkkjkkjkkjkkjkjkkjkkjkjkkjkkj
283C494kjkkjkjkkjkkjkjkjkkjkjkkjkjkkjkjkjkkjkjkjkkjkjkjkkjkjkjkjkjkkjkjkjkjk
$$ plain form
357 4451 4448 4446 4443 4441 4439 4436 4434 4431 4429 4426 4424 4422 4419 4417 4415 4412 4410 4407 4405 4403 4400 4398 4395 4393 4391 4388 4386 4384 4381 4379 4377 4374 4372 4369 4367 4365 4362 4360 4358 4355 4353 4351 4348 4346 4344 4341 4339 4337 4334 4332 4330 4328 4325 4323 4321 4318 4316 4314 4311 4309 4307 4304 4302 4300 4298 4295 4293 4291 4288
346 4288 4286 4284 4282 4279 4277 4275 4273 4270 4268 4266 4264 4261 4259 4257 4255 4252 4250 4248 4246 4243 4241 4239 4237 4234 4232 4230 4228 4226 4223 4221 4219 4217 4214 4212 4210 4208 4206 4203 4201 4199 4197 4195 4192 4190 4188 4186 4184 4181 4179 4177 4175 4173 4171 4168 4166 4164 4162 4160 4158 4155 4153 4151 4149 4147 4145 4143 4140 4138 4136
336 4136 4134 4132 4130 4128 4125 4123 4121 4119 4117 4115 4113 4111 4108 4106 4104 4102 4100 4098 4096 4094 4092 4089 4087 4085 4083 4081 4079 4077 4075 4073 4071 4068 4066 4064 4062 4060 4058 4056 4054 4052 4050 4048 4046 4044 4042 4039 4037 4035 4033 4031 4029 4027 4025 4023 4021 4019 4017 4015 4013 4011 4009 4007 4005 4003 4001 3999 3997 3995 3993
325 3993 3991 3989 3987 3985 3982 3980 3978 3976 3974 3972 3970 3968 3966 3964 3962 3960 3958 3956 3955 3953 3951 3949 3947 3945 3943 3941 3939 3937 3935 3933 3931 3929 3927 3925 3923 3921 3919 3917 3915 3913 3911 3909 3907 3905 3903 3901 3900 3898 3896 3894 3892 3890 3888 3886 3884 3882 3880 3878 3876 3874 3873 3871 3869 3867 3865 3863 3861 3859 3857
315 3857 3855 3853 3851 3850 3848 3846 3844 3842 3840 3838 3836 3834 3833 3831 3829 3827 3825 3823 3821 3819 3818 3816 3814 3812 3810 3808 3806 3804 3803 3801 3799 3797 3795 3793 3791 3790 3788 3786 3784 3782 3780 3779 3777 3775 3773 3771 3769 3767 3766 3764 3762 3760 3758 3757 3755 3753 3751 3749 3747 3746 3744 3742 3740 3738 3737 3735 3733 3731 3729
304 3729 3728 3726 3724 3722 3720 3719 3717 3715 3713 3711 3710 3708 3706 3704 3702 3701 3699 3697 3695 3694 3692 3690 3688 3687 3685 3683 3681 3679 3678 3676 3674 3672 3671 3669 3667 3665 3664 3662 3660 3658 3657 3655 3653 3651 3650 3648 3646 3644 3643 3641 3639 3638 3636 3634 3632 3631 3629 3627 3626 3624 3622 3620 3619 3617 3615 3614 3612 3610 3608
294 3608 3607 3605 3603 3602 3600 3598 3596 3595 3593 3591 3590 3588 3586 3585 3583 3581 3580 3578 3576 3575 3573 3571 3570 3568 3566 3564 3563 3561 3559 3558 3556 3554 3553 3551 3549 3548 3546 3545 3543 3541 3540 3538 3536 3535 3533 3531 3530 3528 3526 3525 3523 3521 3520 3518 3517 3515 3513 3512 3510 3508 3507 3505 3504 3502 3500 3499 3497 3495 3494
283 3494 3492 3491 3489 3487 3486 3484 3483 3481 3479 3478 3476 3474 3473 3471 3470 3468 3467 3465 3463 3462 3460 3459 3457 3455 3454 3452 3451 3449 3447 3446 3444 3443 3441 3440 3438 3436 3435 3433 3432 3430 3429 3427 3425 3424 3422 3421 3419 3418 3416 3414 3413 3411 3410 3408 3407 3405 3404 3402 3401 3399 3397 3396 3394 3393 3391 3390 3388 3387 3385
273C385jkjkkjkjkjkjkjkjkjkjkjkjkjkjkjkjkjkjkjkjkjkjkjkjkjkjkjkjjkjkjkjkjkjkj
262C282kjjkjkjkjkjjkjkjkjkjjkjkjkjjkjkjkjjkjkjkjjkjkjjkjkjjkjkjjkjkjjkjkjjkj
252C184kjjkjjkjkjjkjjkjkjjkjjkjkjjkjjkjjkjjkjkjjkjjkjjkjjkjjkjjkjjkjjkjjkjjk
241C090jjkjjjkjjkjjkjjkjjjkjjkjjkjjjkjjkjjjkjjkjjjkjjkjjjkjjkjjjkjjjkjjjkjjk
230C001jjjkjjjkjjjkjjjkjjjkjjjjkjjjkjjjkjjjkjjjjkjjjkjjjjkjjjjkjjjkjjjjkjjjj
220B917kjjjjkjjjjkjjjjjkjjjjkjjjjkjjjjjkjjjjjkjjjjjkjjjjjkjjjjjkjjjjjjkjjjjj
209B836kjjjjjjkjjjjjjjkjjjjjjkjjjjjjjkjjjjjjjkjjjjjjjjkjjjjjjjjkjjjjjjjjjkjj
199B758jjjjjjjkjjjjjjjjjjjkjjjjjjjjjjjjkjjjjjjjjjjjjjkjjjjjjjjjjjjjjjjkjjjjj
$$ plain form
273 3385 3384 3382 3381 3379 3377 3376 3374 3373 3371 3370 3368 3367 3365 3364 3362 3361 3359 3358 3356 3355 3353 3352 3350 3349 3347 3346 3344 3343 3341 3340 3338 3337 3335 3334 3332 3331 3329 3328 3326 3325 3323 3322 3320 3319 3317 3316 3314 3313 3311 3310 3308 3307 3305 3304 3302 3301 3300 3298 3297 3295 3294 3292 3291 3289 3288 3286 3285 3283 3282
262 3282 3280 3279 3278 3276 3275 3273 3272 3270 3269 3267 3266 3265 3263 3262 3260 3259 3257 3256 3254 3253 3252 3250 3249 3247 3246 3244 3243 3242 3240 3239 3237 3236 3234 3233 3232 3230 3229 3227 3226 3224 3223 3222 3220 3219 3217 3216 3215 3213 3212 3210 3209 3208 3206 3205 3203 3202 3201 3199 3198 3196 3195 3194 3192 3191 3189 3188 3187 3185 3184
252 3184 3182 3181 3180 3178 3177 3176 3174 3173 3171 3170 3169 3167 3166 3165 3163 3162 3160 3159 3158 3156 3155 3154 3152 3151 3149 3148 3147 3145 3144 3143 3141 3140 3139 3137 3136 3135 3133 3132 3130 3129 3128 3126 3125 3124 3122 3121 3120 3118 3117 3116 3114 3113 3112 3110 3109 3108 3106 3105 3104 3102 3101 3100 3098 3097 3096 3094 3093 3092 3090
241 3090 3089 3088 3086 3085 3084 3083 3081 3080 3079 3077 3076 3075 3073 3072 3071 3069 3068 3067 3066 3064 3063 3062 3060 3059 3058 3056 3055 3054 3053 3051 3050 3049 3047 3046 3045 3044 3042 3041 3040 3038 3037 3036 3035 3033 3032 3031 3029 3028 3027 3026 3024 3023 3022 3020 3019 3018 3017 3015 3014 3013 3012 3010 3009 3008 3007 3005 3004 3003 3001
230 3001 3000 2999 2998 2996 2995 2994 2993 2991 2990 2989 2988 2986 2985 2984 2983 2981 2980 2979 2978 2976 2975 2974 2973 2972 2970 2969 2968 2967 2965 2964 2963 2962 2960 2959 2958 2957 2955 2954 2953 2952 2951 2949 2948 2947 2946 2944 2943 2942 2941 2940 2938 2937 2936 2935 2934 2932 2931 2930 2929 2927 2926 2925 2924 2923 2921 2920 2919 2918 2917
220 2917 2915 2914 2913 2912 2911 2909 2908 2907 2906 2905 2903 2902 2901 2900 2899 2898 2896 2895 2894 2893 2892 2890 2889 2888 2887 2886 2884 2883 2882 2881 2880 2879 2877 2876 2875 2874 2873 2872 2870 2869 2868 2867 2866 2865 2863 2862 2861 2860 2859 2858 2856 2855 2854 2853 2852 2851 2849 2848 2847 2846 2845 2844 2843 2841 2840 2839 2838 2837 2836
209 2836 2834 2833 2832 2831 2830 2829 2828 2826 2825 2824 2823 2822 2821 2820 2819 2817 2816 2815 2814 2813 2812 2811 2809 2808 2807 2806 2805 2804 2803 2802 2800 2799 2798 2797 2796 2795 2794 2793 2791 2790 2789 2788 2787 2786 2785 2784 2783 2781 2780 2779 2778 2777 2776 2775 2774 2773 2771 2770 2769 2768 2767 2766 2765 2764 2763 2762 2760 2759 2758
199 2758 2757 2756 2755 2754 2753 2752 2751 2749 2748 2747 2746 2745 2744 2743 2742 2741 2740 2739 2738 2736 2735 2734 2733 2732 2731 2730 2729 2728 2727 2726 2725 2724 2722 2721 2720 2719 2718 2717 2716 2715 2714 2713 2712 2711 2710 2709 2707 2706 2705 2704 2703 2702 2701 2700 2699 2698 2697 2696 2695 2694 2693 2692 2691 2689 2688 2687 2686 2685 2684
188B684jjjjjjjjjjjjjjjjkjjjjjjjjjjjjjjjjjjjjjjjjjjjjjjjjjjjjjkjjjjjjjjjjjjjj
178B613jjjjjjjjjjjjjjjjjjjjjjjjjjjjj%jjjjjjjjjjjjjjjjjjjjjjjjjjjjjjjjjjjjjjj
167B545%jjjjjjjjjjjjjjjjjjjjj%jjjjjjjjjjjjjjjjj%jjjjjjjjjjjjjjj%jjjjjjjjjjjj
157B480%jjjjjjjjjjjj%jjjjjjjjjj%jjjjjjjjjj%jjjjjjjjj%jjjjjjjjj%jjjjjjjj%jjjj
146B418jjjj%jjjjjjj%jjjjjjj%jjjjjjj%jjjjjjj%jjjjjj%jjjjjjj%jjjjjj%jjjjjj%jjj
136B358jj%jjjjjj%jjjjj%jjjjjj%jjjjj%jjjjj%jjjjj%jjjjj%jjjjj%jjjj%jjjjj%jjjjj
125B300%jjjj%jjjj%jjjjj%jjjj%jjjj%jjjj%jjjj%jjjj%jjjj%jjjj%jjjj%jjjj%jjj%jjj
115B245j%jjjj%jjj%jjjj%jjjj%jjj%jjj%jjjj%jjj%jjjj%jjj%jjj%jjj%jjjj%jjj%jjj%j
$$ plain form
188 2684 2683 2682 2681 2680 2679 2678 2677 2676 2675 2674 2673 2672 2671 2670 2669 2668 2666 2665 2664 2663 2662 2661 2660 2659 2658 2657 2656 2655 2654 2653 2652 2651 2650 2649 2648 2647 2646 2645 2644 2643 2642 2641 2640 2639 2638 2637 2636 2635 2634 2633 2632 2631 2630 2629 2627 2626 2625 2624 2623 2622 2621 2620 2619 2618 2617 2616 2615 2614 2613
178 2613 2612 2611 2610 2609 2608 2607 2606 2605 2604 2603 2602 2601 2600 2599 2598 2597 2596 2595 2594 2593 2592 2591 2590 2589 2588 2587 2586 2585 2584 2584 2583 2582 2581 2580 2579 2578 2577 2576 2575 2574 2573 2572 2571 2570 2569 2568 2567 2566 2565 2564 2563 2562 2561 2560 2559 2558 2557 2556 2555 2554 2553 2552 2551 2550 2549 2548 2547 2546 2545
167 2545 2545 2544 2543 2542 2541 2540 2539 2538 2537 2536 2535 2534 2533 2532 2531 2530 2529 2528 2527 2526 2525 2524 2524 2523 2522 2521 2520 2519 2518 2517 2516 2515 2514 2513 2512 2511 2510 2509 2508 2507 2507 2506 2505 2504 2503 2502 2501 2500 2499 2498 2497 2496 2495 2494 2493 2492 2492 2491 2490 2489 2488 2487 2486 2485 2484 2483 2482 2481 2480
157 2480 2480 2479 2478 2477 2476 2475 2474 2473 2472 2471 2470 2469 2468 2468 2467 2466 2465 2464 2463 2462 2461 2460 2459 2458 2458 2457 2456 2455 2454 2453 2452 2451 2450 2449 2448 2448 2447 2446 2445 2444 2443 2442 2441 2440 2439 2439 2438 2437 2436 2435 2434 2433 2432 2431 2430 2430 2429 2428 2427 2426 2425 2424 2423 2422 2422 2421 2420 2419 2418
146 2418 2417 2416 2415 2414 2414 2413 2412 2411 2410 2409 2408 2407 2407 2406 2405 2404 2403 2402 2401 2400 2400 2399 2398 2397 2396 2395 2394 2393 2393 2392 2391 2390 2389 2388 2387 2386 2386 2385 2384 2383 2382 2381 2380 2380 2379 2378 2377 2376 2375 2374 2373 2373 2372 2371 2370 2369 2368 2367 2367 2366 2365 2364 2363 2362 2361 2361 2360 2359 2358
136 2358 2357 2356 2356 2355 2354 2353 2352 2351 2350 2350 2349 2348 2347 2346 2345 2345 2344 2343 2342 2341 2340 2339 2339 2338 2337 2336 2335 2334 2334 2333 2332 2331 2330 2329 2329 2328 2327 2326 2325 2324 2324 2323 2322 2321 2320 2319 2319 2318 2317 2316 2315 2314 2314 2313 2312 2311 2310 2310 2309 2308 2307 2306 2305 2305 2304 2303 2302 2301 2300
125 2300 2300 2299 2298 2297 2296 2296 2295 2294 2293 2292 2292 2291 2290 2289 2288 2287 2287 2286 2285 2284 2283 2283 2282 2281 2280 2279 2279 2278 2277 2276 2275 2275 2274 2273 2272 2271 2271 2270 2269 2268 2267 2267 2266 2265 2264 2263 2263 2262 2261 2260 2259 2259 2258 2257 2256 2255 2255 2254 2253 2252 2251 2251 2250 2249 2248 2248 2247 2246 2245
115 2245 2244 2244 2243 2242 2241 2240 2240 2239 2238 2237 2237 2236 2235 2234 2233 2233 2232 2231 2230 2229 2229 2228 2227 2226 2226 2225 2224 2223 2223 2222 2221 2220 2219 2219 2218 2217 2216 2216 2215 2214 2213 2212 2212 2211 2210 2209 2209 2208 2207 2206 2206 2205 2204 2203 2203 2202 2201 2200 2199 2199 2198 2197 2196 2196 2195 2194 2193 2193 2192
104B192jj%jjj%jjj%jjj%jjj%jjj%jjj%jjj%jjj%jjj%jjj%jj%jjj%jjj%jjj%jjj%jj%jjj%
94B141jjj%jj%jjj%jjj%jj%jjj%jj%jjj%jj%jjj%jj%jjj%jj%jjj%jj%jjj%jj%jjj%jj%jj%
83B091jjj%jj%jj%jjj%jj%jj%jj%jjj%jj%jj%jj%jjj%jj%jj%jj%jj%jj%jjj%jj%jj%jj%jj
72B042%jj%jj%jj%jj%jj%jj%jj%jj%jj%jj%jj%jj%jj%jj%jj%jj%jj%jj%jj%jj%jj%jj%j%j
61A996j%jj%jj%jj%jj%jj%j%jj%jj%jj%jj%j%jj%jj%jj%jj%j%jj%jj%j%jj%jj%jj%j%jj%j
51A951j%j%jj%jj%j%jj%jj%j%jj%jj%j%jj%jj%j%jj%j%jj%jj%j%jj%j%jj%jj%j%jj%j%jj%
40A908j%jj%j%jj%j%jj%j%jj%j%jj%j%jj%j%jj%j%jj%j%jj%j%jj%j%jj%j%j%jj%j%jj%j%j
29A866j%j%j%jj%j%jj%j%j%jj%j%j%jj%j%jj%j%j%jj%j%j%jj%j%j%jj%j%j%jj%j%j%jj%j%
$$ plain form
104 2192 2191 2190 2190 2189 2188 2187 2187 2186 2185 2184 2184 2183 2182 2181 2181 2180 2179 2178 2178 2177 2176 2175 2175 2174 2173 2172 2172 2171 2170 2169 2169 2168 2167 2166 2166 2165 2164 2163 2163 2162 2161 2160 2160 2159 2158 2158 2157 2156 2155 2155 2154 2153 2152 2152 2151 2150 2149 2149 2148 2147 2146 2146 2145 2144 2144 2143 2142 2141 2141
94 2141 2140 2139 2138 2138 2137 2136 2136 2135 2134 2133 2133 2132 2131 2130 2130 2129 2128 2128 2127 2126 2125 2125 2124 2123 2123 2122 2121 2120 2120 2119 2118 2118 2117 2116 2115 2115 2114 2113 2113 2112 2111 2110 2110 2109 2108 2108 2107 2106 2105 2105 2104 2103 2103 2102 2101 2100 2100 2099 2098 2098 2097 2096 2095 2095 2094 2093 2093 2092 2091 2091
83 2091 2090 2089 2088 2088 2087 2086 2086 2085 2084 2084 2083 2082 2081 2081 2080 2079 2079 2078 2077 2077 2076 2075 2075 2074 2073 2072 2072 2071 2070 2070 2069 2068 2068 2067 2066 2066 2065 2064 2063 2063 2062 2061 2061 2060 2059 2059 2058 2057 2057 2056 2055 2055 2054 2053 2053 2052 2051 2050 2050 2049 2048 2048 2047 2046 2046 2045 2044 2044 2043 2042
72 2042 2042 2041 2040 2040 2039 2038 2038 2037 2036 2036 2035 2034 2034 2033 2032 2032 2031 2030 2030 2029 2028 2028 2027 2026 2026 2025 2024 2024 2023 2022 2022 2021 2020 2020 2019 2018 2018 2017 2016 2016 2015 2014 2014 2013 2012 2012 2011 2010 2010 2009 2008 2008 2007 2006 2006 2005 2004 2004 2003 2002 2002 2001 2000 2000 1999 1998 1998 1997 1997 1996
61 1996 1995 1995 1994 1993 1993 1992 1991 1991 1990 1989 1989 1988 1987 1987 1986 1985 1985 1984 1984 1983 1982 1982 1981 1980 1980 1979 1978 1978 1977 1976 1976 1975 1975 1974 1973 1973 1972 1971 1971 1970 1969 1969 1968 1967 1967 1966 1966 1965 1964 1964 1963 1962 1962 1961 1961 1960 1959 1959 1958 1957 1957 1956 1955 1955 1954 1954 1953 1952 1952 1951
51 1951 1950 1950 1949 1949 1948 1947 1947 1946 1945 1945 1944 1944 1943 1942 1942 1941 1940 1940 1939 1939 1938 1937 1937 1936 1935 1935 1934 1934 1933 1932 1932 1931 1930 1930 1929 1929 1928 1927 1927 1926 1926 1925 1924 1924 1923 1922 1922 1921 1921 1920 1919 1919 1918 1918 1917 1916 1916 1915 1914 1914 1913 1913 1912 1911 1911 1910 1910 1909 1908 1908
40 1908 1907 1907 1906 1905 1905 1904 1904 1903 1902 1902 1901 1901 1900 1899 1899 1898 1898 1897 1896 1896 1895 1895 1894 1893 1893 1892 1892 1891 1890 1890 1889 1889 1888 1887 1887 1886 1886 1885 1884 1884 1883 1883 1882 1881 1881 1880 1880 1879 1878 1878 1877 1877 1876 1875 1875 1874 1874 1873 1873 1872 1871 1871 1870 1870 1869 1868 1868 1867 1867 1866
29 1866 1865 1865 1864 1864 1863 1863 1862 1861 1861 1860 1860 1859 1858 1858 1857 1857 1856 1856 1855 1854 1854 1853 1853 1852 1852 1851 1850 1850 1849 1849 1848 1847 1847 1846 1846 1845 1845 1844 1843 1843 1842 1842 1841 1841 1840 1839 1839 1838 1838 1837 1837 1836 1835 1835 1834 1834 1833 1833 1832 1831 1831 1830 1830 1829 1829 1828 1827 1827 1826 1826
19A826j%jj%j%j%j%jj%j%j%jj%j%j%j%jj%j%j%j%jj%j%j%j%jj%j%j%j%jj%j%j%j%j%jj%j%
8A787j%j%j%jj%j%j%j%j%jj%j%j%j%j%j%jj%j%j%j%j%j%jj%j%j%j%j%j%j%jj%j%j%j%j%j%
-3A749j%j%jj%j%j%j%j%j%j%j%j%jj%j%j%j%j%j%j%j%j%j%j%j%jj%j%j%j%j%j%j%j%j%j%j
-13A712%j%j%j%j%j%j%j%j%j%j%j%j%j%jj%j%j%j%j%j%j%j%j%j%j%j%j%j%j%j%j%j%j%j%%
-24A678j%j%j%j%j%j%j%j%j%j%j%j%j%j%j%j%j%j%j%j%j%j%j%j%%j%j%j%j%j%j%j%j%j%j%
-35A644j%j%j%%j%j%j%j%j%j%j%j%j%j%%j%j%j%j%j%j%j%j%%j%j%j%j%j%j%j%j%%j%j%j%j
-45A611%j%j%%j%j%j%j%j%j%%j%j%j%j%j%j%%j%j%j%j%j%%j%j%j%j%j%%j%j%j%j%j%%j%j%
-56A580j%j%j%%j%j%j%j%%j%j%j%j%%j%j%j%j%%j%j%j%j%%j%j%j%j%%j%j%j%j%%j%j%j%%j
$$ plain form
19 1826 1825 1825 1824 1823 1823 1822 1822 1821 1821 1820 1820 1819 1818 1818 1817 1817 1816 1816 1815 1814 1814 1813 1813 1812 1812 1811 1811 1810 1809 1809 1808 1808 1807 1807 1806 1806 1805 1804 1804 1803 1803 1802 1802 1801 1801 1800 1799 1799 1798 1798 1797 1797 1796 1796 1795 1794 1794 1793 1793 1792 1792 1791 1791 1790 1790 1789 1788 1788 1787 1787
8 1787 1786 1786 1785 1785 1784 1784 1783 1782 1782 1781 1781 1780 1780 1779 1779 1778 1778 1777 1776 1776 1775 1775 1774 1774 1773 1773 1772 1772 1771 1771 1770 1769 1769 1768 1768 1767 1767 1766 1766 1765 1765 1764 1764 1763 1762 1762 1761 1761 1760 1760 1759 1759 1758 1758 1757 1757 1756 1756 1755 1754 1754 1753 1753 1752 1752 1751 1751 1750 1750 1749 1749
-3 1749 1748 1748 1747 1747 1746 1745 1745 1744 1744 1743 1743 1742 1742 1741 1741 1740 1740 1739 1739 1738 1738 1737 1737 1736 1735 1735 1734 1734 1733 1733 1732 1732 1731 1731 1730 1730 1729 1729 1728 1728 1727 1727 1726 1726 1725 1725 1724 1724 1723 1722 1722 1721 1721 1720 1720 1719 1719 1718 1718 1717 1717 1716 1716 1715 1715 1714 1714 1713 1713 1712
-13 1712 1712 1711 1711 1710 1710 1709 1709 1708 1708 1707 1707 1706 1706 1705 1705 1704 1704 1703 1703 1702 1702 1701 1701 1700 1700 1699 1699 1698 1697 1697 1696 1696 1695 1695 1694 1694 1693 1693 1692 1692 1691 1691 1690 1690 1689 1689 1688 1688 1687 1687 1686 1686 1685 1685 1684 1684 1683 1683 1682 1682 1681 1681 1680 1680 1679 1679 1678 1678 1678
-24 1678 1677 1677 1676 1676 1675 1675 1674 1674 1673 1673 1672 1672 1671 1671 1670 1670 1669 1669 1668 1668 1667 1667 1666 1666 1665 1665 1664 1664 1663 1663 1662 1662 1661 1661 1660 1660 1659 1659 1658 1658 1657 1657 1656 1656 1655 1655 1654 1654 1654 1653 1653 1652 1652 1651 1651 1650 1650 1649 1649 1648 1648 1647 1647 1646 1646 1645 1645 1644 1644
-35 1644 1643 1643 1642 1642 1641 1641 1641 1640 1640 1639 1639 1638 1638 1637 1637 1636 1636 1635 1635 1634 1634 1633 1633 1632 1632 1631 1631 1631 1630 1630 1629 1629 1628 1628 1627 1627 1626 1626 1625 1625 1624 1624 1623 1623 1623 1622 1622 1621 1621 1620 1620 1619 1619 1618 1618 1617 1617 1616 1616 1615 1615 1615 1614 1614 1613 1613 1612 1612 1611
-45 1611 1611 1610 1610 1609 1609 1609 1608 1608 1607 1607 1606 1606 1605 1605 1604 1604 1603 1603 1603 1602 1602 1601 1601 1600 1600 1599 1599 1598 1598 1597 1597 1597 1596 1596 1595 1595 1594 1594 1593 1593 1592 1592 1592 1591 1591 1590 1590 1589 1589 1588 1588 1587 1587 1587 1586 1586 1585 1585 1584 1584 1583 1583 1582 1582 1582 1581 1581 1580 1580
-56 1580 1579 1579 1578 1578 1577 1577 1577 1576 1576 1575 1575 1574 1574 1573 1573 1573 1572 1572 1571 1571 1570 1570 1569 1569 1569 1568 1568 1567 1567 1566 1566 1565 1565 1565 1564 1564 1563 1563 1562 1562 1561 1561 1561 1560 1560 1559 1559 1558 1558 1557 1557 1557 1556 1556 1555 1555 1554 1554 1553 1553 1553 1552 1552 1551 1551 1550 1550 1550 1549
-66A549%j%j%j%%j%j%j%%j%j%j%%j%j%j%%j%j%j%%j%j%j%%j%j%j%%j%j%j%%j%j%j%%j%j%j
-77A519%%j%j%j%%j%j%%j%j%j%%j%j%j%%j%j%%j%j%j%%j%j%%j%j%j%%j%j%%j%j%%j%j%j%%
-87A491j%j%%j%j%%j%j%j%%j%j%%j%j%%j%j%%j%j%%j%j%%j%j%j%%j%j%%j%j%%j%j%%j%j%%
-98A463j%j%%j%j%%j%j%%j%%j%j%%j%j%%j%j%%j%j%%j%j%%j%j%%j%%j%j%%j%j%%j%j%%j%%
-108A436j%j%%j%j%%j%j%%j%%j%j%%j%j%%j%%j%j%%j%%j%j%%j%j%%j%%j%j%%j%%j%j%%j%%
-119A410j%j%%j%%j%j%%j%%j%j%%j%%j%j%%j%%j%j%%j%%j%j%%j%%j%%j%j%%j%%j%j%%j%%j
-129A384%%j%j%%j%%j%%j%j%%j%%j%%j%j%%j%%j%%j%j%%j%%j%%j%j%%j%%j%%j%%j%j%%j%%
$$ plain form
-66 1549 1549 1548 1548 1547 1547 1546 1546 1546 1545 1545 1544 1544 1543 1543 1543 1542 1542 1541 1541 1540 1540 1540 1539 1539 1538 1538 1537 1537 1537 1536 1536 1535 1535 1534 1534 1534 1533 1533 1532 1532 1531 1531 1531 1530 1530 1529 1529 1528 1528 1528 1527 1527 1526 1526 1525 1525 1525 1524 1524 1523 1523 1522 1522 1522 1521 1521 1520 1520 1519
-77 1519 1519 1519 1518 1518 1517 1517 1516 1516 1516 1515 1515 1514 1514 1514 1513 1513 1512 1512 1511 1511 1511 1510 1510 1509 1509 1508 1508 1508 1507 1507 1506 1506 1506 1505 1505 1504 1504 1503 1503 1503 1502 1502 1501 1501 1501 1500 1500 1499 1499 1498 1498 1498 1497 1497 1496 1496 1496 1495 1495 1494 1494 1494 1493 1493 1492 1492 1491 1491 1491
-87 1491 1490 1490 1489 1489 1489 1488 1488 1487 1487 1487 1486 1486 1485 1485 1484 1484 1484 1483 1483 1482 1482 1482 1481 1481 1480 1480 1480 1479 1479 1478 1478 1478 1477 1477 1476 1476 1476 1475 1475 1474 1474 1474 1473 1473 1472 1472 1471 1471 1471 1470 1470 1469 1469 1469 1468 1468 1467 1467 1467 1466 1466 1465 1465 1465 1464 1464 1463 1463 1463
-98 1463 1462 1462 1461 1461 1461 1460 1460 1459 1459 1459 1458 1458 1457 1457 1457 1456 1456 1456 1455 1455 1454 1454 1454 1453 1453 1452 1452 1452 1451 1451 1450 1450 1450 1449 1449 1448 1448 1448 1447 1447 1446 1446 1446 1445 1445 1444 1444 1444 1443 1443 1443 1442 1442 1441 1441 1441 1440 1440 1439 1439 1439 1438 1438 1437 1437 1437 1436 1436 1436
-108 1436 1435 1435 1434 1434 1434 1433 1433 1432 1432 1432 1431 1431 1430 1430 1430 1429 1429 1429 1428 1428 1427 1427 1427 1426 1426 1425 1425 1425 1424 1424 1424 1423 1423 1422 1422 1422 1421 1421 1421 1420 1420 1419 1419 1419 1418 1418 1417 1417 1417 1416 1416 1416 1415 1415 1414 1414 1414 1413 1413 1413 1412 1412 1411 1411 1411 1410 1410 1410
-119 1410 1409 1409 1408 1408 1408 1407 1407 1407 1406 1406 1405 1405 1405 1404 1404 1404 1403 1403 1402 1402 1402 1401 1401 1401 1400 1400 1399 1399 1399 1398 1398 1398 1397 1397 1396 1396 1396 1395 1395 1395 1394 1394 1393 1393 1393 1392 1392 1392 1391 1391 1391 1390 1390 1389 1389 1389 1388 1388 1388 1387 1387 1386 1386 1386 1385 1385 1385 1384
-129 1384 1384 1384 1383 1383 1382 1382 1382 1381 1381 1381 1380 1380 1380 1379 1379 1378 1378 1378 1377 1377 1377 1376 1376 1376 1375 1375 1374 1374 1374 1373 1373 1373 1372 1372 1372 1371 1371 1370 1370 1370 1369 1369 1369 1368 1368 1368 1367 1367 1366 1366 1366 1365 1365 1365 1364 1364 1364 1363 1363 1363 1362 1362 1361 1361 1361 1360 1360 1360
$$ [...]
-2000@
##END=		$$ NMR SPECTRUM
##TITLE=	
##JCAMP-DX=	6.0	$$ MestReNova 15.0.0-34764
##DATA TYPE=	NMR PEAK TABLE
##DATA CLASS=	PEAK TABLE
##BLOCK_ID=	3
##ORIGIN=	Mestrelab Research S.L.
##OWNER=	PC
##CROSS REFERENCE=	NMR SPECTRUM: BLOCK_ID=2                                     
##.OBSERVE FREQUENCY=	400.12699902499997506
##.OBSERVE NUCLEUS=	^Unknown
##NPOINTS=	14
##FIRSTX=	1.8543000590303715391
##LASTX=	3.6403211624838647253
##XFACTOR=	1
##YFACTOR=	1
##FIRSTY=	0.0064938666116124959399
##XUNITS=	PPM
##YUNITS=	ARBITRARY UNITS
##PEAK TABLE=	(XYW..XYW)
1.8543000590303715391,0.0064938666116124959399,0.0021798433577537548907
1.8695519923395331752,0.027495488467374058078,0.0022888355256414421798
1.8848092733022741019,0.043150555632074087675,0.0022888355256414421798
1.9000526403714728119,0.02976280334759526594,0.0022888355256414421798
1.9152989665419726251,0.007739771318310321134,0.002313444274813738176
2.6699909965970491932,0.064306771522153277632,0.0019073629380345353667
2.6852378370330720614,0.12628254283259465751,0.0020597943348951838413
2.7005267717986991549,0.057883921899630583208,0.002072928251291693974
2.8586798797934283023,0.063137787469115858041,0.0019019526964743562088
2.8640176672531265645,0.12968918136365156779,0.0019015355193019579765
2.8693690605434793994,0.064793935343775505009,0.0019092195368399019362
3.6298157114540203771,0.062978883957421336048,0.0019073629380345353667
3.6349689871096155791,0.12964819043108266605,0.0019092631042426269194
3.6403211624838647253,0.063347102617530598456,0.001895346526394289929
##$MNOVA/PEAK_DATA_TABLE=	(T,F,A,ST,SP,APT,APC)
$$ Complementary to PEAK TABLE
$$ T: Type
$$ F: Flags
$$ A: Annotation
$$ ST: Shape Type
$$ SP: Shape Parameter
$$ APT: Attached Peaks Type
$$ APC: Attached Peaks Count
Compound,None,,1,0.26134965033195245443,0,0
Compound,None,,1,0.44401087556062140971,0,0
Compound,None,,1,0.49500927141217382355,0,0
Compound,None,,1,0.49413484029222637384,0,0
Compound,None,,1,0.48321502388574294473,0,0
Compound,None,,1,-0.10390303645877027594,0,0
Compound,None,,1,0.31841219852918928312,0,0
Compound,None,,1,0.23667432954283407209,0,0
Compound,None,,1,0.046961703005092947372,0,0
Compound,None,,1,0.015595667835944154733,0,0
Compound,None,,1,0.051513535854107221634,0,0
Compound,None,,1,0.010506674538798416174,0,0
Compound,None,,1,0.012570805724332976411,0,0
Compound,None,,1,0.033497595671409238771,0,0
##END=		$$ NMR PEAK TABLE
##END=		$$ LINK
