##TITLE=	

##JCAMP-DX=	6.0	$$ MestReNova 14.1.2-25024
##DATA TYPE=	LINK
##BLOCK_ID=	1
##BLOCKS=	2    
##ORIGIN=	Mestrelab Research S.L.
##OWNER=	HGL
##$MNOVA/LINK_BLOCK_TYPE=	ITEM	$$ NMR Spectrum
##$MNOVA/ITEM/POLYGON=	(XY..XY)
5321,5835
8722,5835
8722,8208
5321,8208
5321,5835
##$MNOVA/ITEM/Z=	0
##$MNOVA/ITEM/ANGLE=	0
##TITLE=	
##JCAMP-DX=	6.0	$$ MestReNova 14.1.2-25024
##BLOCK_ID=	2
##DATA TYPE=	NMR SPECTRUM
##DATA CLASS=	XYDATA
##NUMDIM=	1
##ORIGIN=	Mnova: Peaks
##OWNER=	HGL
##.OBSERVE FREQUENCY=	400.13617591306001486
##.OBSERVE NUCLEUS=	^1H
##.SOLVENT NAME=	
##.PULSE SEQUENCE=	
##.ACQUISITIONMODE=	SIMULTANEOUS
##$ORIGINAL FORMAT=	MNova
##$MNOVA/SCALES_VERSION=	9
##$PARAMETER FILE=	(originalData.xml, ASCII, , 0)
$$ <?xml version="1.0" encoding="UTF-8"?>
$$ <MnovaSpectrumParams>
$$     <itemId>{309bd22a-caef-44f2-9012-226029ff66d2}</itemId>
$$     <spectrumIndex>0</spectrumIndex>
$$     <DataFileName>
$$         <dim0>H:/OPCW/NMR-Databases/RICD-NMR-fid_Database/Sulfur compounds/1,3-Bis(2-chloroethylthio)propane/JCAMP-DX/05-3-0045-1,3-Bis(2-chloroethylthio)propane-H.dx</dim0>
$$     </DataFileName>
$$     <Title>
$$         <dim0>1H NMR: 1,3-Bis(2-chloroethylthio)propane; S.1.A.04; [63905-10-2]</dim0>
$$     </Title>
$$     <Comment/>
$$     <Origin>
$$         <dim0>UXNMR, Bruker Analytische Messtechnik GmbH</dim0>
$$     </Origin>
$$     <Owner>
$$         <dim0>markku</dim0>
$$     </Owner>
$$     <Site/>
$$     <Instrument>
$$         <dim0>amx400</dim0>
$$     </Instrument>
$$     <Author/>
$$     <Solvent>
$$         <dim0>CDCl3</dim0>
$$     </Solvent>
$$     <Temperature>
$$         <dim0>303</dim0>
$$     </Temperature>
$$     <PulseSequence>
$$         <dim0>zg45</dim0>
$$     </PulseSequence>
$$     <Experiment>
$$         <dim0>1D</dim0>
$$     </Experiment>
$$     <Probe/>
$$     <NumberofScans>
$$         <dim0>128</dim0>
$$     </NumberofScans>
$$     <ReceiverGain>
$$         <dim0>256</dim0>
$$     </ReceiverGain>
$$     <RelaxationDelay>
$$         <dim0>16</dim0>
$$     </RelaxationDelay>
$$     <PulseWidth>
$$         <dim0>6</dim0>
$$     </PulseWidth>
$$     <PresaturationFrequency/>
$$     <AcquisitionTime>
$$         <dim0>7.340032000000007</dim0>
$$     </AcquisitionTime>
$$     <AcquisitionDate>
$$         <dim0>1992-10-07T20:02:08</dim0>
$$     </AcquisitionDate>
$$     <ModificationDate>
$$         <dim0>2018-07-13T20:14:26</dim0>
$$     </ModificationDate>
$$     <Class/>
$$     <Purity>
$$         <dim0>100</dim0>
$$     </Purity>
$$     <SpectrumQuality>
$$         <dim0>0</dim0>
$$     </SpectrumQuality>
$$     <SpectrometerFrequency>
$$         <dim0>400.13617591306</dim0>
$$     </SpectrometerFrequency>
$$     <SpectralWidth>
$$         <dim0>4464.4219576316</dim0>
$$     </SpectralWidth>
$$     <LowestFrequency>
$$         <dim0>-450.929842811289</dim0>
$$     </LowestFrequency>
$$     <Nucleus>
$$         <dim0>1H</dim0>
$$     </Nucleus>
$$     <AcquiredSize>
$$         <dim0>32768</dim0>
$$     </AcquiredSize>
$$     <SpectralSize>
$$         <dim0>32768</dim0>
$$     </SpectralSize>
$$     <DigitalResolution>
$$         <dim0>0.136243345874988</dim0>
$$     </DigitalResolution>
$$     <AbsoluteReference/>
$$ </MnovaSpectrumParams>
$$ 
##$PARAMETER FILE=	(parameters, ASCII, , 0)
$$ <MnovaSpectrumParams>
$$ <SpecCount>1</SpecCount>
$$ <Dimensions>1</Dimensions>
$$ <Origin>Mnova: Peaks</Origin>
$$ <Window Dim="f1">
$$ <Nucleus>1H</Nucleus>
$$ <Points>32768</Points>
$$ <Width>4464.42195763159998</Width>
$$ <MHz>400.136175913060015</MHz>
$$ <Hz>-450.929842811289006</Hz>
$$ </Window>
$$ <Window Dim="f0">
$$ <Points>1</Points>
$$ </Window>
$$ </MnovaSpectrumParams>
##$PARAMETER FILE=	(title, ASCII, , 0)
$$ 
##XUNITS=	HZ
##YUNITS=	ARBITRARY UNITS
##FIRSTX=	4013.4921148203111443
##LASTX=	-450.7935994654139904
##DELTAX=	-0.13624334587498779237
##XFACTOR=	1
##YFACTOR=	0.46386690616607723081
##FIRSTY=	53.396060943603515625
##MINY=	0
##MAXY=	429495520
##NPOINTS=	32768
##XYDATA=	(X++(Y..Y))
$$ [...]
3402 191 191 191 191 192 192 192 192 192 192 192 192 192 192 192 192 192 192 192 192 192 192 192 192 192 192 192 192 192 192 192 192 192 192 192 192 192 192 192 192 192 193 193 193 193 193 193 193 193 193 193 193 193 193 193 193 193 193 193 193 193 193 193 193 193 193 193 193 193 193
3393 193 193 193 193 193 193 193 193 193 194 194 194 194 194 194 194 194 194 194 194 194 194 194 194 194 194 194 194 194 194 194 194 194 194 194 194 194 194 194 194 194 194 194 194 194 194 195 195 195 195 195 195 195 195 195 195 195 195 195 195 195 195 195 195 195 195 195 195 195 195
3384 195 195 195 195 195 195 195 195 195 195 195 195 195 196 196 196 196 196 196 196 196 196 196 196 196 196 196 196 196 196 196 196 196 196 196 196 196 196 196 196 196 196 196 196 196 196 196 196 197 197 197 197 197 197 197 197 197 197 197 197 197 197 197 197 197 197 197 197 197 197
3374 197 197 197 197 197 197 197 197 197 197 197 197 197 197 198 198 198 198 198 198 198 198 198 198 198 198 198 198 198 198 198 198 198 198 198 198 198 198 198 198 198 198 198 198 198 198 198 198 198 199 199 199 199 199 199 199 199 199 199 199 199 199 199 199 199 199 199 199 199 199
3365 199 199 199 199 199 199 199 199 199 199 199 199 199 199 199 200 200 200 200 200 200 200 200 200 200 200 200 200 200 200 200 200 200 200 200 200 200 200 200 200 200 200 200 200 200 200 200 200 200 201 201 201 201 201 201 201 201 201 201 201 201 201 201 201 201 201 201 201 201 201
3355 201 201 201 201 201 201 201 201 201 201 201 201 201 201 202 202 202 202 202 202 202 202 202 202 202 202 202 202 202 202 202 202 202 202 202 202 202 202 202 202 202 202 202 202 202 202 202 203 203 203 203 203 203 203 203 203 203 203 203 203 203 203 203 203 203 203 203 203 203 203
3346 203 203 203 203 203 203 203 203 203 203 203 204 204 204 204 204 204 204 204 204 204 204 204 204 204 204 204 204 204 204 204 204 204 204 204 204 204 204 204 204 204 204 204 204 205 205 205 205 205 205 205 205 205 205 205 205 205 205 205 205 205 205 205 205 205 205 205 205 205 205
3337 205 205 205 205 205 205 205 206 206 206 206 206 206 206 206 206 206 206 206 206 206 206 206 206 206 206 206 206 206 206 206 206 206 206 206 206 206 206 206 207 207 207 207 207 207 207 207 207 207 207 207 207 207 207 207 207 207 207 207 207 207 207 207 207 207 207 207 207 207 207
3327 207 207 208 208 208 208 208 208 208 208 208 208 208 208 208 208 208 208 208 208 208 208 208 208 208 208 208 208 208 208 208 208 208 209 209 209 209 209 209 209 209 209 209 209 209 209 209 209 209 209 209 209 209 209 209 209 209 209 209 209 209 209 209 209 210 210 210 210 210 210
3318 210 210 210 210 210 210 210 210 210 210 210 210 210 210 210 210 210 210 210 210 210 210 210 210 210 211 211 211 211 211 211 211 211 211 211 211 211 211 211 211 211 211 211 211 211 211 211 211 211 211 211 211 211 211 211 212 212 212 212 212 212 212 212 212 212 212 212 212 212 212
3308 212 212 212 212 212 212 212 212 212 212 212 212 212 212 212 212 213 213 213 213 213 213 213 213 213 213 213 213 213 213 213 213 213 213 213 213 213 213 213 213 213 213 213 213 213 213 214 214 214 214 214 214 214 214 214 214 214 214 214 214 214 214 214 214 214 214 214 214 214 214
3299 214 214 214 214 214 214 215 215 215 215 215 215 215 215 215 215 215 215 215 215 215 215 215 215 215 215 215 215 215 215 215 215 215 215 215 216 216 216 216 216 216 216 216 216 216 216 216 216 216 216 216 216 216 216 216 216 216 216 216 216 216 216 216 217 217 217 217 217 217 217
3290 217 217 217 217 217 217 217 217 217 217 217 217 217 217 217 217 217 217 217 217 217 217 218 218 218 218 218 218 218 218 218 218 218 218 218 218 218 218 218 218 218 218 218 218 218 218 218 218 218 218 219 219 219 219 219 219 219 219 219 219 219 219 219 219 219 219 219 219 219 219
3280 219 219 219 219 219 219 219 219 219 220 220 220 220 220 220 220 220 220 220 220 220 220 220 220 220 220 220 220 220 220 220 220 220 220 220 220 221 221 221 221 221 221 221 221 221 221 221 221 221 221 221 221 221 221 221 221 221 221 221 221 221 221 221 222 222 222 222 222 222 222
3271 222 222 222 222 222 222 222 222 222 222 222 222 222 222 222 222 222 222 222 222 223 223 223 223 223 223 223 223 223 223 223 223 223 223 223 223 223 223 223 223 223 223 223 223 223 223 223 224 224 224 224 224 224 224 224 224 224 224 224 224 224 224 224 224 224 224 224 224 224 224
3261 224 224 224 225 225 225 225 225 225 225 225 225 225 225 225 225 225 225 225 225 225 225 225 225 225 225 225 225 225 226 226 226 226 226 226 226 226 226 226 226 226 226 226 226 226 226 226 226 226 226 226 226 226 226 227 227 227 227 227 227 227 227 227 227 227 227 227 227 227 227
3252 227 227 227 227 227 227 227 227 227 227 228 228 228 228 228 228 228 228 228 228 228 228 228 228 228 228 228 228 228 228 228 228 228 228 228 229 229 229 229 229 229 229 229 229 229 229 229 229 229 229 229 229 229 229 229 229 229 229 229 230 230 230 230 230 230 230 230 230 230 230
3243 230 230 230 230 230 230 230 230 230 230 230 230 230 230 231 231 231 231 231 231 231 231 231 231 231 231 231 231 231 231 231 231 231 231 231 231 231 231 232 232 232 232 232 232 232 232 232 232 232 232 232 232 232 232 232 232 232 232 232 232 232 232 233 233 233 233 233 233 233 233
3233 233 233 233 233 233 233 233 233 233 233 233 233 233 233 233 233 234 234 234 234 234 234 234 234 234 234 234 234 234 234 234 234 234 234 234 234 234 234 234 235 235 235 235 235 235 235 235 235 235 235 235 235 235 235 235 235 235 235 235 235 235 236 236 236 236 236 236 236 236 236
3224 236 236 236 236 236 236 236 236 236 236 236 236 236 236 236 237 237 237 237 237 237 237 237 237 237 237 237 237 237 237 237 237 237 237 237 237 237 238 238 238 238 238 238 238 238 238 238 238 238 238 238 238 238 238 238 238 238 238 239 239 239 239 239 239 239 239 239 239 239 239
3214 239 239 239 239 239 239 239 239 239 239 239 240 240 240 240 240 240 240 240 240 240 240 240 240 240 240 240 240 240 240 240 240 241 241 241 241 241 241 241 241 241 241 241 241 241 241 241 241 241 241 241 241 241 242 242 242 242 242 242 242 242 242 242 242 242 242 242 242 242 242
3205 242 242 242 242 243 243 243 243 243 243 243 243 243 243 243 243 243 243 243 243 243 243 243 243 243 244 244 244 244 244 244 244 244 244 244 244 244 244 244 244 244 244 244 244 244 245 245 245 245 245 245 245 245 245 245 245 245 245 245 245 245 245 245 245 245 246 246 246 246 246
3196 246 246 246 246 246 246 246 246 246 246 246 246 246 246 246 247 247 247 247 247 247 247 247 247 247 247 247 247 247 247 247 247 247 247 248 248 248 248 248 248 248 248 248 248 248 248 248 248 248 248 248 248 248 249 249 249 249 249 249 249 249 249 249 249 249 249 249 249 249 249
3186 249 249 249 250 250 250 250 250 250 250 250 250 250 250 250 250 250 250 250 250 250 250 251 251 251 251 251 251 251 251 251 251 251 251 251 251 251 251 251 251 252 252 252 252 252 252 252 252 252 252 252 252 252 252 252 252 252 252 253 253 253 253 253 253 253 253 253 253 253 253
3177 253 253 253 253 253 253 254 254 254 254 254 254 254 254 254 254 254 254 254 254 254 254 254 254 255 255 255 255 255 255 255 255 255 255 255 255 255 255 255 255 255 256 256 256 256 256 256 256 256 256 256 256 256 256 256 256 256 256 257 257 257 257 257 257 257 257 257 257 257 257
3167 257 257 257 257 257 257 258 258 258 258 258 258 258 258 258 258 258 258 258 258 258 258 259 259 259 259 259 259 259 259 259 259 259 259 259 259 259 259 259 260 260 260 260 260 260 260 260 260 260 260 260 260 260 260 260 261 261 261 261 261 261 261 261 261 261 261 261 261 261 261
3158 261 261 262 262 262 262 262 262 262 262 262 262 262 262 262 262 262 263 263 263 263 263 263 263 263 263 263 263 263 263 263 263 263 264 264 264 264 264 264 264 264 264 264 264 264 264 264 264 265 265 265 265 265 265 265 265 265 265 265 265 265 265 265 266 266 266 266 266 266 266
3149 266 266 266 266 266 266 266 266 266 267 267 267 267 267 267 267 267 267 267 267 267 267 267 268 268 268 268 268 268 268 268 268 268 268 268 268 268 269 269 269 269 269 269 269 269 269 269 269 269 269 269 269 270 270 270 270 270 270 270 270 270 270 270 270 270 270 271 271 271 271
3139 271 271 271 271 271 271 271 271 271 271 272 272 272 272 272 272 272 272 272 272 272 272 272 272 273 273 273 273 273 273 273 273 273 273 273 273 273 274 274 274 274 274 274 274 274 274 274 274 274 274 275 275 275 275 275 275 275 275 275 275 275 275 275 276 276 276 276 276 276 276
3130 276 276 276 276 276 276 276 277 277 277 277 277 277 277 277 277 277 277 277 277 278 278 278 278 278 278 278 278 278 278 278 278 279 279 279 279 279 279 279 279 279 279 279 279 280 280 280 280 280 280 280 280 280 280 280 280 281 281 281 281 281 281 281 281 281 281 281 281 282 282
3120 282 282 282 282 282 282 282 282 282 282 282 283 283 283 283 283 283 283 283 283 283 283 284 284 284 284 284 284 284 284 284 284 284 284 285 285 285 285 285 285 285 285 285 285 285 286 286 286 286 286 286 286 286 286 286 286 287 287 287 287 287 287 287 287 287 287 287 288 288 288
3111 288 288 288 288 288 288 288 288 288 289 289 289 289 289 289 289 289 289 289 290 290 290 290 290 290 290 290 290 290 290 291 291 291 291 291 291 291 291 291 291 292 292 292 292 292 292 292 292 292 292 293 293 293 293 293 293 293 293 293 293 294 294 294 294 294 294 294 294 294 294
3102 294 295 295 295 295 295 295 295 295 295 295 296 296 296 296 296 296 296 296 296 297 297 297 297 297 297 297 297 297 297 298 298 298 298 298 298 298 298 298 299 299 299 299 299 299 299 299 299 300 300 300 300 300 300 300 300 300 301 301 301 301 301 301 301 301 301 302 302 302 302
3092 302 302 302 302 302 302 303 303 303 303 303 303 303 303 303 304 304 304 304 304 304 304 304 305 305 305 305 305 305 305 305 305 306 306 306 306 306 306 306 306 307 307 307 307 307 307 307 307 308 308 308 308 308 308 308 308 308 309 309 309 309 309 309 309 309 310 310 310 310 310
3083 310 310 310 310 311 311 311 311 311 311 311 312 312 312 312 312 312 312 312 313 313 313 313 313 313 313 313 314 314 314 314 314 314 314 315 315 315 315 315 315 315 316 316 316 316 316 316 316 316 317 317 317 317 317 317 317 318 318 318 318 318 318 318 319 319 319 319 319 319 319
3073 319 320 320 320 320 320 320 320 321 321 321 321 321 321 321 322 322 322 322 322 322 322 323 323 323 323 323 323 324 324 324 324 324 324 324 325 325 325 325 325 325 326 326 326 326 326 326 326 327 327 327 327 327 327 328 328 328 328 328 328 329 329 329 329 329 329 330 330 330 330
3064 330 330 330 330 331 331 331 331 331 331 332 332 332 332 332 332 333 333 333 333 333 334 334 334 334 334 334 335 335 335 335 335 335 336 336 336 336 336 336 337 337 337 337 337 338 338 338 338 338 338 339 339 339 339 339 340 340 340 340 340 340 341 341 341 341 341 342 342 342 342
3055 342 342 343 343 343 343 343 344 344 344 344 344 344 345 345 345 345 345 346 346 346 346 346 347 347 347 347 347 348 348 348 348 349 349 349 349 349 350 350 350 350 350 351 351 351 351 351 352 352 352 352 352 353 353 353 353 354 354 354 354 354 355 355 355 355 356 356 356 356 356
3045 356 357 357 357 357 358 358 358 358 358 359 359 359 359 360 360 360 360 361 361 361 361 361 362 362 362 362 363 363 363 363 364 364 364 364 365 365 365 365 366 366 366 366 367 367 367 367 368 368 368 368 369 369 369 369 370 370 370 370 371 371 371 371 372 372 372 373 373 373 373
3036 373 374 374 374 374 375 375 375 375 376 376 376 377 377 377 377 378 378 378 379 379 379 379 380 380 380 381 381 381 381 382 382 382 383 383 383 383 384 384 384 385 385 385 386 386 386 386 387 387 387 388 388 388 389 389 389 390 390 390 390 391 391 391 392 392 392 393 393 393 394
3026 394 394 394 395 395 395 396 396 396 397 397 397 398 398 398 399 399 399 400 400 400 401 401 401 402 402 403 403 403 404 404 404 405 405 405 406 406 406 407 407 408 408 408 409 409 409 410 410 411 411 411 412 412 412 413 413 414 414 414 415 415 416 416 416 417 417 418 418 418 419
3017 419 419 420 420 420 421 421 422 422 423 423 423 424 424 425 425 425 426 426 427 427 428 428 429 429 429 430 430 431 431 432 432 433 433 433 434 434 435 435 436 436 437 437 438 438 439 439 440 440 440 441 441 442 442 443 443 444 444 445 445 446 446 447 447 448 448 449 449 450 450
3008 450 451 451 452 453 453 454 454 455 455 456 456 457 457 458 458 459 460 460 461 461 462 462 463 463 464 465 465 466 466 467 467 468 469 469 470 470 471 472 472 473 473 474 475 475 476 476 477 478 478 479 480 480 481 482 482 483 483 484 485 485 486 487 487 488 489 489 490 491 491
2998 491 492 493 493 494 495 496 496 497 498 498 499 500 500 501 502 503 503 504 505 506 506 507 508 509 509 510 511 512 512 513 514 515 516 516 517 518 519 519 520 521 522 523 524 524 525 526 527 528 528 529 530 531 532 533 534 534 535 536 537 538 539 540 541 542 542 543 544 545 546
2989 546 547 548 549 550 551 552 553 554 555 556 557 558 559 560 561 562 563 564 565 566 567 568 569 570 571 572 573 574 575 576 577 578 579 580 581 582 584 585 586 587 588 589 590 591 593 594 595 596 597 598 600 601 602 603 604 606 607 608 609 611 612 613 614 616 617 618 620 621 622
2979 622 623 625 626 627 629 630 631 633 634 636 637 638 640 641 643 644 645 647 648 650 651 653 654 656 657 659 660 662 663 665 666 668 670 671 673 674 676 678 679 681 682 684 686 687 689 691 692 694 696 698 699 701 703 705 706 708 710 712 714 716 717 719 721 723 725 727 729 731 733
2970 733 735 737 739 741 743 745 747 749 751 753 755 757 759 761 763 766 768 770 772 774 777 779 781 783 786 788 790 793 795 797 800 802 805 807 809 812 814 817 819 822 825 827 830 832 835 838 840 843 846 848 851 854 857 859 862 865 868 871 874 877 879 882 885 888 891 895 898 901 904
2961 904 907 910 913 916 920 923 926 930 933 936 940 943 946 950 953 957 960 964 968 971 975 979 982 986 990 994 997 1001 1005 1009 1013 1017 1021 1025 1029 1033 1038 1042 1046 1050 1054 1059 1063 1068 1072 1076 1081 1086 1090 1095 1099 1104 1109 1114 1119 1123 1128 1133 1138 1143 1148 1154 1159 1164 1169 1175 1180 1185 1191
2951 1191 1196 1202 1207 1213 1219 1225 1230 1236 1242 1248 1254 1260 1266 1273 1279 1285 1292 1298 1305 1311 1318 1325 1331 1338 1345 1352 1359 1366 1373 1381 1388 1395 1403 1410 1418 1426 1433 1441 1449 1457 1465 1474 1482 1490 1499 1507 1516 1524 1533 1542 1551 1560 1569 1579 1588 1598 1607 1617 1627 1637 1647 1657
2943 1657 1667 1677 1688 1698 1709 1720 1731 1742 1753 1765 1776 1788 1800 1811 1823 1836 1848 1860 1873 1886 1899 1912 1925 1938 1952 1966 1980 1994 2008 2022 2037 2052 2067 2082
2938 2082 2097 2113 2129 2145 2161 2177 2194 2211 2228 2245 2262 2280 2298 2316 2335 2354 2373 2392 2411 2431 2451 2472 2492 2513 2535 2556 2578 2600 2623 2645 2669 2692 2716 2740
2933 2740 2765 2790 2815 2841 2867 2893 2920 2948 2975 3004 3032 3061 3091 3121 3152 3183 3214 3246 3279 3312 3346 3380 3415 3450 3486 3523 3560 3598 3637 3676 3716 3757 3798 3840
2929 3840 3883 3927 3972 4017 4063 4110 4158 4207 4257 4308 4359 4412 4466 4521 4576 4634 4692 4751 4812 4873 4936 5001 5067 5134 5202 5272 5344 5417 5492 5568 5646 5726 5807 5891
2924 5891 5976 6063 6153 6244 6337 6433 6531 6632 6735 6840 6948 7059 7172 7289 7408 7531 7656 7785 7918 8054 8193 8337 8484 8635 8791
2921 8791 8951 9116 9285 9459 9639 9824 10014 10210 10412 10620 10835 11057 11285 11521 11765 12017 12277 12546 12824 13112 13409 13717 14037
2918 14037 14367 14710 15066 15434 15817 16215 16628 17057 17504 17968 18452 18956 19481 20028 20600 21197 21820 22472 23154 23867 24615 25399 26222
2915 26222 27086 27993 28948 29953 31012 32129 33307 34553 35871 37266 38745 40315 41984 43759 45650 47668 49823 52130
2912 52130 54602 57255 60109 63183 66500 70089 73978 78202 82802 87823 93319 99351 105992 113327 121457 130502 140604
2910 140604 151936 164708 179175 195653 214536 236318 261631 291287 326347 368223 418818 480760 557746 655127
2908 655127 780868 947250 1173982 1494246 1967172 2705478 3941758 6200009 10754673 20621537 39433720
2906 39433720 56666111 59171481 48839823 27991889 14259771 7836586 4779467 3177858 2256087
2905 2256087 1682806 1303567 1040072 849632 707501 598572 513213 445053 389739 344218 306296 274362
2904 274362 247212 223931 203814 186309 170982 157484 145534 134902 125402 116878 109199 102257 95961 90233 85006
2901 85006 80223 75835 71800 68081 64645 61465 58515 55775 53223 50844 48623 46545 44598 42772 41057 39444 37925
2899 37925 36493 35141 33864 32656 31512 30427 29399 28422 27494 26611 25770 24969 24205 23477 22781 22116 21480 20872 20289 19731
2896 19731 19196 18683 18190 17717 17263 16826 16406 16002 15613 15238 14876 14528 14192 13868 13555 13253 12961 12678 12406 12142 11886 11639 11400
2893 11400 11168 10943 10726 10515 10310 10111 9918 9731 9550 9373 9202 9035 8873 8715 8562 8413 8268 8127 7989 7856 7725 7598 7474
2890 7474 7354 7236 7121 7010 6900 6794 6690 6589 6489 6393 6298 6206 6116 6028 5942 5858 5775 5695 5616 5539 5464 5390 5318 5247 5178 5111 5044 4980 4916 4854
2886 4854 4793 4733 4674 4617 4561 4505 4451 4398 4346 4295 4245 4196 4147 4100 4054 4008 3963 3919 3876 3834 3792 3751 3711 3671 3632 3594 3557 3520 3484 3448 3413 3379 3345 3312
2881 3312 3279 3247 3215 3184 3153 3123 3093 3064 3035 3007 2979 2952 2925 2898 2872 2846 2821 2796 2771 2747 2723 2699 2676 2653 2631 2608 2586 2565 2544 2523 2502 2481 2461 2442
2877 2442 2422 2403 2384 2365 2346 2328 2310 2292 2275 2258 2241 2224 2207 2191 2175 2159 2143 2127 2112 2097 2082 2067 2052 2038 2024 2010 1996 1982 1969 1955 1942 1929 1916 1903
2872 1903 1891 1878 1866 1854 1842 1830 1818 1807 1795 1784 1773 1762 1751 1740 1729 1719 1708 1698 1688 1678 1668 1658 1648 1639 1629 1620 1610 1601 1592 1583 1574 1565 1556 1548 1539 1531 1522 1514 1506 1498 1490 1482 1474
2866 1474 1466 1458 1451 1443 1436 1428 1421 1414 1406 1399 1392 1385 1378 1372 1365 1358 1351 1345 1338 1332 1326 1319 1313 1307 1301 1295 1289 1283 1277 1271 1265 1259 1254 1248 1242 1237 1231 1226 1220 1215 1210 1205 1199 1194 1189 1184 1179 1174 1169 1164 1159 1155 1150 1145 1141 1136 1131 1127 1122 1118 1113 1109 1105 1100 1096 1092 1088 1083
2857 1083 1079 1075 1071 1067 1063 1059 1055 1051 1047 1044 1040 1036 1032 1029 1025 1021 1018 1014 1010 1007 1003 1000 996 993 990 986 983 980 976 973 970 967 963 960 957 954 951 948 945 942 939 936 933 930 927 924 921 918 915 913 910 907 904 902 899 896 894 891 888 886 883 880 878 875 873 870 868 865
2848 865 863 861 858 856 853 851 849 846 844 842 840 837 835 833 831 828 826 824 822 820 818 816 813 811 809 807 805 803 801 799 797 795 793 791 789 787 786 784 782 780 778 776 774 773 771 769 767 765 764 762 760 758 757 755 753 752 750 748 747 745 743 742 740 739 737 735 734 732 731
2838 731 729 728 726 725 723 722 720 719 717 716 714 713 711 710 709 707 706 704 703 702 700 699 698 696 695 694 692 691 690 688 687 686 685 683 682 681 680 678 677 676 675 673 672 671 670 669 668 666 665 664 663 662 661 660 658 657 656 655 654 653 652 651 650 649 648 647 646 645 644
2829 644 642 641 640 639 638 637 636 635 634 634 633 632 631 630 629 628 627 626 625 624 623 622 621 620 620 619 618 617 616 615 614 613 613 612 611 610 609 608 607 607 606 605 604 603 603 602 601 600 599 599 598 597 596 595 595 594 593 592 592 591 590 589 589 588 587 587 586 585 584
2820 584 584 583 582 582 581 580 580 579 578 578 577 576 575 575 574 574 573 572 572 571 570 570 569 568 568 567 567 566 565 565 564 563 563 562 562 561 560 560 559 559 558 558 557 556 556 555 555 554 554 553 553 552 551 551 550 550 549 549 548 548 547 547 546 546 545 545 544 544 543
2810 543 543 542 542 541 541 540 540 539 539 538 538 537 537 536 536 535 535 534 534 533 533 532 532 532 531 531 530 530 529 529 528 528 528 527 527 526 526 525 525 525 524 524 523 523 523 522 522 521 521 521 520 520 519 519 519 518 518 517 517 517 516 516 516 515 515 514 514 514 513
2801 513 513 513 512 512 511 511 511 510 510 510 509 509 509 508 508 508 507 507 507 506 506 506 505 505 505 504 504 504 503 503 503 502 502 502 501 501 501 501 500 500 500 499 499 499 498 498 498 498 497 497 497 496 496 496 495 495 495 495 494 494 494 494 493 493 493 492 492 492 492
2791 492 491 491 491 491 490 490 490 490 489 489 489 488 488 488 488 487 487 487 487 486 486 486 486 486 485 485 485 485 484 484 484 484 483 483 483 483 482 482 482 482 482 481 481 481 481 480 480 480 480 480 479 479 479 479 479 478 478 478 478 477 477 477 477 477 476 476 476 476 476
2782 476 475 475 475 475 475 474 474 474 474 474 474 473 473 473 473 473 472 472 472 472 472 472 471 471 471 471 471 470 470 470 470 470 470 469 469 469 469 469 469 468 468 468 468 468 468 467 467 467 467 467 467 466 466 466 466 466 466 466 465 465 465 465 465 465 464 464 464 464 464
2773 464 464 464 463 463 463 463 463 463 463 462 462 462 462 462 462 462 462 461 461 461 461 461 461 461 460 460 460 460 460 460 460 460 459 459 459 459 459 459 459 459 458 458 458 458 458 458 458 458 458 457 457 457 457 457 457 457 457 456 456 456 456 456 456 456 456 456 456 455 455
2763 455 455 455 455 455 455 455 455 454 454 454 454 454 454 454 454 454 454 453 453 453 453 453 453 453 453 453 453 453 452 452 452 452 452 452 452 452 452 452 452 451 451 451 451 451 451 451 451 451 451 451 451 450 450 450 450 450 450 450 450 450 450 450 450 449 449 449 449 449 449
2754 449 449 449 449 449 449 449 449 449 448 448 448 448 448 448 448 448 448 448 448 448 448 448 447 447 447 447 447 447 447 447 447 447 447 447 447 447 447 447 446 446 446 446 446 446 446 446 446 446 446 446 446 446 446 446 446 445 445 445 445 445 445 445 445 445 445 445 445 445 445
2744 445 445 445 445 445 445 445 444 444 444 444 444 444 444 444 444 444 444 444 444 444 444 444 444 444 444 444 444 444 443 443 443 443 443 443 443 443 443 443 443 443 443 443 443 443 443 443 443 443 443 443 443 443 443 443 442 442 442 442 442 442 442 442 442 442 442 442 442 442 442
2735 442 442 442 442 442 442 442 442 442 442 442 442 442 442 442 442 442 442 442 441 441 441 441 441 441 441 441 441 441 441 441 441 441 441 441 441 441 441 441 441 441 441 441 441 441 441 441 441 441 441 441 441 441 441 441 441 441 441 441 441 441 441 441 441 441 441 441 441 440 440
2726 440 440 440 440 440 440 440 440 440 440 440 440 440 440 440 440 440 440 440 440 440 440 440 440 440 440 440 440 440 440 440 440 440 440 440 440 440 440 440 440 440 440 440 440 440 440 440 440 440 440 440 440 440 440 440 440 440 440 440 440 440 440 440 440 440 440 440 440 440 440
2716 440 440 440 440 440 440 440 440 440 440 440 440 440 440 440 440 440 440 440 440 440 440 440 440 440 440 440 440 440 440 440 440 440 440 440 440 440 440 440 440 440 440 440 440 440 440 440 440 440 440 440 440 440 440 440 440 440 440 440 440 440 440 440 440 440 440 440 440 440 440
2707 440 440 440 440 440 440 440 440 440 440 440 440 440 440 440 440 440 440 440 440 440 440 440 440 440 441 441 441 441 441 441 441 441 441 441 441 441 441 441 441 441 441 441 441 441 441 441 441 441 441 441 441 441 441 441 441 441 441 441 441 441 441 441 441 441 441 441 441 441 441
2697 441 441 441 441 441 441 441 441 441 441 441 441 441 441 442 442 442 442 442 442 442 442 442 442 442 442 442 442 442 442 442 442 442 442 442 442 442 442 442 442 442 442 442 442 442 442 442 442 442 442 442 442 442 442 442 442 442 443 443 443 443 443 443 443 443 443 443 443 443 443
2688 443 443 443 443 443 443 443 443 443 443 443 443 443 443 443 443 443 443 443 443 443 443 443 443 444 444 444 444 444 444 444 444 444 444 444 444 444 444 444 444 444 444 444 444 444 444 444 444 444 444 444 444 444 444 444 445 445 445 445 445 445 445 445 445 445 445 445 445 445 445
2679 445 445 445 445 445 445 445 445 445 445 445 445 445 445 445 446 446 446 446 446 446 446 446 446 446 446 446 446 446 446 446 446 446 446 446 446 446 446 446 446 446 446 447 447 447 447 447 447 447 447 447 447 447 447 447 447 447 447 447 447 447 447 447 447 447 447 447 448 448 448
2669 448 448 448 448 448 448 448 448 448 448 448 448 448 448 448 448 448 448 448 448 448 448 449 449 449 449 449 449 449 449 449 449 449 449 449 449 449 449 449 449 449 449 449 449 449 450 450 450 450 450 450 450 450 450 450 450 450 450 450 450 450 450 450 450 450 450 450 451 451 451
2660 451 451 451 451 451 451 451 451 451 451 451 451 451 451 451 451 451 451 451 452 452 452 452 452 452 452 452 452 452 452 452 452 452 452 452 452 452 452 452 453 453 453 453 453 453 453 453 453 453 453 453 453 453 453 453 453 453 453 453 454 454 454 454 454 454 454 454 454 454 454
2650 454 454 454 454 454 454 454 454 454 455 455 455 455 455 455 455 455 455 455 455 455 455 455 455 455 455 455 455 456 456 456 456 456 456 456 456 456 456 456 456 456 456 456 456 456 456 457 457 457 457 457 457 457 457 457 457 457 457 457 457 457 457 457 457 458 458 458 458 458 458
2641 458 458 458 458 458 458 458 458 458 458 458 458 458 459 459 459 459 459 459 459 459 459 459 459 459 459 459 459 459 459 460 460 460 460 460 460 460 460 460 460 460 460 460 460 460 460 460 461 461 461 461 461 461 461 461 461 461 461 461 461 461 461 461 461 462 462 462 462 462 462
2632 462 462 462 462 462 462 462 462 462 462 462 463 463 463 463 463 463 463 463 463 463 463 463 463 463 463 463 464 464 464 464 464 464 464 464 464 464 464 464 464 464 464 464 465 465 465 465 465 465 465 465 465 465 465 465 465 465 465 466 466 466 466 466 466 466 466 466 466 466 466
2622 466 466 466 466 466 467 467 467 467 467 467 467 467 467 467 467 467 467 467 467 468 468 468 468 468 468 468 468 468 468 468 468 468 468 468 469 469 469 469 469 469 469 469 469 469 469 469 469 469 469 470 470 470 470 470 470 470 470 470 470 470 470 470 470 471 471 471 471 471 471
2613 471 471 471 471 471 471 471 471 471 471 472 472 472 472 472 472 472 472 472 472 472 472 472 472 473 473 473 473 473 473 473 473 473 473 473 473 473 473 474 474 474 474 474 474 474 474 474 474 474 474 474 474 475 475 475 475 475 475 475 475 475 475 475 475 475 475 476 476 476 476
2603 476 476 476 476 476 476 476 476 476 476 476 477 477 477 477 477 477 477 477 477 477 477 477 477 478 478 478 478 478 478 478 478 478 478 478 478 478 478 479 479 479 479 479 479 479 479 479 479 479 479 479 480 480 480 480 480 480 480 480 480 480 480 480 480 480 481 481 481 481 481
2594 481 481 481 481 481 481 481 481 481 482 482 482 482 482 482 482 482 482 482 482 482 482 483 483 483 483 483 483 483 483 483 483 483 483 484 484 484 484 484 484 484 484 484 484 484 484 484 485 485 485 485 485 485 485 485 485 485 485 485 485 486 486 486 486 486 486 486 486 486 486
2585 486 486 486 486 487 487 487 487 487 487 487 487 487 487 487 487 488 488 488 488 488 488 488 488 488 488 488 488 489 489 489 489 489 489 489 489 489 489 489 489 489 490 490 490 490 490 490 490 490 490 490 490 490 491 491 491 491 491 491 491 491 491 491 491 491 492 492 492 492 492
2575 492 492 492 492 492 492 492 492 493 493 493 493 493 493 493 493 493 493 493 493 494 494 494 494 494 494 494 494 494 494 494 494 495 495 495 495 495 495 495 495 495 495 495 495 496 496 496 496 496 496 496 496 496 496 496 496 497 497 497 497 497 497 497 497 497 497 497 498 498 498
2566 498 498 498 498 498 498 498 498 498 498 499 499 499 499 499 499 499 499 499 499 499 500 500 500 500 500 500 500 500 500 500 500 500 501 501 501 501 501 501 501 501 501 501 501 502 502 502 502 502 502 502 502 502 502 502 503 503 503 503 503 503 503 503 503 503 503 503 504 504 504
2556 504 504 504 504 504 504 504 504 504 505 505 505 505 505 505 505 505 505 505 505 506 506 506 506 506 506 506 506 506 506 506 507 507 507 507 507 507 507 507 507 507 507 508 508 508 508 508 508 508 508 508 508 508 509 509 509 509 509 509 509 509 509 509 509 510 510 510 510 510 510
2547 510 510 510 510 510 510 511 511 511 511 511 511 511 511 511 511 512 512 512 512 512 512 512 512 512 512 512 513 513 513 513 513 513 513 513 513 513 513 514 514 514 514 514 514 514 514 514 514 515 515 515 515 515 515 515 515 515 515 515 516 516 516 516 516 516 516 516 516 516 517
2538 517 517 517 517 517 517 517 517 517 517 517 518 518 518 518 518 518 518 518 518 518 519 519 519 519 519 519 519 519 519 519 520 520 520 520 520 520 520 520 520 520 520 521 521 521 521 521 521 521 521 521 521 522 522 522 522 522 522 522 522 522 522 523 523 523 523 523 523 523 523
2528 523 523 523 524 524 524 524 524 524 524 524 524 524 525 525 525 525 525 525 525 525 525 525 526 526 526 526 526 526 526 526 526 526 527 527 527 527 527 527 527 527 527 527 528 528 528 528 528 528 528 528 528 528 529 529 529 529 529 529 529 529 529 529 530 530 530 530 530 530 530
2519 530 530 530 530 531 531 531 531 531 531 531 531 531 531 532 532 532 532 532 532 532 532 532 533 533 533 533 533 533 533 533 533 533 534 534 534 534 534 534 534 534 534 534 535 535 535 535 535 535 535 535 535 536 536 536 536 536 536 536 536 536 536 537 537 537 537 537 537 537 537
2509 537 537 538 538 538 538 538 538 538 538 538 538 539 539 539 539 539 539 539 539 539 540 540 540 540 540 540 540 540 540 540 541 541 541 541 541 541 541 541 541 542 542 542 542 542 542 542 542 542 542 543 543 543 543 543 543 543 543 543 544 544 544 544 544 544 544 544 544 545 545
2500 545 545 545 545 545 545 545 545 546 546 546 546 546 546 546 546 546 546 547 547 547 547 547 547 547 547 547 548 548 548 548 548 548 548 548 548 549 549 549 549 549 549 549 549 549 550 550 550 550 550 550 550 550 550 551 551 551 551 551 551 551 551 551 552 552 552 552 552 552 552
2491 552 552 552 553 553 553 553 553 553 553 553 553 554 554 554 554 554 554 554 554 554 555 555 555 555 555 555 555 555 555 556 556 556 556 556 556 556 556 556 557 557 557 557 557 557 557 557 558 558 558 558 558 558 558 558 558 559 559 559 559 559 559 559 559 559 560 560 560 560 560
2481 560 560 560 560 560 561 561 561 561 561 561 561 561 562 562 562 562 562 562 562 562 562 563 563 563 563 563 563 563 563 563 564 564 564 564 564 564 564 564 565 565 565 565 565 565 565 565 565 566 566 566 566 566 566 566 566 567 567 567 567 567 567 567 567 567 568 568 568 568 568
2472 568 568 568 568 569 569 569 569 569 569 569 569 569 570 570 570 570 570 570 570 570 571 571 571 571 571 571 571 571 571 572 572 572 572 572 572 572 572 573 573 573 573 573 573 573 573 574 574 574 574 574 574 574 574 575 575 575 575 575 575 575 575 575 576 576 576 576 576 576 576
2462 576 576 577 577 577 577 577 577 577 577 578 578 578 578 578 578 578 578 579 579 579 579 579 579 579 579 579 580 580 580 580 580 580 580 580 581 581 581 581 581 581 581 581 582 582 582 582 582 582 582 582 583 583 583 583 583 583 583 583 584 584 584 584 584 584 584 584 585 585 585
2453 585 585 585 585 585 585 586 586 586 586 586 586 586 586 587 587 587 587 587 587 587 587 588 588 588 588 588 588 588 588 589 589 589 589 589 589 589 589 590 590 590 590 590 590 590 590 591 591 591 591 591 591 591 592 592 592 592 592 592 592 592 593 593 593 593 593 593 593 593 594
2444 594 594 594 594 594 594 594 594 595 595 595 595 595 595 595 595 596 596 596 596 596 596 596 597 597 597 597 597 597 597 597 598 598 598 598 598 598 598 598 599 599 599 599 599 599 599 600 600 600 600 600 600 600 600 601 601 601 601 601 601 601 601 602 602 602 602 602 602 602 603
2434 603 603 603 603 603 603 603 603 604 604 604 604 604 604 604 605 605 605 605 605 605 605 605 606 606 606 606 606 606 606 607 607 607 607 607 607 607 607 608 608 608 608 608 608 608 609 609 609 609 609 609 609 609 610 610 610 610 610 610 610 611 611 611 611 611 611 611 611 612 612
2425 612 612 612 612 612 612 613 613 613 613 613 613 613 614 614 614 614 614 614 614 614 615 615 615 615 615 615 615 616 616 616 616 616 616 616 617 617 617 617 617 617 617 618 618 618 618 618 618 618 618 619 619 619 619 619 619 619 620 620 620 620 620 620 620 621 621 621 621 621 621
2415 621 621 622 622 622 622 622 622 622 623 623 623 623 623 623 623 623 624 624 624 624 624 624 624 625 625 625 625 625 625 625 626 626 626 626 626 626 626 627 627 627 627 627 627 627 628 628 628 628 628 628 628 629 629 629 629 629 629 629 630 630 630 630 630 630 630 631 631 631 631
2406 631 631 631 631 632 632 632 632 632 632 632 633 633 633 633 633 633 633 634 634 634 634 634 634 634 635 635 635 635 635 635 635 636 636 636 636 636 636 637 637 637 637 637 637 637 638 638 638 638 638 638 638 639 639 639 639 639 639 639 640 640 640 640 640 640 640 641 641 641 641
2397 641 641 641 641 642 642 642 642 642 642 643 643 643 643 643 643 643 644 644 644 644 644 644 644 645 645 645 645 645 645 646 646 646 646 646 646 646 647 647 647 647 647 647 647 648 648 648 648 648 648 649 649 649 649 649 649 649 650 650 650 650 650 650 650 651 651 651 651 651 651
2387 651 652 652 652 652 652 652 652 653 653 653 653 653 653 654 654 654 654 654 654 654 655 655 655 655 655 655 655 656 656 656 656 656 656 657 657 657 657 657 657 657 658 658 658 658 658 658 659 659 659 659 659 659 659 660 660 660 660 660 660 661 661 661 661 661 661 662 662 662 662
2378 662 662 662 662 663 663 663 663 663 663 664 664 664 664 664 664 664 665 665 665 665 665 665 666 666 666 666 666 666 667 667 667 667 667 667 667 668 668 668 668 668 668 669 669 669 669 669 669 670 670 670 670 670 670 670 671 671 671 671 671 671 672 672 672 672 672 672 673 673 673
2368 673 673 673 673 674 674 674 674 674 674 674 675 675 675 675 675 675 676 676 676 676 676 676 677 677 677 677 677 677 678 678 678 678 678 678 679 679 679 679 679 679 680 680 680 680 680 680 680 681 681 681 681 681 681 682 682 682 682 682 682 683 683 683 683 683 683 684 684 684 684
2359 684 684 684 685 685 685 685 685 685 686 686 686 686 686 686 687 687 687 687 687 687 688 688 688 688 688 688 689 689 689 689 689 689 690 690 690 690 690 690 691 691 691 691 691 691 692 692 692 692 692 692 693 693 693 693 693 693 694 694 694 694 694 694 695 695 695 695 695 695 696
2350 696 696 696 696 696 696 697 697 697 697 697 698 698 698 698 698 698 699 699 699 699 699 699 700 700 700 700 700 700 701 701 701 701 701 701 702 702 702 702 702 702 703 703 703 703 703 704 704 704 704 704 704 705 705 705 705 705 705 706 706 706 706 706 706 707 707 707 707 707 708
2340 708 708 708 708 708 708 709 709 709 709 709 709 710 710 710 710 710 710 711 711 711 711 711 712 712 712 712 712 712 713 713 713 713 713 713 714 714 714 714 714 715 715 715 715 715 715 716 716 716 716 716 716 717 717 717 717 717 718 718 718 718 718 718 719 719 719 719 719 720 720
2331 720 720 720 720 720 721 721 721 721 721 722 722 722 722 722 722 723 723 723 723 723 724 724 724 724 724 724 725 725 725 725 725 725 726 726 726 726 726 727 727 727 727 727 728 728 728 728 728 728 729 729 729 729 729 730 730 730 730 730 730 731 731 731 731 731 732 732 732 732 732
2321 732 732 733 733 733 733 733 734 734 734 734 734 735 735 735 735 735 735 736 736 736 736 736 737 737 737 737 737 737 738 738 738 738 738 739 739 739 739 739 740 740 740 740 740 740 741 741 741 741 741 742 742 742 742 742 743 743 743 743 743 744 744 744 744 744 744 745 745 745 745
2312 745 745 746 746 746 746 746 747 747 747 747 747 748 748 748 748 748 748 749 749 749 749 749 750 750 750 750 750 751 751 751 751 751 752 752 752 752 752 752 753 753 753 753 753 754 754 754 754 754 755 755 755 755 755 756 756 756 756 756 757 757 757 757 757 758 758 758 758 758 759
2303 759 759 759 759 759 760 760 760 760 760 760 761 761 761 761 761 762 762 762 762 762 763 763 763 763 763 764 764 764 764 764 765 765 765 765 765 766 766 766 766 766 767 767 767 767 767 768 768 768 768 768 769 769 769 769 769 770 770 770 770 770 771 771 771 771 771 772 772 772 772
2293 772 772 773 773 773 773 773 774 774 774 774 774 775 775 775 775 775 776 776 776 776 776 777 777 777 777 778 778 778 778 778 779 779 779 779 779 780 780 780 780 780 781 781 781 781 781 782 782 782 782 782 783 783 783 783 783 784 784 784 784 784 785 785 785 785 786 786 786 786 786
2284 786 787 787 787 787 787 788 788 788 788 788 789 789 789 789 789 790 790 790 790 791 791 791 791 791 792 792 792 792 792 793 793 793 793 793 794 794 794 794 795 795 795 795 795 796 796 796 796 796 797 797 797 797 797 798 798 798 798 799 799 799 799 799 800 800 800 800 800 801 801
2274 801 801 801 802 802 802 802 802 803 803 803 803 803 804 804 804 804 805 805 805 805 805 806 806 806 806 807 807 807 807 807 808 808 808 808 808 809 809 809 809 810 810 810 810 810 811 811 811 811 812 812 812 812 812 813 813 813 813 813 814 814 814 814 815 815 815 815 815 816 816
2265 816 816 816 817 817 817 817 817 818 818 818 818 819 819 819 819 819 820 820 820 820 821 821 821 821 821 822 822 822 822 823 823 823 823 823 824 824 824 824 825 825 825 825 825 826 826 826 826 827 827 827 827 827 828 828 828 828 829 829 829 829 830 830 830 830 830 831 831 831 831
2256 831 832 832 832 832 832 833 833 833 833 834 834 834 834 835 835 835 835 835 836 836 836 836 837 837 837 837 838 838 838 838 838 839 839 839 839 840 840 840 840 841 841 841 841 841 842 842 842 842 843 843 843 843 844 844 844 844 844 845 845 845 845 846 846 846 846 847 847 847 847
2246 847 848 848 848 848 848 849 849 849 849 850 850 850 850 851 851 851 851 852 852 852 852 852 853 853 853 853 854 854 854 854 855 855 855 855 856 856 856 856 857 857 857 857 857 858 858 858 858 859 859 859 859 860 860 860 860 861 861 861 861 862 862 862 862 863 863 863 863 863 864
2237 864 864 864 864 865 865 865 865 866 866 866 866 867 867 867 867 868 868 868 868 869 869 869 869 870 870 870 870 871 871 871 871 872 872 872 872 873 873 873 873 873 874 874 874 874 875 875 875 875 876 876 876 876 877 877 877 877 878 878 878 878 879 879 879 879 880 880 880 880 881
2227 881 881 881 881 882 882 882 882 883 883 883 883 884 884 884 884 885 885 885 885 886 886 886 886 887 887 887 887 888 888 888 888 889 889 889 889 890 890 890 891 891 891 891 892 892 892 892 893 893 893 893 894 894 894 894 895 895 895 895 896 896 896 896 897 897 897 897 898 898 898
2218 898 898 899 899 899 899 900 900 900 901 901 901 901 902 902 902 902 903 903 903 903 904 904 904 904 905 905 905 905 906 906 906 906 907 907 907 908 908 908 908 909 909 909 909 910 910 910 910 911 911 911 911 912 912 912 913 913 913 913 914 914 914 914 915 915 915 915 916 916 916
2209 916 917 917 917 917 918 918 918 918 919 919 919 919 920 920 920 921 921 921 921 922 922 922 922 923 923 923 923 924 924 924 925 925 925 925 926 926 926 926 927 927 927 928 928 928 928 929 929 929 929 930 930 930 931 931 931 931 932 932 932 932 933 933 933 934 934 934 934 935 935
2199 935 935 935 936 936 936 937 937 937 937 938 938 938 939 939 939 939 940 940 940 940 941 941 941 942 942 942 942 943 943 943 944 944 944 944 945 945 945 945 946 946 946 947 947 947 947 948 948 948 949 949 949 949 950 950 950 951 951 951 951 952 952 952 953 953 953 953 954 954 954
2190 954 955 955 955 955 956 956 956 956 957 957 957 958 958 958 958 959 959 959 960 960 960 961 961 961 961 962 962 962 963 963 963 963 964 964 964 965 965 965 965 966 966 966 967 967 967 967 968 968 968 969 969 969 969 970 970 970 971 971 971 972 972 972 972 973 973 973 974 974 974
2180 974 974 975 975 975 976 976 976 977 977 977 977 978 978 978 979 979 979 979 980 980 980 981 981 981 982 982 982 982 983 983 983 984 984 984 985 985 985 985 986 986 986 987 987 987 988 988 988 988 989 989 989 990 990 990 991 991 991 991 992 992 992 993 993 993 994 994 994 994 995
2171 995 995 995 996 996 996 997 997 997 998 998 998 998 999 999 999 1000 1000 1000 1001 1001 1001 1001 1002 1002 1002 1003 1003 1003 1004 1004 1004 1005 1005 1005 1006 1006 1006 1006 1007 1007 1007 1008 1008 1008 1009 1009 1009 1010 1010 1010 1010 1011 1011 1011 1012 1012 1012 1013 1013 1013 1014 1014 1014 1015 1015 1015 1015 1016 1016
2162 1016 1016 1017 1017 1017 1018 1018 1018 1019 1019 1019 1020 1020 1020 1021 1021 1021 1021 1022 1022 1022 1023 1023 1023 1024 1024 1024 1025 1025 1025 1026 1026 1026 1027 1027 1027 1028 1028 1028 1028 1029 1029 1029 1030 1030 1030 1031 1031 1031 1032 1032 1032 1033 1033 1033 1034 1034 1034 1035 1035 1035 1036 1036 1036 1037 1037 1037 1038 1038
2152 1038 1038 1039 1039 1039 1039 1040 1040 1040 1041 1041 1041 1042 1042 1042 1043 1043 1043 1044 1044 1044 1045 1045 1045 1046 1046 1046 1047 1047 1047 1048 1048 1048 1049 1049 1049 1050 1050 1050 1051 1051 1051 1052 1052 1052 1053 1053 1053 1054 1054 1054 1055 1055 1055 1056 1056 1056 1057 1057 1057 1058 1058 1058 1059 1059 1059 1060 1060 1060
2143 1060 1061 1061 1061 1062 1062 1062 1063 1063 1063 1064 1064 1064 1065 1065 1065 1066 1066 1066 1067 1067 1067 1068 1068 1068 1069 1069 1070 1070 1070 1071 1071 1071 1072 1072 1072 1073 1073 1073 1074 1074 1074 1075 1075 1075 1076 1076 1076 1077 1077 1077 1078 1078 1078 1079 1079 1079 1080 1080 1081 1081 1081 1082 1082 1082 1083 1083 1083 1084
2134 1084 1084 1084 1085 1085 1085 1086 1086 1086 1087 1087 1088 1088 1088 1089 1089 1089 1090 1090 1090 1091 1091 1091 1092 1092 1092 1093 1093 1094 1094 1094 1095 1095 1095 1096 1096 1096 1097 1097 1097 1098 1098 1098 1099 1099 1100 1100 1100 1101 1101 1101 1102 1102 1102 1103 1103 1103 1104 1104 1105 1105 1105 1106 1106 1106 1107 1107 1107 1108
2124 1108 1108 1109 1109 1109 1110 1110 1110 1111 1111 1111 1112 1112 1113 1113 1113 1114 1114 1114 1115 1115 1115 1116 1116 1117 1117 1117 1118 1118 1118 1119 1119 1119 1120 1120 1121 1121 1121 1122 1122 1122 1123 1123 1124 1124 1124 1125 1125 1125 1126 1126 1126 1127 1127 1128 1128 1128 1129 1129 1129 1130 1130 1131 1131 1131 1132 1132 1132 1133
2115 1133 1133 1134 1134 1134 1135 1135 1135 1136 1136 1137 1137 1137 1138 1138 1138 1139 1139 1140 1140 1140 1141 1141 1141 1142 1142 1143 1143 1143 1144 1144 1145 1145 1145 1146 1146 1146 1147 1147 1148 1148 1148 1149 1149 1150 1150 1150 1151 1151 1151 1152 1152 1153 1153 1153 1154 1154 1155 1155 1155 1156 1156 1156 1157 1157 1158 1158 1158 1159
2106 1159 1159 1160 1160 1160 1161 1161 1161 1162 1162 1163 1163 1163 1164 1164 1165 1165 1165 1166 1166 1167 1167 1167 1168 1168 1169 1169 1169 1170 1170 1171 1171 1171 1172 1172 1172 1173 1173 1174 1174 1174 1175 1175 1176 1176 1176 1177 1177 1178 1178 1178 1179 1179 1180 1180 1180 1181 1181 1182 1182 1182 1183 1183 1184 1184 1184 1185 1185 1186
2097 1186 1186 1186 1187 1187 1188 1188 1189 1189 1189 1190 1190 1191 1191 1191 1192 1192 1193 1193 1193 1194 1194 1195 1195 1195 1196 1196 1197 1197 1197 1198 1198 1199 1199 1200 1200 1200 1201 1201 1202 1202 1202 1203 1203 1204 1204 1204 1205 1205 1206 1206 1207 1207 1207 1208 1208 1209 1209 1209 1210 1210 1211 1211 1212 1212 1212 1213 1213 1214
2087 1214 1214 1214 1215 1215 1216 1216 1217 1217 1217 1218 1218 1219 1219 1219 1220 1220 1221 1221 1222 1222 1222 1223 1223 1224 1224 1225 1225 1225 1226 1226 1227 1227 1228 1228 1228 1229 1229 1230 1230 1231 1231 1231 1232 1232 1233 1233 1234 1234 1234 1235 1235 1236 1236 1237 1237 1237 1238 1238 1239 1239 1240 1240 1240 1241 1241 1242 1242 1243
2078 1243 1243 1243 1244 1244 1245 1245 1246 1246 1247 1247 1247 1248 1248 1249 1249 1250 1250 1250 1251 1251 1252 1252 1253 1253 1254 1254 1254 1255 1255 1256 1256 1257 1257 1258 1258 1258 1259 1259 1260 1260 1261 1261 1262 1262 1262 1263 1263 1264 1264 1265 1265 1266 1266 1266 1267 1267 1268 1268 1269 1269 1270 1270 1270 1271 1271 1272 1272 1273
2069 1273 1273 1274 1274 1275 1275 1275 1276 1276 1277 1277 1278 1278 1279 1279 1280 1280 1280 1281 1281 1282 1282 1283 1283 1284 1284 1285 1285 1285 1286 1286 1287 1287 1288 1288 1289 1289 1290 1290 1291 1291 1291 1292 1292 1293 1293 1294 1294 1295 1295 1296 1296 1297 1297 1298 1298 1298 1299 1299 1300 1300 1301 1301 1302 1302 1303 1303 1304 1304
2060 1304 1305 1305 1305 1306 1306 1307 1307 1308 1308 1309 1309 1310 1310 1311 1311 1312 1312 1313 1313 1314 1314 1314 1315 1315 1316 1316 1317 1317 1318 1318 1319 1319 1320 1320 1321 1321 1322 1322 1323 1323 1324 1324 1325 1325 1325 1326 1326 1327 1327 1328 1328 1329 1329 1330 1330 1331 1331 1332 1332 1333 1333 1334 1334 1335 1335 1336 1336 1337
2050 1337 1337 1338 1338 1339 1339 1340 1340 1341 1341 1342 1342 1343 1343 1344 1344 1345 1345 1346 1346 1347 1347 1347 1348 1348 1349 1349 1350 1350 1351 1351 1352 1352 1353 1353 1354 1354 1355 1355 1356 1356 1357 1357 1358 1358 1359 1359 1360 1360 1361 1361 1362 1362 1363 1363 1364 1365 1365 1366 1366 1367 1367 1368 1368 1369 1369 1370 1370 1371
2041 1371 1371 1372 1372 1373 1373 1374 1374 1375 1375 1376 1376 1377 1377 1378 1378 1379 1379 1380 1380 1381 1381 1382 1382 1383 1383 1384 1384 1385 1385 1386 1387 1387 1388 1388 1389 1389 1390 1390 1391 1391 1392 1392 1393 1393 1394 1394 1395 1395 1396 1396 1397 1397 1398 1399 1399 1400 1400 1401 1401 1402 1402 1403 1403 1404 1404 1405 1405 1406
2032 1406 1406 1407 1408 1408 1409 1409 1410 1410 1411 1411 1412 1412 1413 1413 1414 1414 1415 1416 1416 1417 1417 1418 1418 1419 1419 1420 1420 1421 1421 1422 1423 1423 1424 1424 1425 1425 1426 1426 1427 1427 1428 1429 1429 1430 1430 1431 1431 1432 1432 1433 1433 1434 1435 1435 1436 1436 1437 1437 1438 1438 1439 1439 1440 1441 1441 1442 1442 1443
2023 1443 1443 1444 1444 1445 1446 1446 1447 1447 1448 1448 1449 1449 1450 1451 1451 1452 1452 1453 1453 1454 1454 1455 1456 1456 1457 1457 1458 1458 1459 1460 1460 1461 1461 1462 1462 1463 1463 1464 1465 1465 1466 1466 1467 1467 1468 1469 1469 1470 1470 1471 1471 1472 1473 1473 1474 1474 1475 1475 1476 1477 1477 1478 1478 1479 1479 1480 1481 1481
2013 1481 1482 1482 1483 1484 1484 1485 1485 1486 1486 1487 1488 1488 1489 1489 1490 1490 1491 1492 1492 1493 1493 1494 1495 1495 1496 1496 1497 1498 1498 1499 1499 1500 1500 1501 1502 1502 1503 1503 1504 1505 1505 1506 1506 1507 1508 1508 1509 1509 1510 1511 1511 1512 1512 1513 1514 1514 1515 1515 1516 1517 1517 1518 1518 1519 1520 1520 1521 1521
2004 1521 1522 1523 1523 1524 1524 1525 1526 1526 1527 1527 1528 1529 1529 1530 1530 1531 1532 1532 1533 1533 1534 1535 1535 1536 1536 1537 1538 1538 1539 1540 1540 1541 1541 1542 1543 1543 1544 1544 1545 1546 1546 1547 1548 1548 1549 1549 1550 1551 1551 1552 1553 1553 1554 1554 1555 1556 1556 1557 1558 1558 1559 1559 1560 1561 1561 1562 1563 1563
1995 1563 1564 1564 1565 1566 1566 1567 1568 1568 1569 1570 1570 1571 1571 1572 1573 1573 1574 1575 1575 1576 1577 1577 1578 1578 1579 1580 1580 1581 1582 1582 1583 1584 1584 1585 1586 1586 1587 1587 1588 1589 1589 1590 1591 1591 1592 1593 1593 1594 1595 1595 1596 1597 1597 1598 1598 1599 1600 1600 1601 1602 1602 1603 1604 1604 1605 1606 1606 1607
1986 1607 1608 1608 1609 1610 1610 1611 1612 1612 1613 1614 1614 1615 1616 1616 1617 1618 1618 1619 1620 1620 1621 1622 1622 1623 1624 1624 1625 1626 1626 1627 1628 1628 1629 1630 1630 1631 1632 1632 1633 1634 1634 1635 1636 1636 1637 1638 1638 1639 1640 1640 1641 1642 1643 1643 1644 1645 1645 1646 1647 1647 1648 1649 1649 1650 1651 1651 1652 1653
1976 1653 1654 1654 1655 1656 1656 1657 1658 1658 1659 1660 1660 1661 1662 1663 1663 1664 1665 1665 1666 1667 1667 1668 1669 1670 1670 1671 1672 1672 1673 1674 1674 1675 1676 1677 1677 1678 1679 1679 1680 1681 1681 1682 1683 1684 1684 1685 1686 1686 1687 1688 1689 1689 1690 1691 1691 1692 1693 1694 1694 1695 1696 1696 1697 1698 1699 1699 1700 1701
1967 1701 1702 1702 1703 1704 1704 1705 1706 1707 1707 1708 1709 1710 1710 1711 1712 1712 1713 1714 1715 1715 1716 1717 1718 1718 1719 1720 1720 1721 1722 1723 1723 1724 1725 1726 1726 1727 1728 1729 1729 1730 1731 1732 1732 1733 1734 1735 1735 1736 1737 1738 1738 1739 1740 1741 1741 1742 1743 1744 1744 1745 1746 1747 1747 1748 1749 1750 1750 1751
1958 1751 1752 1753 1753 1754 1755 1756 1756 1757 1758 1759 1759 1760 1761 1762 1763 1763 1764 1765 1766 1766 1767 1768 1769 1769 1770 1771 1772 1773 1773 1774 1775 1776 1776 1777 1778 1779 1779 1780 1781 1782 1783 1783 1784 1785 1786 1787 1787 1788 1789 1790 1790 1791 1792 1793 1794 1794 1795 1796 1797 1798 1798 1799 1800 1801 1801 1802 1803 1804
1948 1804 1805 1805 1806 1807 1808 1809 1809 1810 1811 1812 1813 1813 1814 1815 1816 1817 1817 1818 1819 1820 1821 1821 1822 1823 1824 1825 1826 1826 1827 1828 1829 1830 1830 1831 1832 1833 1834 1834 1835 1836 1837 1838 1839 1839 1840 1841 1842 1843 1843 1844 1845 1846 1847 1848 1848 1849 1850 1851 1852 1853 1853 1854 1855 1856 1857 1858 1858 1859
1939 1859 1860 1861 1862 1863 1863 1864 1865 1866 1867 1868 1868 1869 1870 1871 1872 1873 1874 1874 1875 1876 1877 1878 1879 1879 1880 1881 1882 1883 1884 1885 1885 1886 1887 1888 1889 1890 1891 1891 1892 1893 1894 1895 1896 1897 1897 1898 1899 1900 1901 1902 1903 1903 1904 1905 1906 1907 1908 1909 1910 1910 1911 1912 1913 1914 1915 1916 1917 1917
1930 1917 1918 1919 1920 1921 1922 1923 1924 1924 1925 1926 1927 1928 1929 1930 1931 1932 1932 1933 1934 1935 1936 1937 1938 1939 1940 1940 1941 1942 1943 1944 1945 1946 1947 1948 1949 1949 1950 1951 1952 1953 1954 1955 1956 1957 1958 1959 1959 1960 1961 1962 1963 1964 1965 1966 1967 1968 1969 1969 1970 1971 1972 1973 1974 1975 1976 1977 1978 1979
1921 1979 1980 1981 1981 1982 1983 1984 1985 1986 1987 1988 1989 1990 1991 1992 1993 1994 1995 1995 1996 1997 1998 1999 2000 2001 2002 2003 2004 2005 2006 2007 2008 2009 2010 2011 2011 2012 2013 2014 2015 2016 2017 2018 2019 2020 2021 2022 2023 2024 2025 2026 2027 2028 2029 2030 2031 2032 2033 2034 2034 2035 2036 2037 2038 2039 2040 2041 2042 2043
1911 2043 2044 2045 2046 2047 2048 2049 2050 2051 2052 2053 2054 2055 2056 2057 2058 2059 2060 2061 2062 2063 2064 2065 2066 2067 2068 2069 2070 2071 2072 2073 2074 2075 2076 2077 2078 2079 2080 2081 2082 2083 2084 2085 2086 2087 2088 2089 2090 2091 2092 2093 2094 2095 2096 2097 2098 2099 2100 2101 2102 2103 2104 2105 2106 2107 2108 2109 2110 2111
1902 2111 2112 2113 2114 2115 2116 2117 2118 2119 2121 2122 2123 2124 2125 2126 2127 2128 2129 2130 2131 2132 2133 2134 2135 2136 2137 2138 2139 2140 2141 2142 2143 2145 2146 2147 2148 2149 2150 2151 2152 2153 2154 2155 2156 2157 2158 2159 2160 2162 2163 2164 2165 2166 2167 2168 2169 2170 2171 2172 2173 2174 2175 2177 2178 2179 2180 2181 2182 2183
1893 2183 2184 2185 2186 2187 2188 2190 2191 2192 2193 2194 2195 2196 2197 2198 2199 2201 2202 2203 2204 2205 2206 2207 2208 2209 2210 2212 2213 2214 2215 2216 2217 2218 2219 2220 2222 2223 2224 2225 2226 2227 2228 2229 2231 2232 2233 2234 2235 2236 2237 2238 2240 2241 2242 2243 2244 2245 2246 2247 2249 2250 2251 2252 2253 2254 2255 2257 2258 2259
1884 2259 2260 2261 2262 2264 2265 2266 2267 2268 2269 2270 2272 2273 2274 2275 2276 2277 2279 2280 2281 2282 2283 2284 2286 2287 2288 2289 2290 2291 2293 2294 2295 2296 2297 2299 2300 2301 2302 2303 2304 2306 2307 2308 2309 2310 2312 2313 2314 2315 2316 2318 2319 2320 2321 2322 2324 2325 2326 2327 2328 2330 2331 2332 2333 2334 2336 2337 2338 2339
1874 2339 2340 2342 2343 2344 2345 2347 2348 2349 2350 2351 2353 2354 2355 2356 2358 2359 2360 2361 2363 2364 2365 2366 2367 2369 2370 2371 2372 2374 2375 2376 2377 2379 2380 2381 2382 2384 2385 2386 2387 2389 2390 2391 2392 2394 2395 2396 2398 2399 2400 2401 2403 2404 2405 2406 2408 2409 2410 2412 2413 2414 2415 2417 2418 2419 2421 2422 2423 2424
1865 2424 2426 2427 2428 2430 2431 2432 2433 2435 2436 2437 2439 2440 2441 2443 2444 2445 2446 2448 2449 2450 2452 2453 2454 2456 2457 2458 2460 2461 2462 2464 2465 2466 2468 2469 2470 2472 2473 2474 2476 2477 2478 2480 2481 2482 2484 2485 2486 2488 2489 2490 2492 2493 2494 2496 2497 2498 2500 2501 2502 2504 2505 2507 2508 2509 2511 2512 2513 2515
1856 2515 2516 2517 2519 2520 2522 2523 2524 2526 2527 2528 2530 2531 2533 2534 2535 2537 2538 2540 2541 2542 2544 2545 2547 2548 2549 2551 2552 2554 2555 2556 2558 2559 2561 2562 2563 2565 2566 2568 2569 2570 2572 2573 2575 2576 2578 2579 2580 2582 2583 2585 2586 2588 2589 2590 2592 2593 2595 2596 2598 2599 2601 2602 2603 2605 2606 2608 2609 2611
1847 2611 2612 2614 2615 2617 2618 2619 2621 2622 2624 2625 2627 2628 2630 2631 2633 2634 2636 2637 2639 2640 2642 2643 2645 2646 2648 2649 2651 2652 2654 2655 2657 2658 2660 2661 2663 2664 2666 2667 2669 2670 2672 2673 2675 2676 2678 2679 2681 2682 2684 2685 2687 2688 2690 2691 2693 2694 2696 2697 2699 2701 2702 2704 2705 2707 2708 2710 2711 2713
1837 2713 2714 2716 2718 2719 2721 2722 2724 2725 2727 2729 2730 2732 2733 2735 2736 2738 2740 2741 2743 2744 2746 2747 2749 2751 2752 2754 2755 2757 2759 2760 2762 2763 2765 2767 2768 2770 2771 2773 2775 2776 2778 2779 2781 2783 2784 2786 2787 2789 2791 2792 2794 2796 2797 2799 2801 2802 2804 2805 2807 2809 2810 2812 2814 2815 2817 2819 2820 2822
1828 2822 2824 2825 2827 2829 2830 2832 2834 2835 2837 2839 2840 2842 2844 2845 2847 2849 2850 2852 2854 2855 2857 2859 2860 2862 2864 2866 2867 2869 2871 2872 2874 2876 2877 2879 2881 2883 2884 2886 2888 2889 2891 2893 2895 2896 2898 2900 2902 2903 2905 2907 2908 2910 2912 2914 2915 2917 2919 2921 2922 2924 2926 2928 2929 2931 2933 2935 2937 2938
1819 2938 2940 2942 2944 2945 2947 2949 2951 2953 2954 2956 2958 2960 2961 2963 2965 2967 2969 2970 2972 2974 2976 2978 2979 2981 2983 2985 2987 2989 2990 2992 2994 2996 2998 3000 3001 3003 3005 3007 3009 3011 3012 3014 3016 3018 3020 3022 3023 3025 3027 3029 3031 3033 3035 3037 3038 3040 3042 3044 3046 3048 3050 3052 3053 3055 3057 3059 3061 3063
1809 3063 3065 3067 3069 3070 3072 3074 3076 3078 3080 3082 3084 3086 3088 3090 3092 3093 3095 3097 3099 3101 3103 3105 3107 3109 3111 3113 3115 3117 3119 3121 3123 3125 3127 3128 3130 3132 3134 3136 3138 3140 3142 3144 3146 3148 3150 3152 3154 3156 3158 3160 3162 3164 3166 3168 3170 3172 3174 3176 3178 3180 3182 3184 3186 3188 3190 3192 3194 3196
1800 3196 3198 3200 3203 3205 3207 3209 3211 3213 3215 3217 3219 3221 3223 3225 3227 3229 3231 3233 3235 3238 3240 3242 3244 3246 3248 3250 3252 3254 3256 3258 3261 3263 3265 3267 3269 3271 3273 3275 3277 3280 3282 3284 3286 3288 3290 3292 3294 3297 3299 3301 3303 3305 3307 3309 3312 3314 3316 3318 3320 3322 3325 3327 3329 3331 3333 3336 3338 3340
1791 3340 3342 3344 3346 3349 3351 3353 3355 3357 3360 3362 3364 3366 3369 3371 3373 3375 3377 3380 3382 3384 3386 3389 3391 3393 3395 3398 3400 3402 3404 3407 3409 3411 3413 3416 3418 3420 3423 3425 3427 3429 3432 3434 3436 3439 3441 3443 3445 3448 3450 3452 3455 3457 3459 3462 3464 3466 3469 3471 3473 3476 3478 3480 3483 3485 3487 3490 3492 3494
1782 3494 3497 3499 3501 3504 3506 3509 3511 3513 3516 3518 3520 3523 3525 3528 3530 3532 3535 3537 3540 3542 3544 3547 3549 3552 3554 3557 3559 3561 3564 3566 3569 3571 3574 3576 3579 3581 3583 3586 3588 3591 3593 3596 3598 3601 3603 3606 3608 3611 3613 3616 3618 3621 3623 3626 3628 3631 3633 3636 3638 3641 3643 3646 3648 3651 3653 3656 3659 3661
1772 3661 3664 3666 3669 3671 3674 3676 3679 3682 3684 3687 3689 3692 3694 3697 3700 3702 3705 3707 3710 3713 3715 3718 3720 3723 3726 3728 3731 3734 3736 3739 3742 3744 3747 3749 3752 3755 3757 3760 3763 3765 3768 3771 3773 3776 3779 3781 3784 3787 3790 3792 3795 3798 3800 3803 3806 3809 3811 3814 3817 3819 3822 3825 3828 3830 3833 3836 3839 3841
1763 3841 3844 3847 3850 3852 3855 3858 3861 3864 3866 3869 3872 3875 3878 3880 3883 3886 3889 3892 3894 3897 3900 3903 3906 3909 3911 3914 3917 3920 3923 3926 3929 3931 3934 3937 3940 3943 3946 3949 3952 3955 3957 3960 3963 3966 3969 3972 3975 3978 3981 3984 3987 3990 3992 3995 3998 4001 4004 4007 4010 4013 4016 4019 4022 4025 4028 4031 4034 4037
1754 4037 4040 4043 4046 4049 4052 4055 4058 4061 4064 4067 4070 4073 4076 4079 4082 4085 4089 4092 4095 4098 4101 4104 4107 4110 4113 4116 4119 4122 4126 4129 4132 4135 4138 4141 4144 4147 4151 4154 4157 4160 4163 4166 4169 4173 4176 4179 4182 4185 4189 4192 4195 4198 4201 4205 4208 4211 4214 4217 4221 4224 4227 4230 4234 4237 4240 4243 4247 4250
1745 4250 4253 4256 4260 4263 4266 4269 4273 4276 4279 4283 4286 4289 4293 4296 4299 4303 4306 4309 4313 4316 4319 4323 4326 4329 4333 4336 4340 4343 4346 4350 4353 4356 4360 4363 4367 4370 4374 4377 4380 4384 4387 4391 4394 4398 4401 4405 4408 4412 4415 4418 4422 4425 4429 4432 4436 4439 4443 4446 4450 4454 4457 4461 4464 4468 4471 4475 4478 4482
1735 4482 4485 4489 4493 4496 4500 4503 4507 4511 4514 4518 4521 4525 4529 4532 4536 4540 4543 4547 4551 4554 4558 4562 4565 4569 4573 4576 4580 4584 4587 4591 4595 4599 4602 4606 4610 4613 4617 4621 4625 4629 4632 4636 4640 4644 4647 4651 4655 4659 4663 4666 4670 4674 4678 4682 4686 4689 4693 4697 4701 4705 4709 4713 4716 4720 4724 4728 4732 4736
1726 4736 4740 4744 4748 4752 4756 4759 4763 4767 4771 4775 4779 4783 4787 4791 4795 4799 4803 4807 4811 4815 4819 4823 4827 4831 4835 4839 4844 4848 4852 4856 4860 4864 4868 4872 4876 4880 4884 4889 4893 4897 4901 4905 4909 4913 4918 4922 4926 4930 4934 4938 4943 4947 4951 4955 4959 4964 4968 4972 4976 4981 4985 4989 4993 4998 5002 5006 5011 5015
1717 5015 5019 5023 5028 5032 5036 5041 5045 5049 5054 5058 5063 5067 5071 5076 5080 5084 5089 5093 5098 5102 5107 5111 5115 5120 5124 5129 5133 5138 5142 5147 5151 5156 5160 5165 5169 5174 5178 5183 5187 5192 5197 5201 5206 5210 5215 5219 5224 5229 5233 5238 5243 5247 5252 5256 5261 5266 5270 5275 5280 5285 5289 5294 5299 5303 5308 5313 5318 5322
1708 5322 5327 5332 5337 5341 5346 5351 5356 5361 5365 5370 5375 5380 5385 5389 5394 5399 5404 5409 5414 5419 5424 5429 5433 5438 5443 5448 5453 5458 5463 5468 5473 5478 5483 5488 5493 5498 5503 5508 5513 5518 5523 5528 5533 5538 5543 5549 5554 5559 5564 5569 5574 5579 5584 5590 5595 5600 5605 5610 5615 5621 5626 5631 5636 5641 5647 5652 5657 5662
1698 5662 5668 5673 5678 5684 5689 5694 5700 5705 5710 5716 5721 5726 5732 5737 5742 5748 5753 5759 5764 5769 5775 5780 5786 5791 5797 5802 5808 5813 5819 5824 5830 5835 5841 5846 5852 5857 5863 5869 5874 5880 5885 5891 5897 5902 5908 5914 5919 5925 5931 5936 5942 5948 5954 5959 5965 5971 5976 5982 5988 5994 6000 6005 6011 6017 6023 6029 6035 6040
1689 6040 6046 6052 6058 6064 6070 6076 6082 6088 6094 6100 6106 6112 6118 6123 6130 6136 6142 6148 6154 6160 6166 6172 6178 6184 6190 6196 6202 6208 6215 6221 6227 6233 6239 6245 6252 6258 6264 6270 6277 6283 6289 6295 6302 6308 6314 6321 6327 6333 6340 6346 6352 6359 6365 6372 6378 6384 6391 6397 6404 6410 6417 6423 6430 6436 6443 6449 6456 6462
1680 6462 6469 6476 6482 6489 6495 6502 6509 6515 6522 6529 6535 6542 6549 6555 6562 6569 6576 6582 6589 6596 6603 6610 6616 6623 6630 6637 6644 6651 6658 6664 6671 6678 6685 6692 6699 6706 6713 6720 6727 6734 6741 6748 6755 6762 6769 6777 6784 6791 6798 6805 6812 6819 6827 6834 6841 6848 6855 6863 6870 6877 6884 6892 6899 6906 6914 6921 6928 6936
1671 6936 6943 6951 6958 6965 6973 6980 6988 6995 7003 7010 7018 7025 7033 7041 7048 7056 7063 7071 7079 7086 7094 7102 7109 7117 7125 7132 7140 7148 7156 7163 7171 7179 7187 7195 7203 7210 7218 7226 7234 7242 7250 7258 7266 7274 7282 7290 7298 7306 7314 7322 7330 7338 7346 7355 7363 7371 7379 7387 7395 7404 7412 7420 7428 7437 7445 7453 7462 7470
1661 7470 7478 7487 7495 7503 7512 7520 7529 7537 7546 7554 7563 7571 7580 7588 7597 7606 7614 7623 7631 7640 7649 7658 7666 7675 7684 7692 7701 7710 7719 7728 7737 7745 7754 7763 7772 7781 7790 7799 7808 7817 7826 7835 7844 7853 7862 7871 7880 7890 7899 7908 7917 7926 7935 7945 7954 7963 7973 7982 7991 8001 8010 8019 8029
1653 8029 8038 8048 8057 8067 8076 8086 8095 8105 8114 8124 8133 8143 8153 8162 8172 8182 8191 8201 8211 8221 8231 8240 8250 8260 8270 8280 8290 8300 8310 8320 8330 8340 8350 8360 8370 8380 8390 8400 8410
1647 8410 8421 8431 8441 8451 8462 8472 8482 8492 8503 8513 8524 8534 8544 8555 8565 8576 8586 8597 8607 8618 8629 8639 8650 8660 8671 8682 8693 8703 8714 8725 8736 8747 8757 8768
1643 8768 8779 8790 8801 8812 8823 8834 8845 8856 8867 8878 8890 8901 8912 8923 8934 8946 8957 8968 8980 8991 9002 9014 9025 9037 9048 9059 9071 9083 9094 9106 9117 9129 9141 9152
1638 9152 9164 9176 9188 9199 9211 9223 9235 9247 9259 9271 9283 9294 9307 9319 9331 9343 9355 9367 9379 9391 9404 9416 9428 9440 9453 9465 9477 9490 9502 9515 9527 9540 9552 9565
1633 9565 9577 9590 9603 9615 9628 9641 9654 9666 9679 9692 9705 9718 9731 9744 9757 9770 9783 9796 9809 9822 9835 9849 9862 9875 9888 9902 9915 9928 9942 9955 9969 9982 9996 10009
1629 10009 10023 10036 10050 10064 10077 10091 10105 10119 10133 10146 10160 10174 10188 10202 10216 10230 10244 10258 10273 10287 10301 10315 10329 10344 10358 10372 10387 10401 10416 10430 10445 10459 10474 10489
1624 10489 10503 10518 10533 10548 10562 10577 10592 10607 10622 10637 10652 10667 10682 10697 10712 10728 10743 10758 10773 10789 10804 10819 10835 10850 10866 10881 10897 10913 10928 10944 10960 10976 10991 11007
1620 11007 11023 11039 11055 11071 11087 11103 11119 11135 11152 11168 11184 11200 11217 11233 11250 11266 11283 11299 11316 11332 11349 11366 11382 11399 11416 11433 11450 11467 11484 11501 11518 11535 11552 11569
1615 11569 11587 11604 11621 11639 11656 11674 11691 11709 11726 11744 11761 11779 11797 11815 11833 11851 11868 11886 11904 11923 11941 11959 11977 11995 12014 12032 12050 12069 12087 12106 12124 12143 12162 12180
1610 12180 12199 12218 12237 12256 12275 12294 12313 12332 12351 12370 12390 12409 12428 12448 12467 12487 12506 12526 12545 12565 12585 12605 12625 12644 12664 12684 12705 12725 12745 12765 12785 12806 12826 12846
1606 12846 12867 12887 12908 12929 12949 12970 12991 13012 13033 13054 13075 13096 13117 13138 13160 13181 13202 13224 13245 13267 13288 13310 13332 13353 13375 13397 13419 13441 13463 13485 13507 13530 13552 13574
1601 13574 13597 13619 13642 13664 13687 13710 13733 13755 13778 13801 13824 13848 13871 13894 13917 13941 13964 13988 14011 14035 14058 14082 14106 14130 14154 14178 14202 14226 14250 14275 14299 14323 14348 14372
1596 14372 14397 14422 14446 14471 14496 14521 14546 14571 14596 14622 14647 14672 14698 14723 14749 14775 14801 14826 14852 14878 14904 14930 14957 14983 15009 15036 15062 15089 15116 15142 15169 15196 15223 15250
1592 15250 15277 15304 15332 15359 15386 15414 15442 15469 15497 15525 15553 15581 15609 15637 15665 15694 15722 15751 15779 15808 15837 15866 15895 15924 15953 15982 16011 16041 16070 16100 16129 16159 16189 16219
1587 16219 16249 16279 16309 16339 16370 16400 16431 16461 16492 16523 16554 16585 16616 16647 16678 16710 16741 16773 16804 16836 16868 16900 16932 16964 16997 17029 17061 17094 17127 17159 17192 17225 17258 17292
1583 17292 17325 17358 17392 17425 17459 17493 17527 17561 17595 17629 17664 17698 17733 17767 17802 17837 17872 17907 17942 17978 18013 18049 18085 18120 18156 18192 18229 18265 18301 18338 18374 18411 18448 18485
1578 18485 18522 18559 18597 18634 18672 18709 18747 18785 18823 18862 18900 18938 18977 19016 19054 19093 19133 19172 19211 19251 19290 19330 19370 19410 19450 19490 19531 19571 19612 19653 19694 19735 19776 19818
1573 19818 19859 19901 19943 19985 20027 20069 20112 20154 20197 20240 20283 20326 20369 20412 20456 20500 20544 20588 20632 20676 20721 20765 20810 20855 20900 20945 20991 21036 21082 21128 21174 21220 21267 21313
1569 21313 21360 21407 21454 21501 21549 21596 21644 21692 21740 21788 21837 21885 21934 21983 22032 22081 22131 22180 22230 22280 22330 22381 22431 22482 22533 22584 22636 22687 22739 22791 22843 22895 22947 23000
1564 23000 23053 23106 23159 23212 23266 23320 23374 23428 23483 23537 23592 23647 23702 23758 23813 23869 23925 23982 24038 24095 24152 24209 24266 24324 24382 24440 24498 24557 24615 24674 24733 24793 24852 24912
1559 24912 24972 25033 25093 25154 25215 25276 25338 25400 25461 25524 25586 25649 25712 25775 25839 25902 25966 26030 26095 26160 26225 26290 26355 26421 26487 26553 26620 26687 26754 26821 26889 26957 27025 27093
1555 27093 27162 27231 27301 27370 27440 27510 27581 27651 27722 27794 27865 27937 28009 28082 28155 28228 28301 28375 28449 28523 28598 28673 28748 28824 28900 28976 29052 29129 29206 29284 29362 29440 29519 29597
1550 29597 29677 29756 29836 29916 29997 30078 30159 30241 30322 30405 30487 30570 30654 30738 30822 30906 30991 31076 31162 31248 31334 31421 31508 31596 31684 31772 31860 31950 32039 32129 32219 32310 32401 32492
1545 32492 32584 32677 32769 32863 32956 33050 33145 33239 33335 33431 33527 33623 33720 33818 33916 34014 34113 34212 34312 34412 34513 34614 34716 34818 34921 35024 35127 35231 35336
1541 35336 35441 35547 35653 35759 35866 35974 36082 36190 36300 36409 36519 36630 36741 36853 36965 37078 37191 37305 37420 37535 37651 37767 37884
1538 37884 38001 38119 38237 38356 38476 38596 38717 38839 38961 39083 39207 39330 39455 39580 39706 39832 39959 40087 40215 40344 40474 40604 40735
1535 40735 40867 40999 41132 41266 41400 41535 41671 41807 41945 42082 42221 42360 42500 42641 42783 42925 43068 43212 43356 43502 43648 43794 43942
1532 43942 44090 44240 44390 44540 44692 44845 44998 45152 45307 45463 45619 45777 45935 46094 46254 46415 46577 46740 46903 47068 47233 47400 47567
1529 47567 47735 47904 48074 48245 48417 48590 48764 48939 49115 49292 49470 49649 49829 50010 50192 50375 50559 50744 50930 51118 51306 51496 51686
1526 51686 51878 52071 52265 52460 52656 52854 53052 53252 53453 53655 53859 54063 54269 54476 54684 54894 55105 55317 55530 55745 55961 56178 56397
1523 56397 56617 56838 57060 57284 57510 57737 57965 58195 58426 58658 58892 59128 59364 59603 59843 60084 60327 60572 60818 61065 61315 61565 61818
1520 61818 62072 62328 62585 62844 63105 63367 63631 63897 64165 64434 64705 64978 65253 65529 65808 66088 66370 66654 66940 67228 67518 67810 68103
1516 68103 68399 68697 68997 69298 69602 69908 70216 70527 70839 71154 71470 71789 72110 72434 72760 73088 73418 73751 74086 74423 74763 75105 75450
1513 75450 75797 76147 76499 76854 77211 77571 77934 78299 78667 79037 79411 79787 80166 80547 80932 81319 81710 82103 82499 82899 83301 83706 84114
1510 84114 84526 84941 85359 85780 86204 86632 87062 87497 87934 88376 88820 89268 89720 90175 90634 91096 91562 92032 92506 92983 93464 93949 94439
1507 94439 94932 95429 95930 96435 96945 97458 97976 98498 99025 99556 100091 100631 101176 101725 102279 102837 103400 103968 104541 105119 105702 106290 106883
1504 106883 107481 108084 108693 109307 109926 110551 111181 111818 112459 113107 113760 114419 115085 115756 116433 117117 117807 118503 119205 119914 120630 121352
1501 121352 122081 122817 123560 124310 125067 125831 126603 127382 128168 128962 129763 130573 131390 132215 133049 133890 134740 135598 136465 137341 138225 139118
1498 139118 140020 140931 141852 142782 143721 144670 145629 146598 147577 148566 149566 150576 151596 152628 153670 154724 155788 156865 157952
1495 157952 159052 160164 161287 162424 163572 164733 165908 167095 168295 169509 170737 171979 173234 174504 175789 177089 178403
1493 178403 179733 181078 182439 183816 185209 186619 188045 189489 190950 192428 193925 195439 196973 198525 200096 201687 203297
1491 203297 204928 206579 208251 209944 211659 213395 215154 216936 218741 220569 222422 224299 226200 228127 230080 232059 234064
1488 234064 236097 238158 240247 242364 244511 246688 248895 251133 253403 255706 258041 260409 262812 265250 267723 270233 272779
1486 272779 275364 277987 280649 283351 286095 288880 291709 294580 297497 300459 303468 306524 309628 312783 315988 319245 322555
1484 322555 325920 329340 332817 336352 339946 343601 347319 351100 354946 358860 362841 366893 371017 375214 379487 383837 388267
1481 388267 392777 397372 402051 406819 411676 416626 421671 426814 432056 437401 442852 448412 454083 459869 465773 471798 477949
1479 477949 484227 490639 497186 503874 510706 517687 524822 532115 539571 547196 554994 562972 571135 579489 588041 596797 605764
1477 605764 614950 624361 634006 643894 654031 664428 675095 686040 697275 708809 720656 732826 745332 758187
1475 758187 771406 785003 798994 813394 828221 843493 859230 875450 892176 909431 927237 945621 964610 984231
1473 984231 1004516 1025496 1047206 1069682 1092963 1117091 1142110 1168068 1195015 1223006 1252099 1282356 1313846 1346640
1471 1346640 1380817 1416461 1453662 1492520 1533142 1575642 1620147 1666794 1715732 1767124 1821148 1877999 1937892
1469 1937892 2001063 2067771 2138304 2212979 2292148 2376203 2465581 2560769 2662315 2770832 2887013 3011640 3145601
1468 3145601 3289907 3445709 3614331 3797294 3996356 4213560 4451287 4712328 4999972 5318118 5671413
1466 5671413 6065437 6506928 7004093 7567001 8208118 8943023 9791381 10778297 11936212 13307614 14948974
1465 14948974 16936581 19375376 22412655 26259816 31227927 37787412 46671171 59056638 76889020
1463 76889020 103430133 144009592 206315593 301296216 455274694 546522109 402571094 268405696
1462 268405696 185235753 130550007 95070899 71769918 56017214 45021797 37116284 31283941 26886408
1461 26886408 23510564 20881304 18810637 17167132 15857058 14812438 13983300 13332539 12832450 12462343
1460 12462343 12206902 12055034 11999075 12034249 12158328 12371450 12676069 13077037 13581832 14200929 14948381
1458 14948381 15842649 16907787 18175127 19685704 21493777 23672068 26319741 29574856 33634496 38788440
1457 38788440 45477734 54400720 66711808 84397027 110918574 151749476 212922729 318471764 399787192
1456 399787192 324841005 307817466 334639850 399933268 482936905 521683570 469091278 368981321
1454 368981321 279061563 215305792 176094942 160796381 180415440 264365692 336040079 254079638
1453 254079638 139595308 85851134 61022257 47349607 38741060 32811765 28472960 25162288 22560143
1452 22560143 20470891 18767665 17364374 16200507 15232375 14427808 13762817 13219436 12784276 12447570
1451 12447570 12202513 12044859 11972667 11986206 12087987 12282917 12578603 12985842 13519315 14198609 15049646
1449 15049646 16106732 17415498 19037195 21055048 23583870 26784917 30889386 36236562 43337422 52983253
1448 52983253 66434495 85747492 114300009 157386334 221779460 314933818 473955259 604704970
1447 604704970 447278055 300011952 211378528 150030483 109094077 81870733 63337861 50328776
1446 50328776 40917249 33919227 28588377 24440613 21153022 18504491 16339967 14548361 13048518 11780110
1444 11780110 10697570 9765989 8958272 8253134 7633676 7086343 6600164 6166183 5777031 5426602 5109799
1443 5109799 4822344 4560621 4321559 4102538 3901306 3715924 3544713 3386213 3239150 3102407 2975002
1441 2975002 2856070 2744845 2640646 2542868 2450972 2364472 2282936 2205972 2133230 2064390 1999165 1937295 1878540
1440 1878540 1822685 1769533 1718902 1670629 1624560 1580556 1538491 1498244 1459708 1422781 1387371 1353391 1320761
1438 1320761 1289407 1259258 1230252 1202327 1175429 1149503 1124502 1100380 1077094 1054603 1032870 1011859 991537
1436 991537 971872 952836 934400 916537 899224 882436 866152 850349 835010 820114 805645 791584 777916 764626
1434 764626 751700 739123 726882 714965 703360 692056 681042 670307 659842 649638 639685 629974 620499 611250
1432 611250 602220 593403 584790 576377 568155 560120 552265 544585 537074 529728 522541 515508 508626 501888 495293 488834 482509
1430 482509 476313 470243 464295 458466 452753 447153 441662 436277 430996 425816 420734 415748 410855 406053 401340 396713 392170
1428 392170 387709 383328 379025 374798 370645 366565 362556 358616 354743 350936 347193 343513 339895 336337 332837 329395 326008
1425 326008 322677 319399 316173 312999 309875 306800 303773 300792 297858 294969 292124 289323 286563 283845 281167 278530 275931
1423 275931 273370 270847 268360 265909 263494 261113 258766 256452 254170 251921 249703 247516 245358 243231 241132 239062 237020
1421 237020 235006 233018 231057 229122 227212 225328 223468 221632 219821 218032 216267 214523 212803 211104 209426 207769 206133
1418 206133 204518 202922 201346 199789 198252 196733 195232 193750 192285 190838 189408 187995 186598 185219 183855 182507 181175
1416 181175 179858 178556 177269 175997 174740 173496 172267 171051 169850 168661 167486 166323 165174 164037 162913 161801 160700
1414 160700 159612 158536 157471 156417 155375 154344 153323 152314 151315 150326 149348 148380 147422 146473 145535 144606 143686 142776 141876 140984
1411 140984 140101 139227 138362 137505 136657 135817 134986 134163 133348 132540 131741 130949 130165 129389 128620 127858 127104 126356 125616 124883 124157 123437
1408 123437 122724 122018 121319 120626 119939 119259 118585 117917 117255 116599 115949 115305 114667 114034 113408 112786 112171 111560 110956 110356 109762 109173
1405 109173 108589 108010 107437 106868 106304 105745 105191 104641 104097 103557 103021 102490 101964 101442 100924 100411 99902 99397 98896 98400 97908 97419
1402 97419 96935 96455 95978 95506 95037 94572 94111 93654 93200 92750 92304 91861 91422 90986 90554 90125 89699 89277 88858 88442 88030 87621 87215
1399 87215 86812 86412 86015 85622 85231 84843 84459 84077 83698 83322 82949 82579 82211 81847 81485 81125 80769 80415 80063 79715 79368 79025 78684
1396 78684 78345 78009 77675 77344 77015 76689 76365 76043 75723 75406 75091 74779 74468 74160 73854 73550 73249 72949 72652 72356 72063 71772 71483
1393 71483 71196 70911 70627 70346 70067 69790 69514 69241 68969 68699 68431 68165 67901 67638 67377 67118 66861 66605 66352 66100 65849 65600 65353
1389 65353 65108 64864 64622 64381 64142 63905 63669 63435 63202 62971 62741 62513 62286 62060 61837 61614 61393 61174 60956 60739 60523 60309 60097
1386 60097 59886 59676 59467 59260 59054 58849 58646 58444 58243 58044 57845 57648 57452 57258 57064 56872 56681 56491 56303 56115 55929 55744 55560
1383 55560 55377 55195 55014 54835 54656 54479 54302 54127 53953 53780 53608 53437 53267 53097 52929 52762 52596 52431 52267 52104 51942 51781 51621
1380 51621 51462 51303 51146 50989 50834 50679 50526 50373 50221 50070 49920 49770 49622 49474 49328 49182 49037 48893 48749 48607 48465 48324 48184
1377 48184 48045 47906 47769 47632 47496 47360 47226 47092 46959 46826 46695 46564 46434 46304 46176 46048 45921 45794 45668 45543 45419 45295 45172
1374 45172 45050 44928 44807 44687 44567 44448 44330 44212 44095 43979 43863 43748 43634 43520 43407 43294 43182 43071 42960 42850 42740 42631 42523
1371 42523 42415 42308 42201 42095 41990 41885 41780 41677 41573 41471 41368 41267 41166 41065 40965 40866 40767 40669 40571 40473 40377 40280 40185 40089 39994 39900
1367 39900 39806 39713 39620 39528 39436 39345 39254 39164 39074 38984 38895 38807 38719 38631 38544 38457 38371 38286 38200 38115 38031 37947 37863 37780 37698 37615 37533 37452 37371 37291 37210 37131 37051 36972
1362 36972 36894 36816 36738 36661 36584 36507 36431 36356 36280 36205 36131 36057 35983 35909 35836 35764 35691 35619 35548 35477 35406 35335 35265 35196 35126 35057 34988 34920 34852 34785 34717 34650 34584 34517
1358 34517 34451 34386 34321 34256 34191 34127 34063 33999 33936 33873 33810 33748 33686 33624 33563 33502 33441 33380 33320 33260 33201 33142 33083 33024 32966 32908 32850 32792 32735 32678 32622 32565 32509 32454
1353 32454 32398 32343 32288 32233 32179 32125 32071 32018 31964 31911 31859 31806 31754 31702 31651 31599 31548 31497 31447 31396 31346 31296 31247 31197 31148 31099 31051 31003 30954 30907 30859 30812 30765 30718
1349 30718 30671 30625 30578 30533 30487 30441 30396 30351 30307 30262 30218 30174 30130 30086 30043 30000 29957 29914 29872 29829 29787 29745 29704 29662 29621 29580 29539 29499 29459 29418 29379 29339 29299 29260
1344 29260 29221 29182 29143 29105 29067 29029 28991 28953 28916 28878 28841 28804 28768 28731 28695 28659 28623 28587 28552 28517 28481 28446 28412 28377 28343 28309 28275 28241 28207 28174 28140 28107 28074 28042
1339 28042 28009 27977 27944 27912 27881 27849 27817 27786 27755 27724 27693 27663 27632 27602 27572 27542 27512 27482 27453 27424 27395 27366 27337 27308 27280 27252 27223 27196 27168 27140 27113 27085 27058 27031
1335 27031 27004 26978 26951 26925 26899 26873 26847 26821 26795 26770 26745 26719 26694 26670 26645 26620 26596 26572 26548 26524 26500 26476 26453 26430 26406 26383 26360 26338 26315 26293 26270 26248 26226 26204
1330 26204 26182 26161 26139 26118 26097 26076 26055 26034 26013 25993 25972 25952 25932 25912 25892 25873 25853 25834 25814 25795 25776 25757 25739 25720 25701 25683 25665 25647 25629 25611 25593 25576 25558 25541
1325 25541 25524 25507 25490 25473 25456 25440 25423 25407 25391 25375 25359 25343 25327 25312 25296 25281 25266 25251 25236 25221 25206 25192 25177 25163 25149 25135 25121 25107 25093 25079 25066 25052 25039 25026
1321 25026 25013 25000 24987 24975 24962 24950 24937 24925 24913 24901 24889 24877 24866 24854 24843 24832 24820 24809 24798 24788 24777 24766 24756 24745 24735 24725 24715 24705 24695 24685 24676 24666 24657 24648 24638
1316 24638 24629 24620 24612 24603 24594 24586 24577 24569 24561 24553 24545 24537 24529 24522 24514 24507 24499 24492 24485 24478 24471 24464 24458 24451 24445 24438 24432 24426 24420 24414 24408 24402 24396 24391 24386 24380 24375 24370 24365 24360 24355 24350 24346 24341 24337 24333 24329 24324 24320 24317 24313 24309 24306 24302 24299 24295 24292 24289 24286 24283 24281 24278 24275 24273 24271 24268 24266
1307 24266 24264 24262 24260 24259 24257 24255 24254 24253 24251 24250 24249 24248 24247 24247 24246 24245 24245 24245 24244 24244 24244 24244 24244 24245 24245 24245 24246 24246 24247 24248 24249 24250 24251 24252 24254 24255 24257 24258 24260 24262 24264 24266 24268 24270 24272 24275 24277 24280 24283 24286 24288 24291 24295 24298 24301 24304 24308 24312 24315 24319 24323 24327 24331 24335 24339 24344 24348
1298 24348 24353 24358 24362 24367 24372 24377 24383 24388 24393 24399 24404 24410 24416 24421 24427 24434 24440 24446 24452 24459 24465 24472 24479 24486 24493 24500 24507 24514 24521 24529 24536 24544 24552 24560 24568 24576 24584 24592 24600 24609 24617 24626 24635 24644 24653 24662 24671 24680 24689 24699 24708 24718 24728 24738 24748 24758 24768 24778 24789
1290 24789 24799 24810 24820 24831 24842 24853 24864 24875 24887 24898 24910 24921 24933 24945 24957 24969 24981 24993 25005 25018 25030 25043 25056 25069 25082 25095 25108 25121 25134 25148 25162 25175 25189 25203
1285 25203 25217 25231 25245 25260 25274 25289 25303 25318 25333 25348 25363 25378 25394 25409 25425 25440 25456 25472 25488 25504 25520 25537 25553 25569 25586 25603 25620 25637 25654 25671 25688 25706 25723 25741
1280 25741 25759 25777 25795 25813 25831 25849 25868 25886 25905 25924 25943 25962 25981 26000 26019 26039 26058 26078 26098 26118 26138 26158 26178 26199 26219 26240 26261 26282 26303 26324 26345 26367 26388 26410
1276 26410 26432 26453 26475 26498 26520 26542 26565 26587 26610 26633 26656 26679 26702 26726 26749 26773 26796 26820 26844 26868 26893 26917 26942 26966 26991 27016 27041 27066 27091 27117 27142 27168 27194 27220
1271 27220 27246 27272 27299 27325 27352 27378 27405 27432 27459 27487 27514 27542 27570 27597 27625 27653 27682 27710 27739 27767 27796 27825 27854 27884 27913 27943 27972 28002 28032 28062 28092 28123 28153 28184
1267 28184 28215 28246 28277 28308 28340 28371 28403 28435 28467 28499 28532 28564 28597 28630 28663 28696 28729 28763 28796 28830 28864 28898 28932 28966 29001 29036 29071 29106 29141 29176 29212 29247 29283 29319
1262 29319 29355 29392 29428 29465 29502 29539 29576 29613 29651 29688 29726 29764 29803 29841 29879 29918 29957 29996 30035 30075 30114 30154 30194 30234 30275 30315 30356 30397 30438 30479 30521 30562 30604 30646
1257 30646 30688 30730 30773 30816 30859 30902 30945 30989 31032 31076 31120 31165 31209 31254 31299 31344 31389 31435 31480 31526 31572 31619 31665 31712 31759 31806 31853 31901 31949 31996 32045 32093 32142 32191
1253 32191 32240 32289 32338 32388 32438 32488 32538 32589 32640 32691 32742 32794 32845 32897 32949 33002 33054 33107 33160 33214 33267 33321 33375 33429 33484 33539 33594 33649 33704 33760 33816 33872 33929 33986
1248 33986 34043 34100 34157 34215 34273 34331 34390 34449 34508 34567 34627 34686 34747 34807 34868 34928 34990 35051 35113 35175 35237 35300 35362 35426 35489 35553 35617 35681 35745 35810 35875 35941 36006 36072
1243 36072 36139 36205 36272 36339 36407 36475 36543 36611 36680 36749 36818 36888 36958 37028 37099 37170 37241 37313 37384 37457 37529 37602 37675 37749 37823 37897 37972 38046 38122 38197 38273 38349 38426 38503
1239 38503 38580 38658 38736 38815 38893 38972 39052 39132 39212 39293 39374 39455 39537 39619 39701 39784 39867 39951 40035 40119 40204 40290 40375 40461 40548 40634 40722 40809 40897 40986 41075 41164 41254 41344
1234 41344 41434 41525 41617 41709 41801 41894 41987 42081 42175 42269 42364 42460 42556 42652 42749 42846 42944 43042 43141 43240 43340 43440 43541 43642 43743 43845 43948 44051 44155
1230 44155 44259 44364 44469 44574 44681 44787 44895 45002 45111 45219 45329 45439 45549 45660 45772 45884 45997 46110 46224 46338 46453 46569 46685
1227 46685 46801 46919 47037 47155 47274 47394 47514 47635 47757 47879 48002 48125 48249 48374 48499 48625 48752 48879 49007 49135 49265 49395 49525
1224 49525 49657 49789 49921 50055 50189 50324 50459 50595 50732 50870 51008 51147 51287 51428 51569 51711 51854 51998 52142 52287 52433 52580 52727
1221 52727 52876 53025 53175 53326 53477 53630 53783 53937 54092 54248 54404 54562 54720 54880 55040 55201 55363 55525 55689 55854 56019 56186 56353
1218 56353 56522 56691 56861 57033 57205 57378 57552 57728 57904 58081 58259 58438 58619 58800 58982 59166 59350 59536 59723 59910 60099 60289 60480
1215 60480 60673 60866 61060 61256 61453 61651 61850 62050 62252 62454 62658 62864 63070 63278 63487 63697 63908 64121 64335 64551 64767 64985 65205
1211 65205 65425 65648 65871 66096 66322 66550 66779 67010 67242 67475 67710 67946 68184 68424 68665 68907 69151 69397 69644 69893 70143 70395 70649
1208 70649 70904 71161 71420 71680 71942 72206 72471 72739 73008 73278 73551 73825 74102 74380 74660 74942 75225 75511 75799 76088 76380 76673 76969
1205 76969 77267 77566 77868 78172 78478 78786 79096 79408 79723 80040 80359 80680 81003 81329 81657 81988 82321 82656 82993 83334 83676 84021 84369
1202 84369 84719 85071 85426 85784 86145 86508 86874 87242 87613 87988 88364 88744 89127 89512 89900 90292 90686 91083 91484 91887 92293 92703 93116
1199 93116 93532 93951 94374 94800 95229 95662 96098 96537 96980 97427 97877 98330 98788 99249 99714 100182 100655 101131 101611 102095 102583 103076 103572
1196 103572 104072 104577 105086 105599 106116 106638 107164 107695 108230 108770 109314 109863 110417 110976 111540 112108 112682 113260 113844 114433 115027 115626
1193 115626 116231 116841 117457 118078 118705 119337 119976 120620 121270 121926 122588 123257 123931 124612 125300 125993 126694 127401 128115 128835 129563 130297
1190 130297 131039 131788 132544 133308 134079 134857 135644 136438 137240 138050 138868 139695 140530 141373 142225 143086 143955 144834 145722 146619 147525 148441
1187 148441 149366 150301 151246 152202 153167 154143 155129 156126 157134 158153 159183 160225 161278 162343 163419 164508 165609 166722 167849
1184 167849 168988 170140 171305 172484 173676 174883 176103 177338 178588 179852 181131 182426 183737 185063 186405 187764 189140
1182 189140 190532 191942 193370 194815 196278 197760 199261 200781 202321 203880 205459 207060 208681 210323 211987 213674 215383
1179 215383 217114 218870 220649 222452 224280 226133 228013 229918 231850 233809 235796 237812 239856 241930 244034 246169 248335
1177 248335 250533 252763 255027 257325 259658 262026 264430 266871 269351 271868 274426 277023 279662 282343 285067 287835 290648
1175 290648 293507 296414 299368 302372 305427 308533 311692 314906 318175 321501 324885 328329 331834 335402 339034 342732 346498
1173 346498 350333 354240 358219 362274 366405 370616 374908 379283 383744 388293 392933 397666 402494 407421 412449 417582 422822
1170 422822 428172 433636 439218 444920 450747 456702 462790 469015 475380 481891 488552 495368 502345 509487 516801 524292 531966
1168 531966 539830 547890 556153 564628 573320 582239 591393 600790 610441 620354 630540 641009 651774 662845 674236 685960
1166 685960 698030 710461 723269 736471 750083 764124 778613 793571 809020 824984 841485 858552 876211 894493
1164 894493 913428 933051 953399 974508 996421 1019182 1042838 1067440 1093042 1119705 1147490 1176467 1206710 1238297
1162 1238297 1271317 1305863 1342038 1379951 1419725 1461492 1505396 1551596 1600266 1651596 1705798 1763105 1823773
1160 1823773 1888088 1956368 2028967 2106279 2188748 2276870 2371207 2472391 2581141 2698273 2824721 2961554
1159 2961554 3110001 3271484 3447653 3640431 3852073 4085235 4343066 4629317 4948492 5306032 5708564
1157 5708564 6164220 6683072 7277713 7964052 8762424 9699144 10808744 12137255 13747085 15724521 18191502
1156 18191502 21324700 25387542 30786011 38170410 48630423 64090638 88159598 128024343 198379092
1154 198379092 324091479 503020665 614912933 539751753 361149523 220724502 140660286 95839637
1153 95839637 69224028 52396891 41179518 33373941 27751591 23587567 20433833 18002337 16101566
1152 16101566 14600516 13407380 12456507 11700176 11103259 10639690 10290078 10040074 9879249 9800314 9798608
1150 9798608 9871760 10019514 10243683 10548234 10939498 11426557 12021826 12741917 13608911 14652200 15911265
1149 15911265 17439838 19312414 21634645 24560564 28322242 33283113 40038545 49615072 63882233
1148 63882233 86413019 124104468 188959356 288435959 328669620 252011838 193827045 174820507
1147 174820507 186024704 225351829 295007309 387538437 467742615 487265732 432472740 342309601
1146 342309601 268148898 246545081 300906105 324177124 247708828 136689742 83719781 59633471
1144 59633471 46293649 37753669 31773512 27341329 23929357 21231598 19056388 17276626 15804337
1143 15804337 14576596 13547254 12681808 11954101 11344120 10836507 10419517 10084300 9824395 9635388 9514705
1142 9514705 9461502 9476661 9562866 9724807 9969487 10306710 10749766 11316432 12030387 12923270 14037674 15431614
1140 15431614 17185299 19411649 22273097 26009163 30983298 37765298 47281864 61102000 81992846
1139 81992846 114996183 169292180 259996905 399921886 515205643 440272080 291890208 188521834
1138 188521834 126240038 88628991 65047076 49577306 38987243 31461966 25940863 21778212 18565655
1137 18565655 16035967 14008919 12359656 10999607 9864614 8907314 8092153 7392035 6786024 6257743
1135 6257743 5794234 5385135 5022085 4698276 4408120 4146993 3911047 3697054 3502293 3324455 3161571
1134 3161571 3011953 2874150 2746904 2629122 2519855 2418267 2323627 2235290 2152684 2075304 2002699 1934467
1132 1934467 1870248 1809719 1752591 1698603 1647518 1599122 1553221 1509640 1468218 1428807 1391275 1355499 1321366
1130 1321366 1288773 1257625 1227834 1199319 1172007 1145827 1120716 1096614 1073466 1051221 1029831 1009252 989441
1129 989441 970361 951974 934247 917149 900648 884718 869331 854463 840092 826194 812749 799738 787142 774944
1127 774944 763128 751677 740577 729815 719377 709250 699422 689883 680621 671626 662889 654400 646150 638131 630336
1125 630336 622755 615383 608212 601235 594447 587841 581410 575151 569057 563123 557345 551717 546235 540896 535694 530627 525689
1122 525689 520878 516189 511621 507168 502829 498600 494479 490462 486547 482731 479013 475388 471857 468415 465061 461793 458608
1120 458608 455506 452484 449541 446674 443882 441163 438517 435941 433434 430994 428621 426313 424069 421887 419767 417707 415706
1118 415706 413764 411878 410049 408276 406557 404891 403278 401717 400207 398748 397338 395977 394665 393400 392183 391011 389886
1115 389886 388806 387771 386780 385833 384929 384069 383251 382474 381740 381047 380395 379783 379212 378681 378189 377737 377324 376951 376616 376319 376061 375841
1112 375841 375659 375516 375409 375341 375310 375316 375360 375441 375559 375715 375908 376138 376405 376710 377052 377431 377847 378301 378793 379322 379889 380494 381136 381817
1109 381817 382537 383295 384092 384927 385802 386717 387671 388665 389699 390774 391890 393047 394246 395487 396770 398095 399464 400877 402334
1106 402334 403835 405381 406973 408611 410295 412027 413807 415635 417512 419439 421417 423445 425526 427659 429845 432086 434382
1104 434382 436734 439143 441609 444134 446719 449365 452073 454843 457678 460578 463544 466578 469681 472854 476099 479417 482809
1102 482809 486278 489824 493449 497156 500945 504818 508778 512826 516964 521194 525519 529940 534460 539081 543805 548636 553575
1100 553575 558626 563791 569072 574474 579999 585651 591432 597346 603397 609588 615924 622409 629046 635840 642795 649917 657210
1097 657210 664679 672329 680167 688197 696426 704860 713505 722369 731458 740780 750343 760154 770223 780557 791166 802061
1095 802061 813250 824745 836557 848697 861177 874012 887213 900796 914775 929166 943986 959251 974982 991196
1093 991196 1007914 1025159 1042952 1061319 1080284 1099876 1120123 1141055 1162705 1185108 1208300 1232321 1257212 1283018
1091 1283018 1309786 1337567 1366417 1396392 1427556 1459975 1493722 1528875 1565516 1603738 1643636 1685317 1728895
1089 1728895 1774494 1822249 1872307 1924827 1979985 2037971 2098995 2163287 2231099 2302711 2378431 2458599 2543595
1088 2543595 2633838 2729798 2832001 2941034 3057558 3182320 3316164 3460046 3615057 3782444 3963637 4160285
1086 4160285 4374294 4607880 4863634 5144593 5454346 5797152 6178098 6603306 7080186 7617785 8227237
1085 8227237 8922366 9720511 10643637 11719910 12985896 14489742 16295824 18491709 21198802 24589066
1083 24589066 28911971 34539312 42042154 52327440 66888147 88269396 120910613 172341089 252583485
1082 252583485 360991581 453775298 456059609 365682754 256890169 175574430 123414607 90415132
1081 90415132 68908864 54359773 44168630 36813141 31370414 27260716 24107695 21659764 19744389
1080 19744389 18240639 17062214 16146647 15448307 14933734 14578508 14365120 14281517 14320134 14477269 14752733
1078 14752733 15149729 15674926 16338757 17155936 18146263 19335781 20758432 22458366 24493221 26938804
1077 26938804 29895879 33500147 37937261 43465885 50454054 59438053 71220803 87041682 108879610
1076 108879610 140010393 186044347 256760787 368372560 539884584 759157687 925902482 908461479
1074 908461479 722747588 507193897 346393463 242979834 177309721 134316510 105074415 84460519
1073 84460519 69468452 58271244 49718166 43059915 37793797 33573546 30155067 27362794 25068237
1072 25068237 23175990 21614385 20329137 19278963 18432500 17766156 17262590 16909668 16699770 16629390 16698977
1071 16698977 16913016 17280348 17814784 18536049 19471201 20656677 22141232 23990206 26291726 29165945
1069 29165945 32778958 37364230 43256321 50945113 61164932 75043585 94353107 121922179 162246659
1068 162246659 222057367 309222525 423068732 523150163 527042245 430559708 315513226 226173548
1067 226173548 164604922 123033454 94581491 74619067 60228008 49580734 41515158 35275264 30356940
1066 30356940 26415781 23211108 20571152 18370972 16518077 14942917 13592426 12425581 11410281 10521133
1064 10521133 9737842 9044034 8426388 7873974 7377760 6930231 6525093 6157038 5821575 5514870 5233647
1063 5233647 4975083 4736741 4516504 4312530 4123207 3947120 3783023 3629815 3486521 3352273 3226298
1061 3226298 3107905 2996475 2891451 2792334 2698671 2610053 2526110 2446505 2370932 2299112 2230791 2165735 2103730
1060 2103730 2044581 1988108 1934143 1882535 1833143 1785835 1740491 1696999 1655255 1615162 1576631 1539578 1503925
1058 1503925 1469599 1436532 1404661 1373926 1344271 1315645 1287997 1261282 1235457 1210480 1186314 1162921 1140269
1056 1140269 1118325 1097057 1076438 1056440 1037038 1018207 999923 982166 964913 948146 931845 915993 900572
1054 900572 885567 870962 856742 842893 829402 816257 803445 790954 778773 766892 755301 743990 732949 722170
1052 722170 711644 701363 691319 681505 671913 662537 653370 644404 635636 627057 618663 610449 602408 594537 586829 579281
1050 579281 571887 564644 557548 550593 543777 537095 530544 524121 517821 511642 505581 499634 493799 488072 482451 476933 471516
1048 471516 466197 460973 455843 450804 445853 440989 436210 431513 426897 422359 417898 413513 409200 404960 400789 396687 392652
1046 392652 388682 384776 380933 377151 373429 369765 366159 362608 359113 355671 352282 348944 345657 342419 339230 336088 332992
1043 332992 329942 326936 323974 321055 318178 315342 312546 309790 307073 304393 301751 299146 296576 294042 291542 289077 286644
1041 286644 284244 281877 279541 277235 274960 272715 270500 268313 266154 264023 261919 259842 257792 255767 253768 251794 249844
1039 249844 247918 246017 244138 242283 240450 238639 236850 235083 233336 231611 229906 228221 226556 224910 223283 221676 220086
1036 220086 218516 216963 215427 213910 212409 210925 209458 208007 206573 205154 203751 202363 200991 199633 198290 196962 195648
1034 195648 194348 193062 191790 190531 189285 188053 186833 185626 184432 183250 182080 180922 179777 178642 177520 176408 175308
1032 175308 174219 173141 172074 171017 169971 168935 167909 166893 165887 164891 163905 162928 161960 161002 160053 159113 158182 157260 156346
1029 156346 155441 154545 153657 152777 151905 151041 150186 149338 148497 147665 146840 146023 145213 144410 143614 142826 142044 141270 140502 139741 138987 138239
1026 138239 137498 136763 136035 135313 134598 133888 133185 132487 131796 131110 130430 129756 129087 128425 127767 127116 126469 125828 125192 124562 123937 123316
1023 123316 122701 122091 121486 120886 120290 119700 119114 118533 117956 117384 116817 116254 115695 115141 114591 114046 113504 112967 112435 111906 111381 110861
1020 110861 110344 109831 109322 108818 108317 107819 107326 106836 106350 105867 105388 104913 104441 103973 103508 103047 102589 102134 101683 101235 100790 100348
1017 100348 99910 99474 99042 98613 98187 97765 97345 96928 96514 96103 95695 95289 94887 94487 94091 93697 93305 92917 92531 92148 91767 91389
1014 91389 91014 90641 90270 89903 89537 89174 88814 88456 88101 87747 87397 87048 86702 86358 86016 85677 85340 85005 84672 84342 84014 83687 83363
1011 83363 83041 82721 82403 82088 81774 81462 81152 80845 80539 80235 79933 79633 79335 79038 78744 78451 78161 77872 77585 77299 77016 76734 76454
1008 76454 76176 75899 75624 75351 75079 74809 74541 74274 74009 73746 73484 73224 72965 72708 72452 72198 71945 71694 71445 71197 70950 70705 70461
1005 70461 70219 69978 69738 69500 69263 69028 68794 68562 68330 68100 67872 67645 67419 67194 66970 66748 66527 66308 66089 65872 65656 65442 65228
1002 65228 65016 64805 64595 64386 64179 63972 63767 63563 63360 63158 62957 62757 62559 62361 62165 61970 61775 61582 61390 61199 61009 60820 60632
998 60632 60445 60259 60074 59890 59707 59525 59344 59163 58984 58806 58629 58452 58277 58102 57929 57756 57584 57414 57244 57075 56906 56739 56572
995 56572 56407 56242 56078 55915 55753 55592 55431 55271 55112 54954 54797 54640 54485 54330 54176 54022 53870 53718 53567 53417 53267 53118 52970
992 52970 52823 52676 52530 52385 52241 52097 51954 51812 51670 51529 51389 51250 51111 50973 50835 50698 50562 50427 50292 50158 50024 49892 49759
989 49759 49628 49497 49366 49237 49108 48979 48851 48724 48597 48471 48346 48221 48097 47973 47850 47728 47606 47484 47364 47243 47124 47005 46886
986 46886 46768 46651 46534 46418 46302 46186 46072 45958 45844 45731 45618 45506 45394 45283 45173 45063 44953 44844 44735 44627 44520 44413 44306
983 44306 44200 44094 43989 43884 43780 43676 43573 43470 43368 43266 43165 43064 42963 42863 42763 42664 42565 42467 42369 42272 42174 42078 41982 41886 41791 41696 41601
979 41601 41507 41413 41320 41227 41135 41043 40951 40860 40769 40679 40589 40499 40410 40321 40232 40144 40056 39969 39882 39795 39709 39623 39538 39452 39368 39283 39199 39115 39032 38949 38866 38784 38702 38621
974 38621 38539 38458 38378 38298 38218 38138 38059 37980 37901 37823 37745 37668 37591 37514 37437 37361 37285 37209 37134 37059 36984 36910 36836 36762 36688 36615 36542 36470 36397 36325 36254 36182 36111 36041
970 36041 35970 35900 35830 35760 35691 35622 35553 35485 35416 35348 35281 35213 35146 35079 35013 34947 34880 34815 34749 34684 34619 34554 34490 34426 34362 34298 34235 34172 34109 34046 33984 33921 33860 33798
965 33798 33737 33675 33614 33554 33493 33433 33373 33314 33254 33195 33136 33077 33019 32960 32902 32845 32787 32730 32672 32616 32559 32502 32446 32390 32334 32279 32224 32168 32114 32059 32004 31950 31896 31842
961 31842 31789 31735 31682 31629 31576 31524 31471 31419 31367 31316 31264 31213 31162 31111 31060 31009 30959 30909 30859 30809 30760 30710 30661 30612 30563 30515 30467 30418 30370 30322 30275 30227 30180 30133
956 30133 30086 30039 29993 29947 29900 29854 29809 29763 29718 29672 29627 29582 29538 29493 29449 29404 29360 29317 29273 29229 29186 29143 29100 29057 29014 28972 28929 28887 28845 28803 28762 28720 28679 28638
951 28638 28597 28556 28515 28474 28434 28394 28354 28314 28274 28234 28195 28156 28117 28078 28039 28000 27962 27923 27885 27847 27809 27771 27734 27696 27659 27622 27584 27548 27511 27474 27438 27401 27365 27329
947 27329 27293 27258 27222 27187 27151 27116 27081 27046 27011 26977 26942 26908 26874 26840 26806 26772 26738 26705 26671 26638 26605 26572 26539 26506 26474 26441 26409 26377 26345 26313 26281 26249 26218 26186
942 26186 26155 26124 26093 26062 26031 26000 25970 25939 25909 25879 25849 25819 25789 25759 25730 25700 25671 25642 25613 25584 25555 25526 25498 25469 25441 25413 25385 25357 25329 25301 25273 25246 25218 25191
937 25191 25164 25137 25110 25083 25056 25030 25003 24977 24950 24924 24898 24872 24846 24821 24795 24769 24744 24719 24694 24669 24644 24619 24594 24569 24545 24520 24496 24472 24448 24424 24400 24376 24352 24329
933 24329 24305 24282 24259 24236 24213 24190 24167 24144 24121 24099 24076 24054 24032 24010 23988 23966 23944 23922 23901 23879 23858 23836 23815 23794 23773 23752 23731 23711 23690 23669 23649 23629 23608 23588
928 23588 23568 23548 23528 23509 23489 23469 23450 23431 23411 23392 23373 23354 23335 23316 23298 23279 23260 23242 23224 23205 23187 23169 23151 23133 23116 23098 23080 23063 23045 23028 23011 22994 22977 22960
923 22960 22943 22926 22909 22893 22876 22860 22843 22827 22811 22795 22779 22763 22747 22732 22716 22701 22685 22670 22654 22639 22624 22609 22594 22579 22565 22550 22535 22521 22507 22492 22478 22464 22450 22436
919 22436 22422 22408 22394 22381 22367 22354 22340 22327 22314 22301 22288 22275 22262 22249 22237 22224 22211 22199 22187 22174 22162 22150 22138 22126 22114 22102 22091 22079 22068 22056 22045 22033 22022 22011
914 22011 22000 21989 21978 21968 21957 21946 21936 21925 21915 21905 21894 21884 21874 21864 21854 21844 21835 21825 21815 21806 21797 21787 21778 21769 21760 21751 21742 21733 21724 21716 21707 21698 21690 21682 21673 21665 21657 21649 21641 21633 21625 21618 21610 21602 21595 21588 21580 21573 21566
908 21566 21559 21552 21545 21538 21531 21525 21518 21511 21505 21499 21492 21486 21480 21474 21468 21462 21456 21451 21445 21439 21434 21428 21423 21418 21413 21408 21403 21398 21393 21388 21383 21379 21374 21370 21365 21361 21357 21353 21349 21345 21341 21337 21333 21329 21326 21322 21319 21316 21312 21309 21306 21303 21300 21297 21294 21292 21289 21287 21284 21282 21279 21277 21275 21273 21271 21269 21267 21265
898 21265 21264 21262 21261 21259 21258 21257 21255 21254 21253 21252 21252 21251 21250 21249 21249 21248 21248 21248 21248 21247 21247 21247 21248 21248 21248 21248 21249 21249 21250 21251 21251 21252 21253 21254 21255 21257 21258 21259 21261 21262 21264 21265 21267 21269 21271 21273 21275 21277 21280 21282 21284 21287 21290 21292 21295 21298 21301 21304 21307 21310 21314 21317 21320 21324 21328 21331 21335 21339
889 21339 21343 21347 21351 21356 21360 21364 21369 21373 21378 21383 21388 21393 21398 21403 21408 21413 21419 21424 21430 21436 21441 21447 21453 21459 21465 21471 21478 21484 21491 21497 21504 21511 21517 21524 21531 21539 21546 21553 21561 21568 21576 21583 21591 21599 21607 21615 21623 21631 21640 21648 21657 21665 21674 21683 21692 21701 21710 21719 21729 21738 21747 21757 21767 21777
880 21777 21786 21796 21807 21817 21827 21837 21848 21859 21869 21880 21891 21902 21913 21924 21936 21947 21959 21970 21982 21994 22006 22018 22030 22042 22055 22067 22080 22092 22105 22118 22131 22144 22157 22171 22184
876 22184 22198 22211 22225 22239 22253 22267 22281 22295 22310 22324 22339 22354 22369 22384 22399 22414 22429 22445 22460 22476 22492 22508 22524 22540 22556 22572 22589 22605 22622 22639 22656 22673 22690 22708
871 22708 22725 22743 22760 22778 22796 22814 22832 22851 22869 22888 22906 22925 22944 22963 22982 23002 23021 23041 23060 23080 23100 23120 23141 23161 23181 23202 23223 23244 23265 23286 23307 23329 23350 23372
866 23372 23394 23416 23438 23460 23482 23505 23528 23551 23573 23597 23620 23643 23667 23690 23714 23738 23762 23787 23811 23836 23860 23885 23910 23935 23961 23986 24012 24037 24063 24089 24116 24142 24168 24195
862 24195 24222 24249 24276 24303 24331 24359 24386 24414 24443 24471 24499 24528 24557 24586 24615 24644 24674 24703 24733 24763 24793 24823 24854 24885 24915 24946 24978 25009 25040 25072 25104 25136 25168 25201
857 25201 25233 25266 25299 25332 25366 25399 25433 25467 25501 25536 25570 25605 25640 25675 25710 25745 25781 25817 25853 25889 25926 25963 25999 26036 26074 26111 26149 26187 26225 26263 26302 26341 26380 26419
852 26419 26458 26498 26538 26578 26618 26658 26699 26740 26781 26823 26864 26906 26948 26991 27033 27076 27119 27162 27206 27249 27293 27337 27382 27427 27472 27517 27562 27608 27654 27700 27746 27793 27840 27887
848 27887 27935 27982 28030 28078 28127 28176 28225 28274 28324 28373 28424 28474 28525 28576 28627 28678 28730 28782 28834 28887 28940 28993 29047 29101 29155 29209 29264 29319 29374 29430 29485 29542 29598 29655
843 29655 29712 29770 29827 29885 29944 30003 30062 30121 30181 30241 30301 30362 30423 30484 30546 30608 30671 30733 30796 30860 30924 30988 31052 31117 31183 31248 31314 31381 31447 31514 31582 31650 31718 31786
838 31786 31855 31925 31995 32065 32135 32206 32278 32349 32422 32494 32567 32641 32714 32789 32863 32938 33014 33090 33166 33243 33320 33398 33476 33555 33634 33713 33793 33874 33954 34036 34118 34200 34283 34366
834 34366 34449 34534 34618 34704 34789 34875 34962 35049 35137 35225 35314 35403 35493 35583 35674 35765 35857 35950 36043 36136 36230 36325 36420 36516 36612 36709 36807 36905 37003 37103 37203 37303 37404
829 37404 37506 37608 37711 37814 37919 38023 38129 38235 38342 38449 38557 38666 38775 38885 38996 39107 39219 39332 39445 39559 39674 39790 39906
826 39906 40023 40141 40259 40378 40498 40619 40741 40863 40986 41110 41234 41360 41486 41613 41740 41869 41998 42129 42260 42392 42524 42658 42792
823 42792 42928 43064 43201 43339 43478 43618 43758 43900 44043 44186 44330 44476 44622 44770 44918 45067 45217 45369 45521 45674 45828 45984 46140
820 46140 46298 46456 46616 46776 46938 47101 47265 47430 47596 47764 47932 48102 48273 48445 48618 48792 48968 49145 49323 49502 49683 49865 50048
817 50048 50232 50418 50605 50793 50983 51174 51367 51560 51756 51952 52150 52350 52551 52753 52957 53162 53369 53577 53787 53999 54211 54426 54642
814 54642 54860 55079 55300 55523 55747 55973 56201 56430 56661 56894 57129 57365 57604 57844 58086 58329 58575 58823 59072 59323 59577 59832 60090
811 60090 60349 60610 60874 61139 61407 61677 61949 62223 62499 62778 63058 63342 63627 63915 64204 64497 64792 65089 65388 65690 65995 66302 66612
807 66612 66924 67239 67556 67877 68200 68525 68854 69185 69519 69856 70195 70538 70884 71232 71584 71939 72296 72657 73021 73389 73759 74133 74510
804 74510 74891 75275 75662 76053 76448 76846 77247 77653 78062 78474 78891 79311 79736 80164 80596 81032 81473 81917 82366 82819 83276 83738 84204
801 84204 84675 85150 85629 86114 86603 87097 87596 88099 88608 89121 89640 90164 90693 91228 91768 92313 92864 93421 93983 94551 95125 95705 96291
798 96291 96883 97481 98085 98696 99314 99937 100568 101205 101850 102501 103159 103825 104497 105177 105865 106560 107263 107974 108693 109420 110155 110898 111650
795 111650 112411 113180 113958 114746 115542 116348 117163 117988 118822 119667 120522 121387 122262 123148 124045 124953 125872 126802 127744 128698 129663 130641 131631
792 131631 132634 133650 134679 135721 136776 137846 138929 140027 141139 142266 143408 144566 145739 146928 148133 149355 150594
789 150594 151851 153124 154416 155726 157055 158402 159770 161156 162563 163991 165440 166910 168402 169917 171454 173015 174600
787 174600 176209 177843 179502 181188 182900 184639 186407 188202 190027 191882 193767 195683 197632 199613 201627 203676 205760
785 205760 207881 210038 212233 214467 216741 219055 221412 223811 226255 228744 231280 233864 236497 239180 241915 244704 247548
782 247548 250448 253406 256425 259505 262649 265858 269135 272481 275899 279392 282960 286608 290338 294152 298052 302044 306128
780 306128 310309 314590 318975 323467 328070 332789 337628 342591 347684 352911 358279 363792 369457 375280 381268 387429 393769
778 393769 400297 407022 413953 421100 428472 436082 443940 452061 460457 469144 478137 487452 497110 507128 517529 528336
776 528336 539574 551270 563454 576159 589420 603276 617770 632949 648865 665575 683143 701639 721143 741743
774 741743 763537 786637 811168 837273 865112 894872 926763 961029 997951 1037858 1081130 1128219 1179653 1236064
772 1236064 1298206 1366989 1443517 1529144 1625538 1734784 1859508 2003056 2169748 2365237 2597031 2875274
770 2875274 3213926 3632609 4159559 4836491 5726905 6930718 8610867 11042570 14701775 20391487 29207280
769 29207280 41365882 53322510 58690477 54154512 42572051 30306697 21274108 15450281 11740486
767 11740486 9311211 7665205 6515279 5692029 5092067 4650074 4323456 4083678 3911195 3792387 3717670
766 3717670 3680279 3675489 3700096 3752082 3830386 3934773 4065754 4224562 4413175 4634371 4891840 5190348
764 5190348 5535961 5936366 6401305 6943172 7577837 8325806 9213853 10277372 11563807 13137743 15088602
763 15088602 17542468 20680550 24768322 30201380 37575420 47782016 62098243 82158333 109992084
762 109992084 150568361 204647511 220942633 175205186 128491261 97992478 77375427 64366044
761 64366044 57903367 57191021 60283558 62289224 58014007 47928329 36974592 28456535 22611052 18642933
759 18642933 15877278 13889594 12424478 11325599 10494234 9866104 9398336 9061934 8837323 8711673 8677303
758 8677303 8730800 8872677 9107505 9444641 9899790 10498085 11280150 12314461 13723026 15727934 18660374
756 18660374 22519996 26175622 28679765 30213873 32119297 36018018 42600577 52579150 67353893 89242857
755 89242857 121192142 164335517 212082006 249182320 263656144 252186440 217851505 172327982 131311372
754 131311372 102355221 85127202 77315582 76550992 78761040 76954358 67234794 53876018 42028344
752 42028344 33192669 26908850 22418564 19141059 16691871 14823233 13373929 12236851 11339212 10630541
751 10630541 10075304 9648290 9331658 9113057 8984400 8941101 8981646 9107410 9322698 9635002 10055503 10599865
749 10599865 11289423 12152914 13228987 14569848 16246622 18357287 21038573 24483872 28970219 34898150
748 34898150 42847630 53646612 68427213 88593308 115409172 147585971 174439812 177473837 154212113
747 154212113 122250618 94767131 74442059 60609449 52636443 50142969 50254552 48049847 42991861
746 42991861 34482050 25586962 19469679 15638147 13105388 11304798 9948786 8884882 8025848 7317962
744 7317962 6726032 6225849 5800128 5436182 5124527 4858006 4631224 4440175 4282004 4154868 4057862 3991026
743 3991026 3955418 3953268 3988247 4065890 4194242 4384865 4654408 5027097 5538814 6243912 7226955 8623404
741 8623404 10656286 13698020 18348441 25378671 34906219 44407224 48751436 44825435 35408527 25678598
740 25678598 18382415 13509393 10291393 8111688 6584791 5479604 4655757 4025548 3532457 3138957
738 3138957 2819439 2555992 2335805 2149531 1990226 1852649 1732782 1627507 1534373 1451430 1377114 1310156
737 1310156 1249517 1194343 1143923 1097661 1055056 1015684 979182 945241 913592 884005 856278 830236 805723 782604
735 782604 760760 740082 720478 701861 684157 667296 651218 635868 621194 607152 593701 580801 568419 556523
733 556523 545084 534075 523472 513252 503394 493879 484688 475805 467215 458902 450853 443056 435499 428171 421061 414160
731 414160 407458 400947 394620 388467 382482 376659 370990 365471 360094 354854 349747 344768 339911 335173 330548 326034 321626
728 321626 317321 313115 309005 304988 301060 297219 293462 289786 286190 282669 279223 275848 272544 269306 266135 263027 259981
726 259981 256995 254068 251198 248383 245621 242912 240254 237646 235085 232572 230104 227681 225302 222965 220669 218414 216197
724 216197 214020 211879 209775 207707 205674 203674 201708 199774 197872 196001 194160 192349 190566 188812 187086 185387 183714
721 183714 182067 180446 178849 177277 175728 174203 172701 171221 169763 168326 166911 165516 164141 162786 161451 160134 158836
719 158836 157557 156295 155052 153825 152615 151422 150246 149085 147940 146811 145697 144597 143513 142443 141386 140344 139316
717 139316 138300 137298 136309 135333 134369 133417 132478 131550 130634 129729 128836 127954 127083 126223 125373 124533 123704 122885 122076 121276 120486 119706
714 119706 118935 118173 117420 116676 115941 115214 114496 113786 113084 112391 111705 111028 110358 109696 109041 108394 107754 107121 106496 105877 105265 104661 104062
711 104062 103471 102886 102307 101735 101169 100610 100056 99508 98967 98431 97901 97376 96858 96344 95837 95334 94837 94346 93859 93378 92901 92430 91964
707 91964 91502 91046 90594 90147 89704 89266 88833 88404 87979 87559 87143 86732 86324 85921 85522 85127 84736 84349 83966 83586 83211 82839 82471
704 82471 82107 81747 81390 81037 80687 80341 79998 79658 79322 78990 78661 78335 78012 77692 77376 77063 76752 76445 76141 75840 75542 75247 74955
701 74955 74666 74380 74096 73815 73537 73262 72990 72720 72453 72188 71927 71667 71411 71157 70905 70656 70409 70165 69924 69684 69447 69213 68981
698 68981 68751 68523 68298 68075 67854 67635 67419 67205 66993 66783 66575 66370 66166 65965 65765 65568 65373 65179 64988 64799 64611 64426 64242
695 64242 64061 63881 63703 63528 63353 63181 63011 62842 62676 62511 62348 62186 62027 61869 61713 61558 61405 61254 61105 60957 60811 60667 60524
692 60524 60383 60244 60106 59970 59835 59702 59570 59441 59312 59185 59060 58936 58814 58693 58574 58456 58340 58225 58112 58000 57890 57781 57673
689 57673 57567 57463 57360 57258 57157 57058 56961 56865 56770 56676 56584 56494 56404 56316 56230 56144 56060 55978 55896 55817 55738 55661 55585 55510 55436 55364 55294 55224 55156 55089 55023 54959
684 54959 54896 54834 54773 54714 54656 54599 54544 54489 54436 54385 54334 54285 54237 54190 54144 54100 54057 54015 53975 53935 53897 53860 53824 53790 53757 53725 53694 53664 53636 53609 53583 53559 53535 53513
680 53513 53492 53472 53454 53436 53420 53405 53392 53380 53368 53358 53350 53342 53336 53331 53327 53325 53324 53324 53325 53327 53331 53336 53342 53350 53359 53369 53380 53393 53407 53422 53438 53456 53475 53495 53517 53540 53564 53589 53616 53644 53674 53705
674 53705 53737 53770 53805 53841 53879 53917 53958 53999 54042 54087 54132 54180 54228 54278 54329 54382 54436 54492 54549 54608 54668 54729 54792 54857 54923 54990 55059 55129 55201 55275 55350 55427 55505 55585
669 55585 55666 55749 55834 55920 56008 56097 56188 56281 56375 56471 56569 56669 56770 56873 56978 57084 57192 57302 57414 57528 57643 57761 57880 58001 58124 58249 58375
666 58375 58504 58635 58767 58902 59039 59177 59318 59461 59605 59752 59901 60052 60206 60361 60519 60679 60841 61005 61172 61340 61512 61685 61861
662 61861 62039 62220 62403 62589 62777 62968 63161 63356 63555 63756 63959 64165 64374 64586 64800 65018 65238 65461 65686 65915 66147 66381 66619
659 66619 66860 67103 67350 67600 67853 68110 68370 68633 68899 69169 69442 69718 69999 70282 70570 70861 71155 71453 71756 72062 72371 72685 73003
656 73003 73325 73650 73980 74314 74653 74996 75343 75694 76050 76410 76775 77145 77519 77898 78282 78671 79065 79464 79868 80277 80692 81112 81537
653 81537 81968 82404 82846 83294 83748 84207 84673 85144 85622 86106 86596 87093 87596 88106 88623 89147 89678 90215 90760 91312 91872 92439 93014
650 93014 93597 94187 94786 95392 96007 96631 97263 97904 98553 99212 99880 100557 101243 101939 102645 103361 104088 104824 105571 106329 107097 107877 108667
647 108667 109470 110284 111109 111947 112798 113660 114536 115425 116327 117242 118171 119114 120072 121044 122030 123032 124050 125083 126132 127198 128280
644 128280 129379 130495 131630 132782 133953 135142 136351 137579 138827 140096 141386 142696 144029 145384 146761 148162 149586
642 149586 151034 152507 154006 155530 157081 158658 160263 161897 163559 165251 166973 168727 170511 172329 174179 176063 177982
639 177982 179937 181929 183957 186024 188131 190277 192465 194695 196968 199286 201650 204060 206519 209026 211585 214195 216858
637 216858 219577 222351 225184 228076 231028 234044 237124 240270 243485 246770 250127 253558 257066 260653 264320 268072 271909
635 271909 275835 279852 283964 288173 292482 296894 301414 306043 310786 315647 320628 325736 330972 336343 341852 347504 353305
632 353305 359259 365372 371649 378096 384721 391528 398525 405718 413116 420726 428556 436614 444910 453453 462252 471319 480663
630 480663 490296 500231 510479 521055 531971 543243 554886 566917 579353 592212 605513 619277 633525 648281
628 648281 663568 679412 695840 712882 730567 748928 768001 787821 808429 829867 852178 875410 899616 924849
626 924849 951168 978636 1007320 1037291 1068629 1101415 1135740 1171701 1209402 1248957 1290487 1334125 1380013 1428309
624 1428309 1479180 1532812 1589404 1649176 1712367 1779239 1850080 1925203 2004956 2089720 2179917 2276011 2378519
623 2378519 2488009 2605119 2730555 2865104 3009649 3165177 3332795 3513752 3709452 3921484 4151647
621 4151647 4401983 4674815 4972792 5298941 5656728 6050127 6483709 6962732 7493256 8082265 8737809
620 8737809 9469154 10286941 11203332 12232131 13388839 14690565 16155716 17803307 19651649 21716149
618 21716149 24005812 26518056 29231632 32097806 35031143 37902699 40540326 42741561 44302112 45056428
617 45056428 44918069 43903205 42126109 39768808 37038956 34132027 31207621 28380951 25725294 23279966
615 23279966 21059629 19062648 17277595 15687870 14274759 13019328 11903515 10910683 10025852 9235728
614 9235728 8528632 7894360 7324035 6809947 6345413 5924629 5542559 5194826 4877617 4587610 4321898
613 4321898 4077938 3853498 3646613 3455553 3278787 3114961 2962874 2821454 2689749 2566907 2452166
611 2452166 2344842 2244321 2150048 2061526 1978303 1899970 1826157 1756528 1690776 1628622 1569811 1514111 1461309
609 1461309 1411208 1363630 1318410 1275396 1234447 1195436 1158242 1122756 1088875 1056504 1025557 995950 967609 940463
607 940463 914445 889496 865556 842573 820497 799281 778881 759256 740368 722179 704657 687769 671484 655776
606 655776 640617 625981 611845 598187 584986 572220 559872 547924 536358 525158 514310 503798 493609 483729
604 483729 474147 464851 455829 447070 438566 430305 422279 414478 406896 399522 392351 385374 378584 371976 365542 359277 353174
601 353174 347228 341435 335787 330282 324913 319677 314569 309585 304722 299974 295339 290813 286393 282075 277856 273734 269704
599 269704 265766 261915 258149 254466 250864 247339 243890 240515 237211 233977 230810 227709 224672 221697 218783 215927 213129
597 213129 210386 207698 205062 202478 199944 197459 195021 192630 190284 187982 185723 183506 181330 179194 177096 175037 173014
594 173014 171028 169077 167161 165278 163428 161610 159823 158068 156342 154645 152977 151337 149724 148138 146578 145044 143534
592 143534 142049 140588 139151 137736 136344 134974 133625 132298 130991 129704 128437 127189 125960 124750 123558 122384 121228
590 121228 120088 118965 117859 116769 115695 114636 113593 112564 111550 110551 109566 108594 107636 106691 105760 104841 103935 103041 102159 101289
587 101289 100431 99585 98749 97925 97112 96309 95517 94735 93964 93202 92450 91708 90975 90252 89537 88832 88135 87448 86768 86097 85435 84780 84134
584 84134 83495 82864 82241 81625 81016 80415 79821 79234 78654 78080 77513 76953 76400 75852 75311 74777 74248 73725 73208 72697 72192 71692 71198
581 71198 70710 70226 69749 69276 68808 68346 67889 67436 66988 66546 66108 65674 65245 64821 64401 63985 63574 63167 62765 62366 61972 61581 61195
578 61195 60813 60434 60059 59688 59321 58957 58597 58241 57888 57539 57193 56850 56511 56175 55842 55513 55186 54863 54543 54226 53912 53601 53292
574 53292 52987 52685 52385 52088 51794 51503 51214 50928 50645 50364 50086 49810 49537 49266 48998 48732 48468 48207 47948 47691 47437 47185 46935
571 46935 46687 46441 46198 45957 45717 45480 45245 45012 44780 44551 44324 44098 43875 43653 43433 43215 42999 42785 42572 42361 42152 41945 41739
568 41739 41535 41333 41132 40933 40735 40539 40345 40152 39961 39771 39582 39396 39210 39026 38844 38663 38483 38305 38128 37953 37778 37606 37434
565 37434 37264 37095 36927 36761 36596 36432 36269 36108 35948 35788 35631 35474 35318 35164 35011 34858 34707 34557 34409 34261 34114 33968 33824
562 33824 33680 33538 33396 33256 33116 32977 32840 32703 32568 32433 32299 32166 32034 31903 31773 31644 31516 31388 31261 31136 31011 30887 30764
559 30764 30641 30520 30399 30279 30160 30042 29924 29807 29691 29576 29462 29348 29235 29123 29011 28901 28790 28681 28572 28465 28357 28251 28145
556 28145 28040 27935 27831 27728 27625 27523 27422 27322 27222 27122 27023 26925 26828 26731 26634 26539 26443 26349 26255 26161 26068 25976 25884 25793 25702 25612 25523 25434 25345
552 25345 25257 25170 25083 24996 24911 24825 24740 24656 24572 24489 24406 24323 24241 24160 24079 23998 23918 23838 23759 23680 23602 23524 23447 23370 23293 23217 23142 23066 22991 22917 22843 22769 22696 22624
547 22624 22551 22479 22408 22336 22266 22195 22125 22056 21986 21917 21849 21781 21713 21646 21579 21512 21446 21380 21314 21249 21184 21119 21055 20991 20927 20864 20801 20739 20676 20614 20553 20492 20431 20370
542 20370 20310 20250 20190 20130 20071 20012 19954 19896 19838 19780 19723 19666 19609 19552 19496 19440 19385 19329 19274 19219 19165 19111 19057 19003 18949 18896 18843 18790 18738 18686 18634 18582 18531 18480
538 18480 18429 18378 18328 18277 18227 18178 18128 18079 18030 17981 17933 17884 17836 17788 17741 17693 17646 17599 17552 17506 17459 17413 17367 17322 17276 17231 17186 17141 17096 17052 17008 16963 16920 16876
533 16876 16833 16789 16746 16703 16661 16618 16576 16534 16492 16450 16409 16367 16326 16285 16244 16204 16163 16123 16083 16043 16003 15964 15924 15885 15846 15807 15768 15730 15691 15653 15615 15577 15539 15502
529 15502 15464 15427 15390 15353 15316 15280 15243 15207 15171 15135 15099 15063 15027 14992 14957 14922 14887 14852 14817 14782 14748 14714 14680 14646 14612 14578 14545 14511 14478 14445 14412 14379 14346 14313
524 14313 14281 14248 14216 14184 14152 14120 14088 14057 14025 13994 13963 13932 13901 13870 13839 13808 13778 13748 13717 13687 13657 13627 13597 13568 13538 13509 13479 13450 13421 13392 13363 13334 13306 13277
519 13277 13249 13220 13192 13164 13136 13108 13080 13053 13025 12997 12970 12943 12916 12889 12862 12835 12808 12781 12755 12728 12702 12675 12649 12623 12597 12571 12545 12520 12494 12469 12443 12418 12392 12367
515 12367 12342 12317 12292 12268 12243 12218 12194 12169 12145 12121 12096 12072 12048 12024 12000 11977 11953 11929 11906 11882 11859 11836 11813 11790 11767 11744 11721 11698 11675 11653 11630 11608 11585 11563
510 11563 11541 11518 11496 11474 11452 11431 11409 11387 11365 11344 11322 11301 11280 11258 11237 11216 11195 11174 11153 11132 11111 11091 11070 11049 11029 11009 10988 10968 10948 10927 10907 10887 10867 10847
505 10847 10828 10808 10788 10768 10749 10729 10710 10691 10671 10652 10633 10614 10595 10575 10557 10538 10519 10500 10481 10463 10444 10426 10407 10389 10370 10352 10334 10316 10297 10279 10261 10243 10225 10208
501 10208 10190 10172 10154 10137 10119 10102 10084 10067 10049 10032 10015 9998 9981 9963 9946 9929 9913 9896 9879 9862 9845 9829 9812 9795 9779 9762 9746 9730 9713 9697 9681 9665 9649 9632
496 9632 9616 9600 9584 9569 9553 9537 9521 9506 9490 9474 9459 9443 9428 9412 9397 9382 9366 9351 9336 9321 9306 9290 9275 9260 9246 9231 9216 9201 9186 9172 9157 9142 9128 9113 9099
491 9099 9084 9070 9055 9041 9027 9012 8998 8984 8970 8956 8942 8928 8914 8900 8886 8872 8858 8844 8831 8817 8803 8789 8776 8762 8749 8735 8722 8708 8695 8682 8668 8655 8642 8629 8616
487 8616 8603 8589 8576 8563 8550 8537 8525 8512 8499 8486 8473 8461 8448 8435 8423 8410 8397 8385 8372 8360 8348 8335 8323 8310 8298 8286 8274 8261 8249 8237 8225 8213 8201 8189 8177
482 8177 8165 8153 8141 8129 8118 8106 8094 8082 8071 8059 8047 8036 8024 8013 8001 7990 7978 7967 7955 7944 7933 7921 7910 7899 7888 7877 7865 7854 7843 7832 7821 7810 7799 7788 7777
477 7777 7766 7755 7744 7734 7723 7712 7701 7691 7680 7669 7659 7648 7637 7627 7616 7606 7595 7585 7575 7564 7554 7543 7533 7523 7513 7502 7492 7482 7472 7462 7451 7441 7431 7421 7411
472 7411 7401 7391 7381 7371 7361 7352 7342 7332 7322 7312 7303 7293 7283 7273 7264 7254 7244 7235 7225 7216 7206 7197 7187 7178 7168 7159 7150 7140 7131 7121 7112 7103 7094 7084 7075 7066 7057 7048 7039 7029 7020 7011 7002 6993 6984 6975 6966
466 6966 6957 6948 6940 6931 6922 6913 6904 6895 6887 6878 6869 6860 6852 6843 6834 6826 6817 6808 6800 6791 6783 6774 6766 6757 6749 6740 6732 6724 6715 6707 6698 6690 6682 6674 6665 6657 6649 6641 6632 6624 6616 6608 6600 6592 6584 6575 6567 6559 6551 6543 6535 6527 6519 6512 6504 6496 6488 6480 6472 6464 6457 6449 6441 6433 6425 6418 6410 6402 6395
456 6395 6387 6379 6372 6364 6357 6349 6341 6334 6326 6319 6311 6304 6296 6289 6281 6274 6267 6259 6252 6245 6237 6230 6223 6215 6208 6201 6194 6186 6179 6172 6165 6158 6150 6143 6136 6129 6122 6115 6108 6101 6094 6087 6080 6073 6066 6059 6052 6045 6038 6031 6024 6017 6010 6004 5997 5990 5983 5976 5970 5963 5956 5949 5943 5936 5929 5922 5916 5909 5903
447 5903 5896 5889 5883 5876 5870 5863 5856 5850 5843 5837 5830 5824 5817 5811 5805 5798 5792 5785 5779 5773 5766 5760 5753 5747 5741 5735 5728 5722 5716 5709 5703 5697 5691 5685 5678 5672 5666 5660 5654 5648 5641 5635 5629 5623 5617 5611 5605 5599 5593 5587 5581 5575 5569 5563 5557 5551 5545 5539 5533 5527 5522 5516 5510 5504 5498 5492 5487 5481 5475
438 5475 5469 5463 5458 5452 5446 5440 5435 5429 5423 5418 5412 5406 5401 5395 5389 5384 5378 5372 5367 5361 5356 5350 5345 5339 5334 5328 5323 5317 5312 5306 5301 5295 5290 5284 5279 5273 5268 5263 5257 5252 5246 5241 5236 5230 5225 5220 5215 5209 5204 5199 5193 5188 5183 5178 5172 5167 5162 5157 5152 5146 5141 5136 5131 5126 5121 5116 5110 5105 5100
428 5100 5095 5090 5085 5080 5075 5070 5065 5060 5055 5050 5045 5040 5035 5030 5025 5020 5015 5010 5005 5000 4995 4990 4985 4981 4976 4971 4966 4961 4956 4951 4947 4942 4937 4932 4927 4923 4918 4913 4908 4904 4899 4894 4889 4885 4880 4875 4871 4866 4861 4857 4852 4847 4843 4838 4833 4829 4824 4820 4815 4810 4806 4801 4797 4792 4788 4783 4778 4774 4769
419 4769 4765 4760 4756 4751 4747 4743 4738 4734 4729 4725 4720 4716 4711 4707 4703 4698 4694 4689 4685 4681 4676 4672 4668 4663 4659 4655 4650 4646 4642 4638 4633 4629 4625 4620 4616 4612 4608 4603 4599 4595 4591 4587 4582 4578 4574 4570 4566 4561 4557 4553 4549 4545 4541 4537 4533 4528 4524 4520 4516 4512 4508 4504 4500 4496 4492 4488 4484 4480 4476
409 4476 4472 4468 4464 4460 4456 4452 4448 4444 4440 4436 4432 4428 4424 4420 4416 4412 4408 4404 4400 4396 4393 4389 4385 4381 4377 4373 4369 4365 4362 4358 4354 4350 4346 4343 4339 4335 4331 4327 4324 4320 4316 4312 4309 4305 4301 4297 4294 4290 4286 4282 4279 4275 4271 4268 4264 4260 4257 4253 4249 4246 4242 4238 4235 4231 4227 4224 4220 4216 4213
400 4213 4209 4206 4202 4199 4195 4191 4188 4184 4181 4177 4174 4170 4166 4163 4159 4156 4152 4149 4145 4142 4138 4135 4131 4128 4124 4121 4118 4114 4111 4107 4104 4100 4097 4093 4090 4087 4083 4080 4076 4073 4070 4066 4063 4060 4056 4053 4049 4046 4043 4039 4036 4033 4029 4026 4023 4019 4016 4013 4010 4006 4003 4000 3996 3993 3990 3987 3983 3980 3977
391 3977 3974 3970 3967 3964 3961 3957 3954 3951 3948 3945 3941 3938 3935 3932 3929 3926 3922 3919 3916 3913 3910 3907 3903 3900 3897 3894 3891 3888 3885 3882 3878 3875 3872 3869 3866 3863 3860 3857 3854 3851 3848 3845 3842 3838 3835 3832 3829 3826 3823 3820 3817 3814 3811 3808 3805 3802 3799 3796 3793 3790 3787 3784 3781 3778 3776 3773 3770 3767 3764
381 3764 3761 3758 3755 3752 3749 3746 3743 3740 3737 3735 3732 3729 3726 3723 3720 3717 3714 3712 3709 3706 3703 3700 3697 3694 3692 3689 3686 3683 3680 3677 3675 3672 3669 3666 3663 3661 3658 3655 3652 3649 3647 3644 3641 3638 3636 3633 3630 3627 3625 3622 3619 3616 3614 3611 3608 3605 3603 3600 3597 3595 3592 3589 3587 3584 3581 3578 3576 3573 3570
372 3570 3568 3565 3562 3560 3557 3555 3552 3549 3547 3544 3541 3539 3536 3533 3531 3528 3526 3523 3520 3518 3515 3513 3510 3507 3505 3502 3500 3497 3495 3492 3489 3487 3484 3482 3479 3477 3474 3472 3469 3467 3464 3461 3459 3456 3454 3451 3449 3446 3444 3441 3439 3436 3434 3431 3429 3426 3424 3422 3419 3417 3414 3412 3409 3407 3404 3402 3399 3397 3395
362 3395 3392 3390 3387 3385 3382 3380 3378 3375 3373 3370 3368 3366 3363 3361 3358 3356 3354 3351 3349 3346 3344 3342 3339 3337 3335 3332 3330 3328 3325 3323 3321 3318 3316 3314 3311 3309 3307 3304 3302 3300 3297 3295 3293 3290 3288 3286 3283 3281 3279 3277 3274 3272 3270 3268 3265 3263 3261 3258 3256 3254 3252 3249 3247 3245 3243 3240 3238 3236 3234
353 3234 3232 3229 3227 3225 3223 3220 3218 3216 3214 3212 3209 3207 3205 3203 3201 3198 3196 3194 3192 3190 3188 3185 3183 3181 3179 3177 3175 3172 3170 3168 3166 3164 3162 3160 3157 3155 3153 3151 3149 3147 3145 3143 3140 3138 3136 3134 3132 3130 3128 3126 3124 3122 3120 3117 3115 3113 3111 3109 3107 3105 3103 3101 3099 3097 3095 3093 3091 3089 3086
344 3086 3084 3082 3080 3078 3076 3074 3072 3070 3068 3066 3064 3062 3060 3058 3056 3054 3052 3050 3048 3046 3044 3042 3040 3038 3036 3034 3032 3030 3028 3026 3024 3022 3020 3018 3016 3014 3012 3010 3009 3007 3005 3003 3001 2999 2997 2995 2993 2991 2989 2987 2985 2983 2981 2980 2978 2976 2974 2972 2970 2968 2966 2964 2962 2960 2959 2957 2955 2953 2951
334 2951 2949 2947 2945 2944 2942 2940 2938 2936 2934 2932 2930 2929 2927 2925 2923 2921 2919 2918 2916 2914 2912 2910 2908 2906 2905 2903 2901 2899 2897 2896 2894 2892 2890 2888 2886 2885 2883 2881 2879 2877 2876 2874 2872 2870 2869 2867 2865 2863 2861 2860 2858 2856 2854 2853 2851 2849 2847 2845 2844 2842 2840 2838 2837 2835 2833 2831 2830 2828 2826
325 2826 2825 2823 2821 2819 2818 2816 2814 2812 2811 2809 2807 2806 2804 2802 2800 2799 2797 2795 2794 2792 2790 2788 2787 2785 2783 2782 2780 2778 2777 2775 2773 2772 2770 2768 2767 2765 2763 2762 2760 2758 2757 2755 2753 2752 2750 2748 2747 2745 2743 2742 2740 2739 2737 2735 2734 2732 2730 2729 2727 2725 2724 2722 2721 2719 2717 2716 2714 2713 2711
315 2711 2709 2708 2706 2705 2703 2701 2700 2698 2697 2695 2693 2692 2690 2689 2687 2685 2684 2682 2681 2679 2678 2676 2674 2673 2671 2670 2668 2667 2665 2664 2662 2660 2659 2657 2656 2654 2653 2651 2650 2648 2647 2645 2644 2642 2640 2639 2637 2636 2634 2633 2631 2630 2628 2627 2625 2624 2622 2621 2619 2618 2616 2615 2613 2612 2610 2609 2607 2606 2604
306 2604 2603 2601 2600 2598 2597 2595 2594 2592 2591 2589 2588 2587 2585 2584 2582 2581 2579 2578 2576 2575 2573 2572 2570 2569 2568 2566 2565 2563 2562 2560 2559 2557 2556 2555 2553 2552 2550 2549 2547 2546 2545 2543 2542 2540 2539 2538 2536 2535 2533 2532 2530 2529 2528 2526 2525 2523 2522 2521 2519 2518 2516 2515 2514 2512 2511 2510 2508 2507 2505
297 2505 2504 2503 2501 2500 2498 2497 2496 2494 2493 2492 2490 2489 2488 2486 2485 2483 2482 2481 2479 2478 2477 2475 2474 2473 2471 2470 2469 2467 2466 2465 2463 2462 2461 2459 2458 2457 2455 2454 2453 2451 2450 2449 2447 2446 2445 2443 2442 2441 2439 2438 2437 2436 2434 2433 2432 2430 2429 2428 2426 2425 2424 2423 2421 2420 2419 2417 2416 2415 2414
287 2414 2412 2411 2410 2408 2407 2406 2405 2403 2402 2401 2399 2398 2397 2396 2394 2393 2392 2391 2389 2388 2387 2386 2384 2383 2382 2381 2379 2378 2377 2376 2374 2373 2372 2371 2369 2368 2367 2366 2365 2363 2362 2361 2360 2358 2357 2356 2355 2353 2352 2351 2350 2349 2347 2346 2345 2344 2343 2341 2340 2339 2338 2337 2335 2334 2333 2332 2331 2329 2328
278 2328 2327 2326 2325 2323 2322 2321 2320 2319 2317 2316 2315 2314 2313 2312 2310 2309 2308 2307 2306 2305 2303 2302 2301 2300 2299 2298 2296 2295 2294 2293 2292 2291 2289 2288 2287 2286 2285 2284 2283 2281 2280 2279 2278 2277 2276 2275 2273 2272 2271 2270 2269 2268 2267 2266 2264 2263 2262 2261 2260 2259 2258 2257 2255 2254 2253 2252 2251 2250 2249
268 2249 2248 2247 2245 2244 2243 2242 2241 2240 2239 2238 2237 2236 2234 2233 2232 2231 2230 2229 2228 2227 2226 2225 2224 2222 2221 2220 2219 2218 2217 2216 2215 2214 2213 2212 2211 2210 2208 2207 2206 2205 2204 2203 2202 2201 2200 2199 2198 2197 2196 2195 2194 2193 2192 2190 2189 2188 2187 2186 2185 2184 2183 2182 2181 2180 2179 2178 2177 2176 2175
259 2175 2174 2173 2172 2171 2170 2169 2168 2167 2166 2165 2164 2163 2162 2161 2160 2159 2157 2156 2155 2154 2153 2152 2151 2150 2149 2148 2147 2146 2145 2144 2143 2142 2141 2140 2139 2138 2137 2136 2135 2134 2133 2132 2131 2130 2130 2129 2128 2127 2126 2125 2124 2123 2122 2121 2120 2119 2118 2117 2116 2115 2114 2113 2112 2111 2110 2109 2108 2107 2106
250 2106 2105 2104 2103 2102 2101 2100 2099 2099 2098 2097 2096 2095 2094 2093 2092 2091 2090 2089 2088 2087 2086 2085 2084 2083 2082 2082 2081 2080 2079 2078 2077 2076 2075 2074 2073 2072 2071 2070 2069 2069 2068 2067 2066 2065 2064 2063 2062 2061 2060 2059 2059 2058 2057 2056 2055 2054 2053 2052 2051 2050 2049 2049 2048 2047 2046 2045 2044 2043 2042
240 2042 2041 2041 2040 2039 2038 2037 2036 2035 2034 2033 2033 2032 2031 2030 2029 2028 2027 2026 2026 2025 2024 2023 2022 2021 2020 2019 2019 2018 2017 2016 2015 2014 2013 2013 2012 2011 2010 2009 2008 2007 2007 2006 2005 2004 2003 2002 2001 2001 2000 1999 1998 1997 1996 1996 1995 1994 1993 1992 1991 1990 1990 1989 1988 1987 1986 1985 1985 1984 1983
231 1983 1982 1981 1981 1980 1979 1978 1977 1976 1976 1975 1974 1973 1972 1972 1971 1970 1969 1968 1967 1967 1966 1965 1964 1963 1963 1962 1961 1960 1959 1959 1958 1957 1956 1955 1955 1954 1953 1952 1951 1951 1950 1949 1948 1947 1947 1946 1945 1944 1944 1943 1942 1941 1940 1940 1939 1938 1937 1937 1936 1935 1934 1933 1933 1932 1931 1930 1930 1929 1928
221 1928 1927 1927 1926 1925 1924 1924 1923 1922 1921 1921 1920 1919 1918 1917 1917 1916 1915 1914 1914 1913 1912 1912 1911 1910 1909 1909 1908 1907 1906 1906 1905 1904 1903 1903 1902 1901 1900 1900 1899 1898 1898 1897 1896 1895 1895 1894 1893 1892 1892 1891 1890 1890 1889 1888 1887 1887 1886 1885 1885 1884 1883 1882 1882 1881 1880 1880 1879 1878 1877
212 1877 1877 1876 1875 1875 1874 1873 1873 1872 1871 1870 1870 1869 1868 1868 1867 1866 1866 1865 1864 1864 1863 1862 1862 1861 1860 1859 1859 1858 1857 1857 1856 1855 1855 1854 1853 1853 1852 1851 1851 1850 1849 1849 1848 1847 1847 1846 1845 1845 1844 1843 1843 1842 1841 1841 1840 1839 1839 1838 1837 1837 1836 1836 1835 1834 1834 1833 1832 1832 1831
203 1831 1830 1830 1829 1828 1828 1827 1827 1826 1825 1825 1824 1823 1823 1822 1821 1821 1820 1820 1819 1818 1818 1817 1816 1816 1815 1815 1814 1813 1813 1812 1812 1811 1810 1810 1809 1808 1808 1807 1807 1806 1805 1805 1804 1804 1803 1802 1802 1801 1801 1800 1799 1799 1798 1798 1797 1796 1796 1795 1795 1794 1793 1793 1792 1792 1791 1791 1790 1789 1789
193 1789 1788 1788 1787 1786 1786 1785 1785 1784 1784 1783 1782 1782 1781 1781 1780 1780 1779 1778 1778 1777 1777 1776 1776 1775 1774 1774 1773 1773 1772 1772 1771 1771 1770 1769 1769 1768 1768 1767 1767 1766 1766 1765 1765 1764 1763 1763 1762 1762 1761 1761 1760 1760 1759 1759 1758 1758 1757 1757 1756 1755 1755 1754 1754 1753 1753 1752 1752 1751 1751
184 1751 1750 1750 1749 1749 1748 1748 1747 1747 1746 1746 1745 1745 1744 1744 1743 1743 1742 1742 1741 1741 1740 1740 1739 1739 1738 1738 1737 1737 1736 1736 1735 1735 1734 1734 1733 1733 1732 1732 1731 1731 1730 1730 1729 1729 1728 1728 1727 1727 1726 1726 1726 1725 1725 1724 1724 1723 1723 1722 1722 1721 1721 1720 1720 1719 1719 1719 1718 1718 1717
174 1717 1717 1716 1716 1715 1715 1714 1714 1714 1713 1713 1712 1712 1711 1711 1711 1710 1710 1709 1709 1708 1708 1707 1707 1707 1706 1706 1705 1705 1704 1704 1704 1703 1703 1702 1702 1702 1701 1701 1700 1700 1699 1699 1699 1698 1698 1697 1697 1697 1696 1696 1695 1695 1695 1694 1694 1693 1693 1693 1692 1692 1691 1691 1691 1690 1690 1690 1689 1689 1688
165 1688 1688 1688 1687 1687 1686 1686 1686 1685 1685 1685 1684 1684 1683 1683 1683 1682 1682 1682 1681 1681 1681 1680 1680 1680 1679 1679 1678 1678 1678 1677 1677 1677 1676 1676 1676 1675 1675 1675 1674 1674 1674 1673 1673 1673 1672 1672 1672 1671 1671 1671 1670 1670 1670 1669 1669 1669 1668 1668 1668 1667 1667 1667 1667 1666 1666 1666 1665 1665 1665
156 1665 1664 1664 1664 1664 1663 1663 1663 1662 1662 1662 1661 1661 1661 1661 1660 1660 1660 1659 1659 1659 1659 1658 1658 1658 1658 1657 1657 1657 1656 1656 1656 1656 1655 1655 1655 1655 1654 1654 1654 1654 1653 1653 1653 1653 1652 1652 1652 1652 1651 1651 1651 1651 1650 1650 1650 1650 1650 1649 1649 1649 1649 1648 1648 1648 1648 1648 1647 1647 1647
146 1647 1647 1647 1646 1646 1646 1646 1645 1645 1645 1645 1645 1645 1644 1644 1644 1644 1644 1643 1643 1643 1643 1643 1642 1642 1642 1642 1642 1642 1641 1641 1641 1641 1641 1641 1640 1640 1640 1640 1640 1640 1640 1639 1639 1639 1639 1639 1639 1639 1638 1638 1638 1638 1638 1638 1638 1637 1637 1637 1637 1637 1637 1637 1637 1637 1636 1636 1636 1636 1636
137 1636 1636 1636 1636 1636 1635 1635 1635 1635 1635 1635 1635 1635 1635 1635 1635 1635 1634 1634 1634 1634 1634 1634 1634 1634 1634 1634 1634 1634 1634 1634 1634 1634 1634 1634 1633 1633 1633 1633 1633 1633 1633 1633 1633 1633 1633 1633 1633 1633 1633 1633 1633 1633 1633 1633 1633 1633 1633 1633 1633 1633 1633 1633 1633 1633 1633 1633 1633 1633 1633
127 1633 1633 1633 1633 1633 1633 1633 1634 1634 1634 1634 1634 1634 1634 1634 1634 1634 1634 1634 1634 1634 1634 1634 1635 1635 1635 1635 1635 1635 1635 1635 1635 1635 1635 1636 1636 1636 1636 1636 1636 1636 1636 1637 1637 1637 1637 1637 1637 1637 1637 1638 1638 1638 1638 1638 1638 1639 1639 1639 1639 1639 1639 1640 1640 1640 1640 1640 1640 1641 1641
118 1641 1641 1641 1641 1642 1642 1642 1642 1643 1643 1643 1643 1643 1644 1644 1644 1644 1645 1645 1645 1645 1646 1646 1646 1646 1647 1647 1647 1648 1648 1648 1648 1649 1649 1649 1650 1650 1650 1650 1651 1651 1651 1652 1652 1652 1653 1653 1653 1654 1654 1654 1655 1655 1656 1656 1656 1657 1657 1657 1658 1658 1659 1659 1659 1660 1660 1661 1661 1661 1662
109 1662 1662 1663 1663 1663 1664 1664 1665 1665 1666 1666 1667 1667 1668 1668 1668 1669 1669 1670 1670 1671 1671 1672 1672 1673 1673 1674 1674 1675 1676 1676 1677 1677 1678 1678 1679 1679 1680 1681 1681 1682 1682 1683 1683 1684 1685 1685 1686 1686 1687 1688 1688 1689 1690 1690 1691 1692 1692 1693 1694 1694 1695 1696 1696 1697 1698 1698 1699 1700 1701
99 1701 1701 1702 1703 1703 1704 1705 1706 1707 1707 1708 1709 1710 1710 1711 1712 1713 1714 1714 1715 1716 1717 1718 1719 1719 1720 1721 1722 1723 1724 1725 1726 1726 1727 1728 1729 1730 1731 1732 1733 1734 1735 1736 1737 1738 1739 1740 1741 1742 1743 1744 1745 1746 1747 1748 1749 1750 1751 1752 1753 1754 1755 1757 1758 1759 1760 1761 1762 1763 1764 1766
90 1766 1767 1768 1769 1770 1771 1773 1774 1775 1776 1778 1779 1780 1781 1783 1784 1785 1786 1788 1789 1790 1792 1793 1794 1796 1797 1799 1800 1801 1803 1804 1806 1807 1808 1810 1811 1813 1814 1816 1817 1819 1820 1822 1823 1825 1826 1828 1829 1831 1833 1834 1836 1838 1839 1841 1842 1844 1846 1847 1849 1851 1853 1854 1856 1858 1860 1861 1863 1865 1867 1869
80 1869 1870 1872 1874 1876 1878 1880 1882 1884 1886 1887 1889 1891 1893 1895 1897 1899 1901 1903 1906 1908 1910 1912 1914 1916 1918 1920 1923 1925 1927 1929 1931 1934 1936 1938 1940 1943 1945 1947 1950 1952 1954 1957 1959 1962 1964 1967 1969 1972 1974 1977 1979 1982 1984 1987 1989 1992 1995 1997 2000 2003 2005 2008 2011 2014 2016 2019 2022 2025 2028 2031
71 2031 2034 2036 2039 2042 2045 2048 2051 2054 2057 2061 2064 2067 2070 2073 2076 2079 2083 2086 2089 2093 2096 2099 2103 2106 2109 2113 2116 2120 2123 2127 2130 2134 2138 2141 2145 2149 2152 2156 2160 2163 2167 2171 2175 2179 2183 2187 2191 2195 2199 2203 2207 2211 2215 2219 2224 2228 2232 2236 2241 2245 2250 2254 2258 2263 2267 2272 2277 2281 2286 2291
61 2291 2295 2300 2305 2310 2315 2319 2324 2329 2334 2339 2344 2350 2355 2360 2365 2371 2376 2381 2387 2392 2398 2403 2409 2414 2420 2426 2431 2437 2443 2449 2455 2461 2467 2473 2479 2485 2491 2497 2504 2510 2516 2523 2529 2536 2543 2549 2556 2563 2570 2576 2583 2590 2597 2604 2612 2619 2626 2633 2641 2648 2656 2663 2671 2679 2686 2694 2702 2710 2718 2726
52 2726 2734 2742 2751 2759 2768 2776 2785 2793 2802 2811 2820 2829 2838 2847 2856 2865 2874 2884 2893 2903 2913 2922 2932 2942 2952 2962 2972 2983 2993 3004 3014 3025 3036 3046 3057 3068 3080 3091 3102 3114 3125 3137 3149 3161 3173
45 3173 3185 3197 3209 3222 3234 3247 3260 3273 3286 3299 3312 3326 3339 3353 3367 3381 3395 3409 3424 3438 3453 3468 3483 3498 3513 3528 3544 3560 3576 3592 3608 3624 3641 3657 3674
41 3674 3691 3709 3726 3744 3762 3779 3798 3816 3835 3853 3872 3891 3911 3930 3950 3970 3990 4011 4031 4052 4073 4095 4116 4138 4160 4183 4205 4228 4251 4274 4298 4322 4346 4371 4395
36 4395 4420 4446 4471 4497 4523 4550 4577 4604 4631 4659 4687 4716 4745 4774 4803 4833 4864 4894 4925 4957 4988 5021 5053 5086 5120 5154 5188 5223 5258 5294 5330 5367 5404 5441 5479
31 5479 5518 5557 5597 5637 5678 5719 5761 5803 5846 5890 5934 5979 6025 6071 6118 6165 6213 6262 6312 6362 6413 6465 6517 6570 6625 6679 6735 6792 6849 6907 6967 7027 7088 7150 7213
26 7213 7277 7342 7408 7475 7543 7612 7683 7754 7827 7901 7976 8052 8130 8209 8289 8371 8454 8538 8624 8712 8801 8892 8984 9078 9173 9270 9369 9470 9573 9678 9784 9893 10003
22 10003 10116 10231 10348 10467 10589 10713 10839 10968 11100 11234 11371 11510 11653 11799 11947 12099 12254 12412 12573 12738 12907 13079 13255
19 13255 13435 13619 13807 13999 14196 14397 14603 14814 15030 15251 15477 15708 15946 16189 16438 16693 16955 17223 17498 17780 18070 18367 18672
16 18672 18985 19307 19637 19976 20325 20683 21052 21431 21821 22222 22635 23060 23498 23949 24414 24893 25387 25896 26422 26965 27525 28103 28701
12 28701 29318 29957 30618 31301 32008 32741 33499 34286 35101 35946 36824 37735 38681 39664 40687 41750 42857 44009 45210 46462 47768
10 47768 49131 50555 52042 53598 55226 56931 58717 60591 62557 64623 66794 69078 71484 74019 76693 79518 82503 85662
7 85662 89008 92557 96325 100330 104594 109138 113987 119171 124719 130668 137057 143929 151336 159334 167988 177371 187568 198676
5 198676 210806 224088 238672 254735 272484 292162 314060 338525 365975 396915 431964 471882 517615 570351
3 570351 631596 703285 787933 888867 1010548 1159081 1342991 1574480 1871501 2261354 2787194 3520510
1 3520510 4586768 6222760 8919577 13833068 24203011 51449947 136984361 237304154 161914909
0 161914909 60723736 27297191 15157443 9597810 6614553 4833059 3685269 2902779 2345542 1934708
-1 1934708 1623137 1381243 1189695 1035429 909361 805014 717669 643823 580831 526664 479749 438846 402970
-3 402970 371329 343282 318305 295966 275905 257823 241468 226627 213119 200788 189502 179146 169620 160839
-5 160839 152726 145215 138248 131774 125747 120128 114880 109971 105372 101059 97007 93197 89609 86226 83033 80016 77163
-7 77163 74461 71901 69472 67165 64973 62889 60904 59013 57211 55491 53848 52279 50779 49343 47969 46652 45390 44179
-10 44179 43017 41902 40830 39800 38809 37856 36938 36054 35202 34380 33588 32824 32086 31374 30686 30020 29377 28755 28153 27571 27007 26461
-13 26461 25931 25418 24921 24438 23970 23516 23075 22647 22232 21828 21435 21053 20682 20322 19970 19629 19296 18972 18657 18350 18051 17759 17475
-16 17475 17198 16928 16665 16408 16157 15912 15673 15440 15212 14990 14773 14560 14353 14150 13952 13758 13569 13383 13202 13025 12851 12681 12515
-19 12515 12352 12193 12037 11884 11734 11587 11444 11303 11165 11030 10897 10767 10639 10514 10392 10271 10153 10037 9924 9812 9702 9595 9489
-22 9489 9386 9284 9184 9086 8989 8894 8801 8710 8620 8532 8445 8359 8275 8193 8111 8032 7953 7876 7800 7725 7652 7579 7508 7438 7369 7301 7234 7168 7104 7040 6977 6915 6854
-27 6854 6794 6735 6677 6620 6563 6507 6453 6399 6345 6293 6241 6190 6140 6090 6041 5993 5945 5898 5852 5807 5762 5717 5673 5630 5588 5546 5504 5463 5423 5383 5344 5305 5266 5229 5191
-32 5191 5154 5118 5082 5047 5012 4977 4943 4909 4876 4843 4810 4778 4746 4715 4684 4653 4623 4593 4564 4535 4506 4477 4449 4421 4394 4366 4340 4313 4287 4261 4235 4210 4184 4160 4135
-36 4135 4111 4087 4063 4039 4016 3993 3970 3948 3926 3904 3882 3860 3839 3818 3797 3776 3756 3736 3716 3696 3676 3657 3637 3618 3600 3581 3562 3544 3526 3508 3490 3473 3456 3438 3421
-41 3421 3404 3388 3371 3355 3338 3322 3306 3291 3275 3260 3244 3229 3214 3199 3184 3170 3155 3141 3127 3112 3099 3085 3071 3057 3044 3031 3017 3004 2991 2978 2966 2953 2940 2928 2916
-46 2916 2903 2891 2879 2867 2855 2844 2832 2821 2809 2798 2787 2776 2765 2754 2743 2732 2721 2711 2700 2690 2679 2669 2659 2649 2639 2629 2619 2610 2600 2590 2581 2571 2562 2553 2543 2534 2525 2516
-51 2516 2507 2498 2490 2481 2472 2464 2455 2446 2438 2430 2421 2413 2405 2397 2389 2381 2373 2365 2357 2350 2342 2334 2327 2319 2312 2304 2297 2290 2282 2275 2268 2261 2254 2247 2240 2233 2226 2219 2213 2206 2199 2193 2186 2180 2173 2167 2160 2154 2148 2141 2135 2129 2123 2117 2111 2105 2099 2093 2087 2081 2075 2069 2064 2058 2052 2047 2041 2035 2030
-60 2030 2024 2019 2014 2008 2003 1998 1992 1987 1982 1977 1972 1966 1961 1956 1951 1946 1941 1936 1931 1927 1922 1917 1912 1907 1903 1898 1893 1889 1884 1880 1875 1870 1866 1862 1857 1853 1848 1844 1840 1835 1831 1827 1822 1818 1814 1810 1806 1802 1798 1793 1789 1785 1781 1777 1773 1770 1766 1762 1758 1754 1750 1746 1743 1739 1735 1731 1728 1724 1720
-70 1720 1717 1713 1710 1706 1702 1699 1695 1692 1688 1685 1681 1678 1675 1671 1668 1664 1661 1658 1654 1651 1648 1645 1641 1638 1635 1632 1629 1626 1622 1619 1616 1613 1610 1607 1604 1601 1598 1595 1592 1589 1586 1583 1580 1577 1574 1571 1569 1566 1563 1560 1557 1555 1552 1549 1546 1543 1541 1538 1535 1533 1530 1527 1525 1522 1519 1517 1514 1512 1509
-79 1509 1506 1504 1501 1499 1496 1494 1491 1489 1486 1484 1482 1479 1477 1474 1472 1469 1467 1465 1462 1460 1458 1455 1453 1451 1448 1446 1444 1442 1439 1437 1435 1433 1430 1428 1426 1424 1422 1420 1417 1415 1413 1411 1409 1407 1405 1403 1400 1398 1396 1394 1392 1390 1388 1386 1384 1382 1380 1378 1376 1374 1372 1370 1368 1366 1364 1363 1361 1359 1357
-89 1357 1355 1353 1351 1349 1347 1346 1344 1342 1340 1338 1336 1335 1333 1331 1329 1327 1326 1324 1322 1320 1319 1317 1315 1313 1312 1310 1308 1307 1305 1303 1302 1300 1298 1297 1295 1293 1292 1290 1288 1287 1285 1284 1282 1280 1279 1277 1276 1274 1272 1271 1269 1268 1266 1265 1263 1262 1260 1259 1257 1256 1254 1253 1251 1250 1248 1247 1245 1244 1242
-98 1242 1241 1239 1238 1237 1235 1234 1232 1231 1229 1228 1227 1225 1224 1222 1221 1220 1218 1217 1216 1214 1213 1212 1210 1209 1208 1206 1205 1204 1202 1201 1200 1198 1197 1196 1194 1193 1192 1191 1189 1188 1187 1186 1184 1183 1182 1181 1179 1178 1177 1176 1174 1173 1172 1171 1170 1168 1167 1166 1165 1164 1162 1161 1160 1159 1158 1157 1155 1154 1153
-107 1153 1152 1151 1150 1149 1147 1146 1145 1144 1143 1142 1141 1140 1138 1137 1136 1135 1134 1133 1132 1131 1130 1129 1128 1127 1125 1124 1123 1122 1121 1120 1119 1118 1117 1116 1115 1114 1113 1112 1111 1110 1109 1108 1107 1106 1105 1104 1103 1102 1101 1100 1099 1098 1097 1096 1095 1094 1093 1092 1091 1090 1089 1088 1087 1086 1085 1084 1083 1082
-117 1082 1082 1081 1080 1079 1078 1077 1076 1075 1074 1073 1072 1071 1070 1070 1069 1068 1067 1066 1065 1064 1063 1062 1062 1061 1060 1059 1058 1057 1056 1055 1055 1054 1053 1052 1051 1050 1049 1049 1048 1047 1046 1045 1044 1044 1043 1042 1041 1040 1039 1039 1038 1037 1036 1035 1035 1034 1033 1032 1031 1030 1030 1029 1028 1027 1027 1026 1025 1024
-126 1024 1023 1023 1022 1021 1020 1019 1019 1018 1017 1016 1016 1015 1014 1013 1013 1012 1011 1010 1010 1009 1008 1007 1007 1006 1005 1004 1004 1003 1002 1002 1001 1000 999 999 998 997 996 996 995 994 994 993 992 991 991 990 989 989 988 987 987 986 985 985 984 983 982 982 981 980 980 979 978 978 977 976 976 975
-135 975 974 974 973 972 972 971 970 970 969 968 968 967 967 966 965 965 964 963 963 962 961 961 960 959 959 958 958 957 956 956 955 954 954 953 953 952 951 951 950 950 949 948 948 947 946 946 945 945 944 943 943 942 942 941 941 940 939 939 938 938 937 936 936 935 935 934 934 933 932
-145 932 932 931 931 930 929 929 928 928 927 927 926 926 925 924 924 923 923 922 922 921 921 920 919 919 918 918 917 917 916 916 915 915 914 913 913 912 912 911 911 910 910 909 909 908 908 907 907 906 905 905 904 904 903 903 902 902 901 901 900 900 899 899 898 898 897 897 896 896 895
-154 895 895 894 894 893 893 892 892 891 891 890 890 889 889 888 888 887 887 886 886 885 885 884 884 883 883 882 882 881 881 881 880 880 879 879 878 878 877 877 876 876 875 875 874 874 873 873 873 872 872 871 871 870 870 869 869 868 868 867 867 867 866 866 865 865 864 864 863 863 863
-163 863 862 862 861 861 860 860 859 859 859 858 858 857 857 856 856 855 855 855 854 854 853 853 852 852 852 851 851 850 850 849 849 849 848 848 847 847 846 846 846 845 845 844 844 844 843 843 842 842 841 841 841 840 840 839 839 839 838 838 837 837 837 836 836 835 835 835 834 834 833
-173 833 833 833 832 832 831 831 831 830 830 829 829 829 828 828 827 827 827 826 826 825 825 825 824 824 824 823 823 822 822 822 821 821 820 820 820 819 819 819 818 818 817 817 817 816 816 816 815 815 814 814 814 813 813 813 812 812 811 811 811 810 810 810 809 809 808 808 808 807 807
-182 807 807 806 806 806 805 805 805 804 804 803 803 803 802 802 802 801 801 801 800 800 800 799 799 798 798 798 797 797 797 796 796 796 795 795 795 794 794 794 793 793 793 792 792 792 791 791 791 790 790 789 789 789 788 788 788 787 787 787 786 786 786 785 785 785 784 784 784 783 783
-192 783 783 782 782 782 781 781 781 780 780 780 779 779 779 779 778 778 778 777 777 777 776 776 776 775 775 775 774 774 774 773 773 773 772 772 772 771 771 771 770 770 770 770 769 769 769 768 768 768 767 767 767 766 766 766 765 765 765 765 764 764 764 763 763 763 762 762 762 761 761
-201 761 761 761 760 760 760 759 759 759 758 758 758 758 757 757 757 756 756 756 755 755 755 755 754 754 754 753 753 753 752 752 752 752 751 751 751 750 750 750 750 749 749 749 748 748 748 748 747 747 747 746 746 746 746 745 745 745 744 744 744 744 743 743 743 742 742 742 742 741 741
-210 741 741 740 740 740 740 739 739 739 738 738 738 738 737 737 737 736 736 736 736 735 735 735 735 734 734 734 733 733 733 733 732 732 732 732 731 731 731 730 730 730 730 729 729 729 729 728 728 728 727 727 727 727 726 726 726 726 725 725 725 725 724 724 724 723 723 723 723 722 722
-220 722 722 722 721 721 721 721 720 720 720 720 719 719 719 719 718 718 718 717 717 717 717 716 716 716 716 715 715 715 715 714 714 714 714 713 713 713 713 712 712 712 712 711 711 711 711 710 710 710 710 709 709 709 709 708 708 708 708 707 707 707 707 706 706 706 706 705 705 705 705
-229 705 704 704 704 704 703 703 703 703 702 702 702 702 701 701 701 701 700 700 700 700 700 699 699 699 699 698 698 698 698 697 697 697 697 696 696 696 696 695 695 695 695 694 694 694 694 694 693 693 693 693 692 692 692 692 691 691 691 691 690 690 690 690 690 689 689 689 689 688 688
-239 688 688 688 687 687 687 687 687 686 686 686 686 685 685 685 685 684 684 684 684 684 683 683 683 683 682 682 682 682 682 681 681 681 681 680 680 680 680 680 679 679 679 679 678 678 678 678 678 677 677 677 677 676 676 676 676 676 675 675 675 675 674 674 674 674 674 673 673 673 673
-248 673 672 672 672 672 672 671 671 671 671 671 670 670 670 670 669 669 669 669 669 668 668 668 668 667 667 667 667 667 666 666 666 666 666 665 665 665 665 665 664 664 664 664 663 663 663 663 663 662 662 662 662 662 661 661 661 661 661 660 660 660 660 659 659 659 659 659 658 658 658
-257 658 658 658 657 657 657 657 657 656 656 656 656 656 655 655 655 655 655 654 654 654 654 654 653 653 653 653 653 652 652 652 652 652 651 651 651 651 650 650 650 650 650 649 649 649 649 649 648 648 648 648 648 648 647 647 647 647 647 646 646 646 646 646 645 645 645 645 645 644 644
-267 644 644 644 644 643 643 643 643 643 642 642 642 642 642 641 641 641 641 641 640 640 640 640 640 639 639 639 639 639 639 638 638 638 638 638 637 637 637 637 637 636 636 636 636 636 635 635 635 635 635 635 634 634 634 634 634 633 633 633 633 633 632 632 632 632 632 632 631 631 631
-276 631 631 631 630 630 630 630 630 629 629 629 629 629 629 628 628 628 628 628 627 627 627 627 627 626 626 626 626 626 626 625 625 625 625 625 624 624 624 624 624 624 623 623 623 623 623 622 622 622 622 622 622 621 621 621 621 621 620 620 620 620 620 620 619 619 619 619 619 619 618
-286 618 618 618 618 618 617 617 617 617 617 617 616 616 616 616 616 616 615 615 615 615 615 614 614 614 614 614 614 613 613 613 613 613 613 612 612 612 612 612 611 611 611 611 611 611 610 610 610 610 610 610 609 609 609 609 609 609 608 608 608 608 608 608 607 607 607 607 607 606 606
-295 606 606 606 606 606 605 605 605 605 605 605 604 604 604 604 604 604 603 603 603 603 603 603 602 602 602 602 602 602 601 601 601 601 601 601 600 600 600 600 600 600 599 599 599 599 599 599 598 598 598 598 598 598 597 597 597 597 597 597 596 596 596 596 596 596 595 595 595 595 595
-304 595 595 594 594 594 594 594 594 593 593 593 593 593 593 593 592 592 592 592 592 592 591 591 591 591 591 591 590 590 590 590 590 590 589 589 589 589 589 589 588 588 588 588 588 588 588 587 587 587 587 587 587 586 586 586 586 586 586 585 585 585 585 585 585 585 584 584 584 584 584
-314 584 584 583 583 583 583 583 583 582 582 582 582 582 582 582 581 581 581 581 581 581 580 580 580 580 580 580 580 579 579 579 579 579 579 578 578 578 578 578 578 578 577 577 577 577 577 577 576 576 576 576 576 576 576 575 575 575 575 575 575 574 574 574 574 574 574 574 573 573 573
-323 573 573 573 573 573 572 572 572 572 572 572 571 571 571 571 571 571 571 570 570 570 570 570 570 570 569 569 569 569 569 569 568 568 568 568 568 568 568 567 567 567 567 567 567 567 566 566 566 566 566 566 566 565 565 565 565 565 565 564 564 564 564 564 564 564 563 563 563 563 563
-333 563 563 563 562 562 562 562 562 562 562 561 561 561 561 561 561 561 560 560 560 560 560 560 560 559 559 559 559 559 559 559 558 558 558 558 558 558 558 557 557 557 557 557 557 557 556 556 556 556 556 556 556 555 555 555 555 555 555 555 554 554 554 554 554 554 554 553 553 553 553
-342 553 553 553 553 552 552 552 552 552 552 552 551 551 551 551 551 551 551 551 550 550 550 550 550 550 550 549 549 549 549 549 549 549 548 548 548 548 548 548 548 547 547 547 547 547 547 547 546 546 546 546 546 546 546 546 545 545 545 545 545 545 545 544 544 544 544 544 544 544 544
-351 544 543 543 543 543 543 543 543 542 542 542 542 542 542 542 541 541 541 541 541 541 541 541 540 540 540 540 540 540 540 539 539 539 539 539 539 539 539 538 538 538 538 538 538 538 537 537 537 537 537 537 537 537 536 536 536 536 536 536 536 535 535 535 535 535 535 535 535 534 534
-361 534 534 534 534 534 534 534 533 533 533 533 533 533 533 532 532 532 532 532 532 532 532 531 531 531 531 531 531 531 531 530 530 530 530 530 530 530 530 529 529 529 529 529 529 529 528 528 528 528 528 528 528 528 527 527 527 527 527 527 527 527 526 526 526 526 526 526 526 526 525
-370 525 525 525 525 525 525 525 525 524 524 524 524 524 524 524 524 523 523 523 523 523 523 523 523 522 522 522 522 522 522 522 522 521 521 521 521 521 521 521 521 520 520 520 520 520 520 520 520 519 519 519 519 519 519 519 519 518 518 518 518 518 518 518 518 517 517 517 517 517 517
-380 517 517 517 516 516 516 516 516 516 516 516 515 515 515 515 515 515 515 515 514 514 514 514 514 514 514 514 514 513 513 513 513 513 513 513 513 512 512 512 512 512 512 512 512 511 511 511 511 511 511 511 511 510 510 510 510 510 510 510 510 510 509 509 509 509 509 509 509 509 508
-389 508 508 508 508 508 508 508 508 508 507 507 507 507 507 507 507 507 506 506 506 506 506 506 506 506 505 505 505 505 505 505 505 505 505 504 504 504 504 504 504 504 504 504 503 503 503 503 503 503 503 503 502 502 502 502 502 502 502 502 502 501 501 501 501 501 501 501 501 500 500
-398 500 500 500 500 500 500 500 500 499 499 499 499 499 499 499 499 499 498 498 498 498 498 498 498 498 497 497 497 497 497 497 497 497 497 496 496 496 496 496 496 496 496 496 495 495 495 495 495 495 495 495 495 494 494 494 494 494 494 494 494 494 493 493 493 493 493 493 493 493 493
-408 493 492 492 492 492 492 492 492 492 492 491 491 491 491 491 491 491 491 490 490 490 490 490 490 490 490 490 489 489 489 489 489 489 489 489 489 489 488 488 488 488 488 488 488 488 488 487 487 487 487 487 487 487 487 487 486 486 486 486 486 486 486 486 486 485 485 485 485 485 485
-417 485 485 485 485 484 484 484 484 484 484 484 484 484 483 483 483 483 483 483 483 483 483 482 482 482 482 482 482 482 482 482 482 481 481 481 481 481 481 481 481 481 480 480 480 480 480 480 480 480 480 479 479 479 479 479 479 479 479 479 479 478 478 478 478 478 478 478 478 478 477
-427 477 477 477 477 477 477 477 477 477 477 476 476 476 476 476 476 476 476 476 475 475 475 475 475 475 475 475 475 475 474 474 474 474 474 474 474 474 474 473 473 473 473 473 473 473 473 473 473 472 472 472 472 472 472 472 472 472 471 471 471 471 471 471 471 471 471 471 470 470 470
-436 470 470 470 470 470 470 470 470 469 469 469 469 469 469 469 469 469 469 468 468 468 468 468 468 468 468 468 467 467 467 467 467 467 467 467 467 467 466 466 466 466 466 466 466 466 466 466 465 465 465 465 465 465 465 465 465 465 464 464 464 464 464 464 464 464 464 464 463 463 463
-445 463 463 463 463 463 463 463 463 462 462 462 462 462 462 462 462 462 462 461 461 461 461 461 461 461 461 461 461 460 460 460 460 460 460 460 460 460 460 459 0
-451@
##END=	
##TITLE=	
##JCAMP-DX=	6.0	$$ MestReNova 14.1.2-25024
##BLOCK_ID=	3
##DATA TYPE=	NMR PEAK TABLE
##DATA CLASS=	PEAK TABLE
##CROSS REFERENCE=	NMR SPECTRUM: BLOCK_ID=2                                     
##.OBSERVE FREQUENCY=	400.13617591306001486
##.OBSERVE NUCLEUS=	^1H
##NPOINTS=	25
##FIRSTX=	5.7981710730939514317e-05
##LASTX=	7.2629190501595939367
##XFACTOR=	1
##YFACTOR=	1
##FIRSTY=	110461296.5013255775
##XUNITS=	PPM
##YUNITS=	ARBITRARY UNITS
##PEAK TABLE=	(XYW..XYW)
5.7981710730939514317e-05,110461296.5013255775,0.00083960949591875251932
1.5413871296064129979,20920475.230809371918,0.0067868199286139603912
1.8493005826683059922,21998481.017706979066,0.0020809462789818781482
1.8635613231084406927,11121760.69041487202,0.0017592393956651539676
1.8668143352100705634,82305913.26813313365,0.0023815558839522252624
1.8813556082065818753,23266433.993947919458,0.0021075611357653308182
1.8847136542216755828,119298258.6815289557,0.0025330628627879179203
1.8889796463394301629,3960242.8620092030615,0.001738675904435042557
1.8992331472878982712,18875043.750266183168,0.0019769282889676694295
1.902525972094009532,101828378.172774598,0.0017856278996245418794
1.9201206971417277281,26671767.849120240659,0.0020300889251749238557
2.667677865378653479,249638297.8876145184,0.0019866048878872670687
2.6854228124779568887,436981656.31336009502,0.0018789365707654953012
2.7030937269873409612,216367137.45928233862,0.0018371146704939296263
2.844530864308248308,239087324.9598261714,0.0014531957055706728587
2.8616066051067647891,107678739.84616065025,0.0010689312485142156775
2.8637288787935202272,216996996.31065163016,0.0021166267253005894775
2.8668068953446854685,132650626.26089663804,0.0012643781211110877681
2.8836949334944814716,284963541.42956537008,0.0015027707819185076501
3.6158169571183158553,279907579.58097159863,0.001383415313106826092
3.6324619814615921598,127701941.16753974557,0.0010141883678795888396
3.6355430961647803301,225678693.37139695883,0.0021145734913919265151
3.6376644121337786686,138220129.99082702398,0.0011424565762111608437
3.6550025204077298824,254146053.14118224382,0.0014119138866364746264
7.2629190501595939367,27606460.263591833413,0.0014866891766222563396
##$MNOVA/PEAK_DATA_TABLE=	(T,F,A,ST,SP,APT,APC)
$$ Complementary to PEAK TABLE
$$ T: Type
$$ F: Flags
$$ A: Annotation
$$ ST: Shape Type
$$ SP: Shape Parameter
$$ APT: Attached Peaks Type
$$ APC: Attached Peaks Count
Compound,None,,1,0.73091258532421354843,0,0
Compound,None,,1,0,0,0
Compound,None,,1,0.24541552074648848025,0,0
Compound,None,,1,1.0268838069736940799,0,0
Compound,None,,1,-0.16076413899558528176,0,0
Compound,None,,1,0.034457654776109666872,0,0
Compound,None,,1,0.56877559239905695065,0,0
Compound,None,,1,0.60000000000000008882,0,0
Compound,None,,1,0.21436563101341049586,0,0
Compound,None,,1,-0.58713548144947058649,0,0
Compound,None,,1,0.37494385921641187887,0,0
Compound,None,,1,-0.048997160639880243949,0,0
Compound,None,,1,0.20105431000717705059,0,0
Compound,None,,1,0.15399800330450827412,0,0
Compound,None,,1,-0.1449300336865346206,0,0
Compound,None,,1,0.98830780948382934703,0,0
Compound,None,,1,0.25770217201044426369,0,0
Compound,None,,1,-0.19980764922913593629,0,0
Compound,None,,1,0.31107512619059957126,0,0
Compound,None,,1,-0.80000000000000004441,0,0
Compound,None,,1,0.48960619954178896673,0,0
Compound,None,,1,-0.098750024955856385844,0,0
Compound,None,,1,-0.86187487420908226454,0,0
Compound,None,,1,-0.58911324167462209012,0,0
Compound,None,,1,1.3061340642834133874,0,0
##END=	
##END=	
