##TITLE=	3314#-P-0302
Sample code: 3314#
CH3P(=O)(OH)(OBu)
2013-03-02

##JCAMP-DX=	6.0	$$ MestReNova 14.1.2-25024
##DATA TYPE=	LINK
##BLOCK_ID=	1
##BLOCKS=	2    
##ORIGIN=	Mestrelab Research S.L.
##OWNER=	HGL
##$MNOVA/LINK_BLOCK_TYPE=	ITEM	$$ NMR Spectrum
##$MNOVA/ITEM/POLYGON=	(XY..XY)
5835,5321
8208,5321
8208,8722
5835,8722
5835,5321
##$MNOVA/ITEM/Z=	0
##$MNOVA/ITEM/ANGLE=	0
##TITLE=	3314#-P-0302
##JCAMP-DX=	6.0	$$ MestReNova 14.1.2-25024
##BLOCK_ID=	2
##DATA TYPE=	NMR SPECTRUM
##DATA CLASS=	XYDATA
##NUMDIM=	1
##ORIGIN=	Varian
##OWNER=	HGL
##.OBSERVE FREQUENCY=	242.8036489000000131
##.OBSERVE NUCLEUS=	^31P
##.SOLVENT NAME=	cdcl3
##.PULSE SEQUENCE=	s2pul
##LONGDATE=	2013/03/02 11:33:06.000
##.ACQUISITIONMODE=	SIMULTANEOUS
##$ORIGINAL FORMAT=	Varian
##$MNOVA/SCALES_VERSION=	9
##$PARAMETER FILE=	(datafile, ASCII, h:/%E7%A7%91%E7%A0%94/%E9%A1%B9%E7%9B%AE/C4519/AI%E8%B0%B1%E5%9B%BE%E8%A7%A3%E6%9E%90%E8%BD%AF%E4%BB%B6%E5%BC%80%E5%8F%91%E8%AE%A2%E5%88%B6/%E8%BD%AF%E4%BB%B6%E8%AF%84%E4%BB%B7%E6%B5%8B%E8%AF%95%E6%95%B0%E6%8D%AE/FID%E6%A0%BC%E5%BC%8F%E6%95%B0%E6%8D%AE/Butyl%20methylphosphonate/3314#-P-0302.fid/fid, 0)
$$ 
##$PARAMETER FILE=	(header, BASE64, h:/%E7%A7%91%E7%A0%94/%E9%A1%B9%E7%9B%AE/C4519/AI%E8%B0%B1%E5%9B%BE%E8%A7%A3%E6%9E%90%E8%BD%AF%E4%BB%B6%E5%BC%80%E5%8F%91%E8%AE%A2%E5%88%B6/%E8%BD%AF%E4%BB%B6%E8%AF%84%E4%BB%B7%E6%B5%8B%E8%AF%95%E6%95%B0%E6%8D%AE/FID%E6%A0%BC%E5%BC%8F%E6%95%B0%E6%8D%AE/Butyl%20methylphosphonate/3314#-P-0302.fid/fid, 0)
AAAAAQAAAAEAANkEAAAABAADZBAAA2QsAAAAyQAAAAE=
##$PARAMETER FILE=	(log, ASCII, h:/%E7%A7%91%E7%A0%94/%E9%A1%B9%E7%9B%AE/C4519/AI%E8%B0%B1%E5%9B%BE%E8%A7%A3%E6%9E%90%E8%BD%AF%E4%BB%B6%E5%BC%80%E5%8F%91%E8%AE%A2%E5%88%B6/%E8%BD%AF%E4%BB%B6%E8%AF%84%E4%BB%B7%E6%B5%8B%E8%AF%95%E6%95%B0%E6%8D%AE/FID%E6%A0%BC%E5%BC%8F%E6%95%B0%E6%8D%AE/Butyl%20methylphosphonate/3314#-P-0302.fid/log, 0)
$$ Sat Mar  2 11:33:18 2013: Experiment started
$$ Sat Mar  2 11:34:44 2013: BS 16 completed
$$ Sat Mar  2 11:34:49 2013: BS 17 completed
$$ Sat Mar  2 11:34:51 2013: Acquisition aborted
$$ 
##$PARAMETER FILE=	(procpar, ASCII, h:/%E7%A7%91%E7%A0%94/%E9%A1%B9%E7%9B%AE/C4519/AI%E8%B0%B1%E5%9B%BE%E8%A7%A3%E6%9E%90%E8%BD%AF%E4%BB%B6%E5%BC%80%E5%8F%91%E8%AE%A2%E5%88%B6/%E8%BD%AF%E4%BB%B6%E8%AF%84%E4%BB%B7%E6%B5%8B%E8%AF%95%E6%95%B0%E6%8D%AE/FID%E6%A0%BC%E5%BC%8F%E6%95%B0%E6%8D%AE/Butyl%20methylphosphonate/3314#-P-0302.fid/procpar, 0)
$$ execprescan 2 2 8 0 0 4 1 0 1 64
$$ 1 ""
$$ 0 
$$ dcg 2 2 3 0 0 4 1 1 1 64
$$ 1 ""
$$ 2 "dc" "cdc" 
$$ awc1 1 1 1 -1 0.001 3 1 1 0 64
$$ 1 0 
$$ 0 
$$ alock 2 2 8 0 0 2 1 0 1 64
$$ 1 "n"
$$ 5 "a" "n" "s" "u" "y" 
$$ acqpath 2 2 8 0 0 2 1 0 1 64
$$ 1 ""
$$ 0 
$$ MinSW 2 2 8 0 0 3 1 0 1 64
$$ 1 "off"
$$ 3 "off" "auto" "manual" 
$$ Gmap 2 2 8 0 0 2 1 1 1 64
$$ 1 "lk"
$$ 0 
$$ CARBONnt 7 1 32767 0 0 3 1 1 1 64
$$ 1 0 
$$ 0 
$$ PROTONnt 7 1 32767 0 0 3 1 1 1 64
$$ 1 0 
$$ 0 
$$ PFGflg 4 2 4 0 0 2 1 16385 1 64
$$ 1 "y"
$$ 0 
$$ acqdim 7 1 32767 0 0 2 1 0 1 64
$$ 1 1 
$$ 0 
$$ [...]
$$ 1 ""
$$ 0 
$$ wtune 4 2 4 0 0 2 1 0 1 64
$$ 1 "st12"
$$ 11 "s" "t" "e" "i" "n" "o" "v" "1" "2" "3" "4" 
$$ x3 7 1 19 19 19 2 1 8192 1 64
$$ 1 7604 
$$ 0 
$$ x2y2 7 1 19 19 19 2 1 8192 1 64
$$ 1 2429 
$$ 0 
$$ x4 7 1 19 19 19 2 1 8192 1 64
$$ 1 0 
$$ 0 
$$ z3y 7 1 19 19 19 2 1 8192 1 64
$$ 1 973 
$$ 0 
$$ z2xy 7 1 19 19 19 2 1 8192 1 64
$$ 1 -2942 
$$ 0 
$$ yz2 7 1 19 19 19 2 1 8192 1 64
$$ 1 -3534 
$$ 0 
$$ y3 7 1 19 19 19 2 1 8192 1 64
$$ 1 -7490 
$$ 0 
$$ xz2 7 1 19 19 19 2 1 8192 1 64
$$ 1 -2031 
$$ 0 
$$ xz 7 1 19 19 19 2 1 8192 1 64
$$ 1 8498 
$$ 0 
$$ y1 7 1 19 19 19 2 1 8192 1 64
$$ 1 -7073 
$$ 0 
$$ yz 7 1 19 19 19 2 1 8192 1 64
$$ 1 6297 
$$ 0 
$$ y4 7 1 19 19 19 2 1 8192 1 64
$$ 1 0 
$$ 0 
$$ z2 7 1 19 19 19 2 1 8192 1 64
$$ 1 -7650 
$$ 0 
$$ z1 7 1 19 19 19 2 1 8192 1 64
$$ 1 20265 
$$ 0 
$$ z0_ 1 1 19 19 19 2 1 73744 1 64
$$ 1 -6520 
$$ 0 
$$ z1c 7 1 19 19 19 2 1 8192 1 64
$$ 1 0 
$$ 0 
$$ z2x2y2 7 1 19 19 19 2 1 8192 1 64
$$ 1 -1183 
$$ 0 
$$ z2c 7 1 19 19 19 2 1 8192 1 64
$$ 1 0 
$$ 0 
$$ z2x3 7 1 19 19 19 2 1 8192 1 64
$$ 1 0 
$$ 0 
$$ z3x 7 1 19 19 19 2 1 8192 1 64
$$ 1 -808 
$$ 0 
$$ z3 7 1 19 19 19 2 1 8192 1 64
$$ 1 17211 
$$ 0 
$$ z2y3 7 1 19 19 19 2 1 8192 1 64
$$ 1 0 
$$ 0 
$$ z3c 7 1 19 19 19 2 1 8192 1 64
$$ 1 0 
$$ 0 
$$ z3x3 7 1 19 19 19 2 1 8192 1 64
$$ 1 0 
$$ 0 
$$ z3x2y2 7 1 19 19 19 2 1 8192 1 64
$$ 1 0 
$$ 0 
$$ z3xy 7 1 19 19 19 2 1 8192 1 64
$$ 1 0 
$$ 0 
$$ z5 7 1 19 19 19 2 1 8192 1 64
$$ 1 352 
$$ 0 
$$ z4x 7 1 19 19 19 2 1 8192 1 64
$$ 1 -1761 
$$ 0 
$$ z4 7 1 19 19 19 2 1 8192 1 64
$$ 1 -2604 
$$ 0 
$$ z3y3 7 1 19 19 19 2 1 8192 1 64
$$ 1 0 
$$ 0 
$$ z4c 7 1 19 19 19 2 1 8192 1 64
$$ 1 0 
$$ 0 
$$ z4xy 7 1 19 19 19 2 1 8192 1 64
$$ 1 0 
$$ 0 
$$ z4x2y2 7 1 19 19 19 2 1 8192 1 64
$$ 1 0 
$$ 0 
$$ z4y 7 1 19 19 19 2 1 8192 1 64
$$ 1 2132 
$$ 0 
$$ z7 7 1 19 19 19 2 1 8192 1 64
$$ 1 7469 
$$ 0 
$$ z5y 7 1 19 19 19 2 1 8192 1 64
$$ 1 0 
$$ 0 
$$ z5x 7 1 19 19 19 2 1 8192 1 64
$$ 1 0 
$$ 0 
$$ z6 7 1 19 19 19 2 1 8192 1 64
$$ 1 -879 
$$ 0 
$$ zx2y2 7 1 19 19 19 2 1 8192 1 64
$$ 1 -4048 
$$ 0 
$$ z8 7 1 19 19 19 2 1 8192 1 64
$$ 1 0 
$$ 0 
$$ zxy 7 1 19 19 19 2 1 8192 1 64
$$ 1 -2140 
$$ 0 
$$ zx3 7 1 19 19 19 2 1 8192 1 64
$$ 1 -342 
$$ 0 
$$ zy3 7 1 19 19 19 2 1 8192 1 64
$$ 1 -988 
$$ 0 
$$ 
##$PARAMETER FILE=	(text, ASCII, h:/%E7%A7%91%E7%A0%94/%E9%A1%B9%E7%9B%AE/C4519/AI%E8%B0%B1%E5%9B%BE%E8%A7%A3%E6%9E%90%E8%BD%AF%E4%BB%B6%E5%BC%80%E5%8F%91%E8%AE%A2%E5%88%B6/%E8%BD%AF%E4%BB%B6%E8%AF%84%E4%BB%B7%E6%B5%8B%E8%AF%95%E6%95%B0%E6%8D%AE/FID%E6%A0%BC%E5%BC%8F%E6%95%B0%E6%8D%AE/Butyl%20methylphosphonate/3314#-P-0302.fid/text, 0)
$$ Sample code: 3314#
$$ CH3P(=O)(OH)(OBu)
$$ 2013-03-02
$$ 
##XUNITS=	HZ
##YUNITS=	ARBITRARY UNITS
##FIRSTX=	24644.595301560002554
##LASTX=	-3132.7586209882638286
##DELTAX=	-0.42385525173645027808
##XFACTOR=	1
##YFACTOR=	0.00020711911941821576082
##FIRSTY=	-0.008498818613588809967
##MINY=	-0.092462025582790374756
##MAXY=	6.3780436515808105469
##NPOINTS=	65536
##XYDATA=	(X++(Y..Y))
$$ [...]
16386 267 224 193 156 108 61 39 54 68 52 32 30 26 3 -12 -19 -51 -93 -111 -76 4 78 112 125 118 111 124 133 141 174 212 213 183 154 125 76 -3 -78 -121
16370 -121 -154 -167 -122 -19 85 131 117 69 15 -23 -64 -102 -111 -93 -70 -50 -31 -27 -52 -77 -64 -20 21 41 56 82 107 116 100 74 53 21 -14 -19 7
16355 7 27 29 16 6 19 38 48 67 100 118 99 59 18 -18 -47 -53 -48 -72 -133 -200 -241 -237 -202 -169 -149 -131 -115 -122 -141 -149 -154 -144 -95 -4 104 172 166 132 117
16338 117 107 72 49 59 62 44 6 -48 -84 -77 -42 -28 -56 -99 -131 -142 -145 -165 -177 -148 -98 -69 -87 -160 -244 -277 -254 -190 -93 0 49 58 36 -2 -21 -21 -31
16323 -31 -68 -120 -146 -119 -62 -9 28 51 52 26 -9 -29 -35 -20 1 -17 -57 -70 -60 -57 -60 -54 -56 -70 -77 -75 -66 -54 -44 -28 -3 16 19 15 11 2 0 4 7 -2 -39 -85 -108
16304 -108 -103 -88 -92 -97 -71 -24 13 22 0 -23 -27 -22 -21 -28 -27 -9 -11 -54 -118 -187 -238 -259 -261 -237 -166 -61 33 85 98 82 43 5 -23 -59 -85 -83 -62 -39 -50 -109
16287 -109 -170 -180 -131 -58 -15 -21 -71 -130 -145 -116 -80 -67 -61 -33 -14 -18 -19 -29 -65 -124 -176 -194 -174 -115 -52 -20 -21 -58 -121 -178 -194 -170 -138 -100 -37 34 78
16272 78 88 80 57 13 -24 -33 -11 28 72 96 92 78 59 47 53 63 73 73 50 0 -62 -99 -133 -168 -162 -124 -106 -125 -149 -151 -148 -160 -182 -184 -147 -97 -76 -90 -105
16255 -105 -94 -59 -41 -71 -120 -171 -222 -257 -277 -277 -234 -163 -93 -45 -10 16 8 -24 -43 -47 -51 -62 -68 -69 -75 -72 -53 -56 -95 -146 -189 -203 -190 -172 -156 -157 -156 -127 -92 -92
16238 -92 -120 -111 -36 49 77 56 41 29 11 -8 -40 -69 -77 -78 -93 -101 -67 1 65 98 117 131 122 102 85 72 67 92 159 215 220 213 214 218 218 209 191 163 117 67 32
16221 32 21 27 44 58 59 52 45 48 61 84 110 117 95 53 12 -6 -12 -14 0 20 34 55 66 51 20 -2 -10 -39 -89 -138 -158 -119 -51 16 65 66 35 -18 -81 -120
16204 -120 -135 -124 -101 -103 -134 -164 -158 -125 -107 -114 -109 -87 -73 -74 -92 -126 -151 -139 -102 -86 -106 -127 -113 -63 -12 23 47 80 152 228 244 212 182 182 186 152 107 117
16188 117 175 224 247 237 187 120 47 -1 1 18 5 -24 -51 -82 -112 -132 -136 -117 -90 -52 -6 24 33 34 67 132 173 160 120 110 142 170 171 157 135 106 82
16172 82 57 38 60 119 176 196 170 140 125 105 91 81 40 -18 -67 -90 -86 -59 -11 32 46 24 -6 -47 -97 -117 -116 -138 -185 -218 -208 -180 -161 -152 -143 -126 -101
16156 -101 -74 -53 -47 -53 -51 -21 45 127 167 135 73 38 38 59 95 129 148 139 120 129 171 235 279 276 260 254 240 190 116 69 65 80 97 136 183 191 188 211 229 208
16140 208 148 67 -6 -51 -65 -50 -17 7 12 -6 -34 -38 -16 7 8 -41 -118 -185 -232 -268 -294 -293 -263 -214 -182 -209 -259 -282 -261 -212 -165 -122 -80 -44 -16 6
16124 6 26 41 61 95 125 130 116 101 92 81 56 3 -70 -120 -137 -155 -161 -146 -136 -140 -153 -155 -142 -121 -80 -6 60 72 42 8 -25 -49 -50 -44 -54 -68 -52 0 47
16108 47 47 0 -46 -56 -43 -21 4 24 28 14 -7 -25 -36 -30 -2 29 32 24 14 -19 -63 -98 -100 -54 -4 14 29 53 50 13 -24 -44 -55 -77 -124 -186 -220 -212 -202
16091 -202 -192 -156 -98 -58 -60 -63 -38 -19 -39 -94 -146 -158 -138 -118 -119 -135 -139 -98 -23 37 58 41 5 -15 -22 -32 -47 -76 -116 -139 -146 -145 -112 -46 11 50 77 81
16075 81 48 1 -36 -64 -64 -40 -13 6 9 6 -3 -34 -63 -63 -45 -35 -32 -28 -29 -25 -4 34 99 171 210 198 157 142 159 183 207 212 178 112 27 -48 -95 -100 -82 -73 -72
16058 -72 -55 -18 12 21 29 29 -5 -72 -134 -165 -168 -126 -28 55 56 -4 -55 -49 -11 7 -10 -35 -35 -16 5 22 20 17 14 -22 -70 -106 -161 -217 -244 -248 -236 -216 -205 -214 -208
16040 -208 -166 -141 -155 -186 -214 -212 -177 -134 -96 -64 -32 7 34 31 -1 -64 -122 -161 -208 -242 -220 -162 -119 -81 -29 17 45 56 61 58 34 -13 -76 -113 -89 -27
16025 -27 36 79 96 100 84 42 1 -19 -9 32 79 91 56 0 -53 -84 -95 -96 -92 -94 -106 -123 -147 -156 -140 -119 -102 -92 -99 -123 -145 -162 -178 -172 -140 -112 -120 -148 -157
16009 -157 -143 -127 -120 -127 -130 -101 -61 -35 -14 -6 2 30 68 99 114 109 80 52 43 41 53 68 54 32 24 31 56 87 93 65 22 -13 -45 -94 -140 -146 -111 -54 0 29
15992 29 52 88 102 70 22 -1 9 20 12 1 -16 -40 -60 -91 -106 -77 -57 -87 -120 -122 -108 -103 -122 -157 -189 -208 -208 -195 -180 -154 -119 -82 -42 -19 -10 15 46
15976 46 38 1 -25 -21 9 30 31 17 -21 -68 -94 -102 -101 -75 -21 35 60 47 32 23 -17 -82 -142 -200 -248 -262 -238 -191 -149 -142 -177 -219 -225 -189 -131 -75 -21 26 50
15959 50 53 35 2 -14 -16 -34 -74 -118 -151 -154 -120 -68 -7 45 69 62 34 16 6 -9 -21 -18 -6 -2 -15 -36 -63 -95 -127 -143 -133 -104 -81 -78 -84 -98 -126 -149 -149
15943 -149 -121 -79 -52 -72 -127 -169 -179 -182 -187 -190 -193 -179 -133 -67 -14 12 35 45 30 8 -37 -122 -201 -228 -205 -161 -127 -124 -137 -134 -111 -75 -16 49 89 83 47 5
15927 5 -32 -42 -37 -67 -126 -171 -180 -175 -191 -208 -185 -141 -118 -105 -86 -74 -68 -73 -92 -106 -98 -71 -38 5 32 17 -5 -9 0 19 54 80 88 91 66 15 -16 -11 18 22 -32
15909 -32 -125 -233 -325 -358 -340 -311 -289 -270 -260 -254 -216 -141 -72 -19 41 105 140 138 129 126 119 112 105 99 100 108 106 86 61 29 -10 -22 -9 4 27 49 55 79 134 189
15892 189 235 270 283 273 241 206 187 179 194 231 260 262 240 206 165 113 49 -3 -22 -28 -38 -19 32 74 97 106 92 56 3 -20 12 73 115 118 89 70 101
15877 101 164 219 247 239 201 154 113 91 93 107 116 115 105 103 107 104 98 87 78 72 58 44 33 29 25 2 -16 0 40 65 61 42 21 20 46 68 77 85 96 97 68 40 31
15858 31 15 12 29 41 42 26 27 84 167 215 209 177 136 91 41 -18 -68 -82 -74 -62 -55 -77 -116 -136 -142 -145 -141 -135 -138 -147 -145 -129 -113 -107 -110 -111 -95 -60 -20 14 34 58 89
15840 89 100 97 79 34 -28 -90 -110 -84 -43 -4 9 -7 -31 -47 -42 -11 24 52 72 88 98 111 135 152 119 31 -54 -89 -71 -40 -7 38 70 68 55 62 95
15825 95 131 156 188 227 241 205 126 59 53 71 65 59 76 103 115 118 114 89 46 -11 -71 -96 -95 -91 -71 -43 -38 -59 -93 -132 -160 -138 -77 -38 -32 -29 -23 -25 -46 -55 -32
15807 -32 0 28 32 9 -13 -29 -38 -42 -29 7 60 118 150 140 109 93 94 102 122 157 194 217 221 204 157 97 62 59 74 108 154 177 179 180 167 129 83 36 20
15791 20 62 120 141 124 87 60 49 35 19 18 16 1 9 43 71 69 31 -26 -73 -84 -66 -49 -52 -63 -52 -13 23 37 35 30 28 14 -21 -38 -17 7 14 19 45 90
15774 90 128 145 150 139 102 59 44 85 153 188 200 209 182 101 3 -68 -107 -117 -100 -50 15 84 137 149 126 77 31 19 25 30 15 -23 -70 -79 -20 53 90
15758 90 100 96 84 64 48 55 68 67 52 26 -28 -109 -180 -209 -206 -191 -177 -172 -171 -174 -185 -205 -222 -215 -176 -132 -114 -109 -70 20 123 191 220 236 248 243 231 227 220 189
15741 189 125 31 -64 -121 -114 -67 -32 -32 -33 -20 -24 -38 -32 -9 22 58 88 116 134 134 119 86 43 -10 -56 -73 -75 -74 -76 -68 -33 16 51 58 52 35 -6 -79 -153 -184
15724 -184 -170 -132 -77 -13 41 63 62 82 141 193 193 153 95 48 29 20 0 -43 -75 -55 -3 56 104 116 94 74 69 60 33 2 -5 9 37 71 102 133 148
15708 148 151 149 121 87 65 48 35 36 67 114 148 155 135 113 127 171 198 183 148 132 147 169 177 178 168 126 74 36 34 75 113 109 77 54 54 62 55 4 -75 -127
15692 -127 -156 -187 -221 -236 -208 -159 -116 -82 -61 -45 -28 -26 -32 -21 -5 -15 -44 -78 -105 -116 -96 -44 -13 -36 -84 -115 -116 -89 -44 -9 3 10 16 9 -23 -73 -114
15676 -114 -148 -174 -178 -178 -190 -204 -210 -203 -187 -160 -98 -21 12 14 26 50 73 93 108 115 110 120 140 125 73 0 -101 -218 -332 -397 -375 -302 -232 -183 -155 -154 -147
15660 -147 -101 -42 -18 -40 -76 -88 -70 -46 -39 -32 0 55 115 169 210 218 190 145 93 40 2 -21 -57 -110 -156 -167 -153 -142 -130 -124 -150 -202 -238 -229 -193 -152 -102
15644 -102 -44 2 10 -46 -154 -264 -333 -353 -355 -362 -358 -334 -303 -255 -178 -116 -116 -144 -150 -130 -84 -24 22 36 13 -20 -21 13 50 55 32 20 25 19 3 -9 -24 -33 -31
15628 -31 -26 -1 43 75 93 125 164 175 144 75 -5 -58 -73 -57 -23 -9 -32 -67 -93 -114 -130 -122 -72 8 73 84 59 35 24 35 62 71 47 19 -2 -30
15613 -30 -59 -89 -115 -114 -87 -46 -1 34 49 43 36 35 14 -11 -2 19 13 -3 -8 -10 -24 -52 -87 -130 -168 -190 -211 -220 -195 -149 -110 -106 -128 -133 -108 -104 -140 -176 -172 -110 -35
15595 -35 -13 -52 -113 -157 -164 -148 -126 -77 -2 55 93 129 162 170 158 137 97 34 -22 -31 -4 27 57 60 34 -4 -34 -35 -8 4 -34 -97 -141 -161 -162 -174 -215 -262
15579 -262 -277 -247 -196 -154 -130 -97 -50 0 44 61 43 0 -41 -64 -62 -45 -39 -38 -26 -22 -49 -91 -102 -60 13 98 175 224 242 228 182 142 113 68 30 12
15564 12 0 12 59 103 109 74 15 -27 -26 -14 -36 -81 -121 -146 -157 -152 -131 -108 -95 -89 -82 -60 0 88 167 210 195 161 140 109 84 79 79 72 50 18 -14 -50 -100
15547 -100 -159 -206 -244 -289 -337 -353 -323 -289 -275 -275 -266 -220 -162 -123 -100 -88 -85 -83 -91 -118 -133 -107 -40 52 129 156 151 146 151 152 136 109 87 58 -1 -77 -124 -114 -68
15531 -68 -31 -27 -38 -38 -34 -41 -47 -48 -87 -171 -243 -251 -205 -153 -104 -59 -54 -95 -149 -171 -150 -124 -108 -103 -109 -115 -120 -131 -138 -118 -73 -29 -8 -3 1 9 23 60 113 130 84 18 -27
15513 -27 -55 -74 -70 -47 -19 13 50 92 134 163 155 117 82 46 15 8 9 7 -9 -26 -22 -5 19 56 104 152 176 174 173 182 188 173 126 61 -5 -65 -109 -149 -179 -162
15496 -162 -127 -119 -137 -163 -179 -182 -162 -108 -38 18 67 148 259 320 277 172 70 5 -8 7 13 14 33 66 87 94 108 130 133 110 92 78 46 -5 -64 -115
15480 -115 -162 -184 -149 -89 -48 -38 -46 -59 -68 -71 -74 -93 -124 -123 -75 -23 16 52 73 73 61 44 16 -20 -62 -102 -116 -112 -107 -110 -128 -142 -146 -155 -148 -116 -98 -114 -136 -140 -134
15463 -134 -107 -66 -26 23 60 61 31 -11 -35 -39 -27 2 22 14 -28 -86 -114 -103 -91 -116 -146 -148 -142 -145 -158 -164 -144 -102 -49 -5 21 19 -23 -61 -51 -33 -55 -93
15447 -93 -116 -148 -217 -289 -323 -320 -301 -285 -281 -276 -256 -227 -179 -106 -37 9 23 -4 -36 -39 0 64 122 170 192 174 141 115 95 85 93 116 129 106 74 57 17
15431 17 -47 -86 -83 -54 -36 -57 -102 -136 -144 -121 -71 5 105 198 251 250 226 226 237 231 197 139 90 77 99 129 155 173 176 181 179 148 132 156 182 176 154 150 169
15415 169 178 150 96 38 -9 -33 -48 -76 -101 -106 -92 -60 -34 -37 -48 -37 0 45 75 71 36 2 -20 -48 -73 -65 -21 22 42 51 62 91 131 152 145 118 89 75
15399 75 72 86 113 134 154 171 178 206 267 305 288 265 281 309 314 302 283 249 202 172 186 218 216 176 128 87 56 33 21 36 83 136 151 119 56 -26 -81
15383 -81 -78 -58 -77 -135 -196 -232 -236 -210 -154 -78 -8 43 87 136 166 153 118 92 89 104 126 151 172 185 171 121 60 14 -1 -6 -31 -80 -127 -154 -174 -189 -194
15367 -194 -187 -165 -138 -104 -62 -6 67 110 100 75 49 24 11 2 -20 -42 -46 -36 -14 21 63 91 95 67 7 -39 -42 -30 -49 -102 -140 -128 -74 -25 6 56 109
15352 109 141 163 167 167 169 129 41 -31 -28 46 128 162 144 93 41 17 25 36 39 54 73 82 67 17 -34 -50 -20 41 99 112 66 2 -35 -42 -41 -54 -76 -81 -61
15335 -61 -26 8 17 -13 -71 -117 -119 -81 -20 51 113 155 179 193 185 137 66 4 -23 -29 -42 -59 -83 -112 -145 -194 -251 -293 -301 -271 -222 -162 -100 -61 -57 -63 -65 -77 -101
15319 -101 -116 -115 -124 -147 -153 -124 -78 -37 -22 -33 -36 -35 -43 -46 -32 6 51 75 78 54 8 -30 -56 -84 -126 -176 -194 -143 -55 -6 -12 -38 -53 -49 -37 -23 -3 22 35
15302 35 19 -16 -45 -60 -79 -112 -143 -151 -127 -60 30 86 107 126 150 158 112 38 -16 -22 37 116 141 116 85 46 0 -26 -10 8 -4 -3 43 112 151 128 72
15286 72 4 -78 -152 -197 -215 -212 -202 -200 -214 -232 -226 -185 -140 -107 -78 -62 -63 -71 -92 -127 -144 -133 -123 -116 -110 -127 -164 -201 -239 -271 -267 -253 -264 -276 -264 -232 -211 -233 -278
15270 -278 -286 -248 -215 -204 -193 -162 -106 -44 -6 -15 -58 -89 -95 -82 -53 -22 -8 3 35 78 120 154 173 197 240 269 247 181 114 57 -9 -75 -104 -95 -72 -42
15255 -42 -13 -1 0 -4 -27 -92 -162 -191 -201 -196 -151 -87 -59 -82 -108 -112 -101 -84 -81 -106 -138 -140 -131 -156 -194 -206 -184 -162 -169 -185 -192 -197 -193 -161 -122 -91 -61 -65 -123 -192 -239
15237 -239 -257 -262 -260 -251 -246 -255 -279 -303 -315 -307 -271 -206 -114 -16 61 105 115 117 125 112 46 -36 -88 -108 -128 -162 -181 -177 -166 -129 -71 -39 -35 -22 9 44 46 17 -7 -21
15220 -21 -20 -12 -24 -47 -31 30 76 72 49 17 -19 -47 -61 -51 -9 44 77 57 -21 -112 -150 -135 -113 -110 -135 -169 -175 -151 -114 -76 -51 -38 -38 -56 -85 -104 -99 -93 -97
15204 -97 -68 -6 56 95 109 118 124 131 136 132 133 130 90 33 -11 -51 -93 -130 -168 -192 -165 -102 -31 39 97 139 165 167 139 96 59 28 10 41 95 117 119 128 149 185
15187 185 222 234 204 150 105 76 54 41 58 94 100 66 15 -33 -64 -81 -112 -159 -201 -227 -210 -153 -101 -69 -54 -46 -35 -39 -62 -81 -77 -45 -2 35 69 89
15171 89 96 83 46 14 0 -12 -36 -74 -102 -95 -54 -5 36 70 57 2 -35 -30 -8 5 19 17 -15 -59 -95 -120 -143 -166 -186 -206 -237 -274 -303 -312 -303 -277 -253 -251
15155 -251 -261 -257 -238 -209 -164 -120 -110 -134 -163 -162 -117 -46 21 79 121 140 127 104 95 90 98 127 145 129 105 105 122 141 162 187 198 172 117 68 57 85 114
15140 114 94 13 -83 -169 -229 -243 -236 -224 -188 -134 -93 -64 -29 5 34 46 19 -46 -113 -133 -110 -63 17 102 153 164 139 92 34 -24 -64 -83 -100 -126 -167
15125 -167 -205 -208 -174 -115 -65 -54 -55 -30 30 90 120 140 163 188 208 197 151 109 97 106 127 157 190 188 132 59 -11 -85 -143 -171 -164 -136 -100 -62 -24 14 42
15109 42 55 73 108 153 178 183 198 199 163 120 99 89 68 45 31 18 -19 -77 -93 -73 -60 -51 -64 -106 -142 -159 -176 -199 -202 -194 -188 -179 -187 -209 -214 -182 -126 -70 -25
15093 -25 -17 -44 -80 -99 -86 -53 -20 -7 -40 -105 -155 -174 -174 -156 -145 -154 -141 -91 -43 -11 19 34 18 4 14 42 80 113 124 88 33 11 -1 -29 -40 -27
15077 -27 -9 0 -9 -28 -41 -55 -69 -62 -49 -64 -89 -87 -37 40 95 121 132 127 103 62 29 36 76 109 118 123 142 170 190 196 191 168 128 111 135 146 139 147 173 195 195
15060 195 186 173 157 148 145 139 135 131 112 91 98 131 190 255 291 296 300 326 336 293 233 188 150 115 84 74 87 102 96 50 -3 -18 -8 14 57 101 116 78 19
15043 19 6 40 68 66 56 40 12 -1 21 54 42 -27 -119 -187 -204 -191 -195 -211 -189 -127 -71 -62 -96 -132 -167 -206 -215 -182 -114 -19 82 156 182 173 140 83 21
15028 21 -23 -36 -25 -22 -31 -57 -102 -151 -188 -189 -133 -34 62 118 140 142 129 124 127 120 103 88 62 15 -24 -39 -40 -26 9 57 98 134 155 133 85 40 -6 -53 -85
15011 -85 -93 -82 -61 -37 -42 -84 -99 -55 7 38 20 0 5 14 31 55 65 73 88 100 107 86 13 -58 -59 -9 37 55 47 -2 -99 -186 -218 -215 -211 -226 -236 -211 -171 -135
14994 -135 -95 -67 -77 -122 -179 -214 -202 -149 -84 -21 32 48 40 29 -2 -50 -79 -76 -54 -39 -35 -25 0 49 91 94 79 68 63 52 7 -64 -96 -60 -9 27 36
14979 36 5 -35 -56 -66 -54 -36 -44 -58 -66 -61 -20 46 96 102 76 59 60 54 18 -49 -117 -160 -165 -119 -66 -70 -111 -131 -127 -112 -84 -54 -33 -14 8 23 26 38 60 60
14962 60 38 24 22 35 65 79 51 5 -27 -32 -20 -4 3 6 25 45 43 20 -9 -24 -15 9 29 37 53 85 125 166 193 196 177 157 136 102 56 16 11 27 35 50
14945 50 85 138 203 234 216 177 142 133 131 101 68 58 61 44 -15 -94 -127 -86 -4 66 82 54 23 11 37 89 142 172 166 158 144 91 48 44 47 19 -43 -110
14929 -110 -151 -157 -129 -73 2 63 80 60 32 15 6 -2 -8 -3 7 16 13 0 -13 -34 -37 -11 4 0 -1 -2 -24 -72 -121 -150 -163 -182 -230 -279 -280 -221 -131 -63 -54 -79 -85
14911 -85 -63 -47 -49 -54 -72 -100 -126 -130 -93 -30 25 46 31 5 -18 -28 -26 -27 -40 -64 -90 -100 -87 -61 -34 -10 5 9 0 -16 -21 -9 -10 -26 -21 8 36 43 25 -7
14894 -7 -43 -86 -133 -167 -178 -146 -82 -27 15 45 37 -14 -80 -100 -67 -24 12 36 44 44 53 75 67 18 -16 -20 -13 -8 -21 -61 -86 -54 5 20 -38 -112 -137 -134 -139 -151
14877 -151 -167 -176 -147 -67 20 69 67 20 -27 -39 -42 -60 -67 -51 -47 -67 -92 -116 -141 -171 -195 -206 -208 -195 -167 -139 -126 -136 -154 -155 -119 -59 0 47 88 131 162 155
14861 155 126 95 62 25 -33 -113 -175 -204 -214 -201 -171 -132 -76 -16 29 77 126 122 48 -36 -78 -71 -47 -21 -7 -26 -69 -101 -118 -133 -141 -135 -105 -42 26 72
14846 72 91 73 27 0 14 28 17 -8 -50 -89 -91 -63 -25 19 85 162 198 193 171 129 80 40 20 10 -9 -25 -23 -12 -11 -45 -102 -129 -106 -78 -69 -55 -19
14830 -19 19 19 -23 -61 -60 -19 45 111 144 136 106 63 18 -7 -7 12 53 87 87 71 81 130 162 134 88 51 13 0 25 69 104 104 85 81 88 94 102 104 112 118 75
14813 75 -24 -120 -173 -187 -156 -119 -120 -129 -136 -141 -130 -103 -69 -62 -94 -138 -164 -164 -152 -136 -125 -117 -116 -120 -116 -112 -115 -121 -134 -140 -126 -83 -26 16 27 14 16 35 40 16 -45 -115 -139
14795 -139 -113 -60 -9 16 17 18 38 62 69 43 0 -38 -87 -153 -209 -240 -238 -203 -128 -28 42 66 70 88 127 162 176 186 205 228 229 177 93 30 13 19 11 -20
14779 -20 -54 -70 -75 -72 -57 -47 -50 -51 -48 -59 -97 -142 -176 -186 -139 -44 46 96 98 89 99 117 136 149 150 157 169 181 188 181 177 183 163 114 94 126 180 220 212 164 120 97
14761 97 98 109 101 87 102 143 171 149 100 65 40 16 10 46 111 131 95 69 76 114 171 192 161 105 46 2 -9 18 70 128 184 217 206 143 34 -76
14745 -76 -119 -86 -16 53 97 105 89 68 55 51 45 19 -14 -27 -25 -26 -15 25 67 82 90 98 118 168 194 151 74 -19 -107 -139 -120 -96 -78 -68 -76 -92 -89 -64 -40
14729 -40 -8 41 84 107 120 117 98 86 94 114 140 166 177 173 172 192 232 276 316 337 325 293 260 249 243 228 235 255 260 247 207 146 100 100 122 121 91 34 -34
14712 -34 -70 -54 -14 19 45 62 59 21 -46 -110 -140 -133 -117 -134 -176 -222 -254 -256 -220 -133 -12 81 118 114 67 -29 -124 -167 -174 -169 -156 -135 -107 -81 -56 -42 -60
14697 -60 -92 -99 -99 -121 -132 -108 -90 -96 -96 -71 -28 20 67 112 165 196 175 139 133 162 198 198 156 95 28 -28 -70 -109 -136 -137 -105 -59 -48 -91 -150 -180 -180 -165 -138
14680 -138 -104 -68 -48 -73 -116 -119 -82 -46 -9 30 47 23 -42 -115 -167 -193 -195 -186 -165 -155 -167 -154 -118 -82 -59 -66 -89 -107 -103 -80 -69 -84 -87 -36 20 29 -3 -44
14664 -44 -44 -14 -6 -16 -6 48 113 155 179 166 118 66 14 -29 -47 -40 -26 -5 25 50 50 6 -61 -111 -108 -60 -11 31 70 74 39 4 -16 -33 -41 -50 -77 -127 -185
14648 -185 -207 -179 -137 -119 -117 -84 -14 51 89 120 165 227 290 327 343 338 277 187 132 114 94 74 75 93 108 84 7 -81 -150 -205 -234 -215 -172 -133 -111 -120
14632 -120 -151 -184 -187 -144 -86 -43 -24 -24 -13 6 12 19 23 6 -11 -26 -49 -55 -48 -62 -89 -117 -151 -163 -125 -65 -12 45 74 42 1 -6 8 26 29 17 -1 -28 -77
14616 -77 -145 -207 -257 -293 -303 -291 -270 -245 -216 -190 -178 -160 -129 -91 -40 4 14 -12 -53 -77 -75 -74 -98 -120 -95 -48 -18 -11 -30 -74 -125 -160 -164 -133 -96 -84 -77
14600 -77 -63 -37 0 35 55 62 77 91 89 82 59 26 17 37 53 44 28 16 10 31 51 30 7 5 -6 -27 -27 8 60 91 95 92 86 47 -28 -113 -187 -217 -207 -187
14583 -187 -163 -157 -179 -202 -214 -209 -189 -180 -168 -139 -110 -99 -113 -115 -86 -46 -5 16 27 30 21 28 56 83 122 178 218 237 238 198 117 13 -78 -108 -81 -34 6 26
14567 26 34 40 27 -7 -46 -73 -75 -55 -7 74 150 167 121 43 -39 -97 -120 -131 -147 -186 -227 -226 -182 -111 -33 26 61 70 60 56 60 52 48 63 77 72 55 29 -19 -76
14550 -76 -116 -125 -95 -30 36 59 53 73 123 164 167 156 150 128 102 98 107 106 90 67 53 60 79 83 76 82 93 89 98 146 186 178 155 150 171 203 217 219 220 219 210 188 179 188 179 150
14531 150 143 164 188 207 198 171 150 105 33 -27 -57 -62 -49 -21 27 97 157 167 113 23 -55 -115 -139 -116 -73 -42 -28 3 61 108 139 176 211 210 178 141
14515 141 107 98 122 177 250 292 287 263 245 243 226 181 138 95 39 -1 -6 7 21 37 68 104 113 76 8 -34 -44 -67 -108 -151 -185 -206 -219 -230 -255 -290 -297
14500 -297 -274 -254 -242 -223 -192 -150 -99 -51 0 59 113 152 176 195 189 116 10 -48 -53 -49 -48 -49 -59 -67 -48 1 62 105 112 99 74 54 64 83 93 99 94 74
14484 74 49 35 35 43 42 33 30 22 10 -6 -33 -45 -33 -10 19 42 66 105 133 105 49 36 72 121 163 168 122 59 25 52 112 133 99 54 49 89 125 134 122
14467 122 83 43 45 82 120 128 89 34 6 1 -12 -32 -34 -12 3 -6 -39 -73 -88 -86 -78 -82 -117 -158 -176 -157 -108 -53 -12 1 -8 -14 7 39 50 33 12 23 75
14450 75 129 141 122 109 107 106 86 34 -15 -37 -39 -42 -44 -33 -27 -34 -44 -50 -40 -24 -31 -64 -102 -124 -141 -170 -216 -254 -253 -209 -140 -92 -95 -129 -159 -169 -155 -107 -35 27
14433 27 66 81 81 86 92 72 34 11 6 2 4 16 31 36 18 -11 -33 -24 12 50 79 80 46 7 -1 29 68 88 92 88 91 107 130 164 213 247 237 185 106 18 -42
14416 -42 -48 -10 15 6 -9 -5 23 50 54 45 35 31 30 29 39 64 85 98 126 140 119 89 69 66 64 52 62 90 111 114 105 110 120 118 92 62 73 95 113 142 156 144
14398 144 113 80 53 38 59 83 72 57 77 92 48 -3 -2 38 84 116 145 176 190 160 98 57 45 35 23 27 51 75 92 100 79 23 -50 -112 -139 -141
14383 -141 -138 -144 -142 -122 -108 -104 -88 -52 -21 -25 -41 -23 13 33 39 45 52 49 26 -22 -73 -95 -73 -16 44 69 34 -36 -109 -177 -242 -300 -330 -318 -278 -221 -156 -93 -50
14367 -50 -50 -82 -128 -160 -156 -122 -76 -25 13 21 24 36 42 26 -15 -46 -54 -58 -44 -9 24 44 42 14 -31 -80 -121 -154 -181 -185 -162 -140 -140 -155 -147 -101 -32 31 71 105
14350 105 124 120 129 149 146 98 18 -52 -67 -21 31 70 102 106 57 -22 -93 -121 -88 -21 41 98 135 144 142 144 153 133 66 -10 -74 -121 -143 -144 -149 -160 -164 -169 -162 -134 -90
14332 -90 -27 29 51 37 -8 -61 -100 -125 -147 -156 -138 -111 -104 -120 -120 -75 0 69 101 104 97 80 25 -72 -172 -237 -269 -264 -214 -147 -88 -32 1 10 5 -28 -90 -139
14316 -139 -157 -174 -211 -239 -234 -203 -150 -71 -9 -2 -17 -1 32 40 22 8 0 -4 -15 -42 -88 -148 -201 -221 -200 -186 -201 -217 -235 -258 -265 -247 -207 -166 -141 -125 -97
14300 -97 -43 11 46 66 72 72 63 37 19 31 52 52 39 51 86 85 48 27 33 43 39 31 29 20 16 29 35 11 -20 -21 -2 -1 -28 -62 -75 -61 -35 -27 -48 -65 -63 -57 -55 -52
14282 -52 -51 -48 -46 -58 -62 -52 -66 -107 -150 -170 -156 -123 -93 -78 -76 -75 -66 -50 -43 -55 -80 -115 -164 -221 -268 -282 -247 -183 -134 -111 -116 -149 -169 -163 -161 -174 -179 -179 -188 -192 -174 -128
14264 -128 -63 -31 -77 -158 -208 -219 -201 -166 -137 -137 -168 -206 -229 -251 -285 -310 -300 -248 -177 -119 -84 -38 22 74 111 119 78 17 -19 -20 -17 -28 -35 -24 7 40 50
14248 50 39 9 -37 -85 -127 -153 -131 -62 2 32 29 11 -3 1 33 68 115 200 288 330 313 263 201 136 78 18 -21 -23 -14 -10 -8 -1 11 24 34 37 37 46 47 2
14231 2 -69 -103 -68 -8 24 33 36 55 95 127 150 162 153 133 106 72 58 79 129 181 190 162 124 81 55 52 41 11 -5 14 27 -1 -50 -94 -113 -100 -74 -55
14215 -55 -65 -98 -118 -112 -90 -61 -44 -55 -79 -84 -71 -74 -83 -63 -37 -60 -131 -194 -215 -203 -181 -150 -108 -55 16 80 70 -8 -77 -91 -50 31 109 122 61 -27 -120
14200 -120 -235 -343 -394 -406 -423 -441 -435 -383 -305 -238 -181 -130 -103 -101 -108 -100 -48 17 29 -32 -127 -202 -231 -228 -220 -215 -201 -183 -165 -131 -89 -56 -36 -40 -63 -88 -120
14184 -120 -143 -136 -102 -42 36 111 159 159 112 63 41 32 35 71 128 172 178 154 126 94 45 -13 -59 -69 -37 9 25 13 6 -7 -25 -37 -45 -23 38 107 158 184
14168 184 191 194 192 191 197 176 127 87 76 80 52 -20 -99 -151 -169 -167 -141 -86 -22 8 -11 -37 -32 -8 5 -8 -39 -81 -129 -151 -140 -127 -139 -170 -193 -182 -139 -70
14152 -70 0 38 55 60 39 -9 -70 -130 -186 -227 -237 -218 -192 -158 -102 -31 35 78 83 48 -6 -46 -58 -58 -64 -78 -83 -69 -43 -4 26 12 -29 -58 -87 -130 -163
14136 -163 -185 -217 -257 -287 -309 -320 -307 -262 -186 -111 -71 -54 -34 -5 27 72 145 219 238 216 191 152 97 65 72 110 158 168 133 95 77 77 91 106 106 90
14121 90 82 72 39 -6 -50 -70 -73 -64 -24 24 78 138 168 162 129 75 18 -30 -65 -83 -102 -118 -127 -157 -201 -216 -198 -163 -116 -74 -58 -61 -73 -107 -162 -209 -229 -212
14105 -212 -147 -58 0 10 -15 -43 -34 -5 17 20 1 -25 -43 -27 30 88 109 86 49 14 -34 -91 -135 -175 -230 -294 -338 -349 -328 -274 -191 -107 -52 -45 -70 -99
14089 -99 -130 -162 -175 -158 -122 -86 -53 -25 -8 0 -7 -19 -22 -31 -46 -44 -11 31 45 19 -38 -104 -145 -173 -205 -214 -188 -161 -142 -109 -79 -85 -119 -151 -186 -230 -261 -255 -201
14073 -201 -112 -32 22 77 131 163 171 153 101 35 -40 -116 -142 -114 -91 -100 -128 -158 -173 -165 -145 -117 -82 -56 -46 -53 -89 -146 -175 -171 -165 -154 -131 -96 -58 -27 -1
14057 -1 29 94 175 204 163 94 60 62 42 -7 -49 -80 -112 -112 -76 -33 15 67 115 153 172 168 144 129 142 168 182 177 152 100 12 -114 -238 -312 -350 -366
14042 -366 -361 -344 -315 -286 -257 -217 -170 -135 -116 -94 -71 -76 -104 -117 -90 -21 63 122 145 151 161 176 179 155 132 123 106 81 73 83 84 34 -64 -151 -219 -285 -328 -350
14026 -350 -360 -349 -312 -242 -166 -126 -105 -74 -40 -40 -91 -160 -212 -223 -184 -130 -88 -58 -40 -30 -19 -11 7 40 48 22 4 10 15 2 -38 -76 -74 -56 -38 -23 -17 -43
14010 -43 -108 -174 -239 -324 -381 -353 -264 -186 -143 -103 -47 8 53 89 107 97 66 12 -48 -96 -139 -183 -211 -217 -213 -210 -201 -179 -140 -97 -52 -22 -19 -12 21 57 82 118
13994 118 156 158 147 159 169 152 105 37 -20 -37 -4 45 71 73 48 9 -20 -27 -9 29 63 75 88 116 154 192 199 178 164 155 116 41 -10 -19 -30 -66 -100
13978 -100 -99 -89 -114 -146 -152 -153 -162 -176 -188 -214 -270 -321 -324 -287 -244 -200 -123 -18 67 98 80 64 75 98 114 109 86 49 -7 -71 -113 -122 -121 -132 -136 -124 -105 -95
13962 -95 -111 -152 -180 -165 -113 -55 -23 -15 8 46 39 -39 -134 -199 -243 -263 -254 -217 -161 -125 -135 -178 -225 -262 -276 -246 -200 -190 -221 -259 -259 -215 -159 -134 -153 -179 -184
13946 -184 -172 -154 -137 -127 -129 -127 -108 -93 -95 -90 -63 -28 -9 -8 -6 1 21 70 132 184 205 188 146 111 93 71 37 4 -12 -17 -27 -37 -32 0 37 36 0 -33 -43
13930 -43 -50 -58 -51 -36 -16 0 2 2 2 -13 -40 -63 -80 -100 -123 -135 -127 -97 -56 -39 -61 -89 -101 -104 -107 -108 -106 -93 -48 6 35 37 24 7 -12 -34 -35 -19 0 33 79
13912 79 107 95 56 34 40 59 86 115 136 152 159 153 132 99 87 121 168 190 180 156 135 118 111 111 119 144 172 177 159 112 40 -31 -91 -130 -121 -64 -28 -51 -87
13896 -87 -97 -99 -103 -94 -62 -19 12 38 85 156 205 212 218 249 255 193 103 42 11 0 -5 -26 -54 -64 -63 -59 -34 21 77 91 77 67 63 54 30 14 32 71 107 108 67
13878 67 25 8 -1 -10 -17 -37 -64 -96 -147 -192 -198 -186 -176 -169 -156 -116 -63 -18 15 35 42 16 -51 -108 -97 -38 20 64 86 70 17 -36 -46 -20 10 33 40 26
13862 26 -9 -55 -88 -108 -112 -93 -64 -24 37 110 170 205 219 234 270 314 340 349 305 192 87 30 -13 -31 8 74 115 144 170 176 173 163 131 100 85 76
13847 76 75 63 19 -28 -63 -86 -86 -58 -36 -34 -15 17 18 5 10 40 79 93 78 59 40 12 -10 -1 24 27 5 -12 -8 9 28 51 81 123 169 188 175 145 100
13830 100 68 62 61 61 60 44 4 -52 -102 -133 -139 -131 -139 -158 -175 -171 -114 -11 86 133 130 129 132 115 90 71 83 137 205 271 319 316 265 199 151 138 155 201 256 295
13813 295 312 292 239 179 122 84 57 43 51 61 66 83 105 105 89 61 26 20 34 36 40 45 30 5 -27 -70 -94 -73 -32 -6 -7 -30 -71 -114 -155 -204 -237 -226
13797 -226 -184 -147 -136 -148 -163 -147 -93 -30 9 17 14 19 33 42 50 68 95 130 146 119 89 66 35 11 18 61 136 211 258 288 307 287 220 149 109 94 106
13782 106 130 133 105 53 -5 -53 -85 -98 -96 -99 -106 -91 -68 -70 -74 -44 11 71 120 153 179 209 245 256 222 180 162 171 212 275 316 317 295 261 221 160 56 -46
13766 -46 -62 10 94 141 144 131 132 125 81 19 -26 -52 -59 -29 18 43 30 -3 -34 -58 -70 -70 -69 -51 -6 58 118 141 112 49 -17 -75 -125 -154 -140 -112 -108 -111 -85
13749 -85 -21 44 93 133 145 126 85 37 6 7 18 13 -13 -53 -104 -137 -128 -108 -97 -71 -52 -39 -2 40 69 81 96 116 108 65 16 -10 -21 -34 -59 -92 -100
13733 -100 -64 -3 54 90 114 120 100 70 45 20 -8 -28 -26 -15 -37 -93 -129 -120 -83 -63 -73 -69 -43 -16 4 9 8 5 -5 -29 -76 -126 -140 -135 -127 -101 -62 -45 -78
13717 -78 -124 -148 -154 -128 -68 -1 46 80 109 126 135 138 116 63 -3 -64 -99 -113 -118 -97 -57 -35 -28 -24 -24 -17 -3 -9 -45 -86 -108 -98 -73 -47 -24 -13 -6 18 71 130
13700 130 171 186 180 144 82 40 41 48 26 -22 -75 -132 -192 -230 -252 -272 -261 -210 -151 -117 -122 -162 -204 -225 -207 -154 -101 -64 -43 -21 19 65 122 200 256 255 215
13684 215 179 147 119 97 39 -39 -96 -136 -164 -194 -235 -244 -206 -141 -83 -65 -72 -67 -54 -32 2 33 44 29 19 47 92 126 140 131 107 92 88 68 12 -64 -136
13668 -136 -191 -220 -212 -172 -127 -112 -120 -97 -54 -37 -28 -15 -18 -38 -54 -57 -68 -97 -117 -113 -91 -64 -54 -59 -62 -60 -72 -92 -92 -66 -20 24 55 76 76 54 15 -37 -85 -106
13651 -106 -100 -87 -78 -83 -116 -164 -198 -162 -66 -8 -17 -36 -27 -8 2 11 -4 -45 -76 -85 -59 -13 27 75 125 166 192 182 147 111 76 49 41 31 2 -39 -77 -100
13635 -100 -107 -104 -101 -97 -73 -35 -23 -35 -25 11 42 56 69 75 66 52 35 25 41 82 133 168 170 169 182 165 127 106 89 80 85 94 94 87 77 42 -4 -40 -81 -123 -126
13618 -126 -78 -18 27 69 107 136 144 145 160 157 121 100 116 99 13 -63 -63 -21 8 23 33 44 51 41 30 30 25 11 8 33 58 39 6 3 13 15 17 35 69 99
13601 99 120 137 156 179 179 146 96 36 -13 -39 -45 -36 -15 -6 -23 -21 17 42 40 35 44 64 89 128 154 141 116 105 101 108 124 128 121 105 74 70 109 145 153 126 90 76
13583 76 69 41 5 15 75 128 151 154 145 125 93 33 -34 -99 -183 -255 -287 -289 -257 -214 -188 -174 -161 -145 -109 -49 4 34 50 69 92 105 108 105 94 82 77 94
13567 94 127 158 199 259 315 355 377 352 284 211 135 52 -11 -47 -55 -37 -17 -10 -6 1 25 46 40 29 10 -46 -105 -116 -84 -45 -11 12 15 12 27 52 72 67 17
13551 17 -54 -115 -144 -141 -121 -100 -101 -119 -121 -124 -157 -193 -178 -114 -39 21 56 73 86 86 47 -23 -86 -109 -91 -71 -76 -105 -136 -136 -120 -125 -151 -163 -138 -98 -64 -20 30
13534 30 50 39 24 -7 -52 -72 -59 -36 -32 -37 -33 -31 -35 -35 -35 -49 -88 -141 -190 -222 -221 -181 -124 -73 -49 -48 -20 39 86 85 45 0 -43 -74 -93 -103 -90 -61 -44 -61
13517 -61 -90 -96 -81 -63 -62 -86 -140 -208 -249 -248 -215 -164 -110 -83 -107 -139 -121 -71 -29 2 31 61 94 124 145 157 162 154 122 63 -11 -77 -121 -133 -106 -58 -14
13501 -14 12 35 63 86 92 80 48 21 21 43 60 39 -20 -75 -99 -99 -90 -86 -89 -95 -97 -69 -8 57 115 152 148 117 79 55 68 100 110 90 51 -6 -73 -104 -86
13485 -86 -61 -38 -16 -7 -7 -1 13 32 54 83 101 91 71 54 26 -15 -58 -74 -59 -61 -99 -149 -191 -204 -187 -162 -120 -44 49 117 143 130 65 -31 -114 -169 -204
13469 -204 -220 -212 -181 -139 -95 -74 -78 -78 -67 -64 -105 -163 -189 -186 -168 -143 -116 -101 -112 -141 -168 -160 -113 -74 -66 -74 -88 -104 -117 -149 -209 -262 -284 -288 -275 -221 -154 -125 -128
13453 -128 -126 -113 -121 -129 -102 -73 -59 -35 -10 -18 -48 -64 -60 -61 -78 -69 -10 39 49 53 62 55 32 7 -22 -50 -66 -68 -61 -31 31 90 121 128 105 64 28 7 12 38 47 53
13435 53 80 100 89 58 29 2 -12 18 62 67 52 47 40 30 45 83 125 147 124 73 32 17 26 32 6 -43 -114 -180 -203 -187 -151 -111 -74 -38 -18 -10 -10 0
13419 0 24 29 40 81 115 147 190 228 246 243 228 215 202 181 150 106 61 48 52 25 -21 -43 -54 -81 -114 -141 -165 -182 -206 -240 -255 -255 -259 -264 -251 -214 -190 -182 -153
13402 -153 -97 -35 13 32 19 -4 -7 16 59 91 82 62 79 116 133 112 77 58 60 74 69 50 45 48 73 117 132 106 76 75 91 117 149 181 201 179 138 128
13386 128 142 135 88 40 35 72 110 132 138 115 70 27 -1 -16 -40 -81 -123 -150 -154 -145 -125 -101 -70 -25 23 54 30 -36 -90 -106 -97 -66 -39 -41 -56 -92 -177 -269
13370 -269 -299 -264 -214 -164 -89 -8 19 0 -25 -40 -40 -33 -16 30 74 70 35 -3 -42 -57 -45 -35 -36 -47 -63 -80 -90 -80 -63 -77 -120 -163 -187 -188 -177 -174 -174 -145
13354 -145 -75 -6 9 -44 -128 -183 -203 -212 -201 -167 -129 -80 -40 -41 -69 -101 -119 -111 -86 -53 -34 -50 -94 -147 -165 -145 -132 -137 -141 -141 -131 -109 -100 -112 -103 -41 25 38
13338 38 -3 -69 -131 -173 -196 -193 -156 -89 -18 28 46 35 -9 -74 -118 -125 -120 -106 -82 -75 -92 -119 -138 -136 -122 -110 -95 -82 -79 -79 -74 -54 -11 59 131 153 122 71 18
13321 18 -8 4 24 20 -18 -75 -131 -169 -151 -87 -23 32 73 96 86 38 -29 -92 -127 -124 -102 -77 -42 0 20 -3 -59 -102 -93 -36 25 59 71 76 83 101 98 50
13305 50 -10 -69 -116 -134 -133 -115 -102 -126 -162 -178 -166 -127 -75 -21 13 12 -10 -16 -6 1 13 18 4 -17 -28 -19 -11 -5 13 35 35 21 21 26 16 -19 -66 -98 -115 -112 -90
13288 -90 -52 -11 -8 -35 -66 -106 -135 -120 -87 -75 -83 -81 -59 -42 -26 -7 -2 5 37 82 103 86 83 97 89 56 16 -10 -24 -33 -29 -18 -16 0 46 93 140 170 167 145
13271 145 126 131 144 139 110 66 22 0 5 13 -8 -51 -85 -103 -108 -94 -79 -96 -126 -122 -77 -40 -24 -15 -28 -51 -58 -37 0 24 40 67 78 57 30 7 -25 -60
13255 -60 -78 -72 -42 1 44 57 35 12 5 7 0 -20 -25 22 113 151 88 9 -15 -12 -35 -80 -103 -111 -130 -152 -148 -109 -35 44 89 112 115 108 134 187 227 226 178 107
13238 107 50 42 71 92 70 29 10 6 14 28 31 29 22 -1 -35 -49 -49 -54 -60 -67 -61 -36 12 79 108 94 71 51 43 26 -13 -39 -14 48 97 106 109 125 117 55 -18 -62
13220 -62 -87 -108 -120 -128 -146 -177 -209 -220 -207 -169 -119 -83 -72 -81 -104 -121 -114 -87 -58 -37 -30 -35 -22 18 61 112 178 225 242 227 178 118 76 54 36 16 10 11
13204 11 -2 -29 -47 -55 -59 -50 -36 -45 -78 -111 -127 -122 -114 -114 -89 -14 67 121 161 192 191 150 99 73 54 21 -12 -42 -70 -89 -68 -7 43 53 40 24 11 -2 -1
13187 -1 24 40 33 28 12 -38 -88 -104 -105 -117 -151 -178 -149 -61 48 133 172 172 149 137 145 156 158 144 122 95 54 3 -33 -58 -85 -114 -143 -164 -142 -68 17 81
13171 81 117 120 107 105 123 139 129 105 89 85 66 30 5 -7 -9 10 43 68 75 76 66 41 30 53 87 94 69 30 -4 -26 -28 -16 -2 27 43 27 8 3 16
13155 16 36 43 32 15 0 -20 -55 -88 -104 -95 -71 -43 -25 -24 -26 -24 -15 3 9 -31 -89 -101 -76 -36 18 58 54 32 33 29 -5 -47 -71 -81 -85 -71 -30 19 49 67
13138 67 94 124 126 97 68 45 12 -27 -60 -91 -118 -120 -110 -114 -132 -141 -150 -180 -206 -193 -160 -148 -162 -175 -177 -174 -164 -144 -112 -74 -46 -36 -37 -33 -12 8 11 -4 -28 -58
13121 -58 -85 -107 -153 -206 -200 -127 -32 30 49 41 21 5 -14 -56 -97 -94 -47 12 71 101 87 66 52 28 -1 -23 -50 -88 -128 -154 -128 -50 17 35 26 23 18 -3
13105 -3 -30 -26 19 75 108 91 44 28 54 79 67 40 38 66 108 155 187 201 219 227 214 215 243 263 247 201 135 67 19 -8 -25 -40 -48 -46 -52 -63 -71 -62 -34 -19
13088 -19 -28 -42 -30 3 18 17 21 26 44 77 107 139 155 144 126 126 158 199 231 267 290 271 225 182 133 71 30 19 17 9 -6 -23 -21 11 44 51 35 -1 -42
13071 -42 -56 -38 -19 -30 -79 -133 -162 -169 -157 -124 -75 -31 -20 -22 7 61 83 63 31 7 11 33 63 108 144 152 130 95 86 115 142 137 115 95 93 119 159 178
13055 178 163 121 63 12 -6 -7 -13 -24 -43 -80 -120 -130 -114 -85 -64 -61 -60 -43 -30 -42 -63 -74 -76 -81 -100 -112 -111 -115 -110 -106 -116 -108 -63 -2 33 43 54 66 62 27
13038 27 -22 -63 -101 -139 -163 -141 -87 -49 -28 -20 -29 -35 -28 -8 1 -7 -23 -42 -47 -42 -28 16 41 -4 -57 -50 -20 1 30 58 56 13 -30 -37 -34 -46 -66 -72 -62 -77 -123
13021 -123 -143 -126 -109 -108 -114 -120 -129 -156 -199 -229 -215 -165 -109 -71 -60 -74 -98 -112 -120 -121 -98 -72 -70 -81 -97 -127 -153 -147 -117 -83 -50 0 60 90 74 40 49 109 158
13004 158 167 144 119 123 142 141 124 116 113 119 130 132 124 112 84 40 4 -15 -40 -59 -44 -17 -3 23 77 123 133 105 44 -23 -58 -43 -2 34 43 27 3 -33 -74
12988 -74 -116 -164 -199 -177 -84 22 61 37 20 20 20 24 26 29 36 37 32 30 50 86 96 79 66 54 36 13 5 31 70 95 83 33 -10 -33 -71 -120 -149 -155 -157 -164 -170
12970 -170 -172 -164 -142 -109 -67 -26 2 31 51 23 -38 -98 -132 -132 -127 -143 -178 -216 -224 -187 -123 -50 20 78 98 76 57 57 47 26 8 -10 -12 17 38 16 -18 -37
12954 -37 -35 -25 10 76 127 134 95 48 38 33 -2 -51 -78 -67 -30 14 57 68 47 30 12 -24 -61 -84 -102 -117 -115 -80 -31 -2 14 22 27 66 109 114 102 96 92
12938 92 88 96 118 151 184 189 151 92 36 6 7 22 25 13 7 18 23 7 -27 -79 -138 -192 -240 -267 -268 -238 -169 -80 -4 51 92 110 110 103 77 13 -51 -76 -53 6
12921 6 66 100 119 128 128 134 148 142 107 76 58 34 5 -21 -53 -84 -82 -34 36 112 185 232 229 181 127 105 110 131 159 163 124 54 -7 -47 -92 -147 -190 -203 -181
12904 -181 -148 -126 -116 -94 -51 -18 -19 -40 -76 -139 -188 -189 -176 -169 -169 -178 -186 -174 -166 -193 -217 -200 -178 -180 -182 -163 -136 -94 -31 1 -14 -45 -78 -114 -137 -135 -124 -111 -86
12888 -86 -53 -25 -27 -67 -117 -155 -179 -183 -159 -116 -72 -49 -45 -30 3 32 31 -9 -73 -126 -154 -181 -210 -214 -198 -187 -173 -166 -183 -201 -212 -210 -193 -181 -177 -163 -157 -190 -237
12871 -237 -259 -264 -249 -204 -166 -154 -156 -167 -193 -242 -307 -361 -381 -373 -336 -274 -227 -224 -244 -263 -268 -253 -239 -234 -225 -218 -216 -197 -155 -115 -82 -40 1 14 -2 -39 -82 -93 -52
12855 -52 18 73 79 56 35 23 27 42 56 65 59 28 -7 -34 -76 -140 -192 -206 -184 -131 -65 -17 6 20 43 74 103 110 85 49 20 8 8 22 50 61 33 -16
12839 -16 -35 0 47 83 100 78 15 -39 -43 -20 -16 -58 -113 -149 -181 -202 -167 -74 22 68 61 26 6 22 29 -5 -64 -125 -173 -202 -218 -226 -212 -152 -70 -12 21
12823 21 40 46 36 24 42 69 61 25 2 3 12 5 -10 -15 -14 -19 -46 -90 -124 -157 -193 -214 -211 -180 -139 -126 -142 -149 -125 -84 -62 -69 -70 -45 -6 20 32 57 87 108 121
12805 121 91 31 4 20 44 60 68 75 98 137 173 185 182 172 151 127 105 80 36 -26 -71 -62 -22 -2 -10 -21 -20 -4 34 90 127 124 92 47 25 43 72 78
12789 78 66 40 -22 -117 -186 -180 -129 -82 -49 -37 -54 -74 -52 12 88 168 231 239 194 117 48 15 13 23 46 92 136 142 117 77 24 -22 -45 -50 -41 -4 64 117
12773 117 93 4 -80 -115 -123 -143 -149 -102 -42 -24 -57 -124 -177 -175 -134 -85 -39 -26 -66 -101 -97 -94 -110 -133 -153 -171 -180 -159 -119 -78 -49 -38 -44 -61 -80 -79 -54 -17
12757 -17 2 -30 -87 -112 -105 -94 -96 -97 -108 -141 -149 -120 -92 -89 -82 -47 4 58 96 123 138 131 106 80 63 32 -20 -68 -93 -96 -98 -109 -118 -119 -127 -166 -216 -233 -209 -162 -104
12740 -104 -53 -19 25 78 100 77 43 43 66 81 60 8 -14 -5 3 24 74 137 164 122 39 -31 -81 -128 -149 -115 -66 -40 -26 -15 -14 -35 -57 -53 -39 -27 -14
12724 -14 -8 -11 -39 -66 -45 15 63 72 45 13 3 18 59 111 163 191 167 99 12 -44 -39 -10 1 -6 -7 -4 -20 -38 -39 -11 35 63 58 31 11 14 17 13 26 37 15
12707 15 -5 2 8 -18 -70 -133 -195 -217 -173 -102 -45 -10 5 8 4 2 22 63 97 111 130 151 155 145 122 83 35 -13 -49 -59 -55 -58 -73 -98 -133 -149 -128 -104 -103
12690 -103 -112 -105 -81 -58 -30 -5 0 -15 -33 -31 -13 -6 -5 13 41 47 28 -4 -30 -41 -52 -72 -99 -105 -80 -56 -38 -42 -62 -73 -96 -126 -130 -88 -7 67 102 90 71
12674 71 88 110 91 54 37 22 0 -12 -27 -43 -55 -55 -44 -29 -6 -10 -58 -114 -160 -188 -195 -180 -154 -122 -95 -89 -97 -98 -73 -25 12 24 43 79 110 125 114 77
12658 77 23 -47 -119 -182 -246 -296 -299 -252 -196 -150 -104 -70 -68 -93 -125 -142 -153 -181 -205 -195 -178 -183 -195 -187 -168 -139 -101 -85 -96 -101 -71 -40 -43 -40 -13 14 35 37 18
12641 18 -23 -73 -108 -122 -114 -99 -92 -75 -48 -24 4 17 5 14 52 83 119 163 210 244 238 197 121 28 -36 -62 -72 -80 -92 -95 -92 -97 -105 -112 -117 -128 -135 -123 -114 -121 -122 -101
12623 -101 -58 -20 -9 8 45 78 90 65 6 -53 -81 -65 -30 -1 21 37 40 37 24 0 4 63 133 172 177 161 146 141 153 165 149 111 76 73 92 90 45 -20
12607 -20 -86 -139 -164 -177 -180 -147 -99 -59 -40 -48 -80 -128 -158 -141 -88 -42 -12 14 14 -10 -22 -36 -63 -72 -61 -51 -54 -57 -48 -39 -43 -45 -41 -38 -33 -32 -51 -76 -92 -106 -126 -140
12589 -140 -117 -54 10 57 81 91 115 155 202 257 298 291 261 239 204 155 103 65 61 68 67 54 35 28 46 101 175 222 241 239 198 109 -10 -117 -165 -138
12574 -138 -71 -5 30 23 -6 -39 -62 -44 4 43 65 69 49 34 47 71 94 90 41 -8 -42 -69 -73 -46 -13 -3 -20 -58 -106 -148 -173 -164 -133 -107 -90 -71 -47
12558 -47 -36 -35 -21 27 100 149 163 167 168 154 126 87 23 -47 -92 -115 -129 -126 -100 -68 -54 -45 -22 0 5 -5 -26 -49 -70 -76 -55 -24 2 28 53 72 75 60 31
12542 31 -2 -24 -38 -66 -101 -130 -152 -157 -138 -117 -108 -87 -29 40 91 112 100 43 -39 -102 -150 -205 -248 -263 -238 -187 -157 -165 -178 -151 -99 -60 -62 -102 -150 -174 -157
12526 -157 -128 -107 -78 -50 -48 -58 -64 -77 -90 -84 -68 -48 -24 4 39 68 71 50 6 -61 -124 -167 -189 -188 -182 -177 -161 -112 -33 42 108 158 184 205 235 278 308 274
12510 274 188 98 39 27 28 29 81 169 233 259 263 272 298 317 310 286 274 291 319 338 346 341 312 256 192 147 130 126 134 154 178 205 230 262 301 319 303 267 242
12494 242 221 186 143 104 86 78 60 36 1 -39 -56 -63 -58 -10 68 137 176 182 154 109 76 63 71 95 117 128 129 107 67 28 5 -10 -41 -70 -74 -47 -6 14
12477 14 20 41 79 110 119 107 97 92 80 65 47 36 49 72 73 46 22 19 11 -13 -18 24 70 75 59 37 2 -31 -56 -82 -78 -23 28 48 63 91 118 123 105 70
12460 70 13 -53 -84 -73 -52 -34 -10 25 57 74 79 71 48 6 -48 -92 -103 -87 -64 -57 -55 -45 -50 -81 -107 -118 -127 -124 -85 -31 -21 -64 -130 -199 -233 -211 -143 -57
12444 -57 4 42 85 143 204 245 247 219 197 183 169 173 197 195 127 34 -7 1 45 113 158 156 127 102 90 76 56 42 45 58 51 8 -31 -39 -43 -66 -105 -140 -150
12428 -150 -127 -64 3 24 -4 -52 -84 -95 -89 -68 -32 17 55 69 66 32 -16 -43 -40 -24 -13 -26 -44 -43 -38 -44 -54 -58 -58 -57 -46 -19 17 44 59 69 83 113 153
12411 153 174 157 121 95 79 57 9 -58 -92 -60 19 105 161 159 106 37 -20 -66 -97 -121 -153 -171 -158 -125 -92 -71 -43 -27 -48 -73 -85 -80 -75 -83 -68 -12
12396 -12 47 88 128 175 215 232 202 141 94 80 82 78 78 92 102 105 98 78 69 83 111 130 113 79 60 48 52 75 81 63 38 16 8 12 26 45 43 10 -30 -44
12379 -44 -14 35 68 97 131 142 138 147 145 115 77 44 19 -1 -17 -9 25 52 48 28 0 -50 -92 -91 -67 -64 -90 -112 -122 -137 -137 -107 -78 -46 10 63 86 78 27
12363 27 -49 -118 -174 -197 -181 -155 -128 -90 -45 -9 11 45 95 129 121 77 29 2 -4 -1 -4 -16 -23 -41 -82 -101 -74 -16 25 22 16 16 3 -20 -43 -65 -71 -48 -22
12346 -22 0 30 33 -11 -80 -137 -169 -167 -149 -153 -156 -155 -157 -154 -157 -156 -136 -100 -52 -30 -48 -58 -27 33 91 126 134 116 67 2 -54 -91 -102 -101 -116 -138 -131 -92 -50 -30 -39
12329 -39 -64 -73 -71 -65 -43 -28 -30 -36 -55 -85 -120 -149 -150 -134 -124 -116 -104 -91 -59 -15 23 62 91 105 115 124 114 92 78 68 65 76 92 104 98 56 -31 -127 -197 -226
12312 -226 -187 -98 -14 24 11 -10 -1 48 81 41 -32 -74 -60 -11 21 34 46 31 -26 -85 -108 -89 -32 60 167 254 306 307 263 211 174 159 168 185 174
12297 174 139 117 108 71 0 -46 -50 -50 -51 -63 -78 -65 -53 -66 -83 -95 -118 -157 -183 -188 -192 -212 -234 -244 -250 -238 -199 -156 -107 -71 -76 -95 -99 -89 -83 -92 -90 -74 -64 -61 -56
12279 -56 -36 -8 11 27 61 111 147 155 146 137 123 91 92 153 209 205 159 115 109 137 157 138 95 62 60 76 79 55 19 -21 -66 -92 -94 -87 -74 -55 -30 16 66 74
12263 74 57 34 -8 -45 -53 -47 -31 12 67 87 64 31 13 0 -36 -91 -121 -111 -81 -60 -60 -72 -97 -128 -140 -142 -153 -163 -154 -128 -110 -107 -115 -136 -160 -180 -198 -215
12246 -215 -228 -216 -184 -170 -160 -129 -103 -91 -95 -126 -162 -188 -229 -273 -288 -285 -299 -308 -265 -187 -124 -91 -67 -35 -18 -34 -45 -31 -17 -12 -7 5 23 40 61 69 30
12231 30 -37 -68 -57 -56 -76 -81 -49 1 39 62 108 197 282 301 256 199 147 104 94 101 93 89 96 98 94 86 75 52 23 -17 -72 -111 -127 -151 -198 -248 -273 -262 -217
12214 -217 -144 -59 34 142 233 254 206 148 129 142 161 183 205 205 168 115 81 73 56 25 -2 -15 -14 -41 -88 -104 -94 -74 -61 -53 -28 -5 -10 -24 -17 -5 -17
12199 -17 -33 -55 -125 -223 -273 -260 -218 -176 -159 -163 -180 -200 -194 -181 -171 -145 -121 -125 -153 -175 -180 -181 -185 -179 -134 -46 50 113 143 168 180 167 136 100 83 80 81 88 96 98 80
12181 80 40 -8 -66 -128 -175 -199 -210 -230 -242 -226 -183 -129 -85 -34 39 111 143 120 73 49 53 52 22 -17 -46 -49 -17 21 29 13 8 11 -8 -37 -45 -39 -40 -44 -34 -9
12164 -9 13 23 15 17 54 109 142 150 165 206 247 256 241 232 233 223 178 109 54 35 51 81 89 79 67 43 14 1 2 -8 -38 -66 -78 -87 -114 -154 -180 -192 -216 -247
12147 -247 -249 -222 -203 -206 -213 -200 -179 -165 -152 -155 -182 -207 -210 -160 -67 0 -8 -58 -90 -86 -58 -10 51 103 114 73 4 -40 -45 -32 -18 -19 -52 -97 -133 -139 -101 -50 -29
12131 -29 -55 -89 -89 -88 -115 -153 -200 -250 -275 -256 -209 -160 -113 -74 -43 -4 60 118 121 94 82 100 122 137 165 173 130 68 26 5 -23 -60 -83 -73 -52 -26 16
12115 16 37 21 -8 -40 -49 -37 -34 -27 20 105 181 213 192 128 69 38 25 43 91 145 158 90 -9 -80 -101 -84 -67 -47 -13 27 65 83 87 99 99 67 17
12099 17 -12 -9 4 2 -11 -32 -61 -86 -89 -58 -21 -19 -31 -27 -2 27 39 41 55 94 135 155 155 144 149 163 156 124 80 40 0 -31 -29 -1 24 36 36 28 -1 -25 12
12082 12 84 122 142 188 246 264 243 229 237 235 192 117 72 97 143 157 141 113 82 33 -27 -66 -82 -77 -68 -82 -92 -79 -59 -53 -61 -72 -77 -83 -109 -135 -119 -82 -65
12065 -65 -53 -20 23 64 102 113 92 71 57 31 -6 -48 -73 -79 -82 -71 -36 13 72 122 163 192 187 142 89 65 84 123 141 124 96 70 41 10 1 24 56
12050 56 68 46 23 36 76 101 84 40 8 8 17 5 -36 -82 -85 -50 -1 34 19 -35 -117 -201 -222 -149 -27 49 58 48 28 0 -8 -2 -18 -49 -56 -45 -56 -93
12034 -93 -108 -75 -30 0 36 74 66 46 70 123 171 175 136 88 54 54 60 51 26 -1 6 56 107 136 153 172 187 187 183 184 188 183 166 126 72 30 -2 -7 43 118 165
12016 165 162 111 42 -5 -15 21 106 186 192 124 56 27 12 -7 -21 -4 40 86 135 180 189 169 140 119 101 79 77 102 129 148 150 138 138 140 107 69 62 49
12000 49 2 -45 -47 -11 26 55 71 76 86 102 126 168 210 223 211 191 177 160 148 175 225 237 184 86 -23 -114 -169 -182 -166 -125 -79 -74 -78 -42 12 64
11985 64 85 51 5 -19 -29 -32 -26 -15 -1 3 -21 -53 -51 -30 -17 -12 -17 -26 -22 -12 -11 -22 -28 -37 -73 -112 -136 -143 -115 -64 -20 6 0 -46 -90 -90 -49 6 40 42 47 62 79
11967 79 96 97 94 114 152 193 219 222 205 150 70 8 -28 -45 -46 -22 34 103 167 207 207 203 209 218 220 208 184 153 136 126 116 134 175 206 237 271 281 248 204
11950 204 170 125 72 51 66 57 -2 -49 -46 -22 -1 6 -5 -29 -42 -22 11 17 0 -1 15 29 38 49 65 51 -8 -63 -84 -94 -102 -99 -84 -61 -30 11 39 30 -3
11934 -3 -48 -81 -90 -87 -80 -70 -69 -81 -94 -94 -96 -117 -158 -197 -201 -166 -137 -146 -156 -144 -128 -101 -67 -64 -75 -63 -48 -58 -72 -55 -24 2 30 38 44 78 98 93 91 83 68 59 63
11915 63 73 73 83 116 166 221 243 217 162 99 49 27 25 21 29 56 74 73 78 99 125 145 137 102 72 44 -3 -61 -95 -84 -57 -37 -29 -38 -63 -110 -159 -176 -149
11899 -149 -77 3 39 37 35 33 29 42 67 91 116 122 87 21 -54 -108 -121 -105 -81 -68 -69 -63 -45 -31 -10 15 20 4 2 19 29 14 -14 -32 -31 -40 -71 -92 -70 -17
11882 -17 19 19 0 -27 -62 -113 -172 -206 -182 -102 -36 -16 -12 -25 -49 -47 0 65 108 124 93 17 -47 -69 -51 -14 22 36 24 1 -35 -83 -103 -85 -59 -24
11867 -24 27 80 112 98 30 -58 -123 -159 -181 -174 -145 -121 -101 -66 -4 63 112 122 81 30 11 24 46 41 13 -10 -12 4 26 55 100 148 188 217 242 270
11851 270 275 256 253 267 263 234 184 111 32 -16 -30 -39 -58 -83 -92 -74 -55 -45 -34 -38 -69 -119 -156 -176 -180 -148 -96 -58 -42 -35 -37 -36 -18 4 21 38 56 75 85
11835 85 73 43 28 55 96 123 129 117 107 96 71 35 18 20 23 34 57 70 45 4 -1 19 40 69 108 146 178 182 152 141 169 185 157 99 42 1 -20
11819 -20 -7 29 25 -25 -70 -98 -112 -116 -118 -130 -163 -196 -213 -223 -240 -263 -264 -222 -150 -67 -2 13 -27 -73 -66 -28 -18 -43 -81 -99 -79 -50 -27 -6 -1 -24 -58 -72
11803 -72 -64 -44 -15 -2 -5 -3 -3 -18 -24 -8 5 9 4 -15 -42 -72 -95 -103 -111 -109 -76 -33 -15 -36 -72 -72 -27 39 99 114 86 50 34 53 91 126 155 165 163 138 67
11786 67 -23 -100 -143 -146 -111 -62 -11 47 88 100 115 148 179 187 186 178 147 106 76 49 16 -15 -53 -95 -115 -115 -93 -56 -35 -54 -112 -178 -193 -168 -169 -192 -179 -124
11770 -124 -63 -10 22 20 -18 -75 -118 -142 -146 -119 -76 -22 43 90 89 55 22 3 2 19 39 58 88 121 145 155 139 112 107 121 138 164 192 196 168 126 93
11754 93 70 53 45 41 47 63 59 29 6 16 59 109 115 69 21 16 54 102 127 122 102 82 68 52 24 -8 -20 -6 0 -9 -23 -50 -73 -74 -56 -24 27 83 113 119
11737 119 130 145 119 43 -31 -66 -68 -60 -45 -35 -30 -12 14 46 81 108 125 127 110 85 79 75 42 -5 -50 -79 -76 -60 -72 -114 -143 -150 -145 -118 -81 -53 -32 -7 25
11720 25 60 81 85 94 116 128 119 74 2 -34 -8 57 129 201 266 274 197 100 45 26 15 0 -10 -26 -48 -73 -117 -170 -212 -236 -213 -156 -98 -41 -19 -53 -109
11705 -109 -156 -183 -186 -168 -119 -50 -1 8 -1 5 39 76 104 110 100 90 68 28 -8 -30 -43 -37 -17 -19 -54 -93 -117 -130 -132 -121 -97 -65 -53 -57 -41 -7 23 29 15
11688 15 15 26 34 37 14 -41 -113 -168 -184 -161 -132 -130 -142 -148 -161 -171 -167 -163 -147 -102 -55 -47 -70 -88 -88 -72 -54 -47 -39 -20 2 2 -43 -126 -191 -189 -145 -116 -122 -143 -157 -158
11670 -158 -139 -96 -44 -16 -41 -76 -77 -77 -106 -145 -183 -223 -248 -250 -239 -219 -180 -99 10 110 189 235 226 191 178 187 196 204 204 192 187 184 146 82 41 26 27 40 58
11654 58 77 95 120 147 145 110 79 85 109 97 31 -26 -19 22 59 102 138 136 104 62 24 11 23 41 43 31 0 -70 -161 -226 -243 -211 -141 -68 -24 -1 26
11638 26 47 19 -33 -45 -2 52 67 50 29 -12 -61 -99 -141 -149 -86 14 75 69 26 -24 -60 -78 -89 -98 -114 -132 -156 -175 -161 -119 -66 0 69 118 134 115
11623 115 80 45 -3 -48 -62 -51 -6 61 93 68 36 11 -28 -58 -56 -46 -44 -50 -68 -101 -131 -118 -48 42 90 84 84 111 127 95 27 -22 -31 -2 52 121 182
11607 182 200 172 137 105 70 37 2 -37 -85 -151 -201 -188 -133 -106 -119 -108 -62 -31 -31 -46 -58 -82 -128 -163 -150 -100 -48 -8 10 20 23 -5 -56 -101 -125
11592 -125 -127 -134 -152 -154 -126 -104 -109 -110 -80 -27 9 31 79 160 253 303 287 261 258 236 181 128 90 80 104 125 112 72 32 -7 -65 -122 -161 -197 -234 -248 -203
11577 -203 -113 -19 44 54 19 -20 -42 -54 -59 -64 -90 -134 -166 -162 -133 -96 -73 -70 -71 -65 -48 -24 -5 -11 -61 -106 -88 -36 13 65 100 125 167 211 234 235 211 174
11561 174 154 158 172 183 156 74 -10 -52 -64 -69 -85 -111 -113 -90 -56 9 99 160 175 164 139 100 48 -6 -34 -17 33 102 171 207 185 126 57 -8 -32 -2
11545 -2 40 76 106 144 192 206 169 106 62 49 30 4 -14 -41 -56 -32 -7 -25 -73 -115 -155 -188 -181 -147 -104 -54 -21 -17 -41 -84 -107 -90 -55 -20 15 40
11530 40 53 52 29 11 15 19 11 13 26 22 -2 -36 -69 -84 -87 -90 -101 -138 -196 -226 -207 -170 -153 -168 -173 -124 -54 -7 16 0 -66 -129 -143 -115 -80 -51 -3 53 88
11514 88 101 82 44 14 -18 -63 -110 -126 -103 -82 -83 -87 -78 -62 -45 -18 14 45 73 74 53 46 61 87 109 94 43 -10 -42 -33 -2 2 -36 -101 -156 -169 -150 -115
11497 -115 -78 -63 -68 -67 -39 -1 24 53 105 155 168 157 142 117 85 61 45 24 5 0 -2 -19 -40 -44 -14 29 60 62 59 64 56 35 26 37 54 38 -5 -18 9
11481 9 28 20 -1 -25 -46 -61 -52 -16 40 108 166 198 200 166 91 -2 -60 -67 -62 -75 -86 -69 -53 -85 -125 -120 -93 -73 -74 -84 -80 -78 -86 -85 -60 -24 -4 -8 -35 -72 -111
11464 -111 -159 -210 -254 -278 -273 -261 -259 -261 -265 -249 -202 -156 -127 -116 -103 -58 -5 14 5 -17 -51 -95 -133 -166 -202 -227 -226 -192 -148 -120 -94 -81 -95 -110 -115 -123 -117 -85 -57
11447 -57 -41 -12 14 5 -31 -66 -97 -116 -101 -69 -45 -35 -24 12 83 165 209 203 181 157 123 71 -1 -73 -119 -143 -150 -149 -151 -141 -82 17 109 149 159 168 156 100
11431 100 21 -44 -68 -47 -13 7 24 55 88 103 111 121 127 111 81 63 60 52 33 3 -50 -115 -130 -71 7 62 87 90 84 84 95 115 144 162 169 173 142 100 89
11414 89 95 97 95 93 84 55 -2 -74 -123 -149 -175 -192 -180 -144 -108 -97 -116 -139 -141 -130 -145 -182 -173 -125 -99 -100 -120 -170 -225 -272 -315 -324 -279 -223 -186 -171 -187 -216 -222 -185
11397 -185 -109 -22 36 45 15 -26 -55 -67 -67 -58 -58 -64 -65 -75 -110 -168 -210 -194 -139 -79 -33 -14 -15 -25 -34 -30 -4 31 30 -16 -68 -110 -141 -163 -178 -167 -126 -74 -29
11381 -29 -4 5 0 -27 -59 -70 -64 -75 -113 -145 -152 -163 -182 -172 -147 -129 -98 -58 -23 5 22 15 -21 -51 -41 -21 -12 -7 0 30 84 133 173 203 222 227 226 227 198 149
11364 149 132 155 202 232 182 64 -36 -61 -51 -59 -75 -89 -108 -143 -200 -266 -306 -308 -293 -263 -222 -184 -159 -142 -124 -125 -149 -162 -116 -19 69 124 146 146 143 133
11349 133 114 114 151 194 209 198 171 153 153 146 136 147 161 155 128 107 106 85 36 1 -8 21 96 164 193 189 151 94 44 6 -23 -45 -61 -36 40 123 176 216
11333 216 262 297 306 292 277 276 291 312 308 263 191 122 79 50 45 60 71 89 117 150 176 172 148 122 108 111 103 71 51 59 59 62 108 179 222 218 175 107 31 -37
11316 -37 -63 -21 49 96 95 65 59 96 149 194 221 222 212 191 144 92 74 83 86 77 77 98 125 143 137 110 56 -33 -111 -136 -115 -60 -12 2 -9 -34 -50 -50 -51 -85
11299 -85 -145 -183 -166 -119 -98 -113 -117 -87 -49 -26 0 27 42 57 82 118 142 131 106 80 45 3 -12 20 85 146 185 211 225 206 171 165 176 161 114 52
11283 52 -1 -44 -94 -146 -176 -177 -166 -145 -106 -60 -27 -19 -33 -59 -82 -98 -88 -33 21 15 -26 -43 -30 -14 -3 13 65 127 146 132 117 123 150 172 179 172 143 95
11267 95 35 -23 -52 -46 -36 -38 -44 -39 -20 -4 -21 -59 -86 -104 -117 -148 -210 -256 -262 -237 -194 -149 -117 -99 -80 -60 -38 -2 45 78 64 12 -55 -111 -123 -109 -99
11252 -99 -77 -30 25 51 28 1 -1 -1 -24 -53 -62 -55 -37 -19 -27 -46 -62 -91 -140 -185 -192 -168 -142 -119 -91 -55 -19 21 56 50 7 -21 -21 -17 -12 11 55 81 62 43
11235 43 61 95 109 78 16 -39 -61 -34 13 52 73 63 37 9 -39 -97 -139 -159 -154 -142 -134 -119 -102 -99 -109 -101 -61 -15 7 -2 -35 -66 -78 -57 -21 1 7 -5
11219 -5 -44 -87 -114 -132 -149 -170 -195 -199 -149 -69 -17 -8 -28 -55 -70 -81 -102 -115 -122 -139 -165 -195 -204 -184 -171 -180 -185 -161 -133 -131 -128 -100 -58 -28 -23 -33 -57 -89 -110 -102
11202 -102 -66 -32 -17 9 48 67 74 71 66 74 76 100 160 224 270 284 258 205 126 57 69 122 113 43 -40 -116 -171 -208 -242 -278 -295 -282 -248 -185 -111 -92 -130
11186 -130 -170 -172 -135 -82 -31 -12 -31 -52 -66 -79 -88 -70 -17 47 95 111 111 123 141 152 128 55 -20 -46 -35 -44 -63 -54 -24 13 57 99 121 115 83 30 -26
11170 -26 -64 -67 -58 -62 -60 -53 -39 1 51 85 109 120 111 89 53 8 -32 -84 -150 -186 -191 -197 -211 -223 -212 -179 -156 -162 -185 -190 -158 -96 -36 -20 -50 -86 -109 -128 -161 -186
11153 -186 -183 -156 -116 -70 -14 42 54 20 -8 -26 -64 -105 -113 -96 -88 -96 -97 -83 -73 -53 2 81 131 134 133 143 134 96 55 48 76 96 90 79 91 99 63 1 -67 -129
11136 -129 -163 -180 -188 -177 -174 -194 -225 -253 -269 -282 -301 -321 -319 -290 -246 -175 -71 30 85 101 94 55 6 -21 -37 -69 -108 -127 -130 -142 -158 -163 -150 -122 -121 -162 -202
11121 -202 -234 -247 -220 -167 -116 -101 -123 -149 -175 -211 -240 -242 -221 -175 -93 5 84 126 145 142 104 33 -34 -49 -21 8 19 26 51 71 60 37 19 22 60 107
11105 107 128 113 99 115 129 135 156 168 157 144 145 165 186 191 164 116 72 49 60 69 42 8 9 47 80 76 59 58 68 77 71 42 12 1 -8 -20 -12 17 18 -21
11088 -21 -45 -37 -8 19 15 -8 -29 -46 -54 -44 -25 -24 -41 -43 -26 -24 -35 -23 15 53 73 73 31 -47 -131 -188 -175 -107 -36 21 70 111 141 153 151 134 94 57 56
11072 56 90 147 193 188 144 99 86 101 117 113 88 49 7 -1 25 53 47 8 -13 -4 0 -9 -32 -74 -130 -169 -171 -127 -53 -2 -17 -80 -152 -193 -186 -157 -120 -80 -64
11055 -64 -54 -36 -41 -79 -120 -131 -103 -45 8 5 -44 -94 -112 -117 -149 -197 -236 -259 -262 -255 -247 -242 -217 -137 -43 -2 -11 -25 -34 -40 -34 -33 -63 -108 -128 -127 -128 -128 -102 -51 -4 19
11038 19 10 -23 -57 -75 -69 -21 48 101 128 144 146 130 100 63 29 27 42 32 15 20 48 58 22 -19 -39 -47 -43 -33 -23 -5 31 73 92 90 76 45 6 -19 -26
11021 -26 -22 3 46 66 40 7 2 -3 -35 -64 -70 -79 -100 -128 -149 -142 -118 -91 -63 -50 -35 5 51 73 75 75 83 104 116 118 134 159 158 95 2 -64 -104 -108 -68 -5 64
11004 64 119 146 164 179 168 107 8 -88 -154 -200 -231 -240 -207 -142 -102 -99 -92 -67 -40 -23 -6 3 0 12 47 72 81 84 69 43 25 22 18 -7 -40 -60 -82 -119 -167
10987 -167 -208 -229 -216 -161 -98 -51 -23 -23 -51 -91 -117 -127 -130 -119 -84 -24 31 60 54 27 5 -14 -37 -39 -17 -10 -29 -65 -98 -106 -100 -89 -71 -58 -40 -2 70 161
10971 161 198 174 149 140 125 90 50 42 81 130 154 161 174 190 183 144 89 38 10 18 38 31 -25 -103 -147 -162 -164 -130 -60 24 78 74 21 -57 -104 -105 -91 -60 -32
10954 -32 -41 -40 18 78 83 61 54 72 102 121 91 1 -106 -179 -188 -155 -93 -9 62 110 128 115 103 116 140 156 169 148 72 -6 -53 -76 -65 -36 -26 -31 -26 -19
10938 -19 -31 -59 -67 -31 13 24 16 14 39 92 127 109 59 9 -28 -72 -132 -192 -229 -232 -212 -202 -227 -254 -234 -178 -137 -130 -139 -140 -120 -97 -81 -58 -31 -30 -74 -140 -179
10922 -179 -148 -60 27 105 178 215 198 130 33 -62 -119 -137 -142 -132 -101 -41 26 52 39 10 -11 -2 42 107 143 123 75 25 -24 -83 -147 -187 -179 -139 -111 -94
10907 -94 -51 0 26 37 46 51 36 16 21 34 48 58 41 20 27 65 116 149 155 135 95 54 32 37 44 38 20 -3 0 61 126 136 106 65 41 50 82 116 143 153
10890 153 127 81 42 29 32 16 -9 -30 -39 -39 -48 -43 -2 54 89 90 77 56 31 12 -8 -26 -41 -52 -42 -16 0 27 68 90 94 84 69 69 76 89 93 86 80 48
10873 48 -13 -73 -113 -145 -173 -153 -77 -2 31 31 27 39 56 76 102 103 68 22 -9 -15 -2 23 61 84 64 19 -24 -62 -78 -63 -31 -6 1 12 45 81 92
10857 92 78 71 89 119 171 248 307 326 308 250 184 139 104 71 51 37 7 -31 -41 -31 -43 -69 -92 -125 -151 -148 -130 -132 -156 -188 -227 -247 -234 -207 -188 -179 -152
10841 -152 -97 -28 38 75 83 67 32 -18 -87 -149 -190 -207 -211 -215 -201 -144 -49 36 59 34 -2 -28 -45 -70 -92 -120 -139 -114 -69 -45 -37 -42 -64 -104 -139 -152 -158
10826 -158 -172 -193 -208 -189 -137 -86 -50 -19 -4 -28 -79 -91 -31 51 86 65 23 5 18 37 63 91 110 111 93 67 34 17 54 117 172 201 198 186 174
10811 174 155 170 238 291 279 215 168 179 222 242 220 199 198 166 68 -53 -138 -167 -152 -114 -78 -52 -35 -28 -17 10 25 20 27 40 38 25 19 31 69 119 150
10795 150 158 140 94 27 -35 -39 25 100 145 157 157 160 165 163 150 114 47 -16 -53 -69 -48 -4 24 37 44 50 27 -39 -101 -118 -103 -76 -44 -23 -13 0 11 22
10779 22 28 21 37 95 142 145 119 79 47 65 131 188 185 151 147 178 221 261 275 239 165 95 34 -23 -70 -110 -138 -155 -165 -180 -206 -235 -261 -278 -299 -330 -345
10763 -345 -324 -277 -250 -260 -254 -221 -201 -203 -202 -206 -223 -232 -229 -213 -175 -116 -59 -17 24 79 119 118 95 82 65 11 -47 -41 29 87 91 59 3 -44 -64 -100 -174 -236 -240
10747 -240 -187 -116 -78 -76 -73 -72 -89 -80 -8 85 132 127 92 34 -39 -115 -162 -160 -119 -57 -7 10 2 -25 -65 -113 -156 -159 -119 -70 -19 40 82 88 62 20 -20 -50 -68
10730 -68 -84 -95 -112 -143 -169 -183 -188 -172 -145 -128 -112 -72 -22 2 -14 -63 -112 -152 -167 -150 -122 -79 -13 39 50 44 60 95 126 157 170 134 81 33 -5 -32
10715 -32 -59 -81 -75 -49 -36 -37 -49 -77 -91 -73 -22 60 134 165 152 129 119 103 71 24 -31 -81 -114 -118 -109 -115 -151 -173 -136 -98 -116 -165 -197 -191 -168 -161 -150 -110
10699 -110 -62 -25 -17 -35 -35 -13 0 -16 -61 -100 -99 -50 20 68 67 42 31 28 6 -24 -41 -45 -49 -45 -56 -106 -148 -150 -141 -137 -143 -162 -162 -112 -31 36 54 26 -1 -20 -47
10682 -47 -69 -44 9 48 70 91 136 201 252 276 268 214 138 91 74 67 82 118 153 159 141 120 94 47 -17 -57 -57 -44 -38 -48 -73 -114 -151 -149 -104 -62 -47 -37
10665 -37 -33 -41 -30 13 66 81 44 -14 -74 -129 -176 -219 -257 -285 -299 -289 -264 -230 -187 -154 -145 -134 -114 -119 -170 -225 -233 -196 -143 -103 -95 -116 -142 -155 -171 -199 -218 -213
10649 -213 -178 -121 -78 -66 -82 -105 -110 -113 -118 -104 -68 -13 47 95 104 59 -4 -49 -81 -122 -175 -231 -271 -281 -260 -229 -205 -174 -133 -93 -55 -22 -6 -12 -23 -33 -41
10634 -41 -29 18 72 78 56 48 51 54 48 41 35 16 -11 -38 -67 -103 -132 -147 -143 -131 -148 -170 -146 -101 -64 -40 -26 11 79 125 114 58 -2 -23 -6 19 39 36 1
10617 1 -34 -37 -5 40 74 79 62 31 -6 -31 -43 -67 -97 -130 -165 -176 -148 -108 -101 -113 -125 -143 -138 -112 -84 -36 7 14 -19 -63 -88 -128 -208 -285 -326 -341 -347 -340 -308
10601 -308 -250 -190 -149 -132 -127 -107 -63 -6 35 51 57 65 77 83 75 50 28 24 24 26 19 9 32 72 103 124 134 142 161 177 164 118 69 44 47 53 24 -24 -50 -45 -41
10583 -41 -53 -82 -123 -171 -238 -315 -357 -347 -303 -244 -179 -121 -78 -62 -93 -157 -213 -232 -206 -157 -124 -107 -73 -19 27 53 79 118 140 118 56 -9 -60 -103 -130
10568 -130 -117 -69 -25 9 55 114 177 225 248 250 218 141 53 9 4 5 15 32 51 69 70 65 70 75 76 88 109 128 141 140 111 60 30 19 -22 -92 -147 -171 -158
10552 -158 -109 -45 4 22 11 -4 6 27 20 -10 -24 2 48 77 86 112 163 205 198 157 128 122 127 125 115 111 98 64 13 -45 -74 -51 -28 -46 -71 -71 -36 12
10536 12 28 7 -18 -22 2 32 37 32 24 8 -6 -22 -38 -49 -69 -85 -86 -73 -48 -30 -12 2 -1 4 33 58 61 58 71 114 171 211 219 191 153 152 190 226 236 197
10519 197 120 60 16 -45 -111 -152 -156 -114 -43 18 51 57 58 86 117 114 98 93 101 108 80 20 -21 -26 -20 -24 -32 -25 3 49 105 145 144 101 50 27 17 -2 -37 -83 -119
10501 -119 -142 -170 -211 -247 -227 -123 16 108 122 94 71 77 105 137 162 167 145 87 20 -26 -54 -64 -45 -14 0 10 27 43 49 40 45 65 60 31 21 33
10486 33 31 21 34 57 83 118 155 181 188 169 126 72 21 -21 -51 -68 -64 -52 -61 -88 -122 -143 -124 -91 -65 -30 10 32 50 105 194 278 334 357 328 243 140
10470 140 66 35 28 27 35 38 2 -51 -76 -90 -111 -123 -130 -120 -69 0 39 19 -46 -117 -149 -131 -72 -1 33 39 52 54 26 -17 -66 -98 -102 -91 -64 -24 -6 -30
10454 -30 -77 -129 -163 -183 -188 -169 -151 -148 -148 -141 -124 -108 -102 -94 -57 19 95 123 123 114 102 74 7 -78 -130 -116 -38 62 124 118 80 56 44 25 14 56 127 161 140
10438 140 87 51 49 55 61 60 39 18 17 36 64 71 43 -9 -63 -83 -67 -36 -7 13 39 50 54 76 90 99 113 100 55 16 -10 -50 -88 -67 -3 38 42 24 4
10421 4 4 7 -32 -111 -175 -190 -165 -109 -50 -22 -26 -53 -93 -112 -90 -41 7 46 64 49 21 4 -13 -34 -49 -58 -56 -29 14 42 60 96 105 58 -4 -40 -31 25 102
10405 102 158 174 172 173 164 143 117 90 75 70 73 80 69 44 35 36 9 -34 -75 -132 -188 -196 -174 -155 -147 -147 -141 -110 -68 -47 -60 -92 -116 -128 -126 -101 -57 -17 -3 -21 -56
10387 -56 -76 -76 -82 -90 -105 -139 -164 -161 -142 -116 -88 -72 -82 -113 -134 -108 -51 -9 -16 -74 -131 -151 -149 -133 -98 -34 31 60 67 87 100 68 10 -33 -58 -69 -77 -102 -141
10371 -141 -167 -161 -125 -101 -113 -143 -179 -204 -202 -194 -188 -168 -131 -88 -64 -73 -92 -80 -51 -31 -18 -18 -39 -52 -47 -44 -32 4 46 61 34 -10 -28 -21 -13 -8 -5 3 37 99 158
10353 158 186 192 176 137 108 98 77 40 24 51 84 75 20 -47 -78 -55 -16 10 7 -16 -32 -14 42 108 155 163 138 114 97 84 83 88 90 105 132 148 154 168
10337 168 190 183 145 141 186 224 214 176 134 82 46 43 54 78 109 127 128 119 92 54 33 29 39 77 139 196 214 189 138 90 80 87 70 44 51 83 113 139
10321 139 168 182 170 156 160 184 199 192 186 168 95 -26 -131 -160 -121 -61 -31 -11 32 60 43 19 5 -12 -34 -67 -110 -137 -130 -105 -83 -59 -35 -33 -44 -51
10306 -51 -55 -49 -47 -77 -118 -134 -124 -108 -108 -109 -76 -25 -8 -27 -32 -4 22 43 57 61 84 127 151 123 55 -25 -91 -121 -117 -84 -33 19 54 52 49 78 108 90 26 -25
10289 -25 -51 -68 -51 13 108 172 157 96 21 -52 -94 -92 -68 -43 -22 -4 7 3 -27 -103 -194 -235 -205 -142 -83 -39 8 65 103 109 92 60 44 64 87 92 95
10273 95 91 69 31 -20 -58 -64 -48 -31 -24 -23 4 72 147 186 170 122 89 73 59 58 73 96 114 110 81 75 121 188 258 319 350 340 295 236 188 176 190 196 183
10257 183 147 93 48 19 3 -10 -32 -52 -44 -8 29 51 40 -3 -48 -76 -112 -161 -176 -141 -76 -14 19 41 49 35 9 -18 -48 -67 -66 -70 -83 -80 -69 -56 -51
10241 -51 -63 -65 -33 6 21 13 0 16 74 130 170 202 217 202 153 82 6 -66 -127 -168 -185 -164 -125 -112 -123 -146 -170 -168 -134 -80 -26 15 36 7 -55 -95
10226 -95 -88 -57 -53 -99 -153 -175 -161 -132 -98 -38 37 81 79 48 7 -27 -52 -73 -73 -46 -25 -34 -59 -81 -87 -64 -26 -12 -36 -79 -112 -105 -53 14 67 81 62 49
10210 49 56 56 45 50 77 92 82 73 92 138 197 250 271 265 248 224 208 179 123 69 29 -2 -26 -41 -33 7 83 152 155 95 20 -39 -78 -90 -57 -12 -1 -11
10194 -11 -15 -12 -5 9 23 6 -33 -62 -82 -104 -131 -163 -188 -183 -136 -67 -13 -8 -59 -123 -145 -109 -58 -37 -35 -27 -19 -18 -14 -6 -23 -63 -97 -100 -56 12 74 122 142 152 181
10176 181 219 252 265 254 228 188 163 175 206 225 205 152 83 5 -55 -69 -29 29 53 8 -77 -127 -118 -106 -120 -130 -110 -77 -48 -15 21 35 10 -38 -98
10161 -98 -172 -231 -262 -294 -318 -316 -298 -297 -314 -315 -282 -224 -171 -148 -146 -158 -192 -215 -183 -111 -55 -28 -10 12 39 63 99 153 213 254 264 257 235 192 147 109 81
10146 81 78 109 162 204 206 187 174 167 172 180 184 206 225 218 185 133 92 75 58 31 24 44 44 -9 -78 -94 -66 -45 -27 -8 -4 -14 -35 -54 -43 -7 9 -21 -61 -52
10129 -52 -14 -10 -59 -96 -67 -10 37 77 88 80 89 111 117 102 60 5 -24 -8 56 118 120 84 57 40 8 -40 -66 -56 -41 -46 -70 -82 -39 40 117 165 168 138
10113 138 110 95 68 22 -24 -69 -81 -47 -8 11 25 47 85 132 147 104 44 6 -14 -31 -33 -34 -55 -82 -102 -107 -105 -108 -102 -70 -21 -3 -25 -44 -63 -107 -163
10097 -163 -201 -198 -162 -121 -98 -78 -41 4 30 25 -7 -46 -62 -40 11 45 28 5 4 10 23 46 90 161 229 248 225 198 154 67 -28 -71 -72 -85 -102 -97 -84
10081 -84 -69 -44 -31 -47 -60 -52 -53 -88 -143 -186 -202 -203 -198 -191 -179 -163 -144 -101 -42 -18 -19 -5 -2 -42 -99 -148 -194 -230 -249 -271 -309 -348 -361 -339 -284 -205 -122 -60
10065 -60 -21 1 9 22 45 72 93 78 33 -25 -70 -48 29 89 95 67 27 -22 -57 -66 -53 -18 31 81 111 120 114 95 76 55 34 14 -14 -41 -50 -37 5 74
10049 74 121 109 65 11 -43 -67 -38 15 70 126 189 232 232 188 113 31 -27 -37 0 59 123 147 90 -3 -47 -27 2 19 23 13 11 31 76 141 191 204
10034 204 168 83 0 -49 -67 -46 -11 1 -7 -21 -39 -94 -175 -220 -207 -177 -160 -141 -112 -93 -88 -55 12 75 114 125 123 117 97 88 91 58 -5 -53 -64 -48 -41 -53
10018 -53 -72 -92 -123 -166 -202 -221 -239 -257 -247 -198 -130 -64 1 68 130 174 187 183 169 144 117 71 21 14 21 0 -29 -36 -31 -40 -36 0 30 37 43 66 89 102 114
10001 114 123 138 161 180 178 121 31 -50 -127 -199 -252 -279 -283 -270 -254 -234 -206 -201 -247 -315 -347 -317 -256 -190 -98 13 100 146 168 160 115 72 63 62 50 44 51 70
9985 70 101 113 77 12 -41 -70 -68 -38 -1 20 22 41 101 170 190 161 136 112 68 33 17 9 26 79 145 202 217 166 78 16 20 61 86 109 160 220 275
9969 275 303 284 245 225 218 194 155 104 47 3 -27 -60 -102 -143 -152 -143 -145 -151 -138 -114 -112 -141 -164 -174 -189 -190 -148 -71 -3 21 -2 -61 -117 -158 -186 -193 -187 -182 -185 -198
9953 -198 -206 -207 -212 -216 -202 -172 -151 -164 -210 -244 -242 -222 -185 -149 -141 -126 -82 -25 25 51 72 92 97 69 4 -41 -47 -43 -35 -43 -83 -148 -199 -204 -188 -161 -109 -53 -24 -30 -54
9935 -54 -66 -62 -33 37 122 173 177 143 85 35 27 68 131 174 164 126 99 79 51 22 -4 -16 -9 -10 -20 -42 -81 -101 -85 -62 -62 -82 -84 -70 -64 -57 -57 -61 -43 -9 13
9918 13 17 8 9 38 58 40 20 43 95 122 105 80 85 116 136 116 92 104 126 120 86 39 -15 -49 -40 -9 19 61 116 149 152 150 136 103 68 49 46 16 -26 -36
9901 -36 -9 41 89 101 71 34 29 29 -8 -61 -97 -110 -100 -66 -24 6 20 9 -30 -84 -132 -159 -164 -152 -102 -3 81 114 128 127 102 89 98 106 107 88 48 -11 -75
9884 -75 -112 -117 -106 -98 -98 -116 -145 -142 -105 -60 -40 -60 -106 -156 -176 -155 -115 -59 -7 19 22 0 -53 -122 -164 -155 -129 -129 -144 -175 -231 -281 -318 -331 -302 -243 -181 -135 -96
9868 -96 -83 -99 -116 -154 -201 -220 -207 -164 -108 -45 7 47 93 133 158 170 177 176 157 120 72 33 17 5 -16 -43 -55 -46 -26 -1 19 34 50 80 124 154 131
9852 131 55 -19 -48 -57 -81 -100 -104 -92 -61 -25 -3 8 39 74 86 84 75 52 15 -8 -13 -28 -71 -138 -200 -224 -204 -173 -160 -159 -158 -174 -209 -233 -233 -211 -156 -66 22
9836 22 59 42 18 4 -18 -45 -41 -17 -19 -33 -14 34 78 108 117 86 38 -11 -45 -28 9 41 84 129 138 109 102 130 143 133 117 91 45 5 18 64 96 108
9819 108 111 142 194 197 133 50 -9 -32 -25 -10 5 19 8 -42 -88 -85 -53 -37 -50 -76 -95 -95 -65 -21 19 58 106 156 178 170 155 124 83 61 44 3 -61 -123
9803 -123 -158 -181 -209 -225 -207 -163 -143 -155 -165 -169 -157 -118 -73 -39 -20 -34 -88 -162 -219 -241 -217 -157 -104 -80 -66 -42 -2 51 119 169 158 116 89 58 15
9788 15 -16 -14 30 99 165 199 188 183 216 252 246 219 211 226 239 228 196 179 188 185 167 169 191 215 231 224 186 133 81 27 -15 -38 -56 -52 -4 67 113 121 121 114 80
9771 80 31 -19 -60 -80 -77 -61 -60 -97 -160 -216 -247 -236 -190 -155 -159 -174 -192 -219 -241 -242 -220 -175 -111 -51 -16 15 41 38 14 -19 -37 -25 3 23 28 30 32 40 59 78
9754 78 95 118 133 109 64 47 44 27 -13 -78 -137 -171 -182 -178 -170 -150 -122 -91 -56 -22 11 39 61 88 91 55 21 15 30 46 43 31 42 90 139 143 108 51 -7
9738 -7 -44 -74 -102 -112 -105 -98 -103 -93 -45 19 86 145 177 174 136 92 79 97 126 156 178 177 165 158 147 135 132 134 135 147 170 188 180 158 141 111 64 48 69 66 28
9720 28 -14 -45 -50 -32 -27 -44 -55 -64 -87 -118 -139 -141 -149 -175 -178 -161 -142 -86 0 74 116 122 90 34 -11 -22 -11 -6 -22 -55 -83 -81 -66 -76 -105 -128 -136 -129 -107 -90 -101
9703 -101 -117 -119 -110 -77 -24 3 -1 -6 -27 -48 -48 -52 -52 -26 13 52 80 114 151 154 117 71 46 46 66 95 113 117 123 125 126 129 101 54 30 18 16 43 88 114 94 47
9685 47 5 -16 2 47 80 103 109 83 48 19 -4 -21 -35 -27 4 18 -5 -66 -158 -254 -303 -268 -174 -85 -41 -25 0 29 38 43 68 100 118 127 131 107 64 25
9669 25 -14 -42 -28 0 17 39 61 65 68 83 75 25 -39 -92 -123 -134 -138 -130 -102 -71 -50 -42 -42 -26 12 33 32 43 67 94 108 88 45 11 10 27 44 68 92 85
9652 85 47 19 26 47 59 66 64 57 55 56 65 75 47 -15 -91 -149 -157 -138 -136 -174 -211 -196 -138 -69 -40 -57 -82 -115 -149 -163 -152 -116 -84 -82 -83 -62 -27 5 29 42 40
9635 40 18 -23 -85 -152 -184 -148 -52 55 138 173 155 116 102 118 119 84 31 -10 -39 -79 -130 -165 -168 -153 -141 -116 -88 -92 -110 -120 -122 -119 -129 -130 -100 -72 -62 -67
9619 -67 -79 -85 -88 -78 -54 -33 -28 -56 -102 -142 -167 -163 -141 -108 -50 24 84 110 88 14 -64 -103 -111 -125 -154 -136 -65 -11 6 6 -5 -16 -2 14 7 -8 -32 -59 -55
9602 -55 0 82 147 163 120 55 8 -10 1 10 0 -11 -11 -1 13 31 48 76 101 65 -29 -102 -116 -88 -69 -85 -107 -129 -153 -153 -127 -76 -19 13 27 8 -47
9586 -47 -99 -120 -103 -67 -49 -46 -24 14 38 34 24 30 52 76 89 77 45 13 -13 -54 -114 -158 -162 -140 -100 -46 6 31 10 -31 -69 -111 -156 -178 -167 -146 -125
9571 -125 -95 -44 7 23 -8 -62 -76 -32 22 68 93 82 46 6 -14 -21 -37 -32 12 62 99 121 105 51 3 -14 -25 -42 -32 2 33 55 79 114 162 207
9555 207 231 224 184 130 93 71 46 9 -44 -109 -168 -192 -176 -154 -134 -100 -67 -48 -52 -84 -99 -73 -26 8 24 61 131 206 252 241 197 141 76 18 -9 6
9540 6 46 80 87 62 40 24 -1 -10 9 27 31 45 82 126 145 120 78 48 13 -17 -23 -19 -13 -4 -8 -32 -64 -100 -125 -122 -99 -89 -104 -106 -91 -75 -55 -26 0 -15 -75
9523 -75 -148 -211 -225 -194 -165 -157 -158 -134 -95 -66 -51 -44 -38 -25 -11 -12 -26 -44 -72 -106 -127 -120 -89 -45 17 88 146 185 203 212 203 186 184 176 154 143 151 169 189 193 178
9505 178 149 110 98 128 153 148 136 134 125 90 66 73 90 110 115 67 -20 -89 -108 -90 -53 -20 -6 -20 -40 -36 -23 -10 5 -1 -36 -75 -91 -84 -80 -78 -53 -4 41 77
9488 77 89 79 52 3 -26 6 68 128 178 216 235 234 207 151 89 29 -11 -25 -36 -34 9 85 154 179 146 80 47 72 105 98 56 0 -59 -86 -74 -36 10
9473 10 56 93 113 121 135 150 147 125 110 105 101 100 100 88 63 20 -39 -79 -81 -76 -76 -69 -66 -69 -55 -35 -47 -77 -89 -65 -35 -34 -54 -84 -109 -106 -96 -104 -113 -82 -9 52 75
9454 75 64 42 53 111 181 212 196 149 65 -53 -193 -316 -366 -365 -364 -375 -377 -319 -189 -57 12 26 17 10 10 15 34 54 50 39 37 44 56 64 72 81 81 66 44 22
9438 22 4 -12 -31 -56 -75 -86 -97 -112 -113 -87 -57 -29 -5 -21 -63 -84 -69 -21 12 15 12 32 88 146 169 162 160 176 196 225 252 263 261 227 168 120 89 74
9421 74 88 109 106 91 86 97 102 83 62 67 87 84 53 -3 -77 -123 -136 -154 -173 -157 -105 -78 -108 -147 -179 -207 -215 -210 -211 -219 -220 -228 -255 -271 -284 -312 -310 -259 -187 -110 -38
9404 -38 29 95 151 190 203 178 122 54 7 -2 4 -5 -29 -26 11 44 49 43 48 39 -2 -62 -127 -177 -208 -229 -239 -236 -207 -149 -89 -82 -129 -171 -197 -205 -168 -109 -72 -71 -93
9387 -93 -104 -109 -128 -153 -159 -136 -105 -86 -87 -99 -104 -103 -84 -43 -23 -20 -17 -32 -57 -84 -117 -154 -179 -174 -143 -82 -3 53 67 48 -4 -80 -144 -179 -190 -202 -230 -245 -235
9370 -235 -211 -175 -144 -131 -116 -95 -114 -186 -245 -239 -201 -172 -161 -143 -99 -50 -24 -6 9 6 -25 -80 -151 -218 -268 -314 -353 -355 -313 -271 -255 -250 -237 -201 -146 -99 -91
9354 -91 -110 -112 -80 -27 33 74 82 78 85 107 136 150 145 133 110 97 128 156 127 71 22 -10 -13 12 42 54 41 15 -30 -92 -106 -45 29 77 103 105 85 54 13
9338 13 -21 -36 -40 -40 -36 -42 -74 -101 -84 -37 16 46 20 -32 -60 -30 47 106 111 76 41 31 37 41 27 -2 -21 -14 0 -1 3 27 39 21 -9 -24 -3 29 16 -38
9321 -38 -66 -48 -21 -18 -28 -12 26 55 52 26 2 -14 -39 -72 -88 -87 -94 -106 -109 -110 -123 -143 -159 -163 -149 -118 -100 -112 -110 -74 -40 -9 28 52 37 -12 -77 -143 -181
9304 -181 -171 -131 -90 -58 -24 1 7 -11 -34 -56 -89 -107 -97 -86 -81 -80 -92 -110 -106 -88 -72 -66 -71 -72 -64 -47 -38 -78 -144 -207 -250 -258 -239 -197 -152 -127 -107 -94 -98 -105 -75
9287 -75 0 85 137 136 108 86 85 98 102 84 55 32 22 29 62 118 160 167 134 59 -16 -54 -79 -122 -165 -167 -125 -87 -80 -73 -73 -119 -190 -245 -277 -279 -241 -159 -48 33
9270 33 65 100 141 147 131 115 94 63 27 1 -17 -36 -52 -61 -65 -65 -50 -35 -38 -25 5 27 50 64 42 -5 -67 -131 -165 -161 -154 -149 -98 0 93 149 152 138 167 204
9253 204 190 140 84 38 19 18 28 73 149 189 167 116 51 -16 -55 -48 -17 -1 -14 -31 -24 0 19 39 63 62 43 44 65 82 86 88 91 99 121 120 63 -14 -62 -81
9236 -81 -104 -120 -102 -68 -34 -10 -7 -6 1 -6 -28 -38 -32 -18 8 46 90 122 120 72 4 -34 -24 -1 3 -4 -24 -41 -42 -45 -45 -24 -4 -25 -82 -123 -132 -123 -95 -47 10 70
9218 70 130 184 206 185 136 93 71 63 63 56 62 86 118 177 249 282 247 171 87 21 1 11 2 -43 -90 -105 -118 -165 -210 -216 -201 -192 -193 -196 -187 -161 -140 -138 -141 -145 -158 -162
9201 -162 -151 -136 -124 -124 -132 -134 -120 -98 -83 -78 -77 -64 -30 17 61 64 29 -9 -39 -61 -83 -109 -112 -93 -91 -97 -84 -40 26 80 105 124 151 197 236 232 204 183 179 183 183
9183 183 171 130 76 44 38 49 55 60 73 81 93 103 82 30 -24 -59 -73 -72 -43 17 65 70 55 30 -8 -43 -52 -36 -31 -53 -88 -118 -123 -106 -66 -28 -18 -20 -1 52
9166 52 107 110 54 -16 -71 -97 -69 -12 31 48 40 16 -37 -98 -131 -134 -128 -119 -84 -40 -7 38 64 42 -15 -78 -103 -95 -87 -89 -91 -101 -100 -55 13 62 72 70 78 87 100 106
9148 106 98 101 123 141 151 162 159 142 112 78 88 123 136 135 130 125 106 52 -19 -84 -133 -166 -196 -213 -199 -162 -127 -113 -104 -55 19 74 82 64 59 70 110 205 303
9132 303 338 315 273 238 224 225 221 204 180 158 160 200 245 255 212 142 76 18 4 35 49 33 17 12 2 4 35 81 119 114 90 88 95 98 89 65 37 19 11 9 12
9115 12 21 41 71 97 105 97 82 74 102 168 226 254 277 301 307 285 226 129 31 -37 -75 -72 -38 -20 -35 -50 -57 -76 -113 -166 -194 -153 -70 8 54 62 50 12 -60
9098 -60 -127 -145 -110 -65 -46 -48 -77 -113 -109 -58 16 79 105 91 42 -12 -62 -104 -119 -96 -53 -20 -25 -47 -53 -36 -12 -7 -29 -65 -86 -90 -103 -120 -118 -93 -75 -87 -102
9081 -102 -104 -102 -92 -65 -7 66 124 140 107 47 -12 -59 -82 -79 -46 -1 13 -9 -19 -5 7 28 56 59 35 8 -14 -38 -56 -53 -23 13 41 75 126 173 185
9066 185 184 216 273 312 314 275 216 175 166 169 167 163 167 176 185 199 200 169 122 90 70 52 30 -4 -44 -78 -85 -41 32 68 48 0 -72 -163 -216 -221 -203 -176 -145 -118 -97
9048 -97 -81 -74 -91 -127 -145 -134 -102 -50 11 76 129 128 72 18 3 6 -15 -76 -136 -157 -141 -100 -46 8 54 71 56 50 69 85 77 52 43 62 90 119 138 135 126
9032 126 102 54 20 16 23 39 76 124 148 129 82 44 44 69 98 117 121 112 103 88 71 75 93 102 94 60 -2 -56 -43 12 51 63 56 54 76 103 101 49 -30 -96 -122
9015 -122 -105 -59 -24 -30 -35 -15 -10 -36 -72 -88 -75 -49 -21 1 11 14 12 16 24 36 77 136 176 186 149 73 -4 -61 -84 -70 -47 -50 -55 -44 -33 -22 -10 21 74
8998 74 111 89 17 -28 -26 -15 -24 -64 -92 -90 -95 -110 -120 -113 -85 -40 18 74 96 74 45 29 8 -11 -16 -8 7 24 49 73 97 125 144 154 160 170 182 176 162 146
8981 146 92 19 -13 0 24 21 4 -2 13 60 102 91 58 35 27 42 55 42 9 -21 -17 6 14 -2 -28 -34 -23 -15 -30 -71 -128 -166 -148 -105 -72 -51 -45 -35 -13
8964 -13 22 66 93 90 53 -1 -36 -55 -80 -122 -164 -184 -192 -197 -197 -195 -181 -135 -65 -14 -20 -76 -132 -159 -159 -139 -109 -91 -81 -67 -75 -94 -77 -39 -22 -22 -29 -36 -26 2 43
8947 43 100 165 206 199 155 115 93 62 23 -8 -43 -88 -131 -149 -126 -51 49 119 154 195 234 256 265 266 254 226 201 193 189 177 144 94 57 56 77 106 144 171
8931 171 176 164 145 137 127 92 51 45 92 150 166 154 151 134 85 24 -40 -98 -133 -129 -96 -80 -107 -148 -150 -97 -29 25 66 83 73 55 58 77 66 14 -44 -75
8915 -75 -84 -102 -129 -148 -150 -126 -89 -48 -5 31 52 52 41 29 23 38 47 28 -14 -63 -80 -59 -32 -23 -25 -14 -1 -16 -60 -117 -157 -175 -190 -192 -165 -114 -46 8 43
8898 43 81 87 37 -10 -18 4 54 104 128 123 76 18 13 67 138 175 156 127 131 147 133 93 49 8 -30 -64 -82 -76 -56 -31 1 44 90 119 118 105 84 35 -28
8882 -28 -84 -111 -89 -43 -20 -16 -11 -3 10 16 -5 -34 -48 -75 -108 -102 -68 -40 -22 2 29 29 5 -16 -7 26 41 34 23 23 43 76 102 99 82 82 96 104 97 74 49 33
8864 33 2 -14 5 26 44 72 110 129 114 100 91 70 43 24 26 33 26 -4 -45 -73 -87 -94 -104 -110 -87 -27 38 89 135 161 149 102 50 21 1 -19 -38 -45 -32
8848 -32 -14 -7 -10 -9 8 17 -3 -34 -48 -55 -52 -21 16 38 42 23 -8 -27 -14 19 41 36 26 32 44 54 64 70 68 68 77 72 62 70 75 70 58 40 24 1 -25 -34 -41 -65 -104
8828 -104 -151 -197 -216 -189 -133 -94 -103 -142 -188 -226 -246 -251 -227 -175 -131 -122 -134 -142 -138 -124 -103 -92 -105 -123 -131 -127 -97 -39 -3 -19 -60 -92 -118 -143 -161 -178 -184 -166 -132
8812 -132 -86 -43 -17 14 59 83 70 44 19 -13 -73 -158 -219 -214 -184 -191 -227 -254 -259 -238 -208 -175 -120 -54 -19 -31 -60 -73 -77 -98 -122 -120 -90 -62 -75 -119 -156
8796 -156 -182 -183 -160 -151 -142 -109 -64 -36 -54 -105 -148 -150 -112 -55 -8 7 -10 -44 -89 -147 -198 -214 -199 -161 -110 -86 -108 -153 -183 -169 -112 -58 -48 -78 -108 -115 -120 -137
8780 -137 -141 -102 -34 6 5 3 6 -17 -81 -144 -178 -185 -163 -116 -43 38 81 63 11 -35 -73 -110 -137 -160 -185 -197 -183 -160 -154 -156 -152 -129 -99 -80 -68 -65 -78 -93 -97 -97
8763 -97 -109 -119 -124 -131 -132 -122 -103 -71 -34 7 48 50 3 -42 -67 -88 -83 -44 -4 29 56 65 61 47 29 6 -22 -19 2 -7 -40 -72 -87 -71 -26 39 99 127 121 105
8746 105 100 89 66 50 38 11 -23 -48 -52 -30 6 41 57 56 50 34 11 -12 -39 -75 -121 -158 -145 -92 -55 -45 -34 -26 -34 -53 -71 -81 -88 -95 -83 -48 -20 -15 -14 -1
8729 -1 15 19 5 -21 -43 -45 -57 -99 -160 -222 -254 -241 -212 -176 -133 -98 -82 -84 -85 -80 -62 -35 -31 -28 0 37 66 71 42 -10 -51 -65 -83 -111 -148 -173 -144 -110 -115 -131
8712 -131 -113 -77 -78 -99 -104 -105 -106 -102 -84 -70 -81 -94 -85 -84 -94 -87 -76 -60 -33 -3 24 40 37 16 0 -2 -10 -27 -53 -66 -42 -2 19 25 44 81 89 51 1 -36 -47
8695 -47 12 129 220 249 259 266 239 181 112 72 92 138 169 162 129 91 44 5 -22 -69 -137 -185 -189 -166 -125 -60 4 42 67 90 99 98 102 113 128 153 173 158
8679 158 127 101 75 53 36 6 -58 -124 -138 -86 -5 53 59 30 0 -39 -88 -132 -167 -177 -167 -146 -112 -85 -71 -76 -100 -128 -135 -96 -28 29 76 121 152 152 128
8663 128 98 64 25 -6 0 59 136 194 219 189 125 67 10 -47 -87 -98 -63 12 95 135 115 69 30 -7 -46 -59 -49 -48 -73 -116 -159 -189 -211 -221 -201 -157
8648 -157 -116 -102 -108 -107 -86 -58 -45 -39 -32 -30 -39 -58 -73 -86 -101 -97 -69 -42 -29 -25 -22 -6 18 35 59 102 132 116 76 46 19 9 48 103 122 119 118 112 102 96 102 117
8630 117 131 144 135 92 47 15 -9 -25 -30 -29 -39 -66 -86 -87 -66 -7 77 136 134 80 25 12 29 61 84 73 56 48 -5 -104 -181 -202 -187 -194 -228 -246 -232 -183
8614 -183 -117 -64 -22 14 33 27 12 2 -4 -14 -37 -87 -128 -112 -55 -6 -2 -33 -73 -111 -112 -60 9 58 47 -4 -29 -4 39 69 87 111 122 98 58 34 30
8598 30 49 100 157 179 164 137 96 49 48 109 190 251 265 244 239 264 285 282 256 233 237 239 204 161 148 152 160 176 177 167 172 177 175 176 181 182 171 134 69 1 -47 -66
8580 -66 -42 9 34 32 31 16 -4 2 46 91 88 45 14 16 41 55 35 13 23 45 44 19 -16 -32 -8 37 74 84 85 114 169 225 253 252 262 291 307 295 285
8564 285 310 362 391 360 292 220 161 131 144 210 296 354 371 360 346 321 282 261 265 275 278 278 298 336 372 392 395 374 321 259 214 173 142 137 144 168 222 300
8548 300 372 404 399 401 421 432 433 439 456 501 564 598 601 609 642 693 747 803 863 917 944 934 907 909 963 1044 1128 1216 1310 1410 1533 1687 1862 2054 2279
8533 2279 2538 2841 3186 3544 3933 4408 4992 5691 6523 7519 8697 10050 11599 13395 15484 17871 20507 23266 25921 28195
8525 28195 29862 30755 30794 30031 28605 26698 24480 22075 19601 17189 14947 12921 11113 9543 8214 7086 6116 5271 4536
8516 4536 3925 3428 2986 2578 2233 1959 1761 1632 1536 1441 1323 1189 1070 986 948 943 934 893 822 745 676 624 600 594 608 639 649 638 622 601
8504 601 580 536 456 364 273 220 224 273 324 332 320 314 315 323 314 281 265 306 360 366 339 302 266 224 183 164 143 101 40 -22 -41 -7 44 84 113 136 158 168
8488 168 165 189 236 246 191 103 25 -27 -47 -15 49 118 190 245 250 224 220 247 273 271 243 223 219 216 212 191 142 76 41 52 66 78 90 78 52 9 -30 -46
8472 -46 -50 -46 -51 -74 -95 -84 -25 46 83 90 74 28 -20 -32 -9 18 24 33 69 104 119 112 90 64 34 19 46 98 116 85 52 45 58 82 89 62 37 54 111 177
8455 177 213 216 208 194 172 141 110 100 118 164 222 255 238 187 162 194 244 275 280 273 258 223 187 165 135 85 41 21 17 17 22 39 55 54 40 6 -20 1 17
8438 17 -2 -29 -46 -22 31 63 85 116 130 126 127 148 188 211 178 119 89 70 30 0 -2 -1 -23 -62 -97 -134 -173 -187 -168 -147 -148 -162 -186 -211 -215 -197 -153 -97
8422 -97 -59 -30 1 15 -5 -60 -124 -172 -187 -155 -102 -68 -22 55 139 189 183 157 142 124 94 87 115 138 117 53 -4 -26 -28 4 69 111 100 70 47 23 -17
8406 -17 -93 -179 -204 -170 -146 -164 -206 -217 -160 -69 16 80 110 102 56 -18 -97 -146 -141 -92 -29 39 104 148 161 148 130 110 93 77 61 67 81 96 133 170 175
8391 175 164 153 121 49 -43 -115 -143 -150 -155 -135 -84 -36 -20 -35 -59 -85 -119 -153 -172 -175 -169 -171 -190 -199 -187 -177 -189 -201 -194 -184 -181 -162 -122 -81 -35 3 24 14 -32
8374 -32 -65 -58 -36 -16 -15 -26 -33 -41 -51 -47 -28 -18 -21 -35 -57 -74 -95 -141 -187 -195 -168 -135 -102 -55 9 50 38 13 12 11 4 25 62 69 31 -36 -100 -151 -205 -239 -230
8357 -230 -206 -172 -114 -62 -45 -66 -110 -147 -165 -183 -207 -210 -176 -130 -96 -88 -93 -76 -40 -3 18 10 -13 -26 -29 -33 -32 2 52 99 128 120 84 40 17 40 68 53 8
8340 8 -10 18 61 74 39 -30 -86 -100 -91 -76 -52 -38 -54 -79 -100 -112 -98 -68 -63 -91 -119 -134 -146 -141 -106 -66 -53 -70 -90 -89 -71 -23 38 88 127 151 149 114
8324 114 56 5 -27 -48 -53 -21 43 101 117 94 63 65 100 124 131 125 93 60 41 15 -16 -45 -52 -41 -49 -89 -129 -136 -113 -88 -79 -76 -74 -51 16 74 46 -42 -121 -175
8307 -175 -207 -228 -241 -235 -230 -231 -232 -236 -222 -176 -123 -98 -120 -170 -207 -223 -235 -251 -240 -186 -116 -40 38 102 124 102 54 3 -20 -40 -79 -102 -92 -54 2 49 70
8291 70 71 66 81 116 134 106 41 -25 -69 -86 -83 -65 -23 37 94 146 197 235 254 255 242 223 182 108 35 -6 -14 -5 9 28 43 65 86 70 14 -67 -154 -213
8275 -213 -238 -231 -198 -164 -142 -118 -87 -30 59 149 216 261 295 322 314 273 223 180 155 150 150 155 175 202 209 178 124 68 34 50 90 109 112 117 118 109 87 55 36 40
8258 40 37 22 16 24 35 50 68 74 51 10 -21 -32 -23 1 14 6 -25 -76 -111 -101 -55 -4 28 29 -5 -40 -42 -16 15 34 38 37 34 31 23 8 -4 -29 -82 -137 -158 -144
8241 -144 -134 -151 -169 -163 -122 -49 27 68 74 85 108 116 110 107 108 104 72 19 -23 -30 -5 31 65 71 41 18 45 92 107 88 48 6 -13 -11 -2 -12 -26 -11 28 101
8224 101 172 202 213 211 184 152 128 101 58 -1 -55 -81 -91 -89 -72 -53 -49 -57 -55 -56 -65 -53 -19 6 -10 -61 -118 -176 -219 -228 -208 -201 -222 -234 -224 -201 -174 -151 -133
8207 -133 -118 -113 -111 -87 -46 -11 19 55 78 62 29 21 51 102 119 73 13 -11 -15 -14 -6 8 61 139 179 173 151 133 126 110 77 43 19 18 40 39 -1 -41 -56 -56
8190 -56 -54 -60 -72 -72 -54 -34 -6 39 101 167 212 244 272 299 334 355 333 284 237 202 165 120 86 63 48 51 70 68 24 -26 -48 -34 5 33 12 -50 -117 -168
8174 -168 -217 -276 -317 -318 -305 -306 -315 -317 -300 -247 -176 -115 -50 -7 0 7 7 -32 -103 -156 -165 -152 -148 -129 -60 8 46 74 99 113 98 57 16 -7 -16 -19 -5 7 4 7 19
8157 19 2 -46 -77 -86 -112 -142 -131 -76 -17 13 -1 -35 -46 -45 -40 -12 32 49 12 -60 -138 -181 -165 -113 -78 -68 -60 -58 -74 -100 -116 -102 -59 -12 11 10 -17 -77
8141 -77 -148 -188 -181 -172 -172 -152 -112 -50 17 50 51 43 13 -50 -107 -122 -104 -66 -14 47 88 78 26 -35 -76 -85 -67 -41 -15 24 76 110 114 117 122 107 82 60 51 67
8124 67 98 127 137 127 109 78 38 25 41 42 20 6 5 -3 -40 -88 -109 -89 -52 -18 8 43 82 106 104 69 19 -4 20 60 90 112 117 114 130 135 100 60 54
8107 54 76 88 70 48 48 77 133 189 208 188 159 135 121 115 110 86 39 5 24 90 153 190 214 216 205 188 163 134 97 67 86 132 153 132 93 76 96
8091 96 118 100 54 19 6 -5 -30 -71 -115 -143 -139 -103 -63 -54 -80 -109 -110 -94 -62 -21 -2 -22 -67 -95 -88 -68 -39 2 32 24 -8 -38 -38 -11 21 45 50 45 54 64
8074 64 44 16 24 51 62 33 -14 -33 -22 -1 35 72 86 88 70 17 -32 -54 -66 -76 -83 -84 -84 -84 -82 -91 -107 -114 -100 -72 -53 -44 -25 13 55 85 86 66 79 140 198
8057 198 217 187 125 55 4 -19 -32 -47 -72 -109 -126 -102 -49 14 53 36 -16 -62 -92 -90 -67 -59 -58 -54 -59 -73 -101 -136 -164 -192 -208 -192 -175 -193 -221 -201 -121
8041 -121 -38 -11 -28 -43 -47 -47 -41 -36 -51 -83 -120 -142 -127 -86 -62 -61 -56 -50 -71 -115 -149 -151 -117 -75 -57 -69 -91 -101 -75 -26 15 20 -29 -99 -139 -135 -111 -98 -82 -39
8024 -39 5 32 41 56 80 84 56 2 -52 -76 -79 -78 -74 -57 -28 -21 -30 -28 -18 -7 17 60 102 107 45 -63 -157 -188 -150 -82 -14 58 132 186 206 188 155 122 73
8008 73 27 12 26 43 34 13 11 20 35 57 82 111 147 180 185 171 157 140 109 69 35 16 14 14 -2 -47 -103 -133 -127 -94 -57 -34 -17 -8 -10 -4 8 4 -20 -37 -15
7990 -15 28 59 61 20 -39 -78 -89 -77 -49 -27 -19 -36 -83 -135 -161 -147 -106 -61 -31 -11 18 56 64 17 -37 -56 -52 -50 -68 -93 -89 -55 -32 -26 -4 32 69 103 118
7974 118 108 78 47 25 4 -7 -3 7 13 18 33 46 60 104 167 191 146 78 29 -3 -30 -47 -28 17 56 73 73 90 128 153 156 162 190 210 180 104 53 49
7958 49 46 31 9 -23 -52 -39 3 14 -22 -73 -113 -140 -160 -170 -183 -212 -251 -274 -257 -195 -108 -47 -38 -42 -27 -22 -44 -72 -87 -73 -27 10 15 -2 -23 -43 -71 -102
7942 -102 -135 -154 -160 -188 -243 -299 -333 -357 -383 -381 -343 -277 -201 -160 -156 -154 -143 -127 -98 -66 -45 -22 26 78 71 11 -32 -38 -32 -39 -71 -113 -134 -117 -86 -74 -94 -128 -154
7925 -154 -162 -136 -73 -9 10 -10 -42 -72 -97 -106 -90 -58 -22 7 35 66 90 101 115 127 116 94 72 44 9 -33 -80 -114 -126 -122 -118 -125 -153 -182 -165 -115 -76
7910 -76 -42 -21 -38 -78 -113 -114 -86 -69 -87 -123 -139 -135 -138 -118 -63 -20 -6 -12 -48 -107 -146 -166 -183 -197 -193 -154 -100 -46 8 70 130 151 120 63 38 71 137 210
7893 210 246 226 199 180 147 108 83 56 13 -37 -88 -115 -102 -71 -39 -24 -26 -19 -3 19 41 17 -39 -69 -62 -38 -11 22 77 133 144 122 117 125 115 89 52
7878 52 21 18 28 25 0 -43 -84 -95 -69 -13 37 49 28 -9 -47 -68 -66 -46 -7 14 -14 -82 -155 -212 -253 -289 -293 -239 -159 -83 -15 22 18 -13 -61 -102 -97 -51
7862 -51 -9 13 21 19 15 10 0 -15 -48 -89 -124 -153 -176 -182 -154 -82 -3 41 59 83 117 144 178 225 270 299 296 258 202 162 164 180 173 150 122 87 60 49 45 31
7845 31 -3 -39 -46 -29 12 53 56 36 12 -22 -50 -34 18 45 36 32 37 48 63 55 27 7 0 -10 -19 -25 -50 -80 -100 -131 -149 -123 -69 -23 -16 -25 -5 33 62 98 147
7827 147 181 195 201 212 223 223 210 186 146 82 14 -15 -5 9 34 89 131 137 124 87 44 25 8 -23 -46 -44 -30 -15 -7 3 29 57 64 45 27 38 84 139
7811 139 172 185 192 199 201 179 129 61 16 13 21 26 25 19 1 -36 -56 -18 55 100 98 76 39 -14 -53 -40 3 34 46 65 89 97 87 83 93 96 76 48 42 77 130
7794 130 169 188 174 129 83 39 3 2 45 90 95 50 -26 -74 -61 -22 4 1 0 15 21 8 -28 -76 -95 -79 -67 -81 -114 -150 -169 -173 -171 -166 -167 -174 -188 -195 -179 -164
7777 -164 -172 -194 -212 -225 -235 -222 -180 -157 -175 -200 -196 -144 -73 -31 -20 -8 18 43 42 23 19 18 5 -7 -13 -5 12 16 1 -25 -51 -88 -123 -122 -88 -29 31 62 61 36
7760 36 15 8 0 -12 -1 57 140 201 235 262 273 247 190 140 114 74 17 -28 -77 -125 -139 -93 -2 71 99 116 138 144 139 137 137 128 108 82 50 13 -27 -74 -99
7743 -99 -88 -69 -85 -141 -198 -213 -172 -108 -64 -48 -49 -58 -72 -100 -131 -136 -120 -83 -29 0 -7 -29 -46 -51 -46 -39 -24 -15 -29 -53 -79 -122 -181 -228 -232 -208 -178 -137 -74 4
7726 4 63 62 28 1 -13 -9 27 59 36 -31 -82 -83 -66 -42 -7 18 17 -7 -20 -23 -28 -44 -60 -47 -24 -7 18 58 108 136 112 77 72 68 48 46 64 65 30 -23 -57
7709 -57 -53 -25 8 53 97 124 135 120 83 36 -13 -48 -57 -44 -28 -20 -27 -42 -63 -96 -135 -172 -183 -166 -150 -138 -136 -138 -117 -70 -24 -3 0 2 8 9 1 9 55 141 236
7692 236 304 332 312 252 175 89 6 -51 -73 -60 -28 16 64 112 162 193 179 118 52 14 -10 -18 0 12 -3 -29 -53 -76 -94 -99 -80 -54 -45 -61 -95 -114
7676 -114 -112 -123 -161 -189 -186 -183 -178 -146 -96 -50 -19 0 23 61 105 142 151 112 44 -1 0 26 40 38 27 24 25 12 -13 -32 -48 -78 -107 -120 -118 -112 -110 -87 -62 -67 -91
7659 -91 -105 -98 -82 -55 -8 33 64 88 109 121 117 111 111 108 81 32 -16 -63 -103 -103 -69 -42 -27 -13 13 63 104 111 96 83 92 120 152 166 145 86 4 -75 -120
7642 -120 -111 -81 -59 -43 -28 -20 -29 -56 -97 -131 -130 -86 7 134 229 238 154 46 -2 -17 -57 -109 -149 -190 -226 -225 -192 -162 -181 -232 -264 -267 -252 -226 -198 -175 -147
7627 -147 -99 -69 -100 -167 -218 -225 -200 -180 -172 -162 -147 -148 -189 -274 -358 -392 -366 -314 -265 -199 -111 -46 -29 -48 -86 -124 -139 -120 -87 -71 -56 -9 39 34 -33 -125 -193
7611 -193 -230 -246 -243 -229 -204 -166 -118 -76 -50 -33 -14 6 26 32 22 21 51 87 98 77 47 33 27 4 -31 -75 -140 -223 -277 -291 -299 -296 -272 -224 -162 -122 -118 -118 -102
7595 -102 -62 -11 27 60 111 169 199 181 132 101 103 118 119 101 82 84 112 132 108 77 67 68 81 102 119 105 43 -32 -83 -98 -78 -40 1 41 66 65 32
7579 32 -24 -85 -121 -113 -84 -56 -30 -28 -63 -114 -149 -170 -200 -258 -319 -347 -347 -328 -293 -260 -244 -253 -265 -251 -217 -197 -197 -205 -198 -169 -136 -88 -24 10 0 -29 -58 -81 -87
7562 -87 -83 -92 -104 -112 -123 -125 -125 -134 -140 -135 -105 -66 -53 -70 -115 -174 -209 -213 -195 -157 -121 -101 -86 -73 -58 -51 -46 -6 79 169 248 314 347 333 271 189 124 74 28 -16 -64
7545 -64 -78 -49 0 71 135 147 115 71 46 36 20 0 -13 -15 -6 9 26 31 33 44 67 96 109 98 79 66 61 59 52 45 42 42 38 35 36 29 8 -14 -23 -16 -26 -65 -95
7527 -95 -91 -51 14 83 118 94 47 29 37 49 58 65 62 32 -31 -108 -148 -131 -90 -56 -55 -89 -106 -78 -35 -21 -43 -48 -3 49 79 90 80 32 -44 -118 -167 -191 -209
7510 -209 -224 -223 -208 -185 -153 -114 -86 -85 -95 -85 -52 -27 -3 44 91 102 79 61 64 63 41 0 -32 -34 1 49 76 78 52 4 -41 -69 -74 -77 -79 -65 -36 7 45
7494 45 42 1 -34 -49 -69 -98 -131 -148 -110 -35 5 -13 -40 -38 -28 -38 -66 -80 -70 -53 -38 -32 -48 -67 -69 -70 -78 -88 -102 -95 -62 -44 -49 -53 -47 -26 4 5 -39 -81 -71
7476 -71 -8 70 124 141 117 72 60 90 122 129 96 42 -16 -67 -76 -33 28 62 64 62 49 31 35 60 90 118 149 183 209 206 174 134 101 79 56 30 15 22 35
7460 35 24 -7 -29 -4 58 107 132 163 210 238 238 243 244 236 220 155 59 -14 -50 -57 -42 -18 -7 -11 -22 -29 -24 -25 -37 -64 -88 -68 -21 3 -2 -6 -2 -22 -31 13 79 139
7442 139 172 164 127 73 22 -24 -81 -130 -141 -135 -151 -187 -224 -242 -225 -182 -143 -120 -84 -28 13 46 88 120 130 140 137 94 49 52 96 137 146 122 80 44 18
7426 18 0 5 40 59 35 12 16 28 56 82 84 80 79 61 15 -39 -83 -117 -153 -191 -192 -162 -147 -141 -131 -129 -115 -65 -6 25 29 4 -55 -130 -195 -221 -184 -107 -53 -45
7409 -45 -64 -98 -128 -131 -114 -109 -103 -70 -23 28 76 95 84 72 77 87 88 76 67 76 89 109 135 148 139 106 71 53 44 28 -23 -110 -197 -251 -244 -210 -225 -289 -345 -369
7392 -369 -376 -358 -296 -217 -156 -121 -102 -90 -94 -114 -128 -125 -106 -78 -37 8 34 37 24 -7 -43 -73 -91 -109 -132 -141 -129 -104 -71 -45 -40 -36 -12 -6 -45 -96 -140 -164 -156
7376 -156 -117 -66 -37 -55 -102 -147 -162 -135 -89 -59 -35 -4 17 26 18 -8 -39 -62 -80 -96 -90 -51 -29 -59 -103 -130 -149 -161 -158 -152 -152 -153 -142 -115 -94 -68 -27 -5
7360 -5 1 18 43 54 38 -12 -79 -114 -110 -96 -87 -93 -97 -85 -83 -95 -83 -25 29 45 39 30 28 14 -17 -34 -37 -21 20 51 53 25 -3 11 55 89 81 27 -26 -38 -13 15
7342 15 36 53 58 66 97 122 125 105 66 7 -42 -48 -35 -37 -46 -66 -94 -104 -88 -78 -93 -105 -83 -37 10 65 130 171 171 133 67 -8 -67 -78 -34 41 108 154 198
7325 198 231 226 182 123 80 68 79 96 109 124 145 168 187 209 243 266 249 199 142 105 94 85 71 48 11 -17 -40 -58 -32 34 109 185 269 337 351 314
7310 314 264 203 145 123 118 98 59 4 -47 -93 -125 -140 -169 -206 -233 -254 -264 -255 -213 -165 -125 -73 -27 -8 0 6 15 35 48 43 24 -1 -23 -18 24 68 90 102
7294 102 108 105 98 94 99 118 136 145 154 145 118 80 17 -36 -39 -10 21 23 5 5 16 17 26 46 53 53 75 100 73 -8 -90 -149 -203 -247 -265 -256 -233 -210 -175 -139 -109 -60 9
7276 9 66 66 23 -7 -36 -74 -94 -89 -73 -58 -31 5 15 -13 -67 -124 -154 -144 -108 -80 -88 -113 -121 -104 -65 -24 -15 -41 -69 -66 -32 5 14 -24 -75 -87 -68 -41 -19
7259 -19 3 36 46 31 11 -22 -43 -36 -6 33 57 70 86 91 67 26 -5 -21 -14 -5 -28 -56 -60 -60 -64 -67 -75 -92 -120 -156 -184 -187 -166 -148 -144 -146 -136 -84 -28 -26 -37 -11
7242 -11 32 62 70 72 67 57 48 31 20 32 47 40 19 0 -10 -13 -10 -12 -31 -65 -90 -91 -64 -29 -28 -45 -36 -10 18 42 53 64 72 63 55 56 40 19 15 9 -3 12 72 139
7223 139 173 179 175 174 182 183 165 133 101 70 43 47 83 109 83 22 -14 1 37 61 60 15 -47 -74 -57 -25 -15 -34 -64 -76 -47 15 78 116 128 113 71 23
7207 23 1 0 -7 -7 12 35 45 35 -9 -68 -96 -101 -121 -165 -193 -172 -117 -55 -10 20 54 95 148 192 208 194 162 126 70 10 -6 18 67 88 59 32 37 36
7191 36 -1 -45 -59 -51 -42 -16 46 114 144 137 114 78 40 35 62 116 182 209 197 171 149 135 117 99 113 183 253 262 225 185 168 179 204 238 266 264 223 170
7175 170 133 104 69 25 -36 -113 -170 -194 -204 -197 -173 -154 -149 -138 -109 -77 -41 -14 3 19 6 -40 -91 -129 -165 -176 -159 -157 -183 -215 -212 -163 -107 -47 4 17 2
7159 2 -33 -93 -140 -122 -55 -14 -37 -89 -128 -145 -126 -73 -21 11 30 37 26 18 29 35 26 25 49 78 77 45 5 -27 -53 -57 -22 26 78 118 129 123 94 49 21 -1
7142 -1 -38 -71 -90 -100 -115 -120 -104 -98 -114 -150 -179 -179 -166 -145 -120 -87 -20 70 152 184 140 49 -5 7 32 17 -13 -8 30 49 29 -6 -29 -47 -79 -94 -69 -28
7126 -28 12 50 84 106 103 105 121 103 63 54 84 113 117 125 150 171 175 155 121 94 89 90 74 56 36 4 -16 -17 -14 4 43 64 70 92 118 121 92 43 5 -13 -12 16
7108 16 31 6 -13 7 47 73 91 98 93 97 108 92 66 72 91 105 121 131 135 135 129 124 110 84 68 62 63 82 92 54 -10 -72 -116 -144 -166 -177 -174 -149 -102 -63 -54
7091 -54 -61 -70 -87 -110 -127 -120 -93 -80 -108 -182 -251 -269 -264 -266 -257 -211 -149 -112 -95 -69 -10 59 96 104 96 83 71 46 -9 -75 -100 -76 -46 -49 -80 -98 -71 -9 46 85
7074 85 124 167 195 194 178 164 166 178 186 181 153 99 52 29 15 20 41 51 40 0 -49 -75 -68 -58 -90 -147 -187 -207 -217 -225 -242 -281 -311 -292 -245 -198 -157 -118 -63
7057 -63 3 48 58 55 68 110 130 77 4 -45 -79 -87 -61 -11 43 87 85 27 -39 -87 -117 -135 -131 -98 -64 -45 -27 -11 -10 -40 -97 -159 -188 -169 -128 -109 -141 -208
7041 -208 -278 -321 -331 -326 -337 -350 -325 -283 -247 -216 -196 -161 -103 -39 14 35 28 -2 -52 -91 -127 -181 -222 -204 -147 -95 -57 -28 6 35 37 45 82 110 78 3 -49
7025 -49 -59 -47 -31 -25 -39 -66 -72 -51 -29 -19 -39 -95 -159 -209 -244 -258 -242 -192 -117 -48 -14 -7 11 61 123 148 123 80 41 22 24 32 41 63 76 64 68 111 150
7009 150 170 183 183 175 154 113 57 6 -10 -4 18 43 37 25 38 71 99 101 96 87 62 34 20 12 -2 -26 -46 -62 -89 -130 -173 -201 -195 -176 -177 -183 -150 -73 -7 6
6992 6 -17 -30 -17 -2 8 5 -31 -67 -69 -55 -40 -21 1 33 75 116 141 157 182 194 171 129 91 71 39 -16 -65 -94 -106 -111 -122 -130 -111 -54 32 121 177 187
6976 187 152 113 106 113 126 143 155 162 165 172 178 172 159 136 123 123 112 92 63 38 26 19 25 49 77 104 114 82 19 -43 -92 -127 -141 -121 -85 -44 -2 14 26 46
6959 46 34 9 -3 -9 -1 2 0 -4 -21 -23 32 136 243 327 368 353 292 226 202 203 176 124 86 74 74 64 32 -12 -55 -83 -107 -126 -101 -26 49 84 82 72 63
6942 63 52 48 64 94 122 137 142 143 134 117 105 82 46 26 60 136 204 260 296 281 223 154 108 92 85 97 135 164 160 118 45 -42 -133 -204 -234 -221 -163 -78
6926 -78 -26 -28 -50 -72 -105 -139 -147 -132 -97 -59 -28 -2 -7 -45 -95 -121 -97 -63 -47 -35 -24 -9 4 1 -29 -67 -89 -92 -77 -38 30 106 175 235 276 293 288 262
6910 262 221 179 131 63 -9 -67 -98 -115 -122 -99 -53 10 90 167 231 256 233 198 166 133 101 70 49 45 46 33 21 24 16 10 41 74 69 27 -29 -73 -90 -95 -92
6894 -92 -63 -6 28 -1 -58 -82 -79 -59 -29 -6 13 4 -48 -100 -121 -123 -118 -87 -24 24 30 24 26 37 56 68 81 96 98 85 41 -23 -59 -59 -51 -53 -77 -125 -172 -181 -148
6876 -148 -96 -43 -1 2 -41 -91 -109 -94 -60 -35 -44 -58 -26 46 119 160 162 142 135 131 114 103 109 152 214 226 163 66 -1 -18 -1 16 8 -15 -42 -55 -45 -17
6860 -17 27 64 77 90 120 147 145 119 87 53 4 -46 -75 -89 -97 -73 -3 76 133 167 172 143 87 40 31 48 51 39 37 50 63 52 14 -26 -54 -55 -28 8 26
6844 26 10 -8 -2 13 9 -14 -39 -65 -85 -92 -102 -119 -132 -137 -148 -168 -190 -218 -237 -237 -229 -230 -238 -234 -226 -222 -213 -211 -221 -259 -309 -309 -250 -180 -154 -171 -185 -187 -187 -182 -172 -150 -98 -37
6825 -37 -6 5 24 47 58 62 80 108 128 143 166 186 178 146 119 118 141 153 136 102 67 53 49 35 21 1 -26 -46 -50 -45 -44 -50 -55 -58 -61 -72 -105 -154 -201 -228 -241
6807 -241 -272 -325 -350 -313 -252 -232 -248 -259 -246 -210 -165 -120 -88 -86 -101 -105 -96 -77 -40 3 37 34 -5 -46 -71 -93 -120 -132 -101 -37 24 69 90 88 76 68 63 79
6791 79 113 126 106 86 89 107 112 92 74 70 51 20 10 12 11 9 0 -17 -18 -11 -26 -52 -86 -119 -128 -123 -103 -62 -19 -4 -5 12 40 50 27 5 27 67 84 73 58
6774 58 51 19 -48 -117 -153 -153 -137 -102 -45 9 40 53 81 132 174 177 165 148 99 33 -10 -30 -51 -65 -43 7 57 104 128 104 70 70 80 81 76 78 105 130 112
6757 112 45 -30 -64 -50 -21 -8 -4 -3 -23 -57 -79 -83 -80 -77 -79 -77 -59 -12 58 116 138 131 100 70 55 58 76 79 68 66 62 63 77 82 58 21 -3 -7 21 64 87 81 44
6739 44 -8 -64 -120 -171 -186 -145 -102 -106 -143 -191 -225 -234 -218 -192 -187 -190 -185 -161 -119 -91 -90 -95 -88 -77 -76 -98 -137 -150 -138 -147 -163 -158 -157 -159 -164 -195 -230 -245 -253 -260 -254 -235 -219 -237
6721 -237 -292 -334 -327 -324 -345 -356 -352 -351 -353 -338 -297 -228 -134 -58 -36 -46 -45 -24 -11 -18 -31 -50 -73 -114 -180 -243 -283 -280 -214 -122 -65 -40 -22 -17 -10 24 72 106 102 79
6704 79 93 156 203 197 176 161 118 40 -23 -31 5 41 59 74 80 75 70 68 77 89 91 88 89 89 65 23 -8 -25 -27 -23 -26 -24 -8 17 28 18 6 -7 -42 -79 -71 -10 59
6685 59 100 99 60 19 -11 -44 -58 -35 -4 8 2 3 22 41 58 65 41 -14 -73 -99 -88 -48 11 60 81 72 38 13 2 -9 -20 -40 -71 -92 -100 -98 -95 -81 -51
6669 -51 -32 -45 -98 -156 -169 -143 -97 -52 -28 -20 -11 7 18 15 29 72 118 138 137 122 86 47 15 0 15 20 -12 -37 -22 0 22 43 55 77 126 185 232 254
6653 254 254 247 243 240 246 263 276 275 241 180 132 103 78 75 101 122 113 75 16 -38 -49 -12 15 -19 -105 -187 -216 -159 -65 -13 -10 -21 -26 -3 44 82 94 65 -10 -71
6636 -71 -71 -44 -20 -7 1 21 57 112 188 249 237 167 99 36 -7 0 40 72 75 53 24 -18 -71 -98 -98 -88 -85 -95 -114 -133 -143 -159 -189 -219 -232 -227 -218 -193 -148
6619 -148 -102 -70 -75 -104 -118 -108 -108 -121 -127 -130 -127 -116 -101 -83 -87 -102 -98 -73 -44 -25 0 27 43 52 40 1 -46 -88 -100 -80 -44 -23 -48 -107 -166 -195 -184 -170 -177
6603 -177 -180 -146 -91 -52 -35 -37 -65 -100 -84 -27 25 64 64 23 -15 -28 -24 -23 -31 -53 -74 -77 -63 -43 -18 26 69 64 28 -10 -42 -47 -10 39 54 24 -12 -29 -27 -9
6586 -9 22 41 29 -8 -51 -76 -74 -49 -15 13 20 -18 -86 -123 -106 -59 -8 13 7 17 64 123 168 173 127 73 33 -2 -29 -53 -88 -124 -144 -150 -153 -154 -137 -113 -116 -116
6569 -116 -69 8 79 131 190 245 236 161 70 6 -21 -2 64 134 162 152 138 122 80 33 24 66 113 113 84 71 88 94 58 6 -24 -31 -37 -47 -45 -20 20 51
6553 51 58 44 16 -27 -74 -88 -70 -47 -34 -42 -57 -52 -55 -87 -142 -208 -244 -219 -133 7 154 244 273 301 355 389 375 338 305 286 279 288 293 276 251 224 202 181
6537 181 141 90 61 66 87 102 92 69 54 43 33 26 28 21 -14 -48 -53 -48 -45 -31 11 70 106 114 112 109 98 64 18 -27 -56 -55 -43 -33 -21 0 32 61 77 58
6520 58 -4 -62 -79 -58 -26 -19 -36 -65 -103 -124 -101 -48 -1 31 70 120 162 177 172 141 83 33 20 50 99 137 150 141 126 96 50 16 10 12 -2 -20 -45 -107
6504 -107 -181 -229 -234 -206 -173 -144 -108 -55 6 47 45 14 -9 -8 14 49 62 57 60 46 4 -47 -89 -86 -46 -26 -57 -94 -85 -43 -7 15 44 93 147 187 197 173
6487 173 136 108 121 167 205 222 219 213 225 239 218 165 115 98 125 159 158 135 125 126 116 92 89 124 154 131 71 14 -12 1 30 54 70 72 74 88 101 99 84
6471 84 27 -78 -186 -244 -241 -209 -167 -114 -62 -22 0 14 58 123 166 166 132 92 52 10 -19 -30 -24 -10 7 27 39 32 20 26 47 75 106 112 91 89 116 140
6455 140 157 174 164 113 54 6 -12 30 123 208 245 240 225 195 147 103 79 75 74 78 103 148 202 257 281 253 201 145 82 26 -16 -55 -101 -148 -172 -158 -109
6439 -109 -64 -42 -28 -9 24 56 78 96 89 65 49 39 33 42 74 133 188 193 146 95 82 102 130 144 147 150 143 124 109 96 84 74 57 26 -10 -33 -14 27
6423 27 63 85 74 37 13 0 -41 -92 -94 -69 -52 -13 33 62 90 118 124 100 51 6 -11 -7 34 106 150 155 135 81 17 -16 -28 -36 -31 -26 -27 -28 -51 -85 -122 -156
6406 -156 -160 -140 -121 -120 -134 -135 -108 -68 -24 -7 -35 -64 -68 -58 -44 -49 -63 -59 -48 -30 12 71 122 144 120 73 49 50 57 64 43 -24 -101 -155 -169 -148 -138 -139 -128 -124
6389 -124 -137 -136 -113 -92 -79 -77 -89 -92 -67 -33 -20 -25 -40 -58 -61 -39 -3 21 0 -71 -144 -157 -105 -17 60 95 88 34 -46 -117 -162 -156 -109 -59 -26 -17 -17 -12 -13 -35
6372 -35 -65 -77 -76 -90 -106 -104 -85 -40 20 61 62 22 -31 -65 -68 -64 -82 -125 -173 -200 -206 -200 -206 -240 -255 -234 -215 -219 -221 -186 -120 -69 -73 -115 -147 -159 -160 -151 -132 -104 -52 20
6354 20 76 92 88 88 87 56 4 -27 -35 -40 -57 -78 -86 -76 -63 -50 -27 -4 -3 -26 -25 24 78 95 68 -2 -91 -153 -158 -126 -89 -59 -36 6 82 159 212 228 207 163
6337 163 119 89 57 9 -37 -58 -52 -42 -42 -38 -13 16 26 10 -28 -78 -147 -219 -237 -198 -160 -158 -187 -197 -162 -134 -137 -135 -109 -57 0 14 0 0 3 -26 -90 -158 -185
6321 -185 -164 -120 -85 -101 -142 -135 -96 -90 -126 -164 -165 -139 -103 -54 -3 48 112 173 192 159 101 35 -26 -49 -19 33 78 99 105 84 30 -22 -51 -50 -22 24 77
6305 77 105 119 147 175 176 133 65 16 2 1 0 4 0 -29 -76 -119 -139 -123 -81 -58 -67 -85 -96 -103 -109 -115 -120 -116 -112 -120 -120 -109 -90 -60 -23 26 88 158 215 228 207 163
6287 163 97 26 -22 -27 0 40 76 87 76 55 34 7 -33 -69 -85 -65 -3 63 91 77 45 9 -19 -57 -114 -161 -171 -145 -104 -80 -52 -2 29 35 63 129
6272 129 178 169 121 61 -4 -58 -89 -96 -76 -60 -57 -59 -84 -138 -201 -254 -284 -286 -278 -278 -257 -201 -153 -132 -131 -151 -177 -168 -131 -121 -128 -120 -110 -134 -193 -230 -214 -176 -156 -151 -128
6255 -128 -89 -57 -35 -9 27 59 62 37 0 -34 -50 -46 -21 -5 -40 -99 -135 -153 -153 -114 -49 -7 -6 -25 -54 -77 -75 -64 -56 -61 -83 -102 -100 -78 -28 32 47 22 -1
6238 -1 -10 17 66 91 87 84 84 89 109 127 141 140 87 3 -52 -75 -81 -75 -63 -63 -90 -158 -233 -268 -279 -272 -232 -156 -66 8 53 64 78 101 95 71 55 36 13 -4 -5 12
6220 12 18 -6 -26 -12 20 34 35 55 78 78 75 81 108 167 230 246 236 222 170 88 46 91 192 265 271 244 216 189 164 138 73 -18 -89 -135 -156 -140 -96 -54
6204 -54 -18 14 36 45 56 90 116 102 76 67 54 34 13 -15 -50 -77 -89 -75 -33 5 10 -9 -29 -22 4 13 -11 -67 -115 -106 -53 1 41 68 78 78 98 124 112
6188 112 73 43 35 31 -7 -65 -85 -69 -53 -52 -53 -34 0 34 56 56 44 45 80 120 139 149 147 115 63 6 -59 -118 -147 -164 -191 -228 -270 -299 -312 -321 -315 -274 -218
6171 -218 -186 -178 -146 -76 -20 7 23 20 -2 -34 -51 -47 -39 -50 -99 -161 -183 -146 -80 -28 -1 -9 -52 -93 -88 -28 41 71 58 27 16 34 67 108 151 192 213 209
6155 209 204 193 170 151 142 158 207 247 238 199 168 155 158 160 150 132 133 171 205 208 198 187 180 191 199 171 127 117 148 165 143 98 39 13 63 150 218 243 192
6139 192 84 -3 -41 -45 -20 8 18 11 8 35 79 118 147 132 70 0 -67 -146 -214 -232 -200 -150 -105 -69 -48 -45 -58 -77 -102 -140 -168 -160 -126 -90 -50 3 68
6123 68 134 166 146 115 103 92 80 94 126 153 179 184 152 134 145 154 148 136 120 96 72 47 25 7 -9 -8 13 33 32 19 19 24 33 48 51 28 0 6 36 52
6106 52 39 -2 -36 -33 -21 -28 -33 -21 -21 -18 0 7 -3 -1 36 95 152 211 263 285 284 274 239 188 148 132 125 102 69 31 -21 -84 -150 -193 -200 -192 -182 -164 -138 -105 -75
6089 -75 -61 -60 -68 -81 -95 -99 -77 -27 18 48 85 135 159 151 169 242 324 371 384 362 292 187 100 71 72 66 60 58 59 79 101 105 94 65 33 21 10 -18 -46 -48
6072 -48 -32 -2 24 28 25 32 59 101 122 117 114 130 147 141 107 60 47 81 128 162 184 209 233 237 215 171 108 43 13 17 25 38 51 36 -24 -108 -166 -175 -154 -142
6055 -142 -148 -152 -147 -136 -104 -44 -4 -32 -113 -189 -233 -252 -256 -237 -202 -173 -147 -115 -89 -75 -58 -39 -21 9 44 61 68 69 55 27 -11 -45 -70 -65 0 88 137 139 125
6038 125 106 82 60 40 10 -15 -20 -15 6 42 62 52 17 -21 -53 -89 -113 -87 -22 46 115 173 175 125 72 50 49 36 8 -5 7 41 52 21 -6 -20 -23
6023 -23 -19 -34 -55 -43 17 100 155 168 151 118 75 37 41 94 160 214 254 279 278 245 193 149 138 137 133 129 105 69 61 65 47 35 64 109 152 184 199 203 190 165
6006 165 131 95 82 86 77 48 16 8 20 31 41 55 55 35 31 42 45 49 55 46 23 9 23 62 103 129 146 159 186 226 242 231 197 147 103 63 20 -8 -12 -11
5989 -11 -22 -33 -24 0 15 46 121 194 238 263 272 249 190 129 86 57 23 -11 -43 -82 -97 -61 -3 45 73 71 39 8 -11 -36 -60 -75 -79 -60 -33 -26 -19 9
5972 9 52 83 87 77 62 40 8 -37 -54 -27 0 2 -11 -32 -51 -54 -26 22 73 128 192 242 269 286 284 263 252 265 263 223 168 120 79 29 -28 -75 -97 -102 -103
5956 -103 -97 -96 -102 -89 -51 -5 23 38 49 45 33 38 75 130 164 154 113 57 3 -9 34 104 158 157 109 55 28 27 34 37 28 22 25 10 -9 -5 9 38 74 92 101 90
5938 90 31 -67 -160 -196 -192 -179 -144 -98 -72 -82 -114 -135 -124 -84 -43 -18 -8 -6 -22 -62 -84 -72 -57 -52 -59 -76 -98 -125 -161 -201 -224 -237 -256 -270 -258 -218 -173
5922 -173 -157 -155 -139 -119 -88 -39 16 59 73 86 107 103 65 0 -58 -59 -17 19 39 30 -8 -51 -81 -112 -148 -146 -87 -17 7 -18 -49 -73 -114 -163 -177 -156 -139
5907 -139 -139 -149 -140 -92 -18 64 100 61 3 -23 -24 -17 -5 -7 -30 -40 -23 -13 -34 -68 -108 -151 -182 -196 -189 -157 -110 -61 -34 -49 -103 -153 -171 -176 -174 -161 -141 -127 -121
5890 -121 -109 -77 -28 27 78 112 128 119 94 79 57 21 -3 -16 -9 13 20 -20 -86 -117 -99 -68 -49 -53 -98 -167 -217 -239 -236 -217 -202 -199 -213 -230 -232 -211 -177 -153
5874 -153 -116 -72 -61 -66 -67 -82 -111 -130 -139 -157 -165 -154 -137 -126 -127 -126 -115 -105 -111 -142 -160 -114 -22 63 116 127 117 118 118 102 63 15 -10 -15 -8 15 28 18 9 3 -14
5857 -14 -53 -110 -155 -169 -173 -187 -190 -161 -97 -28 5 2 -4 9 46 89 113 98 66 48 35 37 60 76 61 8 -51 -99 -151 -191 -205 -202 -189 -166 -129 -96 -73 -30
5841 -30 27 77 105 108 93 82 103 144 172 170 150 140 130 95 48 21 11 2 0 -12 -62 -124 -141 -103 -48 -9 12 21 19 14 15 21 31 25 -12 -66 -105 -123 -127 -100 -36
5823 -36 26 70 81 50 -3 -52 -74 -68 -73 -103 -124 -115 -94 -65 -32 4 41 54 46 36 29 34 45 62 93 140 188 216 221 195 151 118 109 139 201 259 289 275 217
5807 217 176 168 141 87 36 1 -18 0 60 106 106 96 117 154 173 187 218 259 287 282 259 246 244 234 205 174 144 118 114 127 125 108 96 82 56 9 -46 -81
5791 -81 -94 -106 -110 -74 -7 27 15 -8 -25 -22 17 80 131 166 187 180 154 152 166 151 111 71 42 30 27 35 56 49 10 -10 -3 -2 -28 -74 -107 -111 -107 -117 -155 -213 -276
5773 -276 -322 -328 -314 -283 -238 -220 -219 -203 -163 -102 -45 -4 25 41 31 -20 -100 -168 -191 -170 -124 -86 -72 -69 -78 -86 -81 -68 -45 -21 -15 -24 -40 -46 -33 -27 -38 -29 21 78
5756 78 107 100 99 144 187 186 153 109 93 108 121 125 113 84 51 21 -16 -61 -93 -99 -109 -135 -144 -114 -76 -60 -55 -40 -6 43 80 71 23 -24 -42 -31 -15 -28 -73
5740 -73 -111 -109 -78 -61 -72 -91 -109 -135 -179 -218 -211 -149 -71 -60 -138 -227 -263 -248 -213 -184 -188 -218 -211 -155 -102 -83 -98 -138 -194 -260 -289 -259 -204 -149 -92 -31 12
5724 12 -6 -57 -45 31 104 141 132 96 73 78 91 98 105 97 39 -58 -134 -155 -135 -89 -31 23 71 118 149 152 152 168 170 143 97 47 17 8 11 21 22 13 13 31 70 113
5706 113 147 166 171 179 180 145 73 -5 -57 -82 -74 -26 14 27 31 10 -40 -100 -168 -237 -268 -242 -191 -146 -104 -76 -88 -148 -246 -334 -378 -391 -380 -341 -276 -203 -155
5691 -155 -139 -138 -142 -139 -131 -127 -122 -105 -61 -11 9 -12 -64 -107 -121 -106 -71 -41 -27 -53 -120 -156 -121 -64 -1 72 116 105 65 38 35 38 63 101 107 80 58 42 17
5674 17 5 13 13 5 5 16 14 8 10 -11 -47 -46 -12 26 50 44 35 37 42 73 112 115 104 119 138 118 68 22 -4 -23 -51 -73 -78 -64 -16 44 63 29 -12 -32 -48 -88
5656 -88 -155 -210 -236 -244 -238 -225 -192 -140 -104 -104 -130 -149 -150 -147 -128 -82 -43 -40 -62 -114 -156 -123 -46 27 91 144 165 151 119 77 41 8 -38 -89 -124 -141 -173 -214
5640 -214 -224 -218 -224 -235 -226 -186 -132 -106 -122 -145 -146 -113 -55 -9 0 -13 -45 -98 -139 -139 -115 -87 -77 -99 -129 -127 -76 -11 25 26 -12 -60 -74 -54 -33 -27 -26 -23 -16 3 26
5623 26 24 4 -4 4 24 43 54 61 59 29 -11 -24 -11 3 6 -19 -74 -119 -138 -144 -127 -91 -78 -85 -72 -31 10 32 48 76 88 58 2 -54 -96 -123 -145 -162 -166 -161
5606 -161 -148 -133 -116 -93 -89 -111 -144 -186 -212 -190 -130 -75 -43 -22 -6 -8 -35 -68 -67 -42 -13 14 9 -36 -98 -147 -166 -149 -105 -63 -48 -33 10 71 131 190 232
5590 232 232 195 148 86 7 -68 -137 -183 -197 -193 -177 -157 -141 -140 -151 -149 -117 -81 -60 -30 15 57 83 78 46 23 23 6 -47 -116 -158 -147 -119 -110 -118 -127 -133 -147 -149 -120
5573 -120 -86 -82 -88 -92 -104 -90 -32 25 50 38 11 -9 -9 -12 -33 -44 -42 -37 -31 -20 3 20 14 -2 -3 10 30 59 69 33 -30 -88 -124 -159 -201 -231 -226 -188 -160 -158 -153
5556 -153 -137 -122 -108 -73 -28 -12 -15 -18 -44 -100 -147 -158 -140 -111 -84 -60 -52 -73 -114 -151 -160 -131 -88 -51 -28 -18 -15 -20 -33 -56 -84 -92 -73 -35 0 2 -18 -32 -37
5539 -37 -46 -58 -68 -71 -58 -33 -2 34 67 97 136 176 191 172 136 107 102 124 169 211 226 233 242 227 192 150 95 32 -25 -59 -66 -45 13 95 150 160 139 103
5523 103 75 49 17 0 3 18 16 -11 -30 -28 -21 -19 -12 -16 -68 -149 -209 -227 -226 -221 -206 -181 -150 -103 -48 -26 -35 -31 -23 -34 -57 -83 -117 -164 -198 -196 -179 -175 -169 -144 -127 -114
5505 -114 -88 -57 -33 -29 -33 -23 -15 -29 -49 -49 -27 -9 -15 -45 -72 -61 -19 22 43 27 -16 -66 -104 -116 -118 -119 -95 -49 -12 4 5 -4 -27 -60 -88 -103 -110 -92 -53 -20
5488 -20 -11 -21 -14 18 57 113 166 189 184 154 120 93 66 49 50 81 142 187 184 165 163 148 111 60 -6 -66 -105 -122 -126 -146 -180 -201 -202 -211 -217 -190 -135 -96 -95 -97 -71
5471 -71 -15 68 141 138 57 -18 -31 15 75 103 97 65 30 18 33 61 84 109 138 142 107 52 13 10 29 47 62 81 113 140 155 175 178 151 109 60 21 3
5455 3 10 28 24 7 -8 -23 -43 -66 -85 -83 -40 25 73 66 19 -12 -26 -39 -52 -72 -102 -144 -184 -191 -153 -106 -88 -76 -39 12 54 75 80 69 47 22 7 9 18 9
5438 9 -34 -93 -128 -112 -52 18 67 90 96 84 65 54 51 39 7 -24 -54 -92 -139 -203 -258 -285 -281 -251 -206 -146 -95 -73 -56 -7 63 120 159 186 183 144 84 26
5422 26 -18 -49 -72 -104 -150 -185 -179 -153 -140 -120 -92 -90 -108 -134 -145 -127 -114 -110 -88 -56 -2 76 145 175 168 137 100 90 110 118 109 92 61 17 -24 -64 -96 -97 -76
5405 -76 -87 -131 -159 -143 -98 -49 -8 26 61 91 103 72 3 -55 -77 -77 -87 -116 -142 -125 -65 -14 2 1 -8 -17 -22 -18 -4 0 -7 -17 -20 -19 -27 -43 -55 -41 -5 16 5
5388 5 -29 -66 -89 -118 -151 -155 -130 -88 -48 -33 -48 -82 -114 -126 -110 -54 6 36 43 37 33 35 31 25 25 25 10 -24 -55 -59 -39 15 88 126 106 48 -8 -16 20 47 43 39
5370 39 39 35 30 9 -9 20 83 135 175 220 237 178 68 -18 -55 -48 -10 41 83 109 143 198 230 193 108 26 -28 -41 -31 -13 1 -9 -16 18 51 47 31 17
5354 17 -23 -87 -124 -119 -85 -29 24 65 93 92 64 35 14 9 8 -12 -47 -79 -113 -153 -179 -178 -142 -96 -85 -94 -91 -80 -47 14 64 72 57 49 58 80 88 85 89 99 108 104 72
5336 72 26 12 29 24 0 -1 12 20 18 9 -2 -20 -35 -37 -15 60 161 212 195 145 103 82 60 34 12 -15 -62 -98 -77 -17 35 64 64 49 43 58 71 67 52
5319 52 23 -17 -61 -99 -114 -108 -105 -129 -146 -112 -59 -4 59 100 113 114 89 46 12 -14 -45 -76 -95 -104 -119 -148 -191 -238 -280 -320 -349 -333 -297 -285 -272 -233 -185
5304 -185 -145 -107 -77 -85 -99 -73 -28 -4 -6 -19 -24 -11 1 -5 -20 -46 -72 -67 -44 -34 -46 -67 -83 -88 -79 -69 -77 -93 -90 -61 -44 -39 -10 31 44 40 65 114 147 148 124
5286 124 84 28 -45 -134 -216 -261 -246 -178 -85 9 71 67 16 -40 -93 -127 -129 -121 -105 -100 -136 -202 -260 -263 -207 -143 -116 -127 -131 -115 -88 -33 50 126 174 174 132 97
5270 97 81 61 39 7 -42 -104 -157 -157 -104 -32 31 70 90 105 134 181 220 246 273 287 259 202 170 189 214 227 249 261 243 206 173 150 120 66 17 26
5255 26 83 130 134 93 44 21 11 3 -1 -7 -20 -35 -44 -52 -53 -45 -47 -61 -52 -2 62 120 139 103 60 39 15 -38 -102 -132 -103 -28 55 128 189 231 274 332 364 341
5238 341 278 208 156 111 64 19 -15 -48 -96 -143 -154 -117 -48 28 109 174 188 154 115 100 89 51 2 -56 -135 -187 -181 -144 -109 -96 -111 -134 -142 -143 -145 -159 -171
5222 -171 -152 -128 -139 -171 -205 -237 -248 -224 -171 -101 -33 13 42 44 24 9 6 25 79 149 199 218 209 182 146 119 117 129 145 170 156 93 29 10 53 123 163
5207 163 161 142 100 18 -68 -133 -179 -187 -175 -197 -235 -245 -228 -203 -170 -99 8 112 182 215 246 287 297 263 222 196 176 139 68 -12 -57 -44 -10 0 -3
5192 -3 2 19 21 0 -9 16 60 95 104 98 84 69 69 87 106 117 141 167 152 84 -7 -85 -141 -173 -170 -138 -100 -94 -127 -169 -191 -180 -141 -90 -55 -60 -88 -100 -96 -94 -85 -55
5174 -55 -21 -4 -4 -14 -23 -8 18 15 -37 -115 -188 -236 -240 -197 -140 -94 -64 -52 -43 -13 30 72 91 76 30 -25 -67 -99 -133 -162 -175 -164 -118 -40 29 67 84 89
5158 89 90 89 87 71 20 -50 -101 -131 -155 -157 -129 -83 -22 34 41 -15 -99 -167 -191 -179 -169 -178 -211 -259 -275 -244 -196 -150 -98 -52 -38 -51 -74 -100 -115 -86 -11 46
5142 46 64 95 125 120 113 111 88 46 1 -17 -6 -15 -66 -102 -87 -46 -21 -50 -106 -148 -180 -183 -145 -87 -23 25 40 24 4 -23 -67 -118 -173 -224 -263 -299 -329 -349
5126 -349 -348 -302 -199 -90 -52 -65 -70 -58 -47 -36 -19 8 28 29 29 37 54 42 0 -16 9 47 58 40 29 13 -31 -87 -125 -115 -57 29 126 181 172 123 37
5110 37 -69 -137 -133 -94 -72 -81 -109 -127 -116 -85 -34 23 56 54 26 -14 -49 -52 -29 -2 1 -20 -32 -8 27 40 24 1 -11 -14 -17 -18 -27 -51 -84 -115 -125 -119 -118 -111 -99
5093 -99 -108 -143 -166 -155 -122 -63 16 66 73 59 15 -39 -58 -38 -19 -20 -29 -37 -39 -35 -46 -81 -116 -116 -75 -27 -10 -10 -3 20 62 95 96 70 49 76 133 175 186 182 189 193
5075 193 167 114 57 14 -13 -38 -72 -102 -131 -154 -147 -104 -36 29 59 47 16 0 2 10 8 0 -11 -26 -2 63 119 146 157 159 140 103 68 27 -6 -14 -10 -6 -8 -32
5058 -32 -76 -128 -165 -164 -125 -78 -41 9 56 47 -1 -40 -55 -42 1 41 42 22 12 12 5 1 20 47 44 1 -37 -52 -47 -17 14 27 20 10 20 45 74 97 115 146
5041 146 179 200 204 187 154 103 34 -14 -16 11 41 58 59 37 -4 -46 -81 -91 -71 -42 -2 36 27 -26 -85 -117 -113 -96 -71 -10 65 106 106 84 56 41 23 -22
5025 -22 -68 -92 -118 -141 -148 -131 -112 -105 -77 -40 -37 -42 -28 -13 -12 -12 -11 -21 -13 21 56 70 64 67 85 100 96 81 67 40 5 -6 15 64 95 86 78 106 158 199 197 156
5007 156 103 47 0 -13 -3 11 25 69 155 230 270 264 223 193 177 161 156 163 153 111 56 11 -1 14 42 76 87 55 -9 -78 -114 -103 -81 -76 -68 -53 -42
4991 -42 -37 -50 -70 -70 -52 -29 0 25 30 26 20 11 -4 -18 -24 -49 -97 -138 -162 -170 -154 -120 -93 -80 -72 -67 -70 -77 -94 -111 -104 -80 -55 -43 -46 -36 -14 -4 -21 -83 -173 -236
4973 -236 -246 -223 -180 -109 -1 105 135 78 -15 -101 -147 -156 -151 -136 -119 -101 -79 -64 -49 -40 -48 -51 -41 -30 -22 -14 -2 21 49 47 17 -10 -31 -47 -75 -108 -120 -117
4957 -117 -88 -38 -6 4 7 5 0 5 43 104 130 111 85 64 38 8 -15 -29 -49 -73 -78 -56 -13 29 63 94 117 130 155 192 193 140 67 8 -19 -18 -3 15
4941 15 38 58 64 64 68 65 38 0 -16 -9 -9 -26 -36 -34 -36 -48 -64 -70 -62 -53 -35 -25 -57 -130 -198 -200 -124 -37 -5 -10 3 44 59 30 1 5 33 64 64 23 -43 -111 -171
4923 -171 -221 -241 -228 -202 -167 -133 -117 -115 -116 -114 -122 -143 -149 -138 -117 -86 -63 -53 -56 -79 -100 -91 -58 -36 -30 -48 -89 -119 -120 -112 -124 -144 -133 -99 -83 -84 -76 -78 -100 -123 -157
4906 -157 -204 -228 -211 -156 -79 -24 -12 -8 18 47 40 -2 -35 -29 27 120 180 174 127 78 48 30 15 -2 -28 -62 -109 -160 -188 -193 -181 -156 -153 -186 -214 -204 -179 -149
4890 -149 -111 -97 -109 -117 -105 -85 -72 -67 -77 -87 -66 -44 -42 -43 -50 -61 -65 -72 -85 -100 -102 -52 27 75 69 46 46 57 54 42 25 15 13 14 23 37 49 76 119 143 138 123
4872 123 108 115 151 187 188 134 61 29 27 2 -25 -25 -25 -53 -87 -123 -175 -212 -219 -203 -169 -112 -22 70 130 160 184 199 170 95 44 47 75 117 155 163 144 119 115
4855 115 123 122 99 57 30 17 7 26 65 95 106 99 77 41 4 4 56 113 147 171 180 169 141 120 106 66 5 -41 -71 -80 -66 -58 -55 -29 12 56 105 148 169
4839 169 166 149 114 64 20 -3 0 19 35 43 50 57 68 79 85 86 90 100 129 149 115 54 19 38 87 105 78 49 36 31 20 0 -14 -21 -35 -33 -4 0 -35 -82 -107
4821 -107 -79 -19 19 27 40 77 93 55 -4 -38 -33 -17 -20 -42 -64 -75 -59 -13 19 6 -27 -67 -102 -123 -174 -253 -279 -252 -243 -265 -276 -258 -223 -187 -171 -185 -211
4806 -211 -211 -164 -75 17 64 64 48 16 -41 -107 -149 -175 -188 -192 -213 -237 -233 -211 -168 -90 13 107 154 142 97 64 59 53 19 -13 -5 36 74 62 17 -12 -41 -106
4790 -106 -189 -225 -179 -113 -95 -114 -115 -78 -27 8 12 0 -9 -8 3 3 -13 -34 -58 -80 -98 -107 -104 -109 -133 -165 -189 -197 -196 -175 -136 -108 -93 -84 -74 -62 -58 -42 1 48 73
4772 73 56 6 -58 -129 -178 -174 -124 -63 8 71 110 158 201 198 160 117 77 43 9 -17 -13 21 71 118 139 140 145 161 166 157 155 166 188 210 210 153 66 9 -6 23
4755 23 73 100 104 99 96 89 90 100 105 104 84 37 -5 -6 26 70 114 142 147 118 63 11 -26 -60 -112 -166 -182 -171 -155 -156 -176 -194 -193 -160 -104 -44 -7 1 -10 -50 -96
4738 -96 -110 -81 -19 48 102 145 189 232 254 244 214 182 150 104 41 -21 -67 -90 -82 -31 38 97 134 136 112 70 0 -94 -175 -205 -197 -192 -182 -164 -146 -116 -75
4722 -75 -38 -12 5 17 19 19 24 32 27 8 -5 -24 -54 -80 -107 -125 -135 -134 -99 -51 -17 1 33 95 170 221 212 166 116 80 77 72 27 -19 -28 -11 21 70 114 147
4705 147 164 150 117 78 52 66 105 131 132 103 69 72 93 76 33 31 70 82 32 -37 -56 -12 47 102 124 90 17 -89 -182 -193 -139 -113 -152 -194 -188 -156
4690 -156 -115 -55 -1 30 56 78 89 76 52 31 15 29 68 76 41 -8 -65 -102 -100 -93 -99 -130 -168 -174 -148 -120 -103 -85 -47 22 84 88 69 56 45 58 110 177
4674 177 216 200 164 154 171 206 253 295 300 240 142 65 5 -54 -77 -43 -9 -18 -53 -68 -45 -27 -43 -94 -176 -243 -263 -247 -205 -144 -92 -59 -9 69 134 150
4659 150 132 122 118 118 119 113 118 129 130 109 63 15 -6 -29 -79 -126 -150 -167 -145 -59 44 118 155 151 101 20 -57 -106 -143 -192 -224 -236 -260 -299 -315 -267 -171 -91
4642 -91 -44 -13 -5 -8 15 62 84 54 -17 -111 -176 -180 -146 -108 -71 -30 12 41 58 78 103 127 143 138 125 127 143 147 135 112 68 0 -58 -92 -96 -75 -68 -64 -22 23
4625 23 23 -24 -80 -106 -109 -101 -95 -92 -84 -80 -64 -34 -24 -20 8 47 76 75 34 2 19 52 68 93 144 200 221 188 127 75 56 68 82 85 90 107 113 95 72 60 70
4608 70 74 38 -18 -71 -110 -141 -176 -208 -207 -176 -151 -143 -136 -102 -59 -55 -88 -135 -157 -139 -123 -101 -46 1 14 -4 -27 -15 30 74 95 88 59 22 0 15 66 108
4592 108 105 86 63 37 37 49 50 57 70 86 107 122 115 83 38 -1 -5 21 28 9 6 34 89 134 133 97 49 8 -4 1 5 8 30 79 130 172 205 225 229 204 159
4575 159 126 125 161 201 216 212 202 205 244 306 337 310 251 185 117 59 21 -16 -74 -125 -149 -170 -193 -207 -224 -235 -213 -168 -137 -131 -144 -167 -191 -216 -231 -231 -226 -230
4559 -230 -233 -217 -189 -179 -187 -192 -203 -209 -171 -98 -25 31 57 37 -39 -142 -222 -246 -224 -195 -172 -150 -123 -88 -52 5 75 96 49 -38 -118 -147 -125 -89 -60 -42
4543 -42 -49 -87 -134 -175 -186 -137 -42 49 112 117 70 13 -36 -83 -126 -148 -124 -73 -25 24 86 148 184 169 112 52 0 -48 -61 -33 -19 -37 -54 -52 -37 -20 -39
4528 -39 -97 -135 -112 -64 -48 -78 -126 -161 -174 -172 -169 -176 -181 -164 -124 -76 -40 -32 -56 -97 -132 -143 -136 -124 -116 -107 -80 -50 -44 -68 -111 -149 -159 -147 -131 -104 -51 -3 -7 -41
4511 -41 -50 -25 16 62 94 109 121 131 127 104 79 73 72 46 -2 -57 -106 -151 -191 -222 -239 -227 -195 -155 -115 -92 -61 -14 17 44 102 178 221 218 184 131 77 46
4495 46 38 30 18 12 14 18 4 -16 -25 -16 6 28 50 62 42 9 -10 -19 -63 -151 -236 -283 -285 -252 -194 -146 -128 -112 -90 -68 -60 -73 -90 -88 -64 -35 -8 24 68 139 227
4477 227 277 261 222 196 175 135 86 56 42 26 2 -24 -39 -35 -10 27 60 83 107 123 85 20 -8 -10 -15 -33 -56 -62 -41 -9 7 7 1 -2 0 0 -27 -67 -72 -49
4460 -49 -43 -46 -22 28 69 83 85 68 21 -14 -8 13 42 78 111 135 147 134 106 93 97 101 114 143 168 146 76 10 -17 -3 32 73 127 193 241 251 222 164
4444 164 100 62 64 69 70 81 82 73 55 24 -16 -59 -85 -66 -17 42 105 149 154 122 66 11 -15 -9 14 57 99 99 52 -10 -57 -61 -18 37 67 60 35 22 22 6
4427 6 -24 -27 -9 -5 -25 -37 -2 74 144 187 215 211 158 76 12 -5 5 26 47 61 78 106 130 135 126 106 80 73 82 107 139 156 166 164 140 106 71 50 57 93
4410 93 136 154 154 163 174 152 101 51 -2 -52 -81 -106 -125 -118 -79 -16 45 74 56 6 -30 -34 -22 -3 0 -32 -83 -104 -66 11 105 184 221 215 176 147 158 196
4394 196 243 267 244 203 176 171 180 178 141 93 50 6 -26 -39 -27 0 6 -29 -80 -87 -56 -32 -20 -1 21 25 10 -4 0 30 79 135 171 164 125 68 -1 -74 -138
4378 -138 -187 -203 -186 -159 -118 -56 10 70 110 128 124 94 59 43 42 44 56 85 115 129 127 97 36 -39 -105 -130 -104 -44 30 91 123 135 154 192 213 184 131
4362 131 82 38 -10 -70 -124 -153 -147 -109 -67 -37 14 110 216 270 254 211 168 133 124 142 155 141 115 98 92 88 85 90 94 84 71 73 96 117 107 62 12 -6
4346 -6 1 4 -1 -12 -29 -54 -91 -136 -174 -199 -217 -230 -226 -183 -106 -31 3 -6 -24 -13 19 36 17 -27 -88 -156 -225 -279 -307 -331 -362 -390 -416 -413 -357 -277 -217 -180 -149
4329 -149 -132 -112 -62 -14 -18 -58 -80 -82 -100 -143 -179 -190 -186 -172 -135 -83 -53 -61 -72 -63 -23 56 123 143 148 155 167 163 124 88 81 86 70 13 -43 -77 -89 -66 -22 7
4312 7 8 4 31 87 136 141 122 139 195 235 232 226 230 220 175 95 7 -58 -82 -63 -40 -42 -56 -65 -61 -18 57 120 144 144 143 149 171 204 208 171 125 97 91 105 122 127 126 106
4294 106 67 32 0 -30 -54 -68 -90 -113 -102 -70 -43 -33 -33 -23 -18 -39 -84 -117 -125 -126 -126 -116 -106 -101 -86 -59 -34 -4 0 -34 -65 -63 -49 -54 -73 -74 -43 -6 -2 -9 5
4276 5 24 26 32 62 94 84 18 -57 -103 -125 -128 -109 -73 -43 -20 20 70 121 176 200 175 127 84 67 55 35 35 54 60 55 60 104 161 179 158 141 146 152 135 109
4259 109 100 122 176 218 220 214 217 207 171 131 122 143 183 222 244 251 236 195 147 109 77 40 2 -27 -46 -60 -73 -72 -52 -16 26 60 105 150 154 143 139 143 152 130
4242 130 66 6 -18 -39 -101 -159 -169 -148 -124 -129 -165 -187 -174 -126 -65 -26 14 66 95 115 133 115 53 -8 -30 -31 -23 15 88 166 195 155 95 53 38 42 37
4227 37 -3 -49 -60 -71 -126 -215 -281 -268 -189 -101 -37 -9 -12 -23 -21 -5 10 15 6 -1 4 26 52 49 21 2 0 6 3 -14 -30 -28 2 59 102 109 84 30 -13 -30 -37 -34
4209 -34 -28 -23 -15 -7 6 28 53 59 42 25 22 38 70 116 162 175 165 150 130 106 78 42 4 -25 -52 -86 -99 -64 -16 22 72 119 145 161 164 138 96 61 51
4192 51 70 106 149 176 164 136 130 144 140 110 93 96 93 93 109 139 177 213 242 255 255 249 239 235 240 221 161 80 14 -13 -25 -56 -90 -99 -84 -48 -13 -3 -14 -46
4175 -46 -82 -97 -87 -40 42 130 181 171 129 85 43 27 45 60 43 18 15 20 12 17 46 80 119 146 132 81 36 34 77 126 131 77 -7 -97 -159 -168 -136 -106 -93
4159 -93 -102 -118 -123 -118 -104 -56 25 85 101 123 148 138 128 147 160 150 143 152 165 157 153 168 177 156 82 -15 -74 -74 -53 -54 -67 -76 -96 -133 -177 -200 -202 -204 -211 -202 -175 -156 -157
4141 -157 -174 -193 -197 -187 -167 -141 -108 -89 -102 -118 -123 -125 -133 -160 -201 -226 -204 -153 -107 -73 -43 -32 -56 -98 -125 -120 -107 -119 -126 -110 -88 -80 -105 -146 -157 -134 -108 -86
4124 -86 -57 -26 -4 8 34 78 109 117 114 111 110 99 84 76 69 59 41 17 -6 -29 -28 -3 12 19 7 -41 -96 -131 -158 -161 -114 -36 31 74 92 73 38 22 19 6
4108 6 -6 3 31 38 16 0 -2 -20 -53 -66 -65 -73 -76 -77 -97 -117 -101 -52 5 40 40 38 46 40 26 44 116 204 247 242 220 205 209 218 204 156 87 24 -25 -55 -58 -44 -12
4089 -12 27 60 86 82 20 -63 -103 -90 -72 -80 -85 -66 -57 -92 -146 -191 -223 -239 -250 -262 -258 -223 -163 -105 -63 -38 -43 -59 -50 -13 19 31 26 22 41 67 77 78 60 24
4072 24 -7 -28 -40 -58 -68 -59 -58 -81 -119 -157 -189 -210 -214 -201 -175 -160 -168 -175 -165 -149 -142 -133 -128 -162 -214 -218 -166 -107 -82 -83 -92 -93 -65 -19 20 40 35 25 19 -7 -56 -83
4055 -83 -77 -71 -81 -113 -162 -206 -228 -209 -150 -73 4 63 100 131 140 105 66 68 114 175 212 232 243 218 163 111 101 130 139 100 40 -5 -28 -29 -13 11 29 34 30
4038 30 25 21 2 -29 -46 -47 -37 -19 -23 -61 -105 -116 -94 -66 -74 -124 -163 -167 -162 -167 -170 -142 -98 -68 -38 5 47 54 34 20 -1 -46 -80 -94 -129 -174 -194 -211 -244 -270
4021 -270 -279 -279 -255 -201 -137 -93 -82 -104 -125 -106 -44 33 84 89 61 36 44 55 19 -55 -130 -181 -206 -202 -173 -140 -116 -74 -3 71 124 122 60 -21 -72 -69 -23 38
4005 38 68 60 50 50 72 118 165 192 196 183 156 136 135 121 90 54 2 -67 -138 -194 -236 -257 -242 -204 -157 -116 -102 -103 -98 -82 -51 -31 -53 -99 -127 -140 -169 -195
3989 -195 -196 -175 -155 -163 -186 -197 -178 -115 -26 47 96 135 161 178 180 163 158 157 121 62 10 -49 -125 -191 -234 -248 -228 -188 -138 -94 -85 -112 -131 -127 -117 -94 -69 -62 -61
3972 -61 -54 -17 41 82 78 49 19 -10 -28 -40 -73 -123 -175 -232 -282 -309 -323 -321 -303 -276 -227 -171 -135 -120 -133 -169 -186 -158 -116 -96 -90 -76 -32 6 -3 -45 -95 -125
3956 -125 -113 -61 17 86 100 51 -27 -101 -177 -264 -314 -279 -179 -78 -5 27 16 -4 -24 -58 -83 -94 -88 -31 60 129 155 147 134 128 119 115 141 179 175 123 65
3941 65 17 -36 -77 -65 -18 33 85 125 155 169 136 82 48 26 3 -14 -28 -42 -49 -67 -103 -121 -93 -40 10 39 29 -15 -66 -93 -99 -121 -169 -204 -173 -79
3925 -79 4 28 19 7 -19 -64 -83 -83 -87 -87 -69 -18 55 111 132 119 90 64 34 22 50 111 183 223 211 157 92 48 16 -20 -65 -118 -167 -190 -169 -135 -138 -178
3909 -178 -208 -198 -156 -96 -48 -40 -50 -52 -55 -76 -106 -127 -122 -73 -5 43 53 46 44 30 6 -4 -4 -5 -7 7 41 92 155 204 226 221 203 190 171 137 96 61 23 -24
3892 -24 -54 -50 -32 -19 -15 -30 -58 -64 -42 -25 -25 -23 -8 6 16 5 -25 -46 -53 -64 -69 -59 -39 -4 29 32 8 -7 4 22 31 45 78 128 173 194 187 164 143 140 153
3875 153 146 120 114 140 181 219 227 188 138 116 113 105 73 22 -16 -34 -55 -93 -137 -175 -212 -215 -139 -19 75 132 144 107 61 46 74 123 154 168 174 176 175 170 157
3858 157 137 124 129 122 85 53 56 79 100 117 137 144 120 82 27 -52 -120 -154 -165 -160 -149 -137 -111 -75 -48 -51 -82 -98 -64 -5 39 64 81 86 65 31 7 10 32
3842 32 49 57 63 54 36 53 114 164 164 127 87 64 53 48 64 106 132 106 51 -4 -41 -58 -76 -107 -142 -169 -178 -168 -151 -131 -97 -53 -7 20 7 -22 -19 14 29
3825 29 19 1 -37 -67 -58 -45 -50 -43 -21 -7 -1 17 62 103 122 137 155 176 189 199 235 285 315 307 268 227 215 233 234 201 167 160 176 184 164 117 48 -15 -50
3809 -50 -73 -101 -128 -172 -219 -224 -175 -101 -39 11 63 106 105 46 -38 -115 -165 -185 -183 -170 -158 -152 -158 -170 -171 -160 -149 -151 -153 -144 -130 -109 -81 -55 -26 28 93 148 201 232
3792 232 223 209 230 271 300 298 260 189 94 12 -22 -31 -30 -25 -16 4 24 34 46 68 89 100 89 67 64 61 38 16 9 13 7 -11 -19 -12 -3 2 -15 -55 -64 -35 8 62 99
3774 99 123 156 192 207 177 118 57 22 18 30 43 36 36 72 95 93 87 65 38 36 45 34 8 -15 -22 -8 11 17 -8 -48 -69 -75 -78 -75 -63 -44 -29 -14 9 12 -40 -122
3756 -122 -194 -235 -237 -214 -181 -148 -116 -81 -60 -45 -15 18 30 18 18 57 108 152 208 259 257 196 97 -5 -82 -134 -174 -202 -213 -193 -147 -98 -44 17 54 65
3740 65 73 69 37 -20 -78 -103 -91 -71 -65 -40 13 66 95 86 57 44 55 53 21 -28 -100 -174 -214 -220 -206 -183 -179 -184 -157 -94 -39 -19 -26 -43 -65 -85 -98 -114 -144 -169
3724 -169 -146 -82 -27 -5 -18 -43 -51 -22 37 67 42 3 -25 -13 37 78 105 145 201 239 224 178 147 144 150 157 182 220 255 268 251 216 173 119 48 -7 -26
3708 -26 -27 -30 -25 -8 -13 -60 -117 -146 -131 -98 -91 -110 -115 -83 -43 -29 -25 -9 11 24 49 84 95 82 54 31 31 36 23 -14 -61 -84 -71 -50 -42 -23 9 24 21 18 31
3690 31 49 49 44 35 23 23 27 41 62 70 66 60 67 74 57 19 -35 -89 -121 -139 -138 -125 -129 -149 -170 -195 -228 -266 -275 -249 -202 -138 -85 -58 -27 11 25 -12 -80 -128 -131 -106
3673 -106 -91 -91 -90 -76 -47 -20 -15 -7 22 42 50 65 66 52 35 18 4 -10 -14 0 25 33 21 2 -16 -28 -25 8 52 69 62 45 32 28 12 -8 10 70 118 120 96
3655 96 94 129 160 168 182 227 299 341 304 223 145 83 44 32 27 15 -16 -86 -168 -201 -171 -101 -27 6 8 23 53 60 44 36 45 57 66 73 73 61 27 -18 -49 -73
3638 -73 -110 -165 -204 -198 -146 -55 9 -2 -37 -27 3 9 1 -16 -54 -90 -115 -130 -97 -26 23 35 22 -2 -29 -66 -102 -109 -101 -97 -70 -2 65 101 91 38 -5 -13 1
3622 1 21 35 53 75 94 100 97 105 134 187 225 207 168 150 138 98 57 61 110 183 245 257 212 127 37 -3 31 101 145 151 128 66 -14 -62 -52 -1 62 92
3606 92 67 30 25 28 10 -15 -30 -15 34 105 164 179 137 72 43 40 16 -38 -89 -87 -52 -21 -2 -5 -7 1 -19 -74 -139 -197 -230 -233 -225 -221 -215 -180 -113 -60 -59 -79 -78 -71
3588 -71 -83 -100 -114 -132 -135 -107 -58 0 41 51 56 55 26 -2 -19 -49 -81 -100 -124 -147 -134 -91 -80 -100 -96 -78 -90 -123 -141 -121 -66 -14 4 7 17 37 75 119
3572 119 135 94 22 -22 -29 -22 -18 -21 -27 -55 -119 -183 -204 -178 -119 -44 21 78 123 133 114 89 77 70 51 13 -39 -99 -154 -171 -146 -124 -124 -114 -86 -54 -29 -22 -27
3555 -27 -44 -87 -120 -112 -72 -9 54 108 135 121 93 56 16 23 76 132 157 135 68 -8 -54 -73 -79 -79 -60 10 107 166 154 86 16 -14 -9 8 32 65 82 72
3539 72 61 62 64 55 30 -7 -48 -81 -93 -84 -65 -42 -11 40 107 172 212 218 185 127 80 54 27 -6 -32 -20 19 38 26 8 0 -4 -6 0 8 -8 -53 -103 -139 -152
3522 -152 -162 -166 -131 -64 -11 7 -14 -76 -152 -208 -249 -273 -262 -237 -225 -227 -230 -231 -236 -236 -215 -190 -169 -140 -95 -46 -4 17 12 11 17 17 29 50 56 63 99 166 225 241 207
3505 207 140 84 66 66 53 25 16 35 68 92 77 31 -7 -13 10 53 93 104 99 86 49 15 27 83 159 207 200 148 72 -13 -94 -141 -129 -68 17 101 152
3489 152 141 80 26 11 13 23 55 97 109 71 2 -63 -107 -115 -85 -34 6 6 -12 -26 -32 -41 -57 -75 -86 -80 -62 -44 -22 -8 -19 -69 -133 -179 -198 -193 -183 -161
3473 -161 -129 -124 -157 -197 -201 -169 -131 -94 -45 -2 9 4 -3 -17 -37 -52 -23 51 118 136 102 56 38 51 69 91 122 147 167 173 153 123 105 101 80 44 18 -8
3457 -8 -22 -4 3 -22 -62 -118 -197 -288 -358 -374 -332 -258 -193 -158 -138 -132 -139 -136 -124 -125 -129 -137 -157 -173 -178 -158 -112 -86 -79 -54 -22 -22 -64 -114 -143 -145 -121 -78 -26 33 85
3440 85 109 104 90 93 119 145 147 132 118 111 118 122 107 97 86 63 45 33 19 5 7 20 16 0 11 51 73 71 42 -18 -67 -89 -102 -117 -137 -150 -173 -225 -273 -255
3423 -255 -179 -123 -116 -117 -99 -64 -38 -34 -26 0 20 12 -13 -35 -70 -137 -207 -251 -276 -268 -223 -177 -162 -172 -183 -180 -173 -168 -165 -180 -210 -216 -181 -139 -124 -134 -149 -152 -151 -179 -219
3405 -219 -214 -151 -84 -62 -72 -77 -66 -46 -29 -17 6 35 51 56 64 78 74 56 45 37 19 -16 -48 -55 -47 -38 -31 -3 36 62 86 100 74 17 -19 -5 13 -6 -44 -64
3388 -64 -69 -96 -142 -143 -90 -42 -33 -43 -51 -43 -18 -2 -9 -29 -79 -149 -203 -239 -253 -230 -176 -109 -43 3 8 -41 -125 -200 -229 -213 -163 -90 -24 8 6 -8 -9 8 45 87
3371 87 113 128 147 179 199 181 164 175 212 262 306 326 313 277 229 171 118 85 74 81 89 80 55 26 3 -15 -37 -67 -83 -62 -29 -11 4 29 75 134 174
3356 174 179 154 122 92 52 -4 -86 -171 -211 -185 -104 -1 72 101 110 114 116 92 31 -19 -17 10 14 -26 -86 -134 -156 -146 -128 -140 -181 -203 -174 -120 -82 -76 -93 -120
3340 -120 -136 -111 -63 -38 -52 -93 -147 -201 -229 -225 -219 -209 -187 -179 -197 -200 -154 -84 -30 9 59 119 188 252 270 233 175 109 26 -69 -133 -136 -99 -42 30 125 220
3324 220 263 247 203 148 112 112 122 100 25 -66 -117 -124 -94 -25 41 54 15 -49 -126 -184 -196 -160 -98 -45 -22 -17 -22 -31 -26 0 32 69 102 115 113 103 92 72
3308 72 41 25 32 48 48 6 -51 -79 -68 -21 28 26 -21 -56 -42 -15 -31 -75 -116 -136 -146 -167 -173 -159 -126 -67 -13 13 12 -11 -31 -24 -1 9 -2 -12 0 12
3292 12 18 8 -33 -92 -168 -269 -355 -361 -279 -192 -152 -129 -106 -75 -27 15 45 85 130 153 164 178 189 174 124 91 99 124 139 133 119 102 86 76 55 11 -36
3276 -36 -67 -70 -46 -20 -5 -3 -24 -53 -77 -81 -51 5 64 99 112 105 71 42 23 -1 -14 -10 0 5 -4 -24 -54 -93 -126 -124 -81 -46 -56 -73 -64 -47 -33 -32 -47 -55 -55
3259 -55 -58 -45 -16 -12 -51 -91 -94 -63 -19 10 7 -3 0 9 26 43 33 7 -5 -16 -33 -50 -39 4 59 116 150 141 106 63 19 -14 -27 -25 -18 -16 -20 -19 -3 33 81
3241 81 132 186 201 145 67 33 57 114 172 200 190 160 128 101 78 61 60 63 58 67 99 115 79 7 -42 -33 26 102 157 198 236 250 214 156 107 59 25 9
3225 9 1 -10 -42 -85 -108 -104 -83 -57 -29 -6 -4 -21 -49 -104 -170 -193 -173 -156 -162 -149 -87 -4 90 182 227 205 159 118 53 -28 -98 -157 -183 -150 -68 20 78 101
3209 101 98 89 100 120 118 96 73 48 20 -3 -21 -39 -49 -26 0 -21 -51 -42 -13 11 11 -9 9 75 136 173 182 153 95 28 -29 -67 -71 -53 -17 44 92 98 81
3192 81 44 -5 -44 -52 -36 -26 -14 5 -4 -34 -30 21 80 105 94 54 9 -18 -43 -53 -31 4 28 22 -20 -70 -93 -83 -48 -19 -25 -42 -35 -13 -15 -40 -47 -21 33
3176 33 96 110 73 40 36 55 80 116 162 198 218 203 137 60 21 14 4 -16 -18 4 41 83 108 100 66 27 -13 -71 -141 -190 -201 -187 -163 -144 -154 -199 -254
3160 -254 -295 -317 -311 -294 -285 -284 -265 -212 -166 -150 -139 -125 -112 -108 -121 -137 -151 -168 -178 -179 -163 -121 -67 -22 25 83 135 179 212 203 153 83 -3 -65 -60 -2 59 104
3144 104 132 132 102 72 49 34 50 78 94 106 92 37 -32 -89 -128 -165 -178 -156 -140 -133 -127 -135 -136 -147 -177 -170 -120 -63 -24 -22 -30 -9 31 66 65 15 -50 -91 -85 -39
3127 -39 24 71 85 89 93 86 78 93 98 62 24 4 -33 -78 -89 -77 -78 -97 -103 -88 -85 -99 -123 -138 -117 -69 -19 35 82 93 67 19 -29 -61 -57 -11 39 63 63 44
3110 44 28 44 87 113 115 127 141 138 124 106 105 118 119 100 78 81 105 130 149 157 165 174 164 149 144 131 105 81 64 62 72 66 27 -12 -10 19 62 112 140 139 135 163
3092 163 207 216 194 172 152 128 101 66 21 -23 -41 -29 -22 -38 -80 -132 -140 -106 -83 -73 -75 -78 -48 3 38 45 45 59 89 108 93 62 49 74 105 97 71 38 0
3076 0 -31 -42 -38 -52 -77 -83 -71 -63 -84 -133 -180 -187 -122 -11 91 149 148 106 52 4 -22 -22 -17 -27 -59 -102 -128 -130 -117 -93 -60 -35 -41 -71 -83 -59 -20 1 -2 -29
3059 -29 -82 -149 -192 -193 -149 -71 21 104 153 174 170 131 75 46 41 23 -6 -20 -22 -34 -51 -59 -57 -26 27 58 62 58 49 49 60 50 11 -38 -83 -101 -87 -73 -74 -90 -109
3042 -109 -100 -61 -21 7 17 0 -25 -65 -126 -172 -191 -206 -217 -198 -142 -99 -102 -128 -156 -170 -146 -115 -118 -144 -177 -214 -260 -318 -349 -327 -283 -259 -262 -269 -264 -265 -291 -316
3025 -316 -304 -252 -174 -109 -102 -135 -160 -168 -157 -119 -73 -65 -119 -199 -257 -279 -266 -232 -179 -106 -40 -19 -43 -80 -90 -62 -29 -11 1 26 58 63 44 50 83 91 60 28
3009 28 29 68 118 161 179 163 136 121 112 74 9 -39 -49 -17 22 19 -4 1 23 31 32 26 12 25 59 54 -9 -66 -60 -3 51 64 53 48 21 -28 -64 -92 -115 -121 -111
2992 -111 -91 -67 -45 -40 -51 -48 -30 -20 -15 -14 -17 4 39 55 69 79 65 31 -16 -59 -83 -87 -76 -88 -127 -155 -159 -137 -84 -36 -25 -41 -72 -107 -139 -169 -185 -184 -188
2975 -188 -194 -178 -147 -125 -124 -161 -200 -197 -175 -154 -133 -124 -118 -105 -89 -85 -86 -63 -30 -27 -61 -123 -190 -238 -248 -228 -203 -181 -174 -192 -213 -209 -198 -204 -195 -154 -122 -100 -68 -32 -10
2958 -10 -10 -15 -10 7 29 42 60 91 96 61 42 55 66 62 62 79 100 107 101 61 -21 -100 -140 -133 -93 -43 10 60 100 124 132 122 101 86 95 130 176 210 211 190 178
2941 178 166 138 88 22 -22 -30 -2 42 57 43 33 38 38 6 -50 -106 -138 -148 -138 -108 -70 -23 12 16 0 -41 -93 -138 -177 -192 -192 -181 -139 -71 -9 16 14 3
2925 3 -3 -11 -27 -48 -62 -68 -70 -73 -76 -70 -30 6 -6 -39 -64 -88 -104 -105 -70 -27 -49 -131 -203 -230 -217 -177 -138 -93 -17 54 98 123 111 75 35 -4 -19 -9 7 32
2908 32 53 67 81 75 36 -25 -102 -165 -171 -136 -89 -44 -12 19 65 120 156 168 175 165 115 34 -28 -41 -19 14 41 41 8 -24 -26 -11 10 29 35 45 62 60 51
2891 51 66 97 100 65 32 18 -17 -82 -115 -71 15 73 85 66 24 -24 -54 -57 -45 -29 -17 -12 -8 -13 -56 -138 -221 -260 -256 -253 -245 -204 -148 -96 -71 -80 -92 -91 -63 -17
2874 -17 13 20 33 61 74 69 59 41 23 0 -27 -51 -57 -25 50 143 213 226 166 69 -1 -42 -75 -93 -92 -89 -94 -83 -38 7 22 14 14 31 42 29 17 28 41
2858 41 35 7 -28 -51 -57 -48 -18 35 106 171 216 247 248 191 136 138 178 211 192 126 58 11 -15 -35 -38 -17 12 46 74 79 57 23 8 16 35 57 55 22 -3 0
2841 0 35 74 74 38 -10 -41 -46 -47 -47 -32 11 58 64 44 27 30 53 84 124 169 186 159 113 74 43 13 -17 -49 -75 -78 -63 -34 27 100 150 164 149 127 113
2824 113 96 65 42 44 50 40 27 20 21 24 25 30 20 -24 -75 -94 -81 -40 29 105 154 168 140 68 -13 -66 -82 -73 -55 -25 5 15 0 -67 -160 -215 -228 -215 -166
2808 -166 -115 -94 -84 -72 -52 -25 -11 -14 -15 -18 -54 -112 -143 -145 -146 -156 -165 -161 -155 -129 -69 -21 -14 -42 -89 -133 -150 -141 -131 -149 -210 -278 -321 -350 -348 -277 -158 -48 21
2791 21 53 64 77 79 48 0 -43 -56 -32 3 18 11 2 -8 -8 18 49 87 137 174 185 173 154 127 84 34 -7 -36 -47 -41 -43 -66 -87 -75 -45 -33 -24 9 51
2775 51 74 61 27 12 24 19 -19 -47 -33 -4 -4 -48 -103 -105 -59 -30 -45 -83 -115 -151 -187 -178 -135 -95 -71 -68 -77 -84 -86 -79 -63 -43 -28 -32 -61 -105 -144 -157 -141 -107
2758 -107 -79 -83 -97 -76 -24 8 5 -15 -62 -118 -141 -137 -132 -127 -106 -61 -5 37 64 85 111 151 184 182 154 135 140 155 181 227 282 314 298 252 201 151 93 22
2741 22 -29 -58 -79 -98 -106 -92 -58 -9 47 88 98 87 55 4 -45 -97 -141 -155 -148 -115 -50 15 39 6 -41 -64 -69 -74 -84 -78 -35 29 72 73 55 40 23 5
2725 5 -1 3 34 91 146 185 206 203 178 127 60 8 -17 -38 -77 -127 -157 -159 -160 -176 -202 -212 -185 -147 -127 -115 -98 -80 -48 -12 12 56 124 177 205 222 237 236 196
2709 196 133 83 44 9 -25 -78 -131 -147 -103 -35 -11 -18 0 34 59 73 73 65 66 71 85 125 175 197 193 185 165 110 22 -52 -72 -61 -68 -105 -140 -131 -84 -17 42
2692 42 63 23 -58 -117 -115 -81 -33 28 82 103 97 82 64 36 18 22 34 59 90 81 36 0 -6 2 5 1 3 -3 -38 -78 -102 -117 -125 -133 -131 -98 -60 -47 -64 -101 -132 -145
2674 -145 -147 -137 -119 -127 -159 -183 -180 -140 -86 -48 -40 -71 -130 -186 -225 -246 -231 -169 -75 7 56 72 59 60 102 145 174 190 183 161 140 138 158 176 169 141 117 106 98
2658 98 84 50 3 -30 -31 -2 42 82 83 46 -14 -101 -188 -226 -208 -181 -174 -172 -142 -80 -22 13 42 54 43 35 33 29 33 41 27 -1 -14 -9 -6 -3 -2 -7 -14 -36 -60 -58 -34
2640 -34 -14 -16 -33 -47 -43 -18 8 14 -11 -51 -78 -103 -125 -122 -99 -86 -91 -81 -25 53 125 173 181 158 117 70 44 33 8 -32 -62 -57 -11 49 82 89 104 130 152
2623 152 158 160 169 175 158 104 38 16 26 13 -32 -73 -91 -87 -74 -72 -70 -74 -98 -124 -136 -122 -81 -35 -9 -3 -14 -29 -24 -5 -2 -21 -40 -56 -93 -136 -149 -136 -120 -115 -118
2606 -118 -104 -71 -52 -64 -99 -135 -153 -142 -93 -39 -10 -9 -21 -20 -8 8 17 13 13 21 22 22 25 15 -15 -65 -107 -109 -99 -115 -135 -133 -117 -105 -86 -52 -17 19 53 60 27
2588 27 -35 -100 -131 -121 -103 -107 -115 -110 -117 -122 -85 -14 49 61 32 4 -16 3 88 190 245 226 163 115 98 83 66 56 35 -4 -49 -90 -129 -144 -103 -42 -2
2573 -2 28 51 56 59 69 69 57 30 -20 -73 -87 -59 -18 19 39 41 30 4 -9 1 21 14 -35 -77 -89 -104 -117 -102 -62 -43 -56 -61 -52 -47 -36 -12 -5 -45 -108 -141
2556 -141 -137 -128 -118 -86 -30 18 58 100 120 114 106 95 70 31 -7 -25 -18 -3 -6 -39 -91 -111 -86 -54 -21 20 58 93 136 165 162 143 112 62 3 -49 -66 -44
2540 -44 -4 46 107 154 175 203 233 229 187 131 84 37 -12 -26 13 78 123 125 103 88 108 151 175 175 176 179 161 121 89 69 33 -17 -40 -25 -4 -16 -56 -92
2524 -92 -113 -137 -154 -141 -121 -119 -123 -96 -29 47 98 109 86 55 31 15 23 63 106 123 97 48 25 39 72 99 91 50 14 4 12 26 38 41 43 48 60 81 103
2507 103 109 100 94 88 62 20 5 39 73 72 45 0 -44 -51 -36 -32 -31 -19 11 75 159 222 244 239 228 225 204 134 52 13 41 98 132 139 118 86 64 46 17 -19
2490 -19 -35 -18 8 30 47 48 37 37 36 6 -45 -91 -112 -98 -66 -35 6 53 93 133 154 144 101 34 -17 -41 -48 -39 -20 13 61 89 95 106 112 85 36 2 -1
2474 -1 -3 -7 2 13 9 -1 -27 -62 -70 -48 -9 34 61 59 43 39 51 70 97 121 123 108 101 96 71 47 49 67 58 12 -29 -53 -64 -59 -48 -45 -61 -90 -109 -110 -97 -67 -22
2455 -22 35 89 118 136 164 185 171 135 108 83 60 54 63 77 91 96 87 69 39 0 -17 -2 24 46 55 60 57 31 -2 -30 -54 -64 -52 -32 -19 -21 -51 -79 -77 -68
2438 -68 -62 -46 -29 -18 0 47 110 133 96 52 58 89 98 87 59 -1 -78 -129 -144 -134 -113 -94 -59 -10 31 65 103 135 140 123 84 22 -38 -78 -104 -127 -149
2423 -149 -169 -173 -156 -128 -98 -88 -102 -116 -124 -122 -85 -38 -35 -66 -81 -84 -109 -143 -147 -128 -102 -72 -58 -63 -66 -56 -50 -58 -76 -84 -85 -100 -107 -71 -28 -33 -75 -106 -116 -119 -123 -145 -176
2404 -176 -196 -186 -126 -47 -3 1 -16 -46 -78 -99 -110 -112 -80 -9 78 140 137 105 90 88 70 16 -49 -109 -153 -166 -156 -118 -55 5 64 148 236 263 224 173 131
2389 131 91 53 17 -4 3 32 43 37 50 90 155 215 227 186 130 101 106 118 112 115 140 138 96 42 5 -13 -29 -23 36 141 232 258 230 158 71 20 14 24
2373 24 24 -2 -53 -94 -127 -168 -178 -159 -156 -158 -137 -85 -24 3 -4 -31 -44 -26 0 17 24 31 65 106 118 115 111 96 58 19 12 32 41 27 29 67 107 93 38 6 -6
2355 -6 -27 -34 -3 39 58 59 45 14 -9 -27 -54 -89 -116 -112 -88 -86 -95 -55 25 96 129 140 155 163 154 140 121 116 114 93 56 21 0 -27 -83 -149 -173 -143 -99 -79
2338 -79 -89 -119 -171 -215 -203 -169 -159 -164 -151 -126 -124 -128 -92 -32 0 -9 -19 -14 -4 20 54 73 72 59 44 32 5 -55 -135 -185 -199 -201 -195 -181 -170 -173 -200 -232 -246 -258
2321 -258 -282 -278 -219 -157 -126 -121 -118 -107 -92 -51 10 56 86 101 84 35 -25 -69 -66 9 126 222 265 270 261 253 253 246 200 126 84 70 35 9 27 45 30 -8 -31
2305 -31 3 63 104 138 157 153 157 173 178 180 198 222 232 223 186 133 106 106 105 100 122 163 179 179 200 247 308 375 434 455 429 348 242 178 165 174 178 167 152 136
2288 136 119 105 78 48 32 32 18 -24 -29 19 39 -2 -78 -148 -172 -142 -81 -13 35 60 74 61 26 10 16 21 22 40 83 125 145 142 119 88 62 43 13 -40
2272 -40 -92 -135 -191 -242 -252 -230 -203 -180 -137 -71 -44 -57 -46 6 73 122 135 115 78 31 -12 -39 -51 -60 -67 -73 -65 -35 -15 -16 -10 -12 -34 -48 -48 -46 -58 -78 -77 -47
2255 -47 9 69 104 120 123 104 67 21 -7 -22 -68 -135 -174 -165 -132 -104 -75 -54 -62 -70 -48 -13 8 14 16 21 36 47 44 33 7 -38 -90 -140 -184 -210 -207 -181 -145 -89
2238 -89 -21 8 -36 -106 -114 -59 -2 28 24 -5 -43 -84 -128 -169 -200 -214 -220 -228 -207 -137 -45 43 119 166 175 153 106 54 35 47 59 62 64 57 50 59 79 98 100 70 21
2221 21 -25 -49 -45 -32 -19 -7 10 37 51 29 -7 -33 -44 -54 -73 -82 -85 -103 -130 -155 -151 -112 -69 -38 -12 18 38 45 56 59 52 58 66 73 106 154 172 149 77 -34
2204 -34 -140 -196 -198 -161 -106 -64 -36 -13 -1 -10 -42 -77 -107 -138 -160 -171 -170 -142 -97 -72 -85 -123 -173 -242 -304 -320 -295 -256 -225 -201 -168 -136 -124 -111 -93 -85 -97
2188 -97 -127 -139 -98 -31 18 48 70 83 65 28 9 6 -5 -40 -86 -110 -103 -85 -63 -55 -63 -96 -156 -203 -231 -258 -270 -251 -204 -144 -91 -65 -61 -50 -49 -81 -117 -127
2172 -127 -124 -121 -110 -90 -65 -46 -23 1 3 -11 -30 -56 -73 -59 -23 2 9 5 -9 -44 -74 -55 -16 -18 -63 -132 -201 -240 -244 -215 -175 -163 -153 -113 -89 -89 -52 29 92
2155 92 107 98 70 22 -21 -26 36 158 260 282 235 164 96 32 -22 -49 -55 -57 -71 -89 -95 -95 -85 -56 -34 -49 -97 -168 -245 -302 -315 -278 -220 -171 -131 -105 -103 -105
2139 -105 -74 -30 -19 -45 -85 -115 -125 -117 -100 -75 -43 -15 6 30 43 53 72 76 50 24 14 0 -31 -65 -89 -111 -126 -134 -157 -221 -299 -328 -312 -290 -256 -211
2124 -211 -188 -180 -168 -156 -135 -117 -126 -129 -112 -92 -86 -88 -63 -44 -67 -96 -93 -43 30 99 149 158 134 108 93 92 103 103 70 12 -42 -58 -47 -47 -57 -62 -58 -44 -31 -18 0
2107 0 22 38 38 36 36 34 32 15 -38 -100 -132 -130 -106 -101 -115 -99 -52 -26 -33 -41 -24 2 7 -18 -49 -43 -11 21 74 130 144 117 72 29 6 -2 -26 -61 -99 -155 -212 -225
2089 -225 -199 -181 -194 -210 -198 -184 -195 -204 -192 -170 -143 -116 -102 -106 -120 -145 -177 -201 -207 -182 -157 -157 -169 -196 -225 -228 -192 -146 -128 -129 -134 -150 -169 -181 -179 -167 -169 -195 -227
2072 -227 -246 -229 -170 -110 -95 -98 -57 9 34 8 -35 -48 -25 4 15 -5 -35 -51 -38 10 63 105 122 92 48 39 64 107 143 133 91 66 46 10 -25 -56
2057 -56 -56 -21 -1 -9 -20 -6 24 22 -37 -95 -91 -54 -29 -30 -47 -82 -149 -208 -224 -229 -231 -208 -169 -150 -171 -215 -234 -190 -112 -54 -23 -5 17 49 86 102 67 0 -43
2040 -43 -44 -32 -37 -37 -9 29 46 32 2 -23 -31 -8 26 29 0 -33 -66 -95 -120 -146 -168 -178 -177 -169 -165 -165 -141 -93 -37 23 67 94 124 143 141 140 138 117 109 137 179 208
2023 208 218 214 195 149 87 32 12 57 136 174 145 91 56 58 69 50 3 -62 -139 -183 -165 -116 -77 -62 -74 -100 -110 -79 -19 39 75 77 49 24 29 36 32 36
2006 36 28 -5 -64 -131 -155 -120 -61 11 105 177 190 168 131 91 68 59 50 50 80 122 141 118 59 3 -24 -17 27 76 93 86 79 79 59 14 -22 -49 -78 -108 -132
1990 -132 -150 -162 -164 -161 -145 -93 -15 69 142 178 170 123 67 11 -38 -55 -57 -68 -67 -48 -29 -13 1 29 56 52 22 -19 -56 -64 -50 -19 27 72 86 60 11 -23
1974 -23 -29 -25 -20 -20 -37 -61 -86 -92 -75 -79 -105 -106 -88 -89 -96 -74 -38 -5 38 76 84 80 78 71 65 53 18 -31 -73 -96 -99 -80 -67 -77 -84 -71 -50 -45 -65 -88 -75 -24 22 49
1955 49 76 103 121 117 102 107 121 107 63 24 11 13 7 -11 -28 -30 -29 -59 -120 -181 -215 -225 -217 -182 -139 -117 -105 -84 -54 -47 -72 -71 -33 3 23 43 72 97 110 133
1938 133 180 224 216 156 80 11 -27 -36 -26 -8 3 5 7 22 38 14 -49 -100 -113 -104 -96 -69 -19 24 52 74 89 120 174 195 162 121 115 124 115 86 43 -1 -36
1922 -36 -81 -127 -134 -104 -63 -30 -22 -29 -25 -8 -6 -36 -81 -130 -201 -255 -233 -151 -69 -32 -28 -27 -28 -35 -43 -46 -43 -19 -10 -56 -124 -164 -168 -145 -106 -85 -98 -112 -117 -112 -84 -58 -80
1903 -80 -131 -153 -135 -107 -91 -89 -89 -93 -109 -115 -87 -36 -4 -8 -35 -70 -94 -96 -83 -63 -51 -58 -88 -137 -179 -216 -270 -304 -299 -268 -208 -152 -143 -180 -222 -254 -277 -273 -248 -231
1887 -231 -223 -200 -159 -94 -3 67 92 92 78 83 137 213 266 264 210 133 55 -20 -82 -104 -91 -79 -78 -84 -89 -84 -81 -66 -37 -14 17 60 103 131 132 133 159 206 227 189
1870 189 115 44 14 6 -20 -57 -79 -83 -77 -50 -11 26 66 100 116 92 35 -8 -19 -19 -35 -41 -13 15 21 4 -26 -66 -85 -64 -26 12 48 74 99 140 196 238
1853 238 243 220 191 175 165 135 90 27 -49 -105 -112 -83 -52 -30 -7 20 41 40 38 51 75 106 137 153 146 109 57 10 -19 -24 -7 16 35 49 68 91 79 22
1837 22 -32 -49 -47 -50 -48 -27 1 21 28 16 -34 -117 -185 -212 -207 -173 -124 -91 -91 -82 -33 25 92 163 201 197 159 117 111 133 149 142 125 104 71 32 0 -30 -76 -139
1820 -139 -185 -188 -166 -143 -122 -101 -76 -34 40 138 230 302 342 345 322 282 243 225 237 259 250 209 164 118 76 55 42 25 8 -5 -14 -14 2 39 79 89 58
1805 58 11 -20 -23 1 44 95 144 173 181 191 210 219 210 191 188 207 210 174 130 108 107 127 142 130 99 53 -5 -51 -62 -46 -41 -69 -102 -117 -100 -66 -75 -130 -181 -211
1788 -211 -222 -199 -139 -85 -75 -86 -111 -145 -156 -146 -136 -112 -71 -38 -16 -16 -43 -82 -123 -130 -101 -77 -69 -65 -54 -53 -75 -90 -103 -114 -90 -43 -7 5 -12 -50 -89
1772 -89 -119 -132 -132 -127 -102 -60 -17 9 2 -40 -95 -130 -114 -48 28 91 139 172 166 106 20 -49 -90 -104 -97 -85 -69 -61 -89 -138 -150 -106 -31 39 63 29 -18 -36
1756 -36 -31 -44 -86 -124 -129 -89 -32 4 35 67 86 90 81 54 23 3 -11 -22 -25 -33 -43 -37 -22 -16 -9 10 19 15 22 37 58 72 49 3 -43 -55 -13 30 27 -19 -81 -101
1738 -101 -68 -33 -28 -44 -76 -125 -164 -184 -194 -182 -138 -91 -60 -46 -48 -62 -76 -74 -63 -50 -52 -85 -99 -54 23 83 82 36 -18 -61 -73 -43 19 71 72 41 28 33
1722 33 40 74 126 160 168 164 163 160 150 115 53 -6 -37 -37 -27 -25 -40 -63 -76 -84 -88 -89 -107 -124 -82 -7 31 43 53 56 56 60 86 137 187 208 189 168 151 130 115 90
1704 90 56 32 15 15 32 55 91 126 130 96 39 -10 -32 -29 -8 14 25 40 79 138 197 241 255 253 258 248 190 99 13 -64 -146 -196 -199 -192 -181 -150 -118 -86 -35
1688 -35 2 2 -7 -20 -38 -55 -80 -113 -129 -109 -60 -26 -31 -55 -73 -88 -105 -94 -49 -14 -4 3 14 23 34 55 93 122 136 151 165 174 175 163 142 122 106 84 39
1671 39 -21 -70 -114 -164 -196 -197 -178 -184 -240 -283 -242 -147 -75 -47 -33 -19 -2 10 0 -16 -11 21 38 12 -35 -94 -142 -136 -77 -19 -14 -41 -34 -21 -62 -107 -98 -46 31
1655 31 108 168 182 143 88 35 -1 -3 10 7 -27 -71 -83 -63 -34 -20 -9 20 70 129 173 189 163 97 35 -10 -48 -53 -28 1 16 7 -12 -39 -60 -53 -33 -16
1639 -16 4 12 -16 -61 -70 -37 -14 -21 -26 -6 34 74 112 150 153 123 98 74 47 20 -13 -32 -11 39 78 64 8 -38 -62 -80 -92 -94 -100 -118 -128 -124 -119 -104 -79 -87
1622 -87 -136 -193 -219 -200 -139 -61 -9 16 36 35 9 -22 -33 -4 54 108 119 106 93 80 82 102 125 142 130 92 68 59 44 18 -27 -89 -144 -178 -170 -123 -68
1606 -68 -24 -21 -94 -184 -219 -203 -161 -96 -22 30 47 50 68 103 147 177 163 104 38 7 31 106 199 272 295 265 207 141 78 37 15 0 -20 -60 -79 -56
1591 -56 -18 14 40 55 65 74 69 34 -12 -46 -64 -81 -109 -130 -114 -60 0 37 37 -1 -52 -91 -136 -198 -241 -234 -187 -138 -110 -87 -65 -71 -114 -168 -196 -199 -212 -230
1575 -230 -232 -229 -215 -182 -167 -170 -165 -157 -150 -173 -245 -328 -381 -379 -327 -263 -206 -164 -145 -140 -129 -101 -67 -51 -82 -158 -215 -196 -121 -60 -50 -66 -83 -78 -33 27 55 31 -19
1558 -19 -60 -68 -34 5 26 32 35 38 34 37 37 25 27 35 12 -49 -121 -177 -215 -237 -242 -212 -150 -70 4 42 41 13 -39 -98 -137 -152 -139 -88 -38 2 59 103 104 73 38
1541 38 39 77 131 186 211 191 151 121 98 71 53 54 73 99 109 85 41 12 12 32 60 76 69 59 71 96 122 148 143 111 98 102 115 120 79 26 18 40 62
1524 62 85 103 105 94 69 30 -6 -27 -39 -45 -34 -31 -60 -96 -107 -79 -28 6 7 -20 -54 -86 -104 -93 -80 -83 -70 -21 45 68 24 -26 -37 -19 6 21 13 8 23
1508 23 53 88 101 88 84 89 82 50 -9 -75 -118 -117 -98 -84 -56 -13 32 78 116 118 74 30 9 -3 -25 -58 -81 -82 -88 -106 -116 -111 -105 -109 -109 -86 -45 -27 -61 -112 -124
1490 -124 -87 -16 68 105 63 0 -31 -59 -119 -167 -155 -116 -72 -17 24 29 -10 -75 -125 -149 -142 -106 -72 -59 -59 -68 -88 -131 -173 -159 -102 -40 27 100 169 215 224
1475 224 207 182 175 202 234 249 248 232 189 105 -18 -158 -259 -289 -277 -256 -222 -170 -128 -116 -135 -182 -237 -258 -234 -193 -159 -118 -60 -20 -14 2 43 83 100
1460 100 91 65 23 -29 -62 -71 -93 -136 -179 -202 -189 -150 -107 -62 -7 27 30 43 81 124 160 172 140 69 -15 -69 -49 11 45 56 72 87 97 109 113 110 125
1444 125 155 180 205 227 234 214 184 156 120 113 155 193 183 140 95 54 17 4 -14 -62 -93 -65 1 56 86 124 178 217 233 237 215 165 135 143 159 152 117
1428 117 81 66 56 16 -44 -94 -128 -121 -80 -49 -31 -21 -32 -54 -72 -93 -99 -69 -36 -28 -35 -41 -37 -53 -114 -178 -184 -142 -105 -78 -44 -9 -4 -31 -45 -21 20 36 16
1412 16 -13 -26 -5 33 72 75 23 -42 -103 -160 -195 -205 -199 -190 -175 -136 -75 -13 48 131 220 286 314 272 178 97 48 35 54 79 94 94 76 47 22 -15 -84
1396 -84 -149 -160 -108 -38 4 14 0 -33 -79 -119 -124 -87 -27 27 69 89 86 71 40 23 37 53 66 87 98 80 46 20 13 21 33 48 70 105 153 184 161
1380 161 90 39 36 34 0 -67 -138 -176 -173 -159 -158 -154 -144 -141 -148 -143 -128 -133 -163 -192 -189 -152 -105 -66 -45 -45 -48 -34 3 60 124 153 123 78 56 24 -46 -121 -149 -127 -89
1363 -89 -71 -84 -96 -69 -35 -29 -36 -52 -64 -58 -40 -9 31 53 34 -5 -54 -119 -170 -160 -84 4 51 50 55 99 145 173 188 184 186 198 187 168 163 158 152 142 127 138
1346 138 176 201 197 173 133 89 49 1 -45 -65 -63 -72 -95 -93 -49 0 18 27 69 132 193 241 269 274 267 265 274 296 338 391 423 416 391 366 327 273 207 130 44 -35
1329 -35 -58 -8 66 123 148 144 120 99 85 51 -13 -83 -123 -129 -121 -111 -107 -111 -93 -21 72 122 115 66 -8 -85 -142 -161 -145 -111 -59 -9 2 -12 -17 -4 13 15 -5
1313 -5 -19 -17 -5 16 42 70 85 81 75 79 76 55 37 44 70 78 44 11 4 -14 -47 -48 -19 23 63 71 58 51 59 70 62 41 6 -53 -101 -101 -79 -74 -82 -85 -72 -37 -13 -11 -3
1294 -3 12 9 -21 -50 -59 -62 -68 -58 -7 75 155 207 219 205 174 134 106 91 89 84 49 -3 -34 -33 -22 -29 -51 -56 -50 -66 -90 -104 -118 -129 -116 -86 -78 -100 -114 -103 -87
1276 -87 -77 -39 13 35 22 -2 -19 -18 -13 -17 -21 2 34 57 92 107 67 25 13 -2 -33 -75 -113 -115 -84 -41 7 52 92 113 93 36 -16 -21 8 43 54 50 63
1260 63 79 98 131 137 90 7 -63 -88 -79 -67 -58 -35 0 34 60 92 136 161 166 156 138 153 207 254 240 179 134 103 56 -3 -55 -92 -116 -142 -183 -231 -267
1244 -267 -290 -310 -323 -327 -315 -286 -265 -244 -224 -234 -268 -315 -363 -374 -318 -221 -127 -46 21 77 115 117 85 54 64 103 122 83 7 -25 7 53 94 137 164 132
1229 132 42 -47 -99 -125 -139 -150 -156 -148 -135 -109 -66 -19 13 19 20 32 43 45 12 -47 -91 -121 -172 -233 -268 -270 -233 -188 -167 -146 -99 -27 56 119 151 157 137 108
1213 108 96 92 52 -24 -79 -75 -21 55 143 240 325 370 363 317 266 225 198 181 157 114 60 23 32 82 146 182 165 125 100 77 40 -9 -58 -86 -106 -112 -89
1197 -89 -64 -61 -64 -55 -47 -43 -32 -32 -35 -27 -7 25 55 83 102 83 30 -30 -85 -113 -98 -57 3 72 124 157 157 112 57 19 -15 -62 -117 -177 -215 -212 -197 -174 -130 -81
1180 -81 -58 -71 -101 -125 -140 -156 -183 -206 -206 -192 -196 -224 -250 -272 -303 -340 -372 -374 -320 -232 -153 -103 -81 -71 -55 -34 -23 -24 -22 -12 -14 -52 -106 -145 -163 -146 -96 -59
1164 -59 -60 -68 -67 -46 -5 30 53 79 110 142 161 151 123 98 78 63 46 14 -21 -51 -54 -26 -8 -17 -25 -37 -79 -120 -128 -128 -131 -112 -77 -70 -87 -84 -58 -45 -66 -103 -126
1146 -126 -142 -163 -181 -173 -125 -71 -19 60 168 255 267 217 165 148 169 206 212 167 112 64 24 10 9 -6 -41 -77 -106 -138 -164 -157 -113 -48 5 21 13 19 28 4
1130 4 -56 -130 -181 -176 -112 -31 24 51 33 -24 -88 -148 -201 -232 -253 -287 -302 -277 -236 -188 -134 -78 -27 -4 -11 -21 -24 -51 -111 -175 -209 -200 -185 -201 -205 -160 -91 -24
1114 -24 23 42 33 6 -14 -5 31 83 129 130 96 72 50 24 12 -1 -23 -40 -53 -51 -34 -14 12 31 12 -22 -46 -59 -51 -12 26 23 -20 -68 -82 -53 -11 30
1098 30 63 75 74 78 92 105 105 110 134 142 120 100 103 123 154 184 205 212 186 145 124 115 96 74 76 92 97 92 83 85 100 115 121 109 89 65 36 -1 -40 -57 -58 -50 -29
1080 -29 -14 -6 -3 -4 10 28 28 14 -12 -51 -86 -94 -67 -28 -8 -9 -26 -52 -74 -85 -90 -98 -132 -188 -222 -199 -132 -60 -22 -34 -71 -89 -88 -90 -95 -97 -99 -94 -71 -54 -75 -100
1062 -100 -98 -98 -110 -121 -120 -114 -109 -104 -100 -97 -110 -136 -156 -176 -201 -211 -202 -186 -174 -151 -102 -57 -35 -23 -25 -50 -97 -152 -188 -166 -100 -46 -32 -57 -97 -127 -143 -162 -184 -191
1045 -191 -180 -164 -150 -155 -191 -243 -264 -251 -257 -261 -231 -185 -149 -139 -128 -87 -39 -17 -15 -4 30 92 155 193 214 199 132 53 5 -14 -11 8 33 60 105 156 169
1029 169 153 126 81 32 -21 -85 -128 -141 -137 -139 -142 -126 -105 -86 -60 -40 -29 4 47 54 39 31 22 -5 -30 -16 19 27 -3 -39 -73 -91 -73 -65 -88 -109 -132 -160 -165
1013 -165 -143 -125 -110 -70 -20 6 -5 -40 -70 -87 -96 -74 -1 97 180 239 294 336 329 276 217 189 185 174 147 113 109 125 121 112 134 163 174 180 180 172 164 160 172 196
996 196 201 183 175 173 150 142 180 220 213 160 92 22 -35 -79 -146 -242 -334 -394 -409 -390 -358 -320 -257 -167 -104 -78 -50 -2 44 73 87 101 128 144 118 58 -27 -112
980 -112 -160 -145 -64 22 61 69 60 16 -39 -48 -9 36 52 33 10 9 9 2 2 -1 -8 0 7 0 0 13 22 24 32 43 45 42 46 49 44 34 18 -21 -98 -168 -172 -132 -103 -100 -112 -138 -171
960 -171 -206 -246 -270 -262 -257 -273 -294 -291 -240 -177 -147 -160 -222 -291 -314 -291 -233 -183 -176 -189 -198 -196 -185 -169 -154 -133 -111 -100 -83 -62 -66 -84 -91 -79 -60 -56 -61 -47 -14 10
943 10 16 20 32 42 54 77 90 96 112 125 134 142 145 142 126 113 108 80 20 -37 -65 -66 -61 -56 -44 -14 37 86 99 88 87 84 59 16 -15 -14 4 33 71 89 70 41 33
925 33 39 39 37 49 62 45 12 -10 -27 -23 14 53 68 98 156 183 169 148 115 72 49 50 52 42 20 -4 1 27 51 72 81 68 39 -2 -41 -52 -37 -7 20 12
908 12 -47 -115 -144 -135 -111 -93 -103 -126 -136 -134 -140 -158 -165 -152 -144 -155 -170 -167 -125 -73 -72 -92 -83 -76 -99 -135 -169 -178 -156 -118 -59 14 45 23 -6 -12 6 22 32 36 34 38 36
890 36 22 0 2 49 98 144 200 235 223 203 207 184 108 48 33 41 63 96 119 105 58 7 -17 4 53 76 64 40 7 -34 -81 -124 -133 -112 -87 -48 6 30
874 30 6 -31 -62 -75 -66 -37 -17 -34 -75 -129 -192 -231 -222 -179 -141 -138 -170 -200 -200 -187 -182 -182 -174 -171 -194 -212 -195 -163 -139 -124 -106 -73 -30 10 26 2 -25 -10 38 86
857 86 119 144 159 150 116 74 51 54 74 90 84 66 63 72 60 10 -61 -117 -125 -101 -93 -115 -153 -187 -208 -205 -169 -126 -106 -101 -90 -80 -81 -82 -75 -40 30 100 130 130 128 120 96
838 96 61 42 50 78 118 145 166 187 174 121 64 34 34 46 55 66 90 113 120 92 32 -20 -54 -63 -38 -31 -66 -92 -88 -66 -42 -32 -21 9 40 54 72 94 103 88
821 88 44 -4 -26 -38 -41 -31 -29 -38 -62 -100 -135 -143 -129 -110 -83 -69 -90 -121 -140 -136 -96 -29 29 69 100 126 142 145 161 180 174 164 148 112 90 78 60 43 25
805 25 12 27 69 97 76 10 -58 -72 -17 58 105 111 91 71 63 53 43 55 95 136 159 165 148 122 107 105 126 149 132 80 33 15 13 23 33 18 -16 -76
789 -76 -165 -239 -265 -235 -176 -121 -67 -24 -22 -54 -87 -101 -102 -85 -43 -24 -61 -102 -109 -111 -132 -169 -208 -228 -222 -178 -91 9 72 65 5 -76 -158 -216 -238 -237 -224 -206 -184
772 -184 -155 -123 -88 -43 -14 -31 -69 -85 -97 -119 -120 -111 -123 -140 -141 -119 -72 -26 -6 -6 -14 -31 -43 -35 -37 -61 -64 -30 26 75 75 31 -30 -69 -41 38 117 164 182 196
755 196 207 194 160 120 95 82 85 111 128 111 84 63 47 43 39 33 37 62 95 114 120 128 128 103 57 11 -24 -41 -25 7 29 26 11 9 14 18 36 55 56 57 79 121
737 121 161 167 137 87 32 -6 -10 3 6 17 34 44 63 81 93 94 70 52 66 89 110 145 183 208 234 261 260 215 146 86 65 75 79 55 13 0 29 59
721 59 56 27 3 17 52 75 97 119 111 87 66 42 33 60 98 135 161 145 94 55 55 67 47 15 -3 -28 -79 -133 -145 -130 -118 -104 -98 -114 -146 -167 -163 -147 -139
705 -139 -154 -181 -196 -184 -154 -129 -106 -77 -79 -123 -154 -138 -99 -71 -58 -41 -24 -15 -4 15 32 10 -46 -99 -141 -167 -169 -150 -105 -61 -46 -45 -51 -51 -36 -26 -21 -15 -4
688 -4 21 42 41 29 10 -19 -49 -65 -78 -95 -102 -82 -49 -31 -17 -10 -20 -45 -82 -102 -112 -128 -143 -154 -160 -167 -184 -209 -218 -214 -216 -212 -205 -196 -156 -98 -66 -62 -38 18 71 100
670 100 116 124 107 67 20 -22 -49 -59 -62 -60 -44 -3 64 146 189 161 96 38 -4 -36 -46 -45 -81 -163 -237 -274 -290 -268 -211 -162 -137 -128 -127 -121 -95 -58 -22 16 50
654 50 52 7 -50 -84 -98 -79 -20 31 44 36 34 47 80 124 144 139 117 77 28 -3 -16 -26 -16 24 60 73 87 107 101 64 10 -47 -100 -118 -99 -93 -113 -135 -145
637 -145 -145 -144 -140 -134 -130 -118 -99 -91 -93 -81 -25 64 131 160 167 135 68 18 10 22 28 34 37 20 6 7 8 4 -10 -36 -58 -71 -85 -114 -165 -220 -234 -202 -155 -102 -61 -36 -18
619 -18 -11 -6 4 14 25 20 -16 -42 -18 25 54 59 38 0 -50 -87 -80 -52 -33 -39 -78 -118 -135 -118 -63 4 50 54 22 -19 -33 9 96 172 203 210 218 220 205 154 55
602 55 -61 -149 -180 -181 -183 -168 -123 -80 -59 -59 -70 -81 -82 -81 -95 -131 -174 -205 -215 -204 -185 -162 -123 -67 -3 63 109 98 37 -21 -51 -52 -27 -2 -7 -34 -30 13 53
585 53 66 45 -17 -116 -214 -260 -253 -242 -270 -323 -354 -353 -323 -284 -264 -255 -247 -226 -173 -103 -45 7 63 94 87 57 25 15 43 97 131 130 115 101 84 74 88 119 143
569 143 123 62 12 12 64 111 120 106 53 -33 -120 -171 -177 -171 -157 -120 -67 -12 38 70 78 79 89 101 102 86 57 32 28 47 71 67 27 -2 15 60 102 130 144 136
552 136 113 97 91 75 44 -2 -73 -130 -135 -90 -4 91 159 194 212 223 228 223 192 131 67 33 18 9 6 -6 -38 -66 -72 -63 -58 -52 -17 58 146 201 193 119 32 -6 -10
534 -10 -22 -53 -106 -156 -154 -110 -74 -61 -66 -99 -145 -163 -139 -77 -6 33 37 19 -21 -62 -59 -15 21 31 10 -30 -56 -31 37 94 101 69 33 40 76 85 56 22 9
$$ [...]
-3133E9
##END=	
##TITLE=	3314#-P-0302
##JCAMP-DX=	6.0	$$ MestReNova 14.1.2-25024
##BLOCK_ID=	3
##DATA TYPE=	NMR PEAK TABLE
##DATA CLASS=	PEAK TABLE
##CROSS REFERENCE=	NMR SPECTRUM: BLOCK_ID=2                                     
##.OBSERVE FREQUENCY=	242.8036489000000131
##.OBSERVE NUCLEUS=	^31P
##NPOINTS=	1
##FIRSTX=	35.105978115445253707
##LASTX=	35.105978115445253707
##XFACTOR=	1
##YFACTOR=	1
##FIRSTY=	6.4570088651864550044
##XUNITS=	PPM
##YUNITS=	ARBITRARY UNITS
##PEAK TABLE=	(XYW..XYW)
35.105978115445253707,6.4570088651864550044,0.026974377129320908919
##$MNOVA/PEAK_DATA_TABLE=	(T,F,A,ST,SP,APT,APC)
$$ Complementary to PEAK TABLE
$$ T: Type
$$ F: Flags
$$ A: Annotation
$$ ST: Shape Type
$$ SP: Shape Parameter
$$ APT: Attached Peaks Type
$$ APC: Attached Peaks Count
Compound,None,,1,0.51198656212904469776,0,0
##END=	
##END=	
