##TITLE=	3314#-C-0328
aliquot code: 3314#

##JCAMP-DX=	6.0	$$ MestReNova 14.1.2-25024
##DATA TYPE=	LINK
##BLOCK_ID=	1
##BLOCKS=	2    
##ORIGIN=	Mestrelab Research S.L.
##OWNER=	HGL
##$MNOVA/LINK_BLOCK_TYPE=	ITEM	$$ NMR Spectrum
##$MNOVA/ITEM/POLYGON=	(XY..XY)
5835,5321
8208,5321
8208,8722
5835,8722
5835,5321
##$MNOVA/ITEM/Z=	0
##$MNOVA/ITEM/ANGLE=	0
##TITLE=	3314#-C-0328
##JCAMP-DX=	6.0	$$ MestReNova 14.1.2-25024
##BLOCK_ID=	2
##DATA TYPE=	NMR SPECTRUM
##DATA CLASS=	XYDATA
##NUMDIM=	1
##ORIGIN=	Varian
##OWNER=	HGL
##.OBSERVE FREQUENCY=	150.82960270000000946
##.OBSERVE NUCLEUS=	^13C
##.SOLVENT NAME=	d2o
##.PULSE SEQUENCE=	s2pul
##LONGDATE=	2013/03/28 16:39:29.000
##.ACQUISITIONMODE=	SIMULTANEOUS
##$ORIGINAL FORMAT=	Varian
##$MNOVA/SCALES_VERSION=	9
##$PARAMETER FILE=	(datafile, ASCII, h:/%E7%A7%91%E7%A0%94/%E9%A1%B9%E7%9B%AE/C4519/AI%E8%B0%B1%E5%9B%BE%E8%A7%A3%E6%9E%90%E8%BD%AF%E4%BB%B6%E5%BC%80%E5%8F%91%E8%AE%A2%E5%88%B6/%E8%BD%AF%E4%BB%B6%E8%AF%84%E4%BB%B7%E6%B5%8B%E8%AF%95%E6%95%B0%E6%8D%AE/FID%E6%A0%BC%E5%BC%8F%E6%95%B0%E6%8D%AE/Butyl%20methylphosphonate/3314#-C-0328.fid/fid, 0)
$$ 
##$PARAMETER FILE=	(header, BASE64, h:/%E7%A7%91%E7%A0%94/%E9%A1%B9%E7%9B%AE/C4519/AI%E8%B0%B1%E5%9B%BE%E8%A7%A3%E6%9E%90%E8%BD%AF%E4%BB%B6%E5%BC%80%E5%8F%91%E8%AE%A2%E5%88%B6/%E8%BD%AF%E4%BB%B6%E8%AF%84%E4%BB%B7%E6%B5%8B%E8%AF%95%E6%95%B0%E6%8D%AE/FID%E6%A0%BC%E5%BC%8F%E6%95%B0%E6%8D%AE/Butyl%20methylphosphonate/3314#-C-0328.fid/fid, 0)
AAAAAQAAAAEAAXWIAAAABAAF1iAABdY8AAAAyQAAAAE=
##$PARAMETER FILE=	(log, ASCII, h:/%E7%A7%91%E7%A0%94/%E9%A1%B9%E7%9B%AE/C4519/AI%E8%B0%B1%E5%9B%BE%E8%A7%A3%E6%9E%90%E8%BD%AF%E4%BB%B6%E5%BC%80%E5%8F%91%E8%AE%A2%E5%88%B6/%E8%BD%AF%E4%BB%B6%E8%AF%84%E4%BB%B7%E6%B5%8B%E8%AF%95%E6%95%B0%E6%8D%AE/FID%E6%A0%BC%E5%BC%8F%E6%95%B0%E6%8D%AE/Butyl%20methylphosphonate/3314#-C-0328.fid/log, 0)
$$ Thu Mar 28 16:31:46 2013: Experiment started
$$ Thu Mar 28 16:31:58 2013: BS 1 completed
$$ Thu Mar 28 16:32:07 2013: BS 2 completed
$$ Thu Mar 28 16:32:16 2013: BS 3 completed
$$ Thu Mar 28 16:32:26 2013: BS 4 completed
$$ Thu Mar 28 16:32:35 2013: BS 5 completed
$$ Thu Mar 28 16:32:44 2013: BS 6 completed
$$ Thu Mar 28 16:32:53 2013: BS 7 completed
$$ Thu Mar 28 16:33:02 2013: BS 8 completed
$$ Thu Mar 28 16:33:12 2013: BS 9 completed
$$ Thu Mar 28 16:37:39 2013: BS 38 completed
$$ Thu Mar 28 16:37:48 2013: BS 39 completed
$$ Thu Mar 28 16:37:57 2013: BS 40 completed
$$ Thu Mar 28 16:38:06 2013: BS 41 completed
$$ Thu Mar 28 16:38:15 2013: BS 42 completed
$$ Thu Mar 28 16:38:25 2013: BS 43 completed
$$ Thu Mar 28 16:38:34 2013: BS 44 completed
$$ Thu Mar 28 16:38:43 2013: BS 45 completed
$$ Thu Mar 28 16:38:52 2013: BS 46 completed
$$ Thu Mar 28 16:39:01 2013: BS 47 completed
$$ Thu Mar 28 16:39:11 2013: BS 48 completed
$$ Thu Mar 28 16:39:20 2013: BS 49 completed
$$ Thu Mar 28 16:39:29 2013: Acquisition complete
$$ 
$$ [...]
$$ 0 
$$ wtfile1 2 2 15 0 0 3 2 1 1 64
$$ 1 ""
$$ 0 
$$ wtfile 2 2 15 0 0 3 1 1 1 64
$$ 1 ""
$$ 0 
$$ wtune 4 2 4 0 0 2 1 0 1 64
$$ 1 "st12"
$$ 11 "s" "t" "e" "i" "n" "o" "v" "1" "2" "3" "4" 
$$ x3 7 1 19 19 19 2 1 8192 1 64
$$ 1 7604 
$$ 0 
$$ x2y2 7 1 19 19 19 2 1 8192 1 64
$$ 1 1649 
$$ 0 
$$ x4 7 1 19 19 19 2 1 8192 1 64
$$ 1 0 
$$ 0 
$$ y1 7 1 19 19 19 2 1 8192 1 64
$$ 1 -7053 
$$ 0 
$$ xz2 7 1 19 19 19 2 1 8192 1 64
$$ 1 -1851 
$$ 0 
$$ xz 7 1 19 19 19 2 1 8192 1 64
$$ 1 8718 
$$ 0 
$$ y4 7 1 19 19 19 2 1 8192 1 64
$$ 1 0 
$$ 0 
$$ y3 7 1 19 19 19 2 1 8192 1 64
$$ 1 -7880 
$$ 0 
$$ yz 7 1 19 19 19 2 1 8192 1 64
$$ 1 6315 
$$ 0 
$$ z3xy 7 1 19 19 19 2 1 8192 1 64
$$ 1 0 
$$ 0 
$$ z2xy 7 1 19 19 19 2 1 8192 1 64
$$ 1 -2142 
$$ 0 
$$ z2 7 1 19 19 19 2 1 8192 1 64
$$ 1 -7677 
$$ 0 
$$ z1 7 1 19 19 19 2 1 8192 1 64
$$ 1 20331 
$$ 0 
$$ z0_ 1 1 19 19 19 2 1 73744 1 64
$$ 1 -6464 
$$ 0 
$$ z1c 7 1 19 19 19 2 1 8192 1 64
$$ 1 0 
$$ 0 
$$ z2x2y2 7 1 19 19 19 2 1 8192 1 64
$$ 1 -883 
$$ 0 
$$ z2c 7 1 19 19 19 2 1 8192 1 64
$$ 1 0 
$$ 0 
$$ z2x3 7 1 19 19 19 2 1 8192 1 64
$$ 1 0 
$$ 0 
$$ z3x 7 1 19 19 19 2 1 8192 1 64
$$ 1 -908 
$$ 0 
$$ z3 7 1 19 19 19 2 1 8192 1 64
$$ 1 17398 
$$ 0 
$$ z2y3 7 1 19 19 19 2 1 8192 1 64
$$ 1 0 
$$ 0 
$$ z3c 7 1 19 19 19 2 1 8192 1 64
$$ 1 0 
$$ 0 
$$ z3x3 7 1 19 19 19 2 1 8192 1 64
$$ 1 0 
$$ 0 
$$ z3x2y2 7 1 19 19 19 2 1 8192 1 64
$$ 1 0 
$$ 0 
$$ z4xy 7 1 19 19 19 2 1 8192 1 64
$$ 1 0 
$$ 0 
$$ z4c 7 1 19 19 19 2 1 8192 1 64
$$ 1 0 
$$ 0 
$$ z3y3 7 1 19 19 19 2 1 8192 1 64
$$ 1 0 
$$ 0 
$$ z3y 7 1 19 19 19 2 1 8192 1 64
$$ 1 673 
$$ 0 
$$ z4 7 1 19 19 19 2 1 8192 1 64
$$ 1 -2621 
$$ 0 
$$ z4x2y2 7 1 19 19 19 2 1 8192 1 64
$$ 1 0 
$$ 0 
$$ z4x 7 1 19 19 19 2 1 8192 1 64
$$ 1 -161 
$$ 0 
$$ z7 7 1 19 19 19 2 1 8192 1 64
$$ 1 11037 
$$ 0 
$$ z5y 7 1 19 19 19 2 1 8192 1 64
$$ 1 0 
$$ 0 
$$ z5 7 1 19 19 19 2 1 8192 1 64
$$ 1 -619 
$$ 0 
$$ z4y 7 1 19 19 19 2 1 8192 1 64
$$ 1 2032 
$$ 0 
$$ z5x 7 1 19 19 19 2 1 8192 1 64
$$ 1 0 
$$ 0 
$$ z6 7 1 19 19 19 2 1 8192 1 64
$$ 1 -1315 
$$ 0 
$$ zx2y2 7 1 19 19 19 2 1 8192 1 64
$$ 1 -3908 
$$ 0 
$$ z8 7 1 19 19 19 2 1 8192 1 64
$$ 1 0 
$$ 0 
$$ zxy 7 1 19 19 19 2 1 8192 1 64
$$ 1 -2330 
$$ 0 
$$ zx3 7 1 19 19 19 2 1 8192 1 64
$$ 1 -842 
$$ 0 
$$ zy3 7 1 19 19 19 2 1 8192 1 64
$$ 1 -1288 
$$ 0 
$$ 
##$PARAMETER FILE=	(text, ASCII, h:/%E7%A7%91%E7%A0%94/%E9%A1%B9%E7%9B%AE/C4519/AI%E8%B0%B1%E5%9B%BE%E8%A7%A3%E6%9E%90%E8%BD%AF%E4%BB%B6%E5%BC%80%E5%8F%91%E8%AE%A2%E5%88%B6/%E8%BD%AF%E4%BB%B6%E8%AF%84%E4%BB%B7%E6%B5%8B%E8%AF%95%E6%95%B0%E6%8D%AE/FID%E6%A0%BC%E5%BC%8F%E6%95%B0%E6%8D%AE/Butyl%20methylphosphonate/3314#-C-0328.fid/text, 0)
$$ aliquot code: 3314#
$$ 
##XUNITS=	HZ
##YUNITS=	ARBITRARY UNITS
##FIRSTX=	34217.809561869995377
##LASTX=	-2546.6158279839983152
##DELTAX=	-0.28049244600143424799
##XFACTOR=	1
##YFACTOR=	0.000696990075571481669
##FIRSTY=	-0.029656933620572090149
##MINY=	-0.31049978733062744141
##MAXY=	11.030589103698730469
##NPOINTS=	131072
##XYDATA=	(X++(Y..Y))
$$ [...]
6183a55j8L7L4KR8N6r4n2O3R3L1r6m9R8N0l0mRLm1n0M2K2q0n5k2k0K6K7lK0R4J60R1m8j00
$$ -155 -173 -136 -102 -100 -2 54 -40 -92 -29 64 95 -1 -50 48 98 68 64 73 76 35 -15 27 49 -31 -86 -108 -128 -102 -75 -78 -58 36 196 287 239 139
6172A39j09o3J2rK3J01jj10n1M4P6Mp9m1jnL5N2L5Mn8k2J00N4j05r3K7J0p0m6kMK1J3J2J7
$$ 139 30 -33 -21 -30 -7 94 93 -17 -68 -24 52 56 -23 -64 -65 -70 -35 17 52 56 -2 -24 76 130 25 -68 -41 -31 -101 -147 -149 -145 -124 -111 -99 -82
6162h2j4K1J04R4kj17j15QK1j7O0O9J4J3qJ3O8j0j42j25L8J41O1l4m5l1K9Q5O9L8OLj9j28
$$ -82 -96 -75 29 123 121 4 -111 -103 -82 -99 -39 30 44 57 49 62 130 120 -22 -147 -109 32 93 59 14 -17 12 97 166 204 210 213 194 66
6153F6j37n4l9OJ7q9o2J02J76O2r4j8J33P3RLrP6O4m6j7l6j06m4%jk4j7J31R2j60j32J6L5
$$ 66 -71 -125 -164 -158 -141 -230 -292 -190 -14 48 -46 -64 69 142 151 154 145 221 285 239 222 186 80 36 36 35 11 -6 125 217 57 -75 -59 -24
6143b4O9K6o6j07j28RJ14M5Q6R0k5ooJN8q8j18O7M6L0K5j52n4J03o8o7P7K9L1K2m0N8Q8k2
$$ -24 45 71 5 -102 -230 -221 -107 -62 24 114 89 83 77 78 136 48 -70 -3 43 73 98 -54 -108 -5 -73 -140 -63 -34 -3 19 -21 37 125 103
6134A03l5k2nM6N2L6Om5q7j21o0L1PK0M6KN5K8j50r4O6O5P2J8p1N8J25l0j06r4p0rJ8L0P0
$$ 103 68 46 41 87 139 175 181 136 49 -72 -132 -101 -94 -74 -28 -26 29 57 -93 -187 -121 -56 16 34 -37 21 146 116 10 -84 -154 -163 -145 -115 -45
6124d5J25J43%p1J7q2j39Q1J26L0pj48j33K7l9m6Q1N0K5J6l5n2j32p2J20N0k1K9m0M5J49p
$$ -45 80 223 223 152 169 87 -52 29 155 185 178 30 -103 -76 -115 -161 -80 -30 -5 11 -24 -76 -208 -280 -160 -110 -131 -102 -142 -97 52 45
6115D5p7p2l2R0r1j87J37J42j4J19K8r0Q9Q1n8p3r3k8L7k5oL9l2r8m3P3N7j5J9QqJ8p3q4M7
$$ 45 -32 -104 -136 -46 -137 -324 -187 -45 -59 60 88 -2 87 168 110 37 -56 -84 -47 -72 -78 -39 -71 -169 -212 -139 -82 -97 -78 -70 -78 -60 -133 -217 -170
6105a70M5K6M0qJ6K5j6M5M3m5k7L2L9p5j66l9M6K8R7M4k2J27J03j03j17k8N8P7l3k8O3J9J1
$$ -170 -125 -99 -59 -67 -51 -26 -42 3 46 1 -26 6 45 -30 -196 -235 -189 -161 -64 -20 -42 85 188 85 -32 -60 -2 75 42 14 77 96 107
6096A07Q6N9m8j20r2j5rk7K1R4J01j2q3J7O2p1j21%R2O2j7p4l3P0N8m5o9q3o2R6J74R2Qq9
$$ 107 193 252 204 84 -8 -23 -32 -59 -38 56 157 145 62 79 141 70 -51 -51 41 103 86 12 -21 49 107 62 -7 -90 -152 -56 118 210 218 129
6086A29j23j0J0o2nN1om1m8j4P5O7k7m9J9J06L6j70j17J00L8n1M2j2q1K7M5P1J65J0j54j2
$$ 129 6 -4 6 -56 -61 -10 -16 -57 -105 -119 -44 23 -4 -53 -34 72 108 -62 -179 -79 -41 -92 -50 -62 -143 -116 -71 0 165 175 21 9
6077IQ7j1q2o1%k5j04j5R9O5M6J3n3L1J00jl6J0k2o9o2J6J02Q0J4%L5P3pq5k3o3j13N3Mk03
$$ 9 96 85 3 -58 -58 -83 -187 -202 -103 -38 8 21 -32 -1 99 98 62 72 50 -19 -81 -65 37 117 131 131 166 239 232 147 124 61 -52 1 5 -198
6067a98M6L03M6j78r7rJ2qK2R2Rp7K0K8o0K7R6n4j11K3M6l5JP1L5k0k9l4jQ0K6j47j06J01
$$ -198 -152 151 197 19 -78 -87 -75 -83 -61 31 40 -37 -17 11 -49 -22 74 20 -91 -68 -22 -57 -56 15 50 30 1 -33 -34 46 72 -75 -181 -80
6058h0J39M9m8j04k5K5m7m0J2J3Ol5lO9lNJ19M8o4j03j10M8J14l0k9M2PK2K3l6k2L9P9L8m3
$$ -80 59 108 60 -44 -69 -44 -91 -131 -119 -106 -100 -135 -138 -69 -72 -67 52 100 36 -67 -177 -129 -15 -45 -74 -32 -25 -3 20 -16 -38 1 80 118 75
6048G5m6oN1R0L2Rl9j54l5Q9o3o8K1o3nQ5o3p8Q1Q1mj5j0k9k2%j4K1K5n3N3J58K2L9O6j90
$$ 75 29 23 74 164 196 205 166 12 -23 66 3 -65 -44 -107 -112 -27 -90 -168 -87 -6 -10 -25 -35 -64 -86 -86 -100 -79 -54 -107 -54 104 126 165 231 41
6038D1j17J59%j25L2K3k0j3j30j08R1J06l6j01q4k6J02J70L0q4k6%JN1M6qo7n7M1No6N6P9
$$ 41 -76 83 83 -42 -10 13 -7 -20 -150 -258 -167 -61 -97 -198 -282 -308 -206 -36 -6 -90 -116 -116 -115 -64 -18 -26 -93 -150 -109 -104 -170 -114 -35
6029c5l8nK4j5Kk2l2j2m6K8Q9j1k4NPJ22J23J6M3Rn4j3q1o8Q8%r8j3r5j46N0J22K8K4O8L7
$$ -35 -73 -78 -54 -69 -67 -89 -121 -133 -179 -151 -62 -73 -97 -92 -85 37 160 176 219 228 174 161 80 12 100 100 2 -11 -106 -252 -202 -80 -52 -28 40 77
6019G7m7m8K3J8K0R1N8m5p4n5PN9l3j24k4Q8O0K8jo3n0J8P5J05J5j24r5L0O7j6j04m6L8l5
$$ 77 30 -18 5 23 43 134 192 147 73 18 25 84 51 -73 -97 -9 51 79 78 15 -35 -17 58 163 178 54 -41 -11 56 40 -64 -110 -72 -107
6009a07j00m4P1J85J68K3j02j25m3rl8N1N7r0k8R9Pm6J4L5M0J6n9j01j6J31Q2m7pJl8L6K2
$$ -107 -207 -251 -180 5 173 196 94 -31 -74 -83 -121 -70 -13 -103 -131 -32 -25 -71 -57 -22 18 34 -25 -126 -142 -11 71 24 17 18 -20 16 38
6000C8o3m7n3l2J2k8M3J17k2p6j9n1JQ8M6N8J26Q3J9l4j11q3L4O5M8O2jj02p6k4l5nN6N6j2
$$ 38 -25 -72 -125 -157 -145 -173 -130 -13 -35 -111 -130 -181 -180 -92 -46 12 138 221 240 206 95 12 46 111 159 221 220 118 42 18 -17 -22 34 90 78
5990G8m0J0qm7K9M6l5J3O3m5j39r1N9J18J6k0N6L1m5j9L5pq1l8L9kk8O0R9J3m3JJn2k7k5o5
$$ 78 38 48 40 -7 22 68 33 46 109 64 -75 -166 -107 11 27 7 63 94 49 30 65 58 -23 -61 -22 -24 -52 8 107 120 77 78 79 27 0 -25 -90
5980i0K2N3o8n2O7O2j2m4J5P3j1l7N3pq4K9R2K2k1n0q2n1J6M8j1q3l2O7P4M8N3J1n8p3n1m2
$$ -90 -68 -15 -83 -135 -68 -6 -18 -62 -47 26 15 -22 31 24 -60 -31 61 83 62 12 -70 -121 -105 -57 -68 -151 -183 -116 -42 6 59 70 12 -61 -112 -154
5969a54l3J9Q4Q4J7l2l1m5q6m2O6O8QL8N5j2m0l5l2J7L2k2lN6O4P4L5q6j04oL7K3J0l6n4k5
$$ -154 -187 -168 -84 0 17 -15 -46 -91 -177 -219 -153 -85 -77 -39 16 4 -36 -71 -103 -86 -54 -76 -79 -23 41 115 150 64 -40 -46 -9 14 24 -12 -66 -91
5959i1oM9R4N5K5k9j54r9Q7P5K7O4qn4lo0n6P1J0r4j4N2P1Q1l2j30o6O3J30P0j1k3n7k8O5
$$ -91 -97 -48 46 101 126 97 -57 -156 -69 6 33 97 89 35 32 -28 -84 -13 -3 -97 -111 -59 12 93 61 -69 -135 -72 58 128 117 94 37 9 74
5950G4j2r2pK9QJ7nKJ6j2k2o9m8J21J84R9j5j52j29%lk6nL9Q2m2j09O6Q6kN3rr9lJ8k1J8j3
$$ 74 62 -30 -37 -8 0 17 12 14 30 18 -4 -73 -121 0 184 283 268 116 -13 -13 -16 -42 -47 -8 74 32 -77 -11 75 73 126 117 18 15 33 12 30 17
5939A7p3m1JJ0O9J45O1o8n0r4j21O3P1m6P8P0q9K2Q2p3o0L8K9j2o1o5K6N9k5j3R7K1r6P1J99
$$ 17 -56 -97 -96 -86 -17 128 189 121 71 -23 -144 -81 -10 -56 22 92 3 25 107 34 -26 12 41 29 -32 -97 -71 -12 -37 -50 47 68 -28 43 242
5929B42N3l3m9j47j32qM5K5k7m3J9O5L6k4l4J3N4Pr3n4O4k0j15L6J11j9m9j1j7L0R6Q4Nr7
$$ 242 295 262 213 66 -66 -74 -29 -4 -31 -74 -55 10 46 22 -12 1 55 62 -31 -85 -21 -41 -156 -120 -9 -28 -77 -88 -105 -75 21 105 110 13
5919A3j53j00J8Q2P1N0K1J0K1l5q2j1Kr9q0N1P6K5K3J9K3Q5N8j0M2J6r0n7m2p6J4R0R0M2q2
$$ 13 -140 -240 -222 -140 -69 -19 2 12 33 -2 -84 -95 -93 -192 -272 -221 -145 -120 -97 -78 -55 30 88 78 120 136 46 -11 -53 -129 -115 -25 65 107 25
5910B5l2R6m6j43J5O0k4k2J9L3Km4m6rO3R9Q3P2rr7l6K2J1N4L1o0k4mr3p3L1J6KP7O5k9n6
$$ 25 -7 89 43 -100 -85 -25 -49 -71 -52 -19 -17 -61 -107 -116 -53 46 129 201 192 95 59 81 92 146 177 117 93 89 -4 -77 -46 -30 -28 49 114 85 29
5899B9o2p0k4L7M5k1kJ42P3j24l7P9m%L1k4K2M5q4j48m6O2K5o0k9J8k3r8j14K6J21M5J05K02
$$ 29 -33 -103 -127 -90 -45 -66 -68 74 147 23 -14 65 61 61 92 68 90 135 51 -97 -143 -81 -56 -116 -145 -127 -150 -248 -362 -336 -215 -170 -65 137
5890A37O4m0m0j01l3J09R4K2LJ3l8j71j01J37J30j8j7l3r3m8l6q6l1N0M2L5L9K8M1rp8M3J43
$$ 137 201 161 121 20 -13 96 190 212 215 228 190 19 -82 55 185 167 150 117 24 -24 -60 -146 -177 -127 -85 -50 -11 17 58 49 -29 14 157
5880A57k9j27j8om1K8M3lNkl1j5pK0J09Q5n4n2M2J9n3j5M6OJ5J19Qj89n5R8orN3m6r5p0p1
$$ 157 128 1 -17 -23 -64 -36 7 4 9 7 -24 -39 -46 -26 83 168 114 62 104 123 70 55 101 107 122 241 249 60 5 103 97 88 141 95 0 -70 -141
5870a41j3M5M5M1M3P9R0K7l6o4k4J3q8r6P5J18M4n1j78j18L6j0m2O9J22P8J7K3K4r4j08N7
$$ -141 -154 -109 -64 -23 20 99 189 216 180 116 92 105 17 -79 -4 114 158 107 -71 -189 -153 -163 -205 -136 -14 64 81 104 128 34 -74 -17
5861a7J03J1n1k0J1n7q3j3pL0P3jLJ2n5J2oj47n9K9j8K4L0O8J39pn5J13Q9rk3p2n4j8j3nj00
$$ -17 86 97 46 26 37 -20 -103 -116 -123 -93 -20 -21 -18 -6 -61 -49 -55 -202 -261 -232 -250 -226 -196 -128 11 4 -51 62 151 142 119 47 -7 -25 -38 -43 -143
5851a43o3J54J40L7L7n7j05n8m6L5Q1Pj2j6m7j7J3J2mJ4L5r3j04J23J22m6j9M2L1j0q3k9Q8
$$ -143 -206 -52 88 125 162 105 0 -58 -104 -69 12 19 7 -9 -56 -73 -60 -48 -52 -38 -3 -96 -200 -77 45 -1 -20 22 53 43 -40 -69 19
5842A9R0M7j8l8L8M5Lk5r2p0K5L1l0r3o2N4O1J5K1Pj0%M8Q8j3j12o8K6J20L1j48n0Oj32JQ5
$$ 19 109 156 138 100 138 183 186 161 69 -1 24 55 25 -68 -130 -76 -15 0 21 28 18 18 66 154 141 29 -39 -13 107 138 -10 -60 -54 -186 -185 -100
5831a00j24k9J66k5j23O9J60J52J46K9j07j20p5j4Kj04j07J9k3k1J40Q3k3J8l4k7O2lk7Nl2
$$ -100 -224 -253 -87 -112 -235 -166 -6 146 292 321 214 94 19 5 7 -97 -204 -185 -208 -229 -89 -6 -29 -11 -45 -72 -10 -13 -40 -35 -67
5823f7J1K6o1r3p2P5J76N8K8Pq3N0P8q0Kj8j98p0J03J24Q8p1o7J01K9r6p6k0O5M9n0l9J8M0
$$ -67 -56 -30 -91 -184 -256 -181 -5 53 81 88 5 55 133 53 55 37 -161 -231 -128 -4 84 13 -54 47 76 -20 -96 -116 -51 -2 -52 -91 -73 -33
5813c3j4k5J38R0j47n8N1j7P1P5p8k5J3n6%L2kJ8ml6PP5P3m3q7j0J4P7J36k8j38n2m2nR0q
$$ -33 -47 -72 66 156 9 -49 2 -15 56 131 53 28 41 -15 -15 17 15 33 29 -7 0 75 148 105 18 8 22 99 235 207 69 17 -25 -30 60 52
5803E2j02o4p8n7M9R4O0l1l6O1Om6P0M1l6L9J4n2PJ4j1j8l3J9L1j1J4m4j20k2Q3J29J11m3
$$ 52 -50 -114 -192 -249 -200 -106 -46 -77 -113 -52 -46 -92 -22 19 -17 22 36 -16 -9 5 -6 -24 -57 -38 -7 -18 -4 -48 -168 -190 -107 22 133 90
5794I0r8l4k7M2J00j7o3Rjk2N7J09O3L0qj11j09J0M3O1Q9j8j25q3OM0L2L5J0j6M3L7m0PK3
$$ 90 -8 -42 -69 -27 73 56 -7 2 1 -21 36 145 208 238 230 119 10 20 63 124 213 195 70 -13 -7 33 65 100 110 94 137 174 134 141 164
5784A64o5q4o2j8K6j4QN5K3O4P9k1o3m4K4O0m5n0k8j27rJ26l8m6J04L4o9k4Q6J27J7q6j08
$$ 164 99 15 -47 -65 -39 -53 -45 10 33 97 176 155 92 48 72 132 87 37 9 -118 -127 -1 -39 -85 19 53 -16 -40 46 173 190 104 -4
5774do5O5P3j2L7O6K7j4r5p7LJ6P1J3j62j23NL3O6O7k2j15m6J42Q4k4J07L0j72o1nq7K4P9
$$ -4 -69 -4 69 57 94 160 187 173 78 1 4 20 91 104 -58 -181 -176 -143 -77 -10 -32 -147 -193 -51 33 9 116 146 -26 -87 -92 -179 -155 -76
5765g6kM3J04N0rj3j7j4L2J2n1mN1O8J06jj44p8j5q1k3J29P0q3J7J00o4o2M8p0j45o4M0J42
$$ -76 -78 -35 69 119 110 97 80 66 98 110 59 55 106 174 280 279 135 57 42 -39 -62 67 137 54 71 171 107 45 93 23 -122 -186 -146 -4
5755dP4l0lm6k3J06L5k7qj04q5J6MK8M7L7M4m8p3j7k0N6P9l3j8Kj8M1k8p8P0Q3jj2m8o4l4
$$ -4 70 40 37 -9 -32 74 109 82 74 -30 -115 -99 -95 -67 -20 17 61 13 -60 -77 -97 -41 38 5 -13 -11 -29 12 -16 -94 -24 59 58 46 -2 -66 -100
5745a00L2J41J17J9m6j33q3L9J8K5K6o3k3O2mp9o4j5l2m1O7P5LJ00J05j05j42K0N8o3j01J3
$$ -100 -68 73 190 209 163 30 -53 -14 4 29 55 -8 -31 31 27 -52 -116 -131 -163 -204 -137 -62 -59 41 146 41 -101 -81 -23 -86 -187 -174
5736a74O9M3%o2L3J60J5j13m4j6QK5j0N7Q3k0j3L9Mk9p7o9P1P9p4q7K3J7l9J1P5O0k6j22m4
$$ -174 -105 -62 -62 -124 -91 69 84 -29 -73 -89 -81 -56 -66 -9 74 54 41 80 84 55 -22 -91 -20 59 -15 -102 -79 -62 -101 -90 -15 45 19 -103 -147
5726a47Q8l9j54L9J45j6r7l1J7N6O3k9n7L2M0K2P5K7j3N5ro4pj00j40J7O0K8M9N2J01J01J5
$$ -147 -59 -98 -252 -213 -68 -84 -181 -212 -195 -139 -76 -105 -162 -130 -90 -68 7 34 21 76 67 3 -4 -104 -244 -227 -167 -139 -90 -38 63 164 179
5717A79K8l5j88j33K0J06J33L2j6M9n8j39K9J00l2p2qmn6k4O4qq1J01J78m1q1M9m2q0R7R1
$$ 179 207 172 -16 -149 -129 -23 110 142 126 175 117 -22 7 107 75 3 -5 -9 -65 -89 -25 -33 -114 -13 165 124 43 92 50 -30 67 158
5708A58o6n0K9O9O8n3j26l5j3p3l8J8LJ5Q5O8l6n0j2l5KN8k1n8k7j00n9J14Q9j1K6M8L8L4
$$ 158 92 42 71 140 208 155 29 -6 -19 -92 -130 -112 -109 -94 -9 59 23 -27 -39 -74 -72 -14 -35 -93 -120 -220 -279 -165 -76 -87 -61 -13 25 59
5698E9l0l0L9J9m9n1OM9jp7q5k1N2J5nJ41J32p2p3j5j00r5j8J4N9K7l4K8J00Q5J9n0m8J8P9
$$ 59 29 -1 38 57 8 -43 -37 12 11 -66 -151 -172 -120 -105 -110 31 163 91 18 3 -97 -192 -210 -196 -137 -110 -144 -116 -16 69 88 38 -10 8 87
5689H7M0o9m8J4p2j04oM9O8Lq3J6N1q6j8J38L1r1m8oL0P8Qq6l5P7M1r7m1J20oj21J14J31j15
$$ 87 127 58 10 24 -48 -152 -158 -109 -41 -38 -121 -105 -54 -140 -158 -20 11 -80 -128 -134 -104 -26 -18 -104 -139 -62 -21 -118 -159 -39 -45 -166 -52 79 -36
5679c6k4Q4m8K4J04n0l7K8k5N8P6j23j61j2N0K5J7Jm9n2qK9N2k0k9J82J80j09j30Pl4n5nJ0
$$ -36 -60 24 -24 0 104 54 17 45 20 78 154 31 -130 -142 -92 -67 -50 -49 -98 -150 -158 -129 -77 -97 -126 56 236 127 -3 4 -30 -85 -90 -80
5669h0Rj3J2Mj14m6J22M6j5P5Rj23m9J05J16j0r3l3L0j6l4J6njJ03N4r0p3o3o8Q6J10o1p8
$$ -80 -71 -84 -72 -68 -182 -228 -106 -60 -75 0 9 -114 -163 -58 58 48 -45 -78 -48 -64 -98 -82 -87 -88 15 69 -21 -94 -157 -225 -139 -29 -90 -168
5660a68J5P3J12L4l9O3P7o6l7Q9Rq1K2L5j06r0O3R5K2mk0q9q1L2O6K0l9j27r2M7N9K7k8j36
$$ -168 -153 -80 32 66 27 90 167 101 64 153 162 81 103 138 32 -58 5 100 122 118 98 9 -72 -40 26 46 7 -120 -212 -165 -106 -79 -107 -243
5650b43k9J21k1q4O6Q4O0N6m8k4O7l5j0J72M2j59n7Nm5L7N5l7k7J5M5R3Nj18q1j0Jjk2oP9
$$ -243 -272 -151 -172 -256 -190 -106 -46 10 -38 -62 5 -30 -40 132 174 15 -42 -37 -82 -45 10 -27 -54 -39 6 99 104 -14 -95 -105 -104 -105 -127 -133 -54
5640e4R9L3J3J6l6k0J6q6p6M3p0j23P5J16K8K2j9m9JR0J69N6j12j19j20o9R1Q3J2N9M8rj6
$$ -54 45 78 91 107 71 51 67 -19 -95 -52 -122 -245 -170 -54 -26 -4 -23 -72 -71 19 188 244 132 13 -107 -176 -85 -2 10 69 117 108 92
5631I2JRp6j20k6j8m6K6N3O8J03Rj07r5mR1R6Jn5RP0L0%Ko3n8L0K8NJm3oN6L6P2J05j2j16
$$ 92 93 102 26 -94 -120 -138 -184 -158 -105 -37 66 75 -32 -127 -131 -40 56 57 2 11 81 111 111 113 50 -8 22 50 55 56 13 7 63 99 171 276 264 148
5620A48q5m6n3K5J16J2j06l7Nn0n0N4J33kj19L0P7k6K6N4mmn6n3M3L4jl7r4l3J4l7jQ9J02
$$ 148 63 17 -36 -11 105 117 11 -26 -21 -71 -121 -67 66 64 -55 -25 52 26 52 106 102 98 42 -11 32 66 65 28 -66 -99 -85 -122 -123 -34 68
5611F8k0j31L3J48j3m2L4kj4m7l4Q4N7ML6o8r7nj6L5O6q8p7R6J19L0l2J7Q5K1j6j3r2r2n0
$$ 68 48 -83 -50 98 85 43 77 75 61 14 -20 64 121 125 161 93 -4 -9 -25 10 76 -12 -89 7 126 156 124 141 226 247 231 218 126 34 -16
5601a6p1oL0n8n5J6M4P2L2l8k5kJ1M8L2k4n1l6l0j1J07J39o5j46K6O3m4m0M4J17O6m9oJ3n0
$$ -16 -87 -93 -63 -121 -176 -160 -116 -44 -12 -50 -75 -77 -66 -18 14 -10 -61 -97 -127 -138 -31 108 43 -103 -77 -14 -58 -98 -54 63 129 80 74 87 37
5591C7Q4J23q8j05j0j5N2M4p8p4n9o0K2L0j2j5j9M1L5r1k1J34M3q5nR4L3q5o4P5J06k2n8M8
$$ 37 121 244 156 51 41 26 78 122 44 -30 -89 -149 -127 -97 -109 -124 -143 -102 -67 -158 -179 -45 -2 -87 -92 2 35 -50 -114 -39 67 45 -13 35
5581C5M1j5oj29j39J35J11r6K3Q7l2j5J1N7R1p9j00P5M9k7j4o2l6K9MJ2M5nn6o8q3r0J2J12
$$ 35 76 61 55 -74 -213 -78 33 -63 -40 47 15 0 11 68 159 80 -20 55 104 77 63 1 -35 -6 -2 10 55 50 -6 -74 -157 -247 -235 -123
5572a23M6k7m5r6k4J22R2m9j16l6P1M3M2Q2l8o1P7K0n2P0O4o9n7L8M8j5n7pP3O5M4J03K5j60
$$ -123 -77 -104 -149 -245 -269 -147 -55 -104 -220 -256 -185 -142 -100 -18 -56 -117 -40 -20 -72 -2 62 -7 -64 -26 22 7 -50 -57 16 81 125 228 253 93
5562I3p0J07nj41p7O9J49M2l0J03N0j65p0Q3o6j34M0Q9K2O8O0n6o3n9j03n5lJ3N2L5L4K8m6
$$ 93 23 130 125 -16 -93 -24 125 167 137 240 290 125 55 138 72 -62 -22 67 89 157 217 161 98 39 -64 -119 -122 -109 -57 -22 12 40 -6
5553fNO5k8KJ06N9m7j58j33O5J35N2l9m2Q8O9m6K9l3j60M5J04j22p1Q2J9%J11O2j60j25R2
$$ -6 -1 64 36 38 144 203 156 -2 -135 -70 65 117 78 36 124 193 147 176 143 -17 28 132 10 -61 21 40 40 151 213 53 -72 20
5544B0Oj32m3MN0Q0p1p6L5J1O4J21M7M3K4k1M2Nj11r5m4QO4O5O8Kj27q6K8Ok7J9J3j8N0J01
$$ 20 26 -106 -149 -145 -95 -15 -86 -162 -127 -116 -52 69 116 159 183 162 204 209 98 3 -41 -33 31 96 164 166 39 -47 -19 -13 -40 -21 -8 -26 24 125
5534A25j5j44o3J27J09m9KJ10L0j8m2j02KL9n4L7N7q4m5k7o1Q5P5p0l2k2m2L4J6k8jk5k2N
$$ 125 110 -34 -97 30 139 90 92 202 232 214 172 70 72 111 57 94 151 67 22 -5 -66 19 94 24 -8 -30 -72 -38 -22 -50 -51 -76 -98 -93
5525i3QP2N7m4k4OlO5K8p9J5O8p2l7R0Nq5k0K5j7o6l7K9mn8m1k9KN0N5Q2R7O4M7Mk9kj6m1
$$ -93 -85 -13 44 0 -24 -18 -21 44 72 -7 8 76 4 -33 57 62 -23 -43 -18 -35 -101 -138 -109 -113 -171 -212 -241 -239 -189 -134 -52 45 109 156 160 131 129 113 72
5514G2o8j16k3R0j7j24l1J00P5p1n3O9Km3L8RRJ29J23j5j17q9L4O0kj5k8m9LO6K9k7J5Ro4
$$ 72 4 -112 -135 -45 -62 -186 -217 -117 -42 -113 -166 -97 -95 -138 -100 -91 -82 47 170 155 38 -51 -17 43 41 26 -2 -51 -48 18 47 20 35 44 -20
5504b0j5L4j7J2K7n4q1k5R0J10k8k3P5J6J4L5o6n5K3L3K1q6j08N6O5n4j3R7R5rm3l5j20p4
$$ -20 -35 -1 -18 -6 21 -33 -114 -139 -49 61 33 10 85 101 115 150 84 29 52 85 106 20 -88 -32 33 -21 -34 63 158 149 106 71 -49 -123
5494a23R9P6K6L2o2m1N1j1JP6j3j30j07L7R6k1m6L4rm5mM0J14O7q1p3%J7M3K2LK5n8j23LQ1
$$ -123 -24 52 78 110 48 7 58 47 48 124 111 -19 -126 -89 7 -14 -60 -26 -35 -80 -84 -44 70 137 56 -17 -17 0 43 65 68 93 35 -88 -85 -4
5484dj7l0N0L3MNm0l4Nl8k7O9R3N4k9r7o3pN0Q6l3j20KP2Nk0L1Q1K2q5l8K1k5j1M3J2l8n6
$$ -4 -21 -51 -1 32 36 41 1 -33 -28 -66 -93 -24 69 123 94 -3 -66 -73 -23 63 30 -90 -88 -16 -11 -31 0 81 103 18 -20 1 -24 -35 8 20 -18 -74
5474g4l7%L9Q5N3nM9N2m0n1o5k9J40Q6j42j23l5J4J13J1j54l9P4O4Q4L2KP5Qp1j2k7m5M3K2
$$ -74 -111 -111 -72 13 66 61 110 162 122 71 6 -23 117 203 61 -62 -97 -83 30 41 -113 -152 -78 -14 70 102 104 179 187 116 104 77 32 75 97
5464I7n5l0l6p0lPq1KJ18jk6J31O3r5n2nJ2K8o0o9P6J20N7L5L8j9j00p7l5n0J4M6l4nN2J6
$$ 97 42 12 -24 -94 -97 -90 -171 -169 -51 -52 -78 53 116 21 -31 -36 -24 4 -56 -125 -49 71 128 163 201 182 82 5 -30 -80 -66 -20 -54 -59 -7 9
5454IL9L9l2o3r3k6J19P4l4l2j3M8N5n9l7N7J6k9m0p1k7J7qJ2P4Q0J4l5pm3j04J8J44Q0j7
$$ 9 48 87 55 -8 -101 -127 -8 66 32 0 -13 35 90 31 -6 51 67 38 -2 -73 -100 -83 -91 -79 -5 75 89 54 47 4 -100 -82 62 142 125
5444A25p8q4NM8J3Lk0k1J9J5L2Q8P1M3Mj01j45j08j0J35P7j16p0N8Rn2o2m8PJ1K4R3L5l1N4
$$ 125 47 -37 -32 16 29 32 12 -9 10 25 57 145 216 259 263 162 17 -91 -101 34 111 -5 -75 -17 -8 -60 -122 -170 -163 -152 -128 -35 0 -31 23
5434B3O3m0j1K9o5q3K5L9j2l3o1j7J14J23K1rK1L8k9j83j88M2J97J02p4r3M1Q7mj0N2np4J
$$ 23 86 46 35 64 -1 -84 -59 -20 -32 -65 -126 -143 -29 94 115 106 127 165 136 -47 -235 -193 4 106 32 -61 -20 67 63 53 105 100 26 27
5424B7N1l8o3J6J4k9Lj1o5J3O5j21k33jK18J16l5j5J8J4L5K2NJ7l2p5j5Lk5J5L2K6N2J7m9
$$ 27 78 40 -23 -7 7 -22 -19 -30 -95 -82 -17 -138 -371 -372 -154 -38 -73 -88 -70 -56 -21 1 6 23 -9 -84 -99 -96 -121 -106 -74 -48 4 21 -28
5415b8n8j2P2N1n9l4mj04o9O3R6R8L3p2j2J06R3no4j2J8n4n8QN3P6mr6n7l1j9Q6J06Nk7j4
$$ -28 -86 -98 -26 25 -34 -68 -72 -176 -245 -182 -86 12 45 -27 -39 67 160 155 91 79 97 43 -15 -7 46 122 118 22 -35 -66 -85 1 107 112 85 71
5405G1l4j8%m5l9O3P3mJ6N2kn6r9o7O6M2q9J1J74R6n5r1n3N8J19rj08k1P4M8j16k31l9J68
$$ 71 37 19 19 -26 -65 -2 71 67 83 135 133 77 -22 -89 -23 19 -70 -59 115 211 156 65 12 70 189 180 72 51 125 173 57 -174 -213 -45
5395d5Q0Jk3r6K0J73N9o1j9K5Mm2k6jk3j4q6j59M0J78K9n3p4j23JJ14K1q9q9NJ05Q6P%L5J9
$$ -45 35 36 13 -83 -63 110 169 108 89 114 118 76 50 49 26 12 -74 -233 -193 -15 14 -39 -113 -236 -235 -121 -100 -189 -278 -273 -168 -82 -75 -75 -40 -21
5385b1JQ6J17l4j38q4j0L7M1Kj2PJ1NL0K5l9k1L3j0k0lm0j9j5o4lJ4j5Q1Q1l4k3J0o9j51p1
$$ -21 -20 66 183 149 11 -73 -83 -46 -5 -3 -15 -8 3 8 38 63 24 3 36 26 6 3 -37 -56 -71 -135 -138 -124 -139 -58 23 -11 -34 -24 -93 -244 -315
5374c15J34J15m6M9J08m2l2N0Qk4o8j01LO7J2%N6O1J9L1J9p7p0k2r6o1J16J30M1jn7n2N2O9
$$ -315 -181 -66 -112 -63 45 3 -29 21 29 5 -63 -164 -161 -94 -82 -82 -26 35 54 85 104 27 -43 -65 -161 -222 -106 24 65 64 7 -45 7 76
5365G6k7q1n7pJ3%K0L9Lj3j1n6p2j7L8O6P9N4m7q5O4Q2j14j08J4oN2J27L4l8m6j7P6N4j1Q
$$ 76 49 -32 -89 -96 -83 -83 -63 -24 -21 -34 -45 -101 -173 -190 -152 -86 -7 47 0 -85 -21 61 -53 -161 -147 -153 -101 26 60 22 -24 -41 35 89 78 86
5355H6l3k7J9o6m2J22P1p1k0N6m3q1R5J19n7n3l4j22k5P8M8P4pj20j4M6K9J05L8j10j14j01
$$ 86 53 26 45 -21 -63 59 130 59 39 95 52 -29 66 185 128 75 41 -81 -106 -28 20 94 87 -33 -47 -1 28 133 171 61 -53 -154
5346a54jJ64J00k8J0k2j24j19j12k0J64J18j9L2K1n5lJ6j6j3m1jM2k6k8j1k0Q0P8m6o2o1j8
$$ -154 -155 9 109 81 91 69 -55 -174 -286 -306 -142 -24 -43 -11 10 -45 -48 -32 -48 -61 -102 -103 -61 -87 -115 -126 -146 -66 12 -34 -96 -157 -175
5337a75J00L0o0J0J4J8N8j6m3J8j4m2J6M6k5j02n5M4N6k7q9NJ17P5J3nJP1O3OP9Q6m4r2m5
$$ -175 -75 -45 -105 -95 -81 -63 -5 -21 -64 -46 -60 -102 -86 -40 -65 -167 -222 -178 -122 -149 -238 -233 -116 -41 -28 -33 -32 39 102 108 187 273 229 137 92
5327I2j3o8j00L1M1p5L2P8p8k6J18P7l3j22o9P4O3L7Q2J0o0m7n3n9n2KJ13R6k5q9j21m5J20
$$ 92 79 11 -89 -58 -17 -92 -60 18 -60 -86 32 109 76 -46 -115 -41 22 59 141 151 91 44 -9 -68 -120 -118 -5 91 66 -23 -144 -189 -69
5318f9J20K6Ql9n6L5J7j01r3j8J1J6K4O2L8j16j53L3J45N0k6O4J30M8K2K3r6j01jm0l6L4k6
$$ -69 51 77 85 46 -10 25 42 -59 -152 -170 -159 -143 -119 -57 -19 -135 -288 -255 -110 -60 -86 -22 108 156 178 201 105 4 3 -37 -73 -39 -65
5308f5j9O9J3k4K9mm3j0k2o1l5J0k0m6K9J04J31J19l7j73n9N6j6l0N9N5L1N1k0j01n7J6P3
$$ -65 -84 -15 -2 -26 3 -1 -44 -54 -76 -137 -172 -162 -182 -228 -199 -95 36 155 118 -55 -114 -58 -74 -104 -45 10 41 92 72 -29 -86 -70 3
5299CQ5mp1p1k0P0J8n2O1N6o2kj8p5L8k3r9J13J26q4q9k7rL1J4Lql7Q0J39m5j02Q0J10k9n8
$$ 3 88 84 13 -58 -78 -8 10 -42 19 75 13 11 -7 -82 -44 -67 -166 -53 73 -11 -100 -127 -136 -105 -91 -88 -96 -133 -53 86 41 -61 19 129 100 42
5289D2l2l9M2Q5k5k7O1K2QM3m9j31m8R7J14l2q5K4M9k7o9m1N7R2J4n0p6j0J05M3p0l1qm9n4
$$ 42 10 -29 13 98 73 46 107 129 137 180 131 0 -48 49 163 131 46 70 119 92 23 -18 39 131 145 95 19 9 114 157 87 56 48 -1 -55
5279e5pP1P1ol0p0o2O8M6k9R6J32m0j39j41m3P3Rk5J00R3m8j00n9K2Q4P4k6j08j8P4M7O6k3
$$ -55 -62 9 80 74 44 -26 -88 -20 26 -3 93 225 185 46 -95 -138 -65 -56 -81 19 112 64 -36 -95 -73 11 85 59 -49 -67 7 54 120 97
5270I7k06o6J31J1n6K7O0Q3K7n9k2mj2Oj0N0P4m3l0O4K1k7l1k9j4m5l6J1PL2j5j59q7J01J08
$$ 97 -109 -175 -44 -33 -89 -62 -2 81 108 49 27 23 11 17 7 57 131 88 58 122 143 116 85 56 42 -3 -39 -28 -21 11 -4 -163 -250 -149 -41
5260d1Ok9O5J29Rq4m5MN1O2O6P7j2p0n4j28j41k3L3P5J01%o7j8K3L4L4m0j15o2L7N9L5o7j14
$$ -41 -35 -64 1 130 139 55 10 14 65 127 193 270 258 188 134 6 -135 -158 -125 -50 51 51 -16 -34 -11 23 57 17 -98 -160 -123 -64 -29 -96 -210
5250b10P6J45l1m6Km4L7R3O0P1l6j35qJ33J31k9j93j26n5o5L3K4o6K1O6O0J06Kj19o2NN5J30
$$ -210 -134 11 -20 -66 -64 -108 -71 22 82 153 117 -18 -26 107 238 209 16 -110 -165 -230 -197 -173 -239 -218 -152 -92 14 16 -103 -165 -160 -105 25
5241B5J35K4p6OO1n8k7N8n6m3M6o5k1J31j3j28l5p5q1J20J38oO%n0Nn9j58J0J41O5M1J7m5
$$ 25 160 184 108 114 175 117 90 148 92 49 95 30 9 140 127 -1 -36 -111 -192 -72 66 60 66 66 16 21 -38 -196 -186 -45 20 61 78 33
5231C3rM4N9R0N6p4j28lP7m9j41p2J4M0j0m7K2O0No3m5J09J39m7r5j0l3q0k9J05J39lj3P7
$$ 33 24 68 127 217 273 199 71 68 145 96 -45 -117 -103 -63 -73 -120 -98 -38 -33 -96 -141 -32 107 60 -35 -45 -78 -158 -187 -82 57 54 41 118
5222A18OpJ3r7l7Q0k7n8K8Jl3Jmm8k0P8Q5J9ol7q6j07m7J09J49K6l1j9K5R1Rj08n4L4O0Ko4
$$ 118 124 117 130 33 -4 76 49 -9 19 20 -13 -12 -16 -64 -84 -6 79 98 92 55 -31 -138 -185 -76 73 99 68 49 74 165 174 66 12 46 106 108 44
5211D4J8P6L%M5oo4nM4r8j67MO0LJ5l7jJ35Q1nn4j54q8%m0N7J14mj2L2J2J6Jl5k0O4J05%j9
$$ 44 62 138 141 141 186 180 116 111 155 57 -110 -106 -46 -43 -28 -65 -66 69 150 145 91 -63 -151 -151 -191 -134 -20 -24 -36 -4 8 24 25 -10 -30 34 139 139 120
5200A20N8l6r5j2J5L4Om3N1N2m8l9q4r8KoL2J10K0J0P9O4Q0k3j65m5L3r5j13lL9j2kN1j8l
$$ 120 178 142 47 35 50 84 90 47 98 150 102 63 -21 -119 -117 -123 -91 19 39 49 128 192 272 249 84 39 72 -23 -136 -139 -100 -112 -114 -63 -81 -84
5190h4J22K6p2PPJ6M1n5n4om3K3O1k6j3J9l7k8K9J7rL8M4n4j04r8p2Q0J69Q6M1Pk7kj5L9J10
$$ -84 38 64 -8 -1 6 22 63 8 -46 -52 -95 -72 -11 -37 -50 -31 -68 -96 -67 -50 -59 -21 23 -31 -135 -233 -305 -225 -56 30 71 78 51 49 34 73 183
5180A83j3q1kNj3k8NR9J8q6n4p0K5J37k3n6P6j7o8K1O5J11qj65k0R9k7j08p9l1QN2Q0n0j83
$$ 183 170 89 87 92 79 51 56 155 173 87 33 -37 -12 125 102 46 122 105 37 58 123 234 226 61 41 140 113 5 -74 -105 -97 -45 35 -15 -198
5170a98o8J17J82Q5r4r2NK2Q3J21M0p7j88q7J38O8p2KQ2R5J9j08p4K8L7k5j50j32O5J24M4
$$ -198 -266 -149 33 118 24 -68 -63 -41 42 163 203 126 -62 -149 -11 57 -15 -13 69 164 183 75 1 29 66 41 -109 -241 -176 -52 -8
5161h%mM2N3ml7n1JO2l8q4N5P9m5p8kO2P5N0pm8p1j01lJ14J5l9K1m3k9M7j8K5O2j9O6N5j13
$$ -8 -8 -12 30 83 79 42 -9 -8 54 16 -68 -13 66 21 -57 -59 3 78 128 121 73 2 -99 -102 12 27 -12 9 -34 -63 -16 -34 -9 53 34 100 155 42
5151D2m8k2m0J39R4p4k2q4j38pm0n5Q5J53K13J35j27j48k2n2o2L1N4n6r6P4J11mN6M9j11o6
$$ 42 -6 -28 -68 71 165 91 69 -15 -153 -160 -200 -255 -170 -17 196 331 204 56 34 -18 -80 -49 5 -51 -147 -73 38 34 90 139 28 -38
5142c8J8%K9Jm7J7J8m0MR1J14L4m2k9j4K1J9r8r5j2n9oJ25P8N1O1r7j73m9L1J4L1J23J61L9
$$ -38 -20 -20 9 10 -37 -20 -2 -42 -38 53 167 201 159 130 116 137 156 58 -37 -49 -108 -114 11 89 140 201 104 -69 -118 -87 -73 -42 81 242 281
5132B81q1j29j43n0M5K1L0L7j5mJl5j2j8l0K6K2mL5O0M1n3j06N6J76O2rJ3q4j97j26O7J89
$$ 281 200 71 -72 -122 -77 -56 -26 11 -4 -8 -7 -42 -54 -72 -102 -76 -54 -58 -23 37 78 25 -81 -25 151 213 204 217 133 -64 -190 -123 66
5123F6J46k3j59n1J16Lj29k5k6r5P2J18j32j60Q3J15OJ5J6J7O8j0q3kK0K8P2LrL7o8q5K6K0
$$ 66 212 189 30 -21 95 98 -31 -56 -82 -177 -105 13 -119 -279 -196 -81 -75 -60 -44 -27 41 31 -52 -54 -34 -6 66 69 60 97 29 -56 -30 -10
5113a0n0j12o2Q7K7l8J26Q9j10r3J1O4P0M7N3k7j08m5l5RJ13j8o9P1n0j11J04R5k8LL0M7J5
$$ -10 -60 -172 -234 -147 -120 -158 -32 57 -53 -146 -135 -71 -1 46 99 72 -36 -81 -116 -107 6 -12 -81 -10 -60 -171 -67 28 0 3 33 80 95
5104I5p8l8Nl9jL8ql4k2L9Q5K3l2NK4PQMLJ3j0PJ10J15k4j47j51rP8j2k2J0j00o4O5j8k2Q1
$$ 95 17 -21 -16 -55 -56 -18 -26 -60 -82 -43 42 65 33 38 62 69 77 81 84 97 87 94 204 319 295 148 -3 -12 66 54 32 42 -58 -122 -57 -75 -97 -16
5093a6ml9N6Qp2rP7K7j02j14mQ8O7p7j15l2n4J4J73P2NJ14K2o7j0o2m7K2n0K5J73O0p4n5m1
$$ -16 -20 -59 -3 5 -67 -76 1 28 -74 -188 -192 -104 -37 -114 -229 -261 -315 -301 -128 -56 -51 63 85 18 8 -54 -101 -79 -129 -104 69 129 55 0 -41
5083d1k2PK3J7o3p8M9R7K2%K1j3n3j0N5K1k2M9Q6Nk7l0r2n2N0L7Jk0o7j6O0Ql0l0k7J7Nn1
$$ -41 -63 -56 -33 -16 -79 -157 -108 -11 11 11 32 19 -34 -44 11 32 10 59 145 150 123 93 1 -51 -1 36 37 17 -50 -66 -6 2 -28 -58 -85 -68 -63 -114
5073a14nK4l2k6M9J04P9j0m5k4l2p5r7rJ29J31N0N4J02O7m2q0k5j5m6m6k2Pj7m4K4J2j01k8
$$ -114 -119 -95 -127 -153 -104 0 79 69 24 0 -32 -107 -204 -213 -84 47 97 151 253 320 278 198 173 158 112 66 44 51 34 -10 14 26 -75 -103
5063a03J41J25l2j54j06M3N6LP6J07Jl0K3j5r3j01l6J12J72pj15m3m3lQ7j9p8L4Mq0n2%Q2
$$ -103 38 163 131 -23 -129 -86 -30 -27 49 156 157 127 150 135 42 -59 -95 17 189 182 67 24 -19 -22 65 46 -32 2 6 -74 -126 -126 -44
5054d4R6M3P5L5n8k9m5o3M3R4P1k1j41m1M9m4jL4p3j1P4J3l4j17j17N8J43J26L5j20n5Q2L5
$$ -44 52 95 170 205 147 118 73 10 53 147 218 197 56 15 64 20 19 53 -20 -31 43 56 22 -95 -212 -154 -11 115 150 30 -25 57 92
5045I2J5Kq1n4j8pN8Op8j0L6jl1J5J33J00l5k0J5K9Q7Mj19q5l8k7l7o1K7R3j5q4j5M1M5K0
$$ 92 107 109 28 -26 -44 -51 7 13 -65 -75 -39 -40 -71 -56 77 177 142 122 137 166 253 257 138 53 15 -12 -49 -110 -83 10 -5 -89 -104 -63 -18 2
5035BLk0o2l2L4O6J06O5q5j13K0R4K2p2q3k4N5O6j4n4k2rJ8J3o4n7K4M1K7K3J9Rk6kN9K3m0
$$ 2 5 -15 -77 -109 -75 -9 97 162 77 -36 -16 78 100 28 -55 -79 -24 42 28 -26 -48 -57 -39 -26 -90 -147 -123 -82 -55 -32 -13 -4 -30 -32 27 50 10
5024A0k1L6N5l5p6M7O4n4k9N1K5l3l1M8O0n5q8k8jL2L2k1o3n7M9J17k5j04L2O3n2l0J20J23
$$ 10 -11 25 80 45 -31 16 80 26 -3 48 73 40 9 57 117 62 -26 -54 -55 -23 9 -12 -75 -132 -83 34 9 -95 -63 0 -52 -82 38 161
5015A61j0m5n6j14k4P7K9M9L5j06m8R3L0j6K1l8j21j01l8l0j4P9J30J06M4n1m2lo3j6M3o7
$$ 161 151 106 50 -64 -88 -11 18 67 102 -4 -52 41 71 55 76 38 -83 -184 -222 -252 -266 -187 -57 49 93 42 0 -3 -66 -82 -39 -106
5006a06n8N6N5L3k6n1M4L5j0K8j5PQ7m8j44m8L9J43J29p0r8L2M3qk2k8k6J6Oj11j01O2Q4L7
$$ -106 -164 -108 -53 -20 -46 -97 -53 -18 -28 0 -15 -8 79 31 -113 -161 -122 21 150 80 -18 14 57 49 27 -1 -27 -11 -5 -116 -217 -155 -71 -34
4996c4L6J3O7Q5p0j04J3Q1R0j2j25o3L9O4j3q0L5J14J0l0n2q9l4RN6N8j15j17O2J1l8Q7P6
$$ -34 2 15 82 167 97 -7 6 87 177 165 40 -23 16 80 67 -13 22 136 146 116 64 -25 -59 -50 6 64 -51 -168 -106 -95 -133 -46 30
4987C0l5p6l9K4K7N7J41R0LQk0l3ok2J1K1j21j71k2O3J7RL2J0k1k0Ll%Q3O1r2l6J16P6K9l5
$$ 30 -5 -81 -120 -96 -69 -12 129 219 222 230 210 177 171 149 160 181 60 -111 -133 -70 -53 -44 -12 -2 -23 -43 -40 -43 -43 40 101 9 -27 89 165 194 159
4976A59j80j18L3K2K2J9J6Q5L1j3P6jp7Ok6n7k2o2PO6m9J8J18n9j33lK0l1n8m3L9Q9P6M3j9
$$ 159 -21 -139 -106 -84 -62 -43 -27 58 89 76 152 151 74 80 54 -3 -25 -87 -80 -14 -63 -45 73 14 -119 -122 -102 -133 -191 -234 -195 -106 -30 13 -6
4967fm1j3p9j00Q1J57J8K4J26L6m4k0r7j14M4Q8l3n3P8J35j3j26n5mj1Ok5k7K5j5m8PjLP7
$$ -6 -47 -60 -139 -239 -158 -1 17 41 167 203 159 139 42 -72 -28 60 27 -26 52 187 174 48 -7 -11 -22 -16 -41 -68 -43 -58 -106 -99 -100 -97 -20
4957b0L7l4M0J13N5pj9o0q0k9l5o5L0J12O9J5p2r8O9J44Mn8n0l1N5L4p1k9O1L9k9m4k9n9L
$$ -20 17 -17 23 136 191 184 165 105 25 -4 -39 -104 -74 38 107 122 50 -48 21 165 169 111 61 30 85 119 48 19 80 119 90 46 17 -42 -39
4947c9J51P3n3M4N7k0L0j6j29p7pk8o7l0N4Nm8O7Q0J1P0N1r6j41p1L5O0M5J08L8j63j20Q1
$$ -39 112 185 132 176 233 213 243 227 98 21 14 -14 -81 -111 -57 -52 -100 -33 47 58 128 179 83 -58 -129 -94 -34 11 119 157 -6 -126 -45
4938d5R2o0j39n9J0j3J3O1O4O2K5J1L8j9p2l3mJ0j9o6K5J13M8kl9r8n3Nk8jO3L3l1p7n5O7
$$ -45 47 -13 -152 -211 -201 -214 -201 -140 -76 -14 11 22 60 41 -31 -64 -68 -58 -77 -143 -118 -5 43 41 2 -96 -149 -144 -172 -173 -110 -77 -108 -185 -240 -173
4928a73R8KJ0O2Jj5L3K0pl6m4K6L6l5n9m4k0k6n8J7N7n5l1J14J13M3J9J0Kl1l5l3m8L5P4j5
$$ -173 -75 -73 -63 -1 0 -15 18 38 31 -5 -49 -23 13 -22 -81 -125 -145 -171 -229 -212 -155 -210 -241 -127 -14 29 48 58 60 29 -6 -39 -87 -52 22 7
4918GJ2M4k5N9L0k24j50J22R6JKLM6J0n9L3N9q7j13J3Q0qj20o0L3K3O9J04K3m5p1J9J44L9
$$ 7 19 63 38 97 127 -97 -247 -125 -29 -28 -26 -23 23 33 -26 7 66 -21 -134 -121 -41 -49 -169 -229 -196 -173 -104 0 23 -22 -93 -74 70 109
4908A09n9K3o4j28N1O6J1J18L4j36l3R2N1kj6k7k1RMj9Ok2o4L9N4q8q3l3m6P3J55M5n3q3p7
$$ 109 50 73 9 -119 -68 -2 9 127 161 25 -8 84 135 133 117 90 69 78 82 63 69 47 -17 22 76 -12 -95 -128 -174 -101 54 99 46 -37 -114
4898a14k0qJM4L8L2N5N0O9Q5j5r5j5N8jn5o1p3l5N0P9K2n6l0J6p4q3Q3J10K9M3pj06l4Q4Q2
$$ -114 -134 -142 -141 -97 -59 -27 28 78 147 232 217 122 107 165 164 109 48 -25 -60 -10 69 91 35 5 21 -53 -136 -53 57 86 129 122 16 -18 66 148
4888A48J7k2j4k1n4m4j6KO2Q1k9j42j13P3J88J4k12j40K9N9R9J17mj10r8l2j3k4P7J49k8j54
$$ 148 165 143 129 108 54 10 -6 -4 58 139 110 -32 -145 -72 116 130 -82 -222 -193 -134 -35 82 78 -32 -130 -162 -175 -199 -122 27 -1 -155
4879a55NJ76J78L8q4n2l2r1o5J2O4P5j7o2L1R0K8q0q8K5N7Mml2q8q2%J08Q3k2NM4j3j5K2M6
$$ -155 -150 26 204 242 158 106 74 -17 -82 -70 -6 69 52 -10 21 111 139 59 -29 -4 53 57 53 21 -67 -149 -149 -41 42 20 25 69 56 41 63 109
4869A09M5m6o7R4J47Jq0l2Lk5m9k6k9q2k7Q3J3o1N8P4m2m1m7n9J1j0rL1o0j9R3j9m8L1L0R0
$$ 109 154 108 41 135 282 283 203 171 174 149 100 74 45 -37 -64 19 32 -29 29 103 61 20 -27 -86 -75 -85 -94 -63 -123 -142 -49 -68 -116 -85 -55 35
4859C5j8j87N3J95J4K3k8j84pJ07k3J1J7r2K4J19l5n7Q2P1L4N7j11k43p2N5M4Q2N9pj2lP1
$$ 35 17 -170 -117 78 92 115 87 -97 -104 3 -20 -9 8 -84 -60 59 24 -33 49 120 154 211 100 -143 -215 -160 -116 -34 25 18 6 3 74
4850G4R1j8n0n1o1k0r9j19Q4J22N2J20L7j40j04K6Q0K5j9L1j9q4J6M2K1J16R7l0l5K5M5J0
$$ 74 165 147 97 46 -15 -35 -134 -253 -169 -47 5 125 162 22 -82 -56 24 49 30 61 42 -42 -26 16 37 153 250 220 185 210 255 265
4841B65l3n7j02l9J08O2m9o8j18q9J7J0M4Q5NJ5L3j5Q4N8j51p3M2m5L7J29l7q1N6R2N2N2M7
$$ 265 232 175 73 34 142 204 155 87 -31 -120 -103 -93 -49 36 41 56 89 74 158 216 65 -8 34 -11 26 155 118 37 93 185 237 289 336
4831C36j7k5P2N3j8K0ok2J07P2m8Q2K34J54Q4K94O63J156J996K384J062j036j949j637j061
$$ 336 319 294 366 419 401 421 415 393 500 572 524 606 840 994 1078 1372 2035 3191 5187 7571 8633 7597 5648 4011 2950
4824B950n92l48l34l51k58j40r6j8N9QQ1L32M78O81J302K157K166M66j585k047j375q89o37
$$ 2950 2358 2010 1676 1325 1067 927 831 813 872 880 961 1293 1771 2452 3754 5911 8077 8543 6958 4911 3536 2647 2010
4818B010l55k13l38m36k08k3j10p0O6N2J5r2j92n6O0J2L1L2n7l3N0M4J6lj2L2J7p1p4o4j03
$$ 2010 1655 1442 1104 668 460 437 327 257 323 375 390 298 106 50 110 122 153 185 128 95 145 189 205 202 190 222 239 168 94 30 -73
4809g3k1R2N6J8k4n9M4N3j09o8J06J13N7K8k2m2n3r1p8%P0P9L9k9m9J9L5n8p4K3N1k7m7L3
$$ -73 -94 -2 54 72 48 -11 33 86 -23 -91 15 128 185 213 191 149 96 5 -73 -73 -3 76 115 86 37 56 91 33 -41 -18 33 6 -41 -8
4800hM5j6qOk3J3K7p4m2J12L9q5N5J04p2p7rn3j9oj4J23J14n2n4p9r4J06J40lK3M4k0nK3J2
$$ -8 37 21 13 19 -4 9 36 -38 -80 32 71 -14 41 145 73 -4 -13 -66 -85 -91 -105 18 132 80 26 -53 -147 -41 99 96 119 163 143 138 161 173
4790A73l9j11p2J2J2j2l2n9m1K2P3Q8Q7L5o0q7n6k0N5O6J3M4L2o5k9M7l7j05oL6n5RJ40K3
$$ 173 134 23 -49 -37 -25 -37 -69 -128 -169 -147 -74 14 101 136 76 -11 -67 -87 -32 34 47 91 123 58 29 76 39 -66 -72 -36 -91 -82 58 81
4780H1j11n0K1M2k3q8N4J50M3Lk0j26j21m1K9O6Ql6qK5N8M4JML2N8lq2RN2n0m9m5q9NR1N2
$$ 81 -30 -80 -59 -17 -40 -128 -74 76 119 122 102 -24 -145 -186 -157 -91 -83 -119 -127 -102 -44 0 1 5 37 95 92 10 19 71 21 -28 -73 -162 -157 -66 -14
4770a4k2o5QQ7M6j1r3j04K8Pj11o1J6M6N3J7O1Q3J4K8K6k2O3P5m7k7O8L2m7k4Mq1j01qJ9k
$$ -14 -36 -101 -93 -6 40 29 -64 -168 -140 -133 -244 -305 -289 -243 -190 -173 -112 -29 -15 13 39 17 80 155 108 81 149 181 134 110 114 33 -68 -76 -57 -59
4760e9n6q0J12J94m7j50j6L0J0K1J5k7m3M3J05K7k6L3Q3K0o4J6R4m4j54q2J8N5Ok5j6o9l5
$$ -59 -115 -195 -83 111 64 -86 -102 -72 -62 -41 -26 -53 -96 -53 52 79 53 86 169 189 125 141 235 191 37 -45 -27 28 34 9 -7 -76 -111
4750a11M3j7rL4o3o0nrJ34J57o3n6O7QJ7J02J7j18r5M5R0M8M5n9j72l8N9l8l0M6N3Q4O3m0
$$ -111 -68 -85 -94 -60 -123 -183 -188 -197 -63 94 31 -25 42 50 67 169 186 68 -27 18 108 156 201 142 -30 -68 -9 -47 -77 -31 22 106 169 129
4741A29r6r8o3QQ6J23M6n9o6n0l8rK3P9O2k0j6o7j00P0J31Q7J16l9j32L0l7j32J1m8j03J05
$$ 129 33 -65 -128 -120 -34 89 135 76 10 -40 -78 -87 -64 15 77 57 41 -26 -126 -56 75 162 278 239 107 137 100 -32 -21 -69 -172 -67
4732f7R6p8n6M6P4K6L1P3n6j26j8K1O7P2l5M8Q0j40j73n3L1J29K4j35n2K1j3j2L6J17P2l6
$$ -67 29 -49 -105 -59 15 41 72 145 89 -37 -55 -34 33 105 70 118 198 58 -115 -168 -137 -8 16 -119 -171 -150 -163 -175 -139 -22 50 14
4723A4j2j8m0On8m9Q4M1jP0Rq9m9O7Q9m4n2R2P6j1m5j42j63k1P2L6K8O8j6o0J22J37k4J0L2
$$ 14 2 -16 -56 -50 -108 -157 -73 -32 -33 37 46 -43 -92 -25 64 20 -32 60 136 125 80 -62 -225 -246 -174 -138 -110 -42 -58 -118 4 141 117 127 159
4713A59j0L8m7j09MOjjj29m9J09Ql6K4J3M9J8l9N9L0j22m9R4O1k6m4n5m8P0J17m1r8nRJ0K6
$$ 159 149 187 140 31 35 41 40 39 -90 -139 -30 -22 -58 -34 -21 28 46 7 66 96 -26 -75 19 80 54 10 -45 -93 -23 94 53 -45 -50 -41 -31 -5
4703ej5j7K8N2J3j11q8R9P9n4J9R2k3r5j8K9l5n8K9M5nN6J01np4n3n3lN2K8L9O8M5nj04j07
$$ -5 -20 -37 -9 43 56 -55 -143 -44 35 -19 0 92 69 -26 -44 -15 -50 -108 -79 -34 -39 17 118 113 39 -14 -67 -70 -18 10 49 117 162 157 53 -54
4693e4L3M1k6K0L7Lj0l5J7P5J4k1m6q0k1jl1%l4n6L0R2J30P9p8p2K5M6Q5M1k8O2K9j67j45
$$ -54 -21 20 -6 14 51 54 44 9 26 101 115 94 48 -32 -53 -54 -85 -85 -119 -175 -145 -53 77 156 78 6 31 77 162 203 175 237 266 99 -46
4683d6Qk2j20m2R5O3j9pMM6O8n3j11k5K3P6J35J00J7p4p9Kj9n2K5O8L0p1j27%M5j15j24KO4
$$ -46 -38 -60 -180 -222 -127 -64 -83 -90 -86 -40 28 -25 -136 -161 -138 -62 73 173 190 116 37 39 20 -32 -7 61 91 20 -107 -107 -62 -177 -301 -299 -235
4673b35J32J22om3oNLl3k4O2J06L2p6l4P7j1j10pL6rJ3j3l9L2K4k1J4nn9m9k5QO3J13J20J3
$$ -235 -103 19 13 -30 -36 -31 -28 -61 -85 -23 83 115 39 5 82 71 -39 -46 -10 -19 -6 -19 -58 -26 -2 -23 -9 -14 -73 -122 -147 -139 -76 37 157 170
4663A70q9m3K5L9L1k8m7J9l3j34j9J11mo2R7J24Ol3q0j14k8L0J7J5MK0K5QO0M3o7k6K9m0l4
$$ 170 81 38 63 102 133 105 58 77 44 -90 -109 2 -2 -64 33 157 163 130 50 -64 -92 -62 -45 -30 -26 -6 19 27 87 130 63 37 66 26 -8
4653hk2o0j7J3J0N4M9L2J2p1o5K3N5O5j3j22o5J5O0J42M3j19k9N9j8n5n7k9O1M0k2M8P0m8
$$ -8 -30 -90 -107 -94 -84 -30 19 51 63 -8 -73 -50 5 70 57 -65 -130 -115 -55 87 130 11 -18 41 23 -32 -89 -118 -57 -17 -39 9 79 31
4644C1j08p9J0J14M5r7k0J02J9n3k7J9Q1J4j35q6J8L4J01O3p9k7O4OrLl5k0L2L6JK0R5J1j06
$$ 31 -77 -156 -146 -32 13 -84 -104 -2 17 -36 -63 -44 37 51 -84 -170 -152 -118 -17 46 -33 -60 4 10 1 4 -31 -51 -19 17 18 38 133 144 38
4634C8J5Q4k8k8j0l6J8j2o8j5k2j2M7n5j07j8K5J15J39rm2J0K7Q1j4j08M9P3j00r9OJ01J02
$$ 38 53 137 109 81 71 35 53 41 -27 -42 -64 -76 -29 -84 -191 -209 -184 -69 70 61 19 29 56 137 123 15 64 137 37 -62 -56 45 147
4625A47l1k1M4n4JJ34Qq1mRj4m2m9L9N6k9l9K2P5L5j17j53m5j8l5K3L9J8R3J18l1n8N7l7j68
$$ 147 116 95 139 85 86 220 228 147 143 152 138 96 47 86 142 113 74 96 171 206 89 -64 -109 -127 -162 -139 -100 -82 11 129 98 40 97 60 -108
4615a08m2O5P1J32M2j31m1P4J6%j2r2o4K9K1j2K1R2R4m1j01j6m2j08qN8RK5M7PK2O6J6o4k4
$$ -108 -150 -85 -14 118 160 29 -12 62 78 78 66 -26 -90 -61 -40 -52 -31 61 155 114 13 -3 -45 -153 -161 -103 -94 -69 -22 -15 7 73 89 25 1
4605AM7l0m8Q1N2k7O0K8r9j00j24m6J33mj61O6J77j1o4N4O6m0o9M8J12L6l3j2K6Jm3l0m1m7
$$ 1 48 18 -30 51 103 76 136 164 65 -35 -159 -205 -72 -76 -237 -171 6 -5 -69 -15 51 11 -58 -10 102 138 105 93 119 120 77 47 6 -41
4596d1j0k0mN0k0l8K6m2m1P7Q1R9P7p4m8K7q6n8P2K6j8k6r0m1L7l0m8M2N7rq7r7L2J19K1n
$$ -41 -51 -71 -75 -25 -45 -83 -57 -99 -140 -63 18 117 194 120 72 99 13 -45 27 53 35 9 -81 -122 -85 -115 -163 -121 -64 -73 -160 -257 -225 -106 -85 -90
4585i0J02M9o9L0J60P3m9k0J0p4j02pO3N7j9q7k7N4N3L6k2p0l1PN4Q6J9RL0m2j7L2q2j18m5
$$ -90 12 61 -8 22 182 255 206 186 196 122 20 13 76 133 114 27 0 54 107 143 121 51 20 27 81 167 186 195 225 183 166 198 116 -2 -47
4576d7j9J0QL8J34N6r8p7n8o6O7J44L9KN9n1j52K9J13o3m5N8n2p2Rk1m7n7o5J3N6P2J09J9
$$ -47 -66 -56 -48 -10 124 180 82 5 -53 -119 -52 92 131 133 192 141 -11 18 131 68 23 81 29 -43 -34 -55 -102 -159 -224 -211 -155 -83 26 45
4566D5j00o5k2l8K7J14Q6M1N1K6J9N0o0j81j00j7j1O0N6n7q4k2J1K0O1R9O1m5q8KM3q1m8J45
$$ 45 -55 -120 -142 -180 -153 -39 47 88 139 165 184 234 174 -7 -107 -124 -135 -75 -19 -76 -160 -182 -171 -151 -90 9 70 25 -63 -61 -18 -99 -147 -2
4557bJ10k3p7j51k4J49k9j09Q5P7%pj40j20J27J91L1q3nR1J4l0K4kJ9J12O0o8j27j00rj6j13
$$ -2 108 85 8 -143 -167 -18 -47 -156 -71 6 6 -1 -141 -261 -134 57 88 5 0 91 105 75 99 97 116 228 288 220 93 -7 -16 -32 -145
4547a45p9M9J02M4p7r2M2J15N1l8q7l9N2O1N5O4m4r3M8K7j09K6J96J04k1q7j42j14j7P5O5
$$ -145 -224 -175 -73 -29 -106 -198 -156 -41 10 -28 -115 -154 -102 -41 14 78 34 -59 -11 16 -93 -67 129 233 212 125 -17 -131 -148 -73 -8
4539hl7o1k5l9j5K8J6KJ4M9P3L8Nj2j7K4M1K3J8l4q2o2k9L7P6L4K0j7q0j5K7j5M6N9r4j30
$$ -8 -45 -106 -131 -170 -185 -157 -141 -139 -125 -76 -3 35 40 28 11 35 76 99 117 83 1 -61 -90 -53 23 57 77 60 -20 -35 -8 -23 23 82 -12 -142
4529a42K6J20P8M6N7j7q4k6Pk7JO1O7ro4j7k5j07p8J1M2L5j2n4m6kO3K7q7m7Q0J00N4Nm0m7
$$ -142 -116 4 82 128 185 168 84 58 65 38 39 100 167 158 94 77 52 -55 -133 -122 -80 -45 -57 -111 -157 -159 -96 -69 -156 -203 -123 -23 31 36 -4 -51
4518e1m3k3K9N7L4k5o5k3L3L5J3J2L1L6Pk1j6K5K2m1l0K6Jm1jQ3J38N6j01q7N5L1j08q3k1
$$ -51 -94 -117 -88 -31 3 -22 -87 -110 -77 -42 -29 -17 14 50 57 36 20 45 67 26 -4 22 23 -18 -19 64 202 258 157 70 125 156 48 -35 -56
4509e6q9o6M6J9j4M7M4j5p2k3J28O4p9L1Q9Lj3q1o9R7N6k5K4l8m1M5j7m3j1p9j03o7O2J90
$$ -56 -145 -211 -165 -146 -160 -113 -69 -84 -156 -179 -51 13 -66 -35 54 57 44 -37 -106 -9 47 22 46 8 -33 12 -5 -48 -59 -138 -241 -308 -246 -56
4499e6k3j41J43J33o8Q8J06j38o1J01qr5n8o9n8K0J0l2L2O8J0l5m3L2J09K4pN4m6j15K0O1
$$ -56 -79 -220 -77 56 -12 76 182 44 -17 84 76 -19 -77 -146 -204 -184 -174 -206 -174 -106 -96 -131 -174 -142 -33 -9 -16 38 -8 -123 -103 -42
4490d2J1K2j9o0J9J03R8J2o6m6J1M0J10J37k9j78j22k3M5Q2K6N9J01j10j89K9M7n7L0L3p4
$$ -42 -31 -9 -28 -88 -69 34 132 144 78 32 43 83 193 330 301 123 1 -22 23 105 131 190 291 181 -8 21 68 11 41 74 0
4481@j8N9J6p0j39q5Q0J06rK5N7j38j08J92J30n5K0q0k14LJ45Q1P9O8J7p2j69p9Q4Q4K3NR
$$ 0 -18 41 57 -13 -152 -237 -157 -51 -60 -35 22 -116 -224 -32 98 43 63 -17 -231 -228 -83 -2 77 145 162 90 -79 -158 -74 10 33 38 47
4472D7j8m2j5k0O0J82rj55M8P3k3Pq9l1J35r0k07KK6O0J30j1QP4j30j18J43J69J2p0o0m2k1
$$ 47 29 -13 -28 -48 12 194 185 30 78 151 128 135 46 15 150 60 -147 -145 -119 -59 71 60 68 142 12 -106 37 206 218 148 88 46 25
4463B5O1M9o0l7qo1lQ2O6k7j18nJ60M9o2Ln1j20l4j1k7N8R5N0J7mK7O6k8j21o0NM6R1J3q7
$$ 25 86 135 75 38 30 -31 -34 48 114 87 -31 -36 124 173 111 114 63 -57 -91 -102 -129 -71 24 74 91 87 114 180 152 31 -29 -24 22 113 126 39
4453C9p6o8J7J34J3j00J9K7n3K9L0j09r6L6J25J06k3p6JMk8K6O7M5j6o0k0J8RJ9Km9j3L0m6
$$ 39 -37 -105 -88 46 59 -41 -22 5 -48 -19 11 -98 -194 -158 -33 73 50 -26 -25 -21 -49 -23 44 89 73 13 -7 11 20 39 41 -8 -21 9 -37
4443c7q3L8P8o8p0N5j9n7Q9O7oQj11q9J34J06ONo0J3J20pm1Kq8q7l6n0J1N3P4J10L4j9j1q2
$$ -37 -120 -82 -4 -72 -142 -87 -106 -163 -74 -7 -13 -5 -116 -205 -71 35 41 46 -14 -1 119 112 71 73 -15 -102 -138 -188 -177 -124 -50 60 94 75 64 -18
4433a8o4Mj9N8R3q5j52j4O3j0m2J03J72jj16m3N3Q4Rj00q2K4K3q6nK01R7j40j17k8M6R0j9
$$ -18 -82 -78 -97 -39 54 -31 -183 -197 -134 -144 -186 -83 89 88 -28 -71 -18 66 75 -25 -107 -83 -60 -146 -151 50 147 7 -110 -138 -92 -2 -21
4424b1j4J41Q6p7j10k3N9k8p3M5j2n1J23Q0m6K2lm2J4l8o4l1l9L5N4k6L3N2n5o3l8p2o0OQ0
$$ -21 -35 106 192 115 5 -18 41 13 -60 -15 -27 -78 45 125 79 101 98 56 70 32 -32 -63 -102 -67 -13 -39 -6 46 -9 -72 -110 -182 -242 -236 -156
4414a56N7l9k1K6L5R6L9j09q1%NP5J11M5j2p6n4Q9P8l3k1j6mN8l2q8N2K1j23j5Q3m1n9J10
$$ -156 -99 -138 -159 -133 -98 -2 37 -72 -153 -153 -148 -73 38 83 71 -5 -59 30 108 75 54 38 34 92 60 -28 24 45 -78 -93 -10 -51 -110 0
4404@J25p0q5Q0K2j27k1J50J41kq7QJ4j29m0R4k8n9P6Q3K2k4p8n7k2m8mR8K5j50p3J34Q7j3
$$ 0 125 55 -30 50 72 -55 -76 74 215 213 126 134 148 19 -21 73 45 -14 62 145 167 143 65 8 -14 -62 -66 32 57 -93 -166 -32 55 42
4395D2N7O2m1q8o6m8n9m7jMM2Q3L7K7M5RK0K5K8O2l6j03qrJ9J26Mq2O7R3On0r9n4m1j34j05
$$ 42 99 161 120 32 -34 -82 -141 -188 -189 -185 -143 -60 -23 4 49 58 78 103 131 193 157 54 46 37 56 182 186 104 171 264 270 220 121 67 26 -108 -213
4384b13k5nR2J57M4o9n1j1k8k3QK0O0Kj28k2J21L0J2O1k7k4N0K6mk2kO3m3k01j39J6J30J32
$$ -213 -238 -243 -151 6 50 -19 -70 -81 -109 -132 -124 -104 -44 -42 -170 -192 -71 -41 -29 32 5 -19 31 57 53 31 29 92 49 -152 -291 -275 -145 -13
4375a3k1p9J3J7K8Q8k8j25jJ7p4L5J06k0K1J84J27l4r7r2n7m6o0j4O1N0k2l3RJ8L1M9j0k2
$$ -13 -34 -113 -100 -83 -55 33 5 -120 -121 -104 -178 -143 -37 -57 -36 148 275 241 144 52 -5 -51 -111 -125 -64 -14 -36 -69 -60 -42 -11 38 28 6
4365FO7N2m2m6j7kJ1j2l8k6NL0L8L6Rk2j4k8m5N7J19m5j95j25J8Q6N7mmJ5NPk9o8L9R6rOK7
$$ 6 73 125 83 37 20 18 29 17 -21 -47 -42 -12 26 62 71 49 35 7 -38 19 138 93 -102 -227 -209 -123 -66 -70 -74 -59 -54 -47 -76 -144 -105 -9 -18 -12 15
4354A5j18p1J34J13K8rn7QJ3r8j3Q2j4m5k6l1J3J7J3J9l8K1Q1j04j48P1J04J2L2J9p0j12n1
$$ 15 -103 -174 -40 73 101 92 35 43 56 -42 -55 27 13 -32 -58 -89 -76 -59 -46 -27 -65 -44 37 -67 -215 -144 -40 -28 4 23 -47 -159 -210
4345b10L8M5M6O8j3p0O1J38Lj06k3P1L1m4k9N8Q7j0p1j9K4M8K3r9q4Q1O0j12j33rP8M2n1m8
$$ -210 -172 -127 -81 -13 -26 -96 -35 103 106 0 -23 48 79 35 6 64 151 141 70 51 75 123 146 47 -37 44 104 -8 -141 -150 -72 -30 -81 -129
4336a29K3J5m3QJ12M4j08p4On5l2J18J30L7rl9k4L3Lj04j46q5K4J28J88J56Oj08q2n7l4M0
$$ -129 -106 -91 -134 -126 -14 30 -78 -152 -146 -201 -233 -115 15 52 43 4 -20 13 16 -88 -234 -319 -295 -167 21 177 183 75 -7 -64 -98 -58
4327e8rp6Q5J55k1m6L3l7k8P2L3l4k8n4p5l0Jk0n6k7O0J01Q0L3m7o5K6O7Nj1L2k3r2j0O2j6
$$ -58 -67 -143 -58 97 76 30 63 26 -2 70 103 69 41 -13 -88 -118 -117 -137 -193 -220 -160 -59 21 54 7 -58 -32 35 40 29 61 38 -54 -64 -2 -18
4316a8j1J15Q2q9j68j10J5O5NKK8k7rR4J26O1j03j71NQ9k0QL6p5m7Qq6l8J26J06jj5Mo%K4
$$ -18 -29 86 168 79 -89 -199 -184 -119 -114 -112 -84 -111 -120 -26 100 161 58 -113 -108 -19 -39 -31 5 -70 -117 -109 -195 -233 -107 -1 -2 -17 -13 -19 -19 5
4306Ek2p2K1P6j2n5o7r3K1J68J37Mo4mM3l4p8n8o6PJ08Q3O9K8j07o4R6N4m5l8l0mL1k3p5o1
$$ 5 -17 -89 -68 8 -4 -59 -126 -219 -198 -30 107 111 47 43 86 52 -26 -84 -150 -143 -35 48 117 145 38 -26 70 124 79 41 11 7 38 15 -60 -121
4296a21l9j3Ll8l2R6J72J13O4L1o7r9m4j4K4L4m3n7J4K7j1k7j6NPnl6n5J5J03O8m3n6O4J06
$$ -121 -160 -173 -170 -208 -240 -144 28 141 205 236 169 70 26 12 36 70 27 -30 -16 11 0 -27 -43 -38 -31 -36 -72 -127 -112 -9 59 16 -40 24 130
4286A30k2q1j3l2q6PR9J6n7J4l8j67oJ68J3q5J1N2P0P3M5M6o3j43N1J72kj22o3L7P5jp2o1
$$ 130 108 27 14 -18 -104 -97 2 18 -39 -25 -63 -230 -236 -68 -55 -140 -129 -77 -7 66 111 157 94 -49 2 174 172 50 -13 24 99 98 26 -35
4277c5j5N2N1k9l2M0N3l6j11l6P2L9J2Q3N1o9m5L4j6o3n9j08m1J27P6r8j10KR6N2k1P4J40
$$ -35 -50 2 53 24 -8 32 85 49 -62 -98 -26 13 25 108 159 90 45 79 63 0 -59 -167 -208 -81 -5 -103 -213 -211 -115 -63 -84 -10 130
4268A30L3m0o4p8j7K5pm8k5P8P6rjm4r3L9N6n9%M1l9k3j6q3m3R5J75R1p3j19p6m0LM5M6LJ
$$ 130 163 123 59 -19 -36 -11 -18 -66 -91 -13 63 54 53 9 -84 -45 11 -48 -48 -7 -46 -69 -85 -168 -211 -116 59 150 77 -42 -118 -158 -155 -110 -64 -61 -60
4257f0Q9O8p3m9P6Q0mq7j11l0Q2R8mm0J01J04j41k16NJ54N9r0j15o5j5K5M8P5R6J3j02q4K5
$$ -60 29 97 24 -25 51 131 127 40 -71 -101 -19 79 75 35 136 240 99 -117 -112 42 101 11 -104 -169 -184 -159 -111 -36 60 73 -29 -113 -88
4248h8Q0L0nO1O6l3m1j1l0NM5L7O3M4o2r7m9MO5O9k8j10r7o0m2ML8QO1J53L4j20p1j1kM0j0
$$ -88 -8 22 17 78 144 111 70 59 29 34 79 116 179 223 161 64 15 19 84 153 125 15 -82 -142 -184 -180 -142 -134 -73 80 114 -6 -77 -88 -90 -50 -60
4238f0o3QJ5JJ14J10r8j31J24K45ok31j68q0k5N8J9rR9Q9k0l4lL4K0n6J4J33L1q1j5L0qj8
$$ -60 -123 -115 -100 -99 15 125 27 -104 20 265 259 28 -140 -220 -245 -187 -168 -177 -78 11 -9 -43 -46 -12 8 -48 -34 99 130 49 34 64 56 38
4228C8j8l1QO8j2j41n9J14O8o9m8L5K8j0k2kK7J4K9Q8K0n7K7L1j6Q0L5j14n1k4o2J02J61l7
$$ 38 20 -11 -3 65 53 -88 -147 -33 35 -34 -82 -47 -19 -29 -51 -53 -26 -12 17 105 125 68 95 126 110 190 225 111 60 36 -26 76 237 200
4219B00j26n1Q6J51Pr6o3j26j42m3k9O2J96P3o2QRm7K0L6n1m7j8o1K6J52nj65j6R2N6P8j2
$$ 200 74 23 109 260 267 171 108 -18 -160 -203 -232 -170 26 99 37 45 54 7 27 63 12 -35 -53 -114 -88 64 59 -106 -122 -30 26 104 92
4209I2j28j6O4JPM3L2j5o2k1j0k3Q4P1o4k9k0n8M1j9j37nL0m3O0P0j6jp0j40o1kL3Q0J18J70
$$ 92 -36 -52 12 13 20 63 95 80 18 -3 -13 -36 48 119 55 26 6 -52 -11 -30 -167 -172 -142 -185 -125 -55 -71 -72 -142 -282 -343 -345 -312 -232 -114 56
4199E6P9p5l5J1l4jJl7PJ4pK5J4K7L3j06p3J92J63o3o1l7q2j1J8pJ2q0j44jJ08J24Q1p0j16
$$ 56 135 60 25 36 2 1 2 -35 -28 -14 -21 4 18 45 78 -28 -101 91 254 191 130 93 11 0 18 11 23 -57 -201 -202 -94 30 111 41 -75
4189g5l7m7rR1M9lM2K2q8p8J05J43l7j00n3l4M3M8n2j8O6N4j8r4PJ45M1m7k5n8NM3n4J6J17
$$ -75 -112 -159 -168 -77 -28 -31 11 33 -55 -133 -28 115 78 -22 -75 -109 -66 -18 -70 -88 -22 32 14 -80 -73 72 113 66 41 -17 -12 31 -23 -7 110
4180A10K2o0j01p6M9J3m2O1J7q7jR4R7L6n4l7J2K7J9p8j14k0K0N3P2m7j10j6R9J20l8j18M
$$ 110 132 72 -29 -105 -56 -43 -85 -24 -7 -94 -95 -1 96 132 78 41 53 80 99 21 -93 -113 -93 -40 32 -15 -125 -141 -42 78 40 -78 -74
4170g4n5j42K7N3m2J09K11M6q1QJ17K0j10o1%qk0l3K9J1j19o6L0j7M9O9q5o2L8jJ0O7Q1P8
$$ -74 -129 -271 -244 -191 -233 -124 87 133 52 60 177 197 87 26 26 18 -2 -35 -6 5 -114 -180 -150 -167 -118 -49 -134 -196 -158 -159 -149 -82 -1 77
4161G7J9l6k5k0l0m4KR6P2j2ML2Rk2m0l1m9p8o6k1Q0J18Ql8J3J3RJ2J0L5Kj7N8L8m5oK9m5
$$ 77 96 60 35 15 -15 -59 -57 39 111 99 103 135 144 122 82 51 2 -76 -142 -163 -83 35 43 5 18 31 40 52 62 97 99 82 140 178 133 127 156 111
4150A11p2pKk9J5K2k8K2M3oKm4o7N2K7j17q4K5N7L3L4P1ro2M8Lr3P2J59J7q3j14n9K8RL1P4
$$ 111 39 32 34 5 20 42 14 36 79 73 75 31 -36 16 43 -74 -158 -133 -76 -43 -9 62 53 -9 39 42 -51 21 180 197 114 0 -59 -31 -22 9 83
4140H3l3j19o3qpM7J23P7RJ5n4j11l6J4J5k4q8m1J4K2J31J46L9Rl2j3P7o0j55k9m7n7P7J3
$$ 83 50 -69 -132 -140 -147 -100 23 100 109 124 70 -41 -77 -63 -48 -72 -160 -201 -187 -165 -34 112 151 160 128 115 192 132 -23 -52 -99 -156 -79 -66
4130f6o7Q8J39Nn0qrn7o6j1L6j3j11n6Q5P0J6L7K2JmKQ5J13J4n0r0o4O1M5o5k0mm6N5P0j07
$$ -66 -133 -45 94 99 49 41 32 -25 -91 -102 -66 -79 -190 -246 -161 -91 -75 -38 -16 -15 -19 -17 68 181 195 145 55 -9 52 97 32 12 8 -38 17 87 -20
4120b0j26K9Q4L6k7n7nK0NN0N2j9l5j6MM9Q0P5J8o8n5K3K8m1r5k3P4L0j0l2j08k7J34Q4n6
$$ -20 -146 -117 -33 3 -24 -81 -86 -66 -61 -11 41 22 -13 -29 -25 24 104 179 197 129 74 97 125 84 -11 -34 40 70 60 28 -80 -107 27 111 55
4110E5j04l6O6L8J9N4p5j51m0kN3J36K7o1JL2L9Mm2L6P4n5j60j28K1J39Q8oj6NJ3Pk5o2n7
$$ 55 -49 -85 -19 19 38 92 17 -134 -174 -176 -123 13 40 -21 -20 12 51 55 13 49 123 68 -92 -220 -199 -60 28 22 6 11 24 31 6 -56 -113
4100a13k3k3JO3N0pj0pKL7L0l2p2RJ04P9L3Pp6j30p9M9J53P8l9j7k5o7mK9MJ9J6Jj0l5oL3
$$ -113 -136 -159 -158 -95 -45 -52 -62 -69 -67 -30 0 -32 -104 -95 9 88 121 128 52 -78 -157 -108 45 123 84 67 42 -25 -29 0 4 23 39 40 30 -5 -11 22
4090B2J4%NL3N7k9q1N9J23k3j08m1J4K3K7Lo2r7j7J04J03L6Rl9m0L7lq0j9Mm9rL9ok9L4O5
$$ 22 36 36 41 74 131 102 21 80 203 180 72 31 45 68 95 98 36 -61 -78 26 129 165 174 135 95 132 129 49 30 34 -15 -24 15 9 -20 14 79
4079G9l8p2N4Q2k4l1K3J1j8J4N2jm7J3M3j0p9j04rL5k5Q1J39r3j68j5po8l4N1J20O3K6O4n4
$$ 79 41 -31 23 105 81 50 73 84 66 80 132 131 84 97 140 130 51 -53 -62 -27 -52 29 168 75 -93 -108 -115 -183 -217 -166 -46 17 43 107 53
4069E3r9R6P5j13m2O3M5M5k9p7J4ml3O7J2p3P1R4o9n8M7M6m9j13j1N6rN8P0j03p8M1MJ4oj05
$$ 53 -46 50 125 12 -30 33 78 123 94 17 31 27 -6 61 73 0 71 165 96 38 85 131 82 -31 -42 14 5 63 133 30 -48 -7 -3 11 5 -100
4059a00k2J07R1O6jj20j54o9N7O1k6nO5N7Pl2k5J7N5K3j36j76JO3L2M4k7j9N3m0%J44Mj06
$$ -100 -122 -15 76 142 141 21 -133 -202 -145 -84 -110 -115 -50 7 14 -18 -43 -26 29 52 -84 -260 -259 -196 -164 -120 -147 -166 -113 -153 -153 -9 -5 -111
4050a11LQ2J59J10j21j60n3LJ35J74no2O3O2n0m6jl5k0jq5p0L7N2L1pp1k5M3K9mj1M6O6o7
$$ -111 -108 -26 133 243 122 -38 -91 -88 47 221 216 154 217 279 229 183 182 147 127 126 41 -29 8 60 91 84 13 -12 31 60 56 45 91 157 90
4040I0j23l7m8q0L5J40O2n4k3M0oq9j19k5J36J29K8J5j0m8m7p2j7N4l0n8L9L2jQ6Q7o4o9N1
$$ 90 -33 -70 -118 -198 -163 -23 39 -15 -38 2 -4 -93 -212 -237 -101 28 56 71 61 13 -34 -106 -123 -69 -99 -157 -118 -86 -87 -1 86 22 -47 4
4030Dj5p9M1M7QP1J4l1K3j0MRo3P1J36r1j44mQ3R2q3k04j11m8O1J69P3J3oq2l6nK5J61M8j28
$$ 4 -11 -90 -49 -2 6 77 91 60 83 73 77 86 23 94 230 139 -5 -9 74 166 83 -121 -232 -280 -219 -50 23 36 30 -52 -88 -93 -68 93 141 13
4020A3J5O3q6q3M0J35N4j34r2M2pj08q2J00J98L7p0l5o1o9k5J3N6%l9P3Q8l5q5p2k9J5LL1
$$ 13 28 91 5 -78 -38 97 151 17 -75 -33 -40 -148 -230 -130 68 105 35 0 -61 -130 -155 -142 -86 -86 -125 -52 36 1 -84 -156 -185 -170 -167 -136
4011a36J04P5j8l0j1n0j4K7n7L1J76n6k00rj1l5J32M8j23o1RR4J45Mo7j7KL6Ml9L6No9rk0
$$ -136 -32 43 25 -5 -16 -66 -80 -53 -110 -79 97 41 -159 -168 -179 -214 -82 -34 -157 -218 -209 -115 30 34 -33 -50 -48 -12 -8 -47 -11 -6 -75 -84 -104
4001a04l4N7L5L1R9n1k09j08M6J23R0j8m5m3k2Q9J21O3J2o8l9N9k3j09n0KL7L0o3p4M4J34
$$ -104 -138 -81 -46 -15 84 33 -176 -284 -238 -115 -25 -43 -88 -131 -153 -64 57 120 132 64 25 84 61 -48 -98 -96 -59 -29 -92 -166 -122 12
3992A2O7l2M9N9j16r8J8L0P2Oq8N3N1j33r7l0mJ13P7l2J5P0O0Lo8o8m1K8N2p3p4O2N5M9O2
$$ 12 79 47 96 155 39 -59 -41 -11 61 67 -21 32 83 -50 -147 -177 -181 -68 9 -23 -8 62 122 125 57 -11 -52 -24 28 -45 -119 -57 -2 47 109
3982A09k3k3j9l7P1L5q9K8O8p2r7j11r9M1Q8N6M3l3l6N7K4m3j3ml9j0N7N5K3L8J3n8o7l9L
$$ 109 86 63 44 7 78 113 24 52 120 48 -49 -160 -259 -218 -130 -74 -31 -64 -100 -43 -19 -62 -75 -79 -118 -128 -71 -16 7 45 58 0 -67 -106 -103
3972a03N6M2k2q1r3RR1ko8j8k8m3M2R0L7k4J5Q0j3q8M6J10M1M8J4r3p5J5N0L2RLm3p0nL8J1
$$ -103 -47 -5 -27 -108 -201 -192 -101 -103 -171 -189 -217 -260 -218 -128 -91 -115 -100 -20 -33 -121 -75 35 76 124 138 45 -30 -15 35 67 76 79 36 -34 -39 -1 10
3962A0m9r7OR9Rj2L5k5n7q1r9L8Q5j6K7Q2K6L4O2J3l7k5J9NKM7J3oJ9r3j42j0L8K2J7n5rJ26
$$ 10 -39 -136 -130 -31 -22 -34 1 -24 -81 -162 -261 -223 -138 -154 -127 -45 -19 15 77 90 53 28 47 52 54 101 114 108 127 34 -108 -118 -80 -58 -41 -96 -105 21
3951B1M2j18r0K8J28J43pj17pJ10J02N2m3p8k0q2j27L1J17L4k2k5pJ1J9J0q3p9N4J2l2N4k2
$$ 21 63 -55 -145 -117 11 154 147 30 23 133 235 287 244 166 146 64 -63 -32 85 119 97 72 65 76 95 105 22 -57 -3 9 -23 31 9
3942Ik2J48N1p0j1q9r4L7k1o1rk3P5J38K1mmm1P0R2p1p7J4J0k0n8j8J16Q3m0nlo3J6M5o6m4
$$ 9 -13 135 186 116 105 16 -78 -41 -62 -123 -132 -155 -80 58 79 75 71 30 100 192 121 44 58 68 48 -10 -28 88 171 131 126 123 60 76 121 55 11
3932A1N5k2j40p9L8L9P8J46Jj32lN2k7jnq5q6m0K1Q5Q1J3r3r4J00J76L0k1M3J0o4l9N3Q5K2
$$ 11 66 44 -96 -175 -137 -98 -20 126 127 -5 -8 44 17 16 11 -74 -160 -200 -179 -94 -13 0 -93 -187 -87 89 119 98 141 151 87 48 101 186 208
3922B08n4p4o0k7L4J7p6j1R5j8q0RlnK0q1p6M7M3MLj4k7m4K6J42Q9k1ON3L4Mj0l0p6q7k8O3
$$ 208 154 80 20 -7 27 44 -32 -43 52 34 -46 -37 -40 -45 -25 -106 -182 -135 -92 -88 -85 -99 -126 -170 -144 -2 87 66 72 125 159 163 153 123 47 -40 -68 -5
3911eM0r5n3O5p3q6J16J4j02P7Q0p1n1K1N1nn6P7J63O4l0p4l6N7M9OJ7N6R9L8q6j15r1m9M
$$ -5 35 -60 -113 -48 -121 -207 -91 -77 -179 -102 -22 -93 -144 -123 -72 -77 -133 -56 107 171 141 67 31 88 137 143 160 216 315 353 267 152 61 12 16
3901A6Ol0l9L3M3p2k7P9n9r0P1N3Nko4j0l7j65J8J79J2k1N4k7PJ29K4j60j31JL7Q0J46K8j54
$$ 16 22 -8 -47 -14 29 -43 -70 9 -50 -140 -69 -16 -11 -13 -77 -87 -124 -289 -271 -92 -80 -101 -47 -74 -67 62 86 -74 -205 -204 -167 -87 59 87 -67
3892f7j16M1J22Q4JJ8L5l9P1J87p5k23L6J09l5m1m6l5K5n9k4J47K2j10L0L2q5k7O0O3K4k9
$$ -67 -183 -142 -20 64 65 83 118 79 150 337 262 39 75 184 149 108 62 27 52 -7 -31 116 138 28 58 90 5 -22 38 101 125 96
3883I6q0r0L7J25kn4L0j2p1q0p8K2Q6M5L4rm2K2J7j5K8L6L8N7J3l1n0o7m2k4j3Nk6m3L2Q3
$$ 96 16 -74 -37 88 86 32 62 50 -21 -101 -179 -157 -71 -26 8 -1 -43 -21 -4 -19 9 45 83 140 153 122 72 5 -37 -61 -74 -69 -95 -138 -106 -23
3872b3K7k2j1l6p6k3M1K9Pj1k3rJ0lp0o6R6J34m0j00J7R6M5l3PN7NLK6j5J5M5j1qop2m2N5
$$ -23 4 -18 -29 -65 -141 -164 -123 -94 -87 -98 -121 -130 -120 -123 -193 -259 -163 -29 -69 -169 -152 -56 -11 -44 -37 20 25 28 54 39 54 99 88 80 74 2 -40 15
3862A5O9Nm2n7n9LM8Lj3k5p1M6J51K7m3JQM0Jp0%j7j12k0K9p8q5l4MQ9J17P0K3OK8J5jL4m0
$$ 15 84 89 47 -10 -69 -66 -18 -15 -28 -53 -124 -78 73 100 57 58 66 106 107 37 37 20 -92 -112 -83 -161 -246 -280 -276 -187 -70 0 23 29 57 72 71 105 65
3851F5j35J1J58O2m4m0m9m3J3L9K6L3J8k8k7j3K5R7Nj26K6J51nq9k1K7L6o3j38n4m9p2P6J21
$$ 65 -70 -59 99 161 117 77 28 -15 -2 37 63 96 114 86 59 46 71 168 173 47 73 224 219 130 109 136 172 109 -29 -83 -132 -204 -128 -7
3841gJ5K3L8n9r5k6M1J04J15l6j26L0P3r1l6J03%q9l5LKnM6Q2n4j52m3N9M4RM7J02J5q9j3
$$ -7 8 31 69 10 -85 -111 -70 34 149 113 -13 17 90 -1 -37 66 66 -23 -58 -55 -53 -58 -12 70 16 -136 -179 -120 -76 -67 -20 82 97 8 -5
3832eM2k0m4j8ml1p1k3M3rl1R3J54O7J3j9j00k2J10k5j28K3P8J3lp3q6K2K2o5o5J0M8j4oJ28
$$ -5 37 17 -27 -45 -49 -80 -151 -174 -131 -140 -171 -78 76 143 156 137 37 15 125 100 -28 -5 73 86 83 10 -76 -54 -32 -97 -162 -152 -104 -118 -124 4
3821DN1j20J0P6j23o6J36P5J8K0m2K0J8r2N9J65Rk6o8j59n5mK5J41J9q5M2mr8q8j09J2J03
$$ 4 55 -65 -55 21 -102 -168 -32 43 61 81 39 59 77 -15 44 209 218 192 124 -35 -90 -94 -69 72 91 6 48 44 -54 -142 -251 -239 -136
3812a36mL5P4m0J1J10N5l2j04r0QN8P2L8k3k6j7jL7O7N6o6j08J4po8L2N6N3O0k4J1N3m6j2
$$ -136 -140 -105 -31 -71 -60 50 105 73 -31 -121 -113 -55 17 55 32 6 -11 -12 25 92 148 82 -26 -12 -19 -87 -55 1 54 114 90 101 154 108 96
3802I6rj29n6L9j0j3O2J59N5j69o6N8o8l9M1KN1J7p0J8L1m5j2J9M8P4pp4k5O9Q0j5l9L8P2
$$ 96 87 -42 -98 -59 -69 -82 -20 139 194 25 -41 17 -51 -90 -49 -47 4 21 -49 -31 0 -45 -57 -38 10 84 77 3 -22 47 127 112 73 111 183
3793A83No3j9j9j02j0Q8KL9J13J5m8q9j02J8K6n5p%m7MP4R0O9J8p4j34l0O6J5j4k8j6Q5O8
$$ 183 188 125 106 87 -15 -25 63 65 104 217 232 184 95 -7 11 37 -18 -25 -25 -72 -68 6 96 165 183 109 -25 -55 11 26 12 -16 -32 53 121
3783A21mJ2m4m6Qn6j2K2j12l7P8k1J4Q5K3K5K4K4L1r6r5L5kj8Rp0l9M7O7J39Q5q7q3j6qK1
$$ 121 117 129 85 39 47 -9 -21 1 -111 -148 -70 -91 -77 8 31 56 80 104 135 39 -56 -21 -23 -41 -32 -102 -141 -94 -27 112 197 110 27 11 3 24
3773B4j9r1p7o3l7R9J55L3JP6J1m8L3Np3k9nJ3M3l1j7O4k6n6L9Rm3j5j1J3K8M2Q8rr2P7R2
$$ 24 5 -86 -163 -226 -263 -164 -9 24 25 101 112 64 97 102 29 0 -5 8 51 20 3 67 41 -15 24 33 -10 -25 -36 -23 5 47 135 126 34 111 203
3762B03j11q8mn4RN2o7l4J18P9l2l3k3lN6nq7J5N7l3J7M9l8L6J18pr0m1K7N1Kj6l3j00l9N7
$$ 203 92 4 0 -54 -45 7 -60 -94 24 103 71 38 15 12 68 63 -24 -9 48 15 32 81 43 79 197 190 100 59 86 137 139 123 90 -10 -49 8
3752HK5M1O4l5m3L2l6j54j03M4O8M5O8J1n0oL0P2K8j06l2Q2mk2Rl5QJ0l8km1p3j3k1N2J35
$$ 8 33 74 138 103 60 92 56 -98 -201 -157 -89 -44 24 35 -15 -21 9 81 109 3 -29 53 49 27 36 1 9 19 -19 -21 -62 -135 -148 -169 -117 18
3742A8Ll2J6p2m0O7N1Q6P8m8o4j3k5p1p2N1J21N4N7Q7J7m0q3j37j18o9K6J53J64M3n4j6Q4
$$ 18 21 -11 5 -67 -107 -40 11 97 175 127 63 50 25 -46 -118 -67 54 108 165 252 269 229 146 9 -109 -178 -152 1 165 208 154 138 222
3733B22L5p5l8m7j60j19m9n7O3J42M2M1O2p1j10j9Ll8m3L9J08N2K9O8K3jK2Oj9q8j33n4K9
$$ 222 257 182 144 97 -63 -182 -231 -288 -225 -83 -41 0 62 -9 -119 -138 -135 -173 -216 -177 -69 -17 12 80 103 102 124 130 111 23 -110 -164 -135
3724a35P0P6N2Q4O5l8m0r4j80j2J68J16Pp3p0j2L0Q9J3j01K1M1j05n2k6r9K4J02lm3J2O0K
$$ -135 -65 11 63 147 212 174 134 40 -140 -152 16 132 139 66 -4 -16 14 103 116 15 36 77 -28 -80 -106 -205 -181 -79 -82 -125 -113 -53 -51
3714e1n4N3R4L8M9j5m8N1j8p9O2K7j45j40o4K6J44Q7j15j24O7R8l5n7K4Q5N7m7k4N5n5j08
$$ -51 -105 -52 42 80 129 114 66 117 99 20 82 109 -36 -176 -240 -214 -70 17 -98 -222 -155 -57 -92 -149 -125 -40 17 -30 -54 1 -54 -162
3705a62L6N2mN1J9o5M7J45Jr7l1o9q9O4R1j3J0N6L0J6L1L1k8n1J6J8k4l2l1N4M4j37n3J72
$$ -162 -126 -74 -78 -27 -8 -73 -26 119 120 23 -8 -77 -166 -102 -11 -24 -14 42 72 88 119 150 122 71 87 105 81 49 18 72 116 -21 -74 98
3696I8J06k6p9q9Q0J51k3p2k3o0n7QN0L3J0O0K4q4l7j8r4J1Q4m2n0J1k1O8J34m5r8Q3R1m5
$$ 98 204 178 99 10 90 241 218 146 123 63 6 14 64 97 107 167 191 107 70 52 -42 -31 53 11 -39 -28 -49 19 153 108 10 93 184 139
3686A39n7J1O9J0j11m9M1l8n2k8p2JQ0O0R4L8r6m3M4J4l5p0k5M3k6r5p9j5R7J13P0J04Oj40
$$ 139 82 93 162 172 61 12 53 15 -37 -65 -137 -136 -56 4 98 136 40 -3 41 55 20 -50 -75 -32 -58 -153 -232 -247 -150 -37 33 137 143 3
3677Cq7m8l3J02Q2l0N6N4j54j57%L1O0J20R1O1J0j01o4N3M0K9K0j09j52l5N9K9o3k1J23J16
$$ 3 -84 -132 -165 -63 19 -11 45 99 -55 -212 -212 -181 -121 -1 90 151 161 60 -4 49 89 118 138 29 -123 -158 -99 -70 -133 -154 -31 85
3668H5N5L2q1j32n6j2O4Q7l5l2L8mK5N2o1q2k0nM3O2K5M6N4J2Ll5q1m1rrN7O3l0l3ml9J0O3
$$ 85 140 172 91 -41 -97 -109 -45 42 7 -25 13 9 34 86 25 -57 -77 -82 -39 23 48 94 148 160 163 128 47 6 -3 -12 45 108 78 45 41 2 12 75
3657G5k0l3N3l2j87q3J57J34m3p5o6l7Q2O1LJ04K1j77p3Q1N1K1Qj0n1q8K8J21O9O8M2l2l3
$$ 75 55 22 75 43 -144 -227 -70 64 21 -54 -120 -157 -75 -14 -11 93 114 -63 -136 -55 -4 17 25 15 -36 -124 -96 25 94 162 204 172 139
3648A39j26j46O7P7q3m9LK0J11P1m8j7M9K1l1k7ll0n9n4j3J09J52Rm3M1k9j26k3N0k7l5K3
$$ 139 13 -133 -66 11 -72 -121 -118 -98 13 84 36 19 68 89 58 31 28 -2 -61 -115 -128 -19 133 142 99 140 111 -15 -38 12 -15 -50 -27
3639b7J3J1oq8q1mml7k6L3Q3L7k5j8j2jJ5PN2J00K2j00r3L4J32R2p7j53kO7l8N2J35p7j31
$$ -27 -14 -3 -9 -97 -178 -182 -186 -223 -249 -216 -133 -96 -121 -139 -151 -152 -137 -130 -78 22 44 -56 -149 -115 17 109 32 -121 -123 -56 -94 -42 93 16 -115
3629a15Nj3L0Q0p1q4K8M4P0mj06K2J02k4j14q8O2J73O7k6nk3k1Jp2j16M1J65Jj08N7J05K6
$$ -115 -110 -123 -93 -13 -84 -168 -140 -96 -26 -30 -136 -114 -12 -36 -150 -238 -176 -3 64 38 33 10 -11 -10 -82 -198 -157 8 9 -99 -42 63 89
3619H9L7l7j02QK0n8m4j5LJ1M4J01kq7N7R1l6qPr5p7J5J9K1N0lm2Q6J45k9j38o3N8J49N5j02
$$ 89 126 89 -13 -5 15 -43 -87 -102 -99 -88 -44 57 55 -32 25 116 80 72 79 -16 -93 -78 -59 -38 12 9 -33 53 198 169 31 -32 26 175 230 128
3609A28n3%r3j07j5P9J36lk07j15R7Q5LLJ0L0J1p1k1J04R2K4j8m0j4j2k7J6J4m6n8J5Q3k7
$$ 128 75 75 -18 -125 -140 -61 75 72 -135 -250 -153 -68 -65 -62 -52 -22 -11 -82 -103 1 93 117 99 59 45 33 6 22 36 -10 -68 -53 30 3
3600Cj58j5R7m3m6Q7K7l5O4M2j07o5O2jj5P7op7k3o2pJ59O6r7l9L2l5n5N7P7m1o9n6k4J03
$$ 3 -155 -170 -73 -116 -162 -75 -48 -83 -19 23 -84 -149 -87 -88 -103 -26 -32 -109 -132 -194 -201 -42 24 -73 -112 -80 -115 -170 -113 -36 -77 -146 -202 -226 -123
3590a23M2q7J09K24J1j04p7o1j5L4O2k6j22L6J61J7p2j8j0n3k7J02R2o4l6M1L6J25J39Mo3
$$ -123 -81 -168 -59 165 176 72 -5 -66 -81 -47 15 -11 -133 -97 64 81 9 -9 -19 -72 -99 3 95 31 -5 36 72 197 336 340 277
3581B77j11j07j4mJ1O6J7j8k8p3nM8o1j08J1P0j2l3K4k3JJ45P5p9m3j4l3oPM2L1m6l0k0l2
$$ 277 166 59 45 41 52 118 135 117 89 16 11 59 -2 -110 -99 -29 -41 -74 -50 -73 -72 73 148 69 26 12 -21 -27 -20 22 53 7 -23 -43 -75
3571g5P3O1q5o0Ql0KN7J9lk1p7j4J38J27J5k4l3j1J0o1l2Q2Lr5%M4%k9j04n6J48J15j30j31
$$ -75 -2 59 -26 -86 -78 -108 -106 -49 -30 -33 -54 -131 -145 -7 120 135 111 78 67 77 16 -16 66 69 -26 -26 18 18 -11 -115 -171 -23 92 -38 -169
3562a69N7O8%Nl3m0M1K9j2J7k3n3M7Q6J4j8l0p9p1N0J35M0r9o1R5J14prO7l0j38k5J28R1r4
$$ -169 -112 -44 -44 -39 -72 -112 -71 -42 -54 -37 -60 -113 -66 20 34 16 -14 -93 -164 -114 21 61 -38 -99 -4 110 103 94 161 131 -7 -32 96 187 93
3552I3j67l5N7L1J9mJ6Q7j6j70j07N5J08J8m2O8P8l0M9Q5n2PR8l3r9p3r4m5Nj6JLj2Ko0q4
$$ 93 -74 -109 -52 -21 -2 -6 10 97 81 -89 -196 -141 -33 -15 -57 11 89 59 108 193 141 148 246 213 114 41 -53 -98 -93 -109 -108 -105 -117 -115 -175 -259
3542b59O3J30K4l9J2P7L5o7l5L4k3oR3K9o2k1j3m7k9J7K0o7q7O3J35M4j7k9k6j0JQ6J36J6
$$ -259 -196 -66 -42 -81 -69 8 43 -24 -59 -25 -48 -54 39 68 6 -15 -28 -75 -104 -87 -67 -134 -221 -158 -23 21 4 -25 -51 -61 -60 26 162 178
3532A78p2p6q6PJ18P8K4N6Q2l4j89j03K6l4j2M7n9m9O5Q8J06jj49n5J6k9K6J9q4j00j0J53
$$ 178 106 30 -56 -49 69 147 171 227 309 275 86 -17 9 -25 -37 10 -49 -98 -33 55 161 160 11 -44 -28 -57 -31 -12 -96 -196 -206 -53
3523e3J25r3p8J9p0m9K9k7J1P9J6J4R5R4L6%n7j32q7L4L2n0o4N2J62M0j17q3n9j3O6o1q3J49
$$ -53 72 -21 -99 -80 -150 -199 -170 -197 -186 -107 -91 -77 18 112 148 148 91 -41 -128 -94 -62 -112 -176 -124 38 78 -39 -122 -181 -194 -128 -189 -272 -123
3514a23J43rj2j4K9O8o9j13M5J48R2o3j16MN0j3j1J0o5j39j5J65J18MqpM2N2o9n4O5Pp9o0
$$ -123 20 11 -1 -15 14 82 13 -100 -55 93 185 122 6 10 60 47 36 46 -19 -158 -173 -8 110 114 106 99 141 193 124 70 135 142 63 3
3504Ck2L5L4o9k7J27M6j36n9O9PmO3L4JOK0J8r6j20P8J47J5r8j76j12Q5J09K1K6K3k0PN5J4
$$ 3 -19 16 50 -19 -46 81 127 -9 -68 1 8 4 67 101 102 108 128 146 50 -70 8 155 170 72 -104 -216 -131 -22 -1 25 48 28 35 90 104
3494A04n0m6k0l7n4K9J47O1q1K6N9j35j42M0J54J31m6j39o2m2L8J20J2j7Rl7O7J07j7j2m9
$$ 104 54 8 -12 -49 -103 -74 73 134 53 79 138 3 -139 -99 55 186 140 1 -61 -103 -65 55 67 50 59 22 89 196 179 167 118
3486A18r1O0P6j8pn1n0J3l1KO4ml3l5n3l7l2J9O1J4J6%j5Q1M3m9N0P1K1J9j00j17J9J6K5L3
$$ 118 27 87 163 145 138 87 37 50 19 21 85 81 48 13 -40 -77 -109 -90 -29 -15 1 1 -14 67 110 61 111 182 203 222 122 5 24 40 65 98
3476I8j02p7M4k1m6M4M6K6M7Mo7l2M2pr6p3N1J31K3r9m0J7MNoO7P7j03m0J62Pq6O2l2j10M0
$$ 98 -4 -81 -37 -58 -104 -60 -14 12 59 63 -4 -36 6 -1 -97 -170 -119 12 35 -64 -104 -87 -83 -78 -84 -17 60 -43 -83 79 86 0 62 30 -80 -40
3465d0j2j01L6K5p4N7J36K4m5p8j01nN9M4O7Q3L3p2j02M0N4j02m5N1MO1J1j23L3J28j4k0J2
$$ -40 -52 -153 -117 -92 -166 -109 27 51 6 -72 -173 -178 -119 -75 -8 75 108 36 -66 -26 28 -74 -119 -68 -64 -3 8 -115 -82 46 32 12 24
3456B4J6K5p4l3Q1l9k4R6j4NN6j48j06J23N3j1K3j09j62j5O1K2qK6P0N6N6M8o5j05j8k8m8
$$ 24 40 65 -9 -42 39 0 -24 72 58 63 119 -29 -135 -12 41 30 53 -56 -218 -233 -172 -150 -158 -132 -62 -6 50 98 33 -72 -90 -118 -166
3447a66L6jm9R9J44Rn1l6M6J09m3j25lPj8L0j0pN2j2n3oK5Q6J24J5r6m2N6J5k4M2N5M1K4q4
$$ -166 -130 -131 -180 -81 63 72 21 -15 31 140 97 -28 -31 -24 -42 -12 -22 -29 23 11 -42 -48 -23 63 187 202 106 64 120 135 111 153 208 249 273 189
3437A89p8M4K1k5jJ1N0Qn8M5P4l7q2j08n6L4m4k7J35P7l3k4r5j16j0K7k0l3M8J14J5p3l7k
$$ 189 111 155 176 151 150 161 211 219 161 206 280 243 161 53 -3 31 -13 -40 95 172 139 115 20 -96 -106 -79 -99 -132 -84 30 45 -28 -65 -67
3427f7K7J7n1o3j9P8J39nq0N3M3o0n5p6oJ05km9N9K1j0P6O8k2p5k9N9j1o6L3L4J6P4j0n7M4
$$ -67 -40 -23 -74 -137 -156 -78 61 56 -24 29 72 12 -43 -119 -125 -20 -22 -71 -12 9 -1 75 143 121 46 17 76 65 -1 32 66 82 156 146 89 133
3417A33Ro0l5m9k2L5QkKLO0K3q5m1J4o7q2M5R9L4MKK0O8l3j75o6R1P7K1m4k1M8m2n6Q8K4q7
$$ 133 142 82 47 -2 -24 11 19 17 19 22 82 105 20 -21 -7 -74 -156 -111 -12 22 26 28 48 116 83 -92 -158 -67 10 31 -13 -34 14 -28 -84 4 28 -59
3407e9j5J5oJ3L3R0Q1qk4k4m4o0j40j16M7P9POM1L9k3o9lO3Oo4j0Q1O3J1J8ko8j05j6J43Q3
$$ -59 -74 -59 -65 -52 -19 71 152 144 120 96 52 -8 -148 -264 -217 -138 -131 -125 -84 -45 -68 -137 -140 -77 -71 -135 -145 -64 -1 10 28 26 -42 -147 -163 -20 63
3396F3j28r8M9K1n1o5j5R5P6k4nPk8K2L7j8lj0n5J2O1k1o4j4P3J21L5n7q0j39o6J07Q4M4P5
$$ 63 -65 -163 -114 -93 -144 -209 -224 -129 -53 -77 -82 -75 -103 -81 -44 -62 -65 -75 -130 -118 -57 -78 -142 -156 -83 38 73 16 -64 -203 -269 -162 -78 -34 41
3386D1j4n4l8o9M5R5n9o3rl6K7J2n8L1O1J3K2j0OL9m6n9qk5MM9K3m0l2J28J23j13q6R6M8L4
$$ 41 27 -27 -65 -134 -89 6 -53 -116 -125 -161 -134 -122 -180 -149 -88 -75 -53 -63 -57 -18 -64 -123 -131 -156 -152 -103 -80 -120 -152 -24 99 -14 -100 -4 44 78
3376G8M1j19j17K6j9n6L0J3j2Q4J21N4j6r2q9K2N0j1j8K6P6M4k6K2k3j54k0J02m9o9M4J4k6
$$ 78 119 0 -117 -91 -110 -166 -136 -123 -135 -51 70 124 108 16 -73 -51 -1 -12 -30 -4 72 116 90 112 89 -65 -85 17 -32 -101 -57 -43 -69
3367f9jM7O6k0q5q3o9N4J32Po3j2J4M7O8L7k0o2m6pL6Q3J5q8l6J2m7k6O0O3L8L5k4r4j9J01
$$ -69 -70 -23 43 23 -62 -145 -214 -160 -28 -21 -84 -96 -82 -35 33 70 50 -12 -58 -65 -29 54 69 -19 -55 -43 -90 -116 -56 7 45 80 56 -38 -57 44
3357D4Q8L4lp1r0j9M3M4Nj6l1n5p8r1rJ01K5n6K4K2lO9M1k5rKM8R1L4j3nL0J5j14j00P6O6
$$ 44 132 166 163 92 2 -17 26 70 75 59 28 -27 -105 -196 -205 -104 -79 -135 -111 -89 -92 -23 18 -7 -16 -14 34 125 159 146 141 171 186 72 -28 48 114
3347A14l6j4j1rK6OK2K5n8KJ37P9j3lk0q2j61j30Q7J09j14o7J02J9LM1r4p3P7O4M5J5j0Q3
$$ 114 78 64 53 44 70 76 98 123 65 67 204 283 270 267 247 165 4 -126 -39 70 -44 -111 -9 10 13 54 -40 -113 -36 28 73 88 78 161
3337A61nj50J3P4r4q6lL7R6N8l3o7l9N9N4n1lL7jP3O8p5o8nn9p3j6J7M9N4j7m4K3J5j08j46
$$ 161 156 6 19 93 -1 -87 -90 -53 43 101 68 1 -38 21 75 24 21 58 57 130 198 123 55 50 -9 -82 -98 -81 -32 22 5 -39 -16 -1 -109 -255
3327b55j5J21R2PL8O5pm3j8j7k9%Q0P4n1p3J3N1M5l0n9L1j2j43m6R6M8j8J6O3N4M4J8q2p1
$$ -255 -270 -149 -57 -50 -12 53 46 3 -15 -32 -61 -61 19 93 42 -31 -18 33 78 48 -11 20 8 -135 -181 -85 -37 -55 -39 24 78 122 140 58 -13
3317a3L8l3r3K0K9J1L9k3%L8l5L8Q6p9o7K7JM5k9j50N1J31p6n2L4n7K3J17l5n6J24R2j01j04
$$ -13 25 -8 -101 -81 -52 -41 -2 -25 -25 13 -22 16 102 23 -44 -17 -16 29 0 -150 -99 32 -44 -96 -62 -119 -96 21 -14 -70 54 146 45 -59
3308e9pj0j7J8Ok6n0k5J07J71L7j05j04k1K2j8k4N4R6M2n0l7P4M5o6n7k8J9P0j8m7N5J9j4
$$ -59 -66 -76 -93 -75 -69 -95 -145 -170 -63 108 145 40 -64 -85 -63 -81 -105 -51 45 87 37 0 74 119 53 -4 -32 -13 57 39 -8 47 66 52
3298E2M8j3l0L4m0n0J8m7K3J83K0j62jJ20%m7J9rl1P7Q9o3j50o8L6Qo6mO0K1Nk7r0n7L6J41
$$ 52 100 87 57 91 51 1 19 -28 -5 178 198 36 35 155 155 108 127 118 87 164 253 190 40 -28 8 16 -50 -54 6 27 32 5 -85 -142 -106 35
3288C5J42o8j45L4O7j8j1r6j75j6J12R5J10N7r8o7P3O2K2L3m0n1L2k2q5m9o5j1J26R3NRj6
$$ 35 177 109 -36 -2 65 47 36 -60 -235 -251 -139 -44 66 123 25 -42 31 93 115 148 108 57 89 67 -18 -67 -132 -143 -17 76 81 90 74
3279G4j1L3k8r9p7K2J29P4q3q5l3m3J6M7%O4R7m9r8k4k1K1J28Q6q3j17O8J84M9pO2l8j29j0
$$ 74 63 96 68 -31 -108 -86 43 117 34 -51 -84 -127 -111 -64 -64 0 97 48 -50 -74 -95 -74 54 140 57 -60 8 192 241 234 296 258 129 119
3269A19O5j1j02m4R4J0j08pk4j14NM5j1Rp5j16M5J36R1J2OJ09N3p2MJ4r0o1kK4L1lK8Om2N4
$$ 119 184 173 71 27 121 131 23 16 -8 -122 -117 -72 -83 -74 -149 -265 -220 -84 7 19 25 134 187 115 119 133 43 -18 -20 4 35 32 60 66 24 78
3259G8j2j67j6Q0lN4N1m3PL7L5N6m3q5J2j3j29q5Q3O7q5k0J11Q5J03L7j66j33J1K9L2j0pJ05
$$ 78 66 -101 -117 -37 -40 14 65 22 29 66 101 157 114 29 41 28 -101 -186 -103 -36 -121 -141 -30 55 158 195 29 -104 -93 -64 -32 -42 -49 56
3249E6M0p9j1Kp5n6L5J04N8l7k7QQJ4J0Ko2j08L6J11k4pJ03K1p0oN4M0Jm8q1k9N2L4m8q5m4
$$ 56 96 17 6 8 -67 -123 -88 16 74 37 10 18 26 40 50 52 -10 -118 -82 29 5 -2 101 122 52 46 100 140 141 93 12 -17 35 69 21 -64 -108
3239a08N7L6n8nrj15J9J46K5K2J02J6p9q9j1Q0po1N4L2k5M6j3p4M6N8m8n8m4k2Lj1K1K6m3
$$ -108 -51 -15 -73 -78 -87 -202 -183 -37 -12 10 112 128 49 -40 -51 29 22 -39 15 47 22 68 55 -19 27 85 37 -21 -65 -87 -84 -95 -74 -48 -91
3229i1j6K6k9k5J6j9k2N7R4L0o4p3MN7K9rM4R7N1J1l7j22o8N6N9On4m0P3P6MQk5mQ6Pp9k3
$$ -91 -107 -81 -110 -135 -119 -138 -160 -103 -9 21 -43 -116 -112 -55 -26 -35 9 106 157 168 131 9 -59 -3 56 62 8 -32 41 117 121 129 104 100 186 193 114 91
3219I1k6k5K7J4J3pn2nj1p5qL9K1N5J2m4J7pm8N8N2p5l3M4M4N7k5j00N1Q1j08q1N4K8po1n8
$$ 91 65 40 67 81 94 87 35 30 19 -56 -64 -25 -4 51 63 19 36 29 -19 39 91 16 -17 27 71 128 103 3 54 135 27 -54 0 28 21 -40 -98
3208i8J57K18J3q5p3q5p0l4K2K5l0NM8M6Q7M8l8lj8j05r0l7L3J29J03joqq9r1k1n4p5K2P0
$$ -98 59 277 290 205 132 47 -23 -57 -35 -10 -40 -35 13 59 146 194 156 153 135 30 -60 -97 -64 65 168 167 161 153 64 -27 -48 -102 -177 -155 -85
3198h5J00J09m4j03PJ0J0N9J6rm4r5rJ2m8k3j07r7J91K17j2k7K1NM5M7k7p5l3M4M4L0M0J0
$$ -85 15 124 80 -23 -16 -6 4 63 79 70 26 -69 -78 -66 -114 -137 -244 -341 -150 67 55 28 49 54 99 146 119 44 11 55 99 129 169 179
3189A79om8q7ok1r7RL8kJ03O3o5j8n7j06on0n6J54J78L2m8p5J8O5q9j22k2k4J9J09P2jk1K1
$$ 179 173 125 38 32 11 -86 -77 -39 -41 62 125 60 42 -15 -121 -127 -177 -233 -79 99 131 83 8 26 91 2 -120 -142 -166 -147 -38 34 33 12 33
3179C3O9Ml2M8L3l9l2l6k7j6o3m3j8n9K7J01j2l3R1J03Lo1k4qn6OO8l0j6J14M7n0J5J0q0m0
$$ 33 102 106 74 122 155 116 84 48 21 5 -58 -101 -119 -178 -151 -50 -62 -95 -4 99 102 41 17 9 -47 -41 27 -3 -19 95 142 92 107 117 37 -3
3169cK0n7p7P4P2j07j12O0J39K8j28q7N5M3k5l0J0J25J28k6o9l3l7M6J05lr8p5j7jl6j4N1
$$ -3 17 -40 -117 -43 29 -78 -190 -130 9 37 -91 -178 -123 -80 -105 -135 -125 0 128 102 33 0 -37 9 114 111 13 -62 -79 -80 -116 -130 -79
3160g9L9mrJ7M7K1k4kOnK3K1L0L1j11j65J9J09K8n0r3%J14Kq3QN7P5J7r6lP6k6LN6j5QM6K6
$$ -79 -40 -44 -53 -36 11 32 8 6 12 7 30 51 81 112 1 -164 -145 -36 -8 -58 -151 -151 -37 -35 -118 -110 -53 22 39 -57 -60 16 -10 -7 49 34 42 88 114
3149A14K8J2O1K5j83q8J37L3qM0j60j47J25J16o5j12k9P3M4J3O2j5o7M0M1k8j4n4r1MP3M0
$$ 114 142 154 215 240 57 -31 106 139 131 171 11 -136 -11 105 40 -72 -101 -28 16 29 91 76 9 49 90 62 48 -6 -97 -93 -20 20
3140B0K4M2N7M4k2o1j7j5m2K4M3j5L3N5n6o4L4O6L6l8p8l6k3l8j3q%N0N3J4nl8p5m1M3N9R
$$ 20 44 86 143 187 165 104 87 72 30 54 97 82 115 170 114 50 84 150 186 148 70 34 11 -27 -40 -48 -48 2 55 69 64 26 -49 -90 -47 12 21
3129B1L0P8rj11o8l0m7kK2k9n3k5M8Q0L5N0K9p1jO8m6oP5l0KO1m7lP7J1ro7j04J8K2m4N1R3
$$ 21 51 129 120 9 -59 -89 -136 -138 -116 -145 -198 -223 -175 -95 -60 -10 19 -52 -53 15 -31 -37 38 8 10 71 24 21 98 109 100 33 -71 -53 -31 -75 -24 69
3119F9K0m5o8m0j5N4R2p0j00O4k2q0R1R3K7J0r0l3N4o3rJ38K6n4M0K9m9l1Pk4l6oj2M2J22
$$ 69 89 44 -24 -64 -79 -25 67 -3 -103 -39 -61 -141 -50 43 70 80 -10 -43 11 -52 -61 77 103 49 89 118 69 38 45 21 -15 -21 -33 9 131
3109A31K6q3o8m6NO2N1K3m6m9L1l9q1K2j7l8O6M9N9P6l2N6J19j18j27M6QK7O5n1m7nl5M0L6
$$ 131 157 74 6 -40 -35 27 78 101 55 6 37 -2 -83 -61 -78 -116 -50 -1 58 134 102 158 277 159 32 78 86 113 178 127 80 75 40 80 116
3099A16q0n0j6l1L5L2n7p0l1Q5J95Q4o0l1n0q0M8M0j69j13J48J35m0p6p6o6M4R6L8nk9j3O3
$$ 116 36 -14 -30 -61 -26 6 -51 -121 -152 -67 128 212 152 121 71 -9 39 79 -90 -203 -55 80 40 -36 -112 -178 -134 -38 0 -5 -34 -47 16
3090A6N7j9lJ1o6r8k7P2J06L2mQ9Q5l7p1r1j57r5J2j8m3L3R8P4l5j02KJ32J29N0j7o7q4j5
$$ 16 73 54 51 62 -4 -102 -129 -57 49 81 77 166 251 214 143 52 -105 -200 -188 -206 -249 -216 -118 -44 -79 -181 -179 -47 82 132 115 48 -36 -51
3080e1M3n2r9M4R7J8L0N6M2J4q1o2M2k3l1R1kj27j1J00Q4K6j2L5L2p8j05n8l9j1OJ2M2P7Q9
$$ -51 -8 -60 -159 -115 -18 0 30 86 128 142 61 -1 41 18 -13 78 76 -51 -62 38 122 148 136 171 203 125 20 -38 -77 -88 -82 -70 -28 49 138
3071A38lj50j16L8L3m6RN3l8n2M4J9o3m5L0J08P1m7kR6O0nq2p3N9Mn1J21J8k21l0J45J7j8
$$ 138 135 -15 -131 -93 -60 -106 -97 -44 -82 -134 -90 -71 -134 -179 -149 -41 30 -17 -19 77 137 132 50 -23 36 40 -11 110 128 -93 -123 22 39 21
3061B1kl7%J8L4P4m1j46m5M5%k0L9O7K4l6p3k9L2j5l0N1K9K4J35J01jqp1j06k2k1m4MqrJ5
$$ 21 19 -18 -18 0 34 108 67 -79 -124 -79 -79 -99 -60 7 31 -5 -78 -107 -75 -90 -120 -69 -40 -16 119 220 219 211 140 34 12 -9 -53 -49 -57 -66 -51
3051e1k4lP3L7o9j06k7K6l4l1P1O8J1j4k1M5L4o7OO8n8j8J21M3o7q9n6N5M1k7Q5R0k7M1M8
$$ -51 -75 -78 -5 32 -37 -143 -170 -144 -178 -209 -138 -70 -59 -73 -94 -49 -15 -82 -76 -8 -66 -84 37 80 13 -76 -132 -77 -36 -63 22 112 85 126 174
3041A74r4o1N4M3o9j67m9J18L2o0n9j49j14R0J38N9K9L1K8j5n6o6q8qJ35J10M3N8n8j59JQ3
$$ 174 80 19 73 116 47 -120 -169 -51 -19 -79 -138 -287 -401 -311 -173 -114 -85 -54 -26 -41 -97 -163 -251 -259 -124 -14 29 87 29 -130 -129 -46
3032d6o9n7R2J4q7L2Q5K1Q1J07n4j19J4J00N5Krk3qLo2o8mm4n9L6K3j3N2L1m5p5j13k6J56
$$ -46 -115 -172 -80 -66 -153 -121 -36 -15 66 173 119 0 14 114 169 171 162 139 131 134 72 4 0 -44 -103 -67 -44 -57 -5 26 -19 -94 -207 -233 -77
3022g7J19j5lkl6J1l2j35l2R2L2J3J7p5m3Q0J07J09L4r0n1J1nK0rk2N7j3o7L8J3l4M9K4rl
$$ -77 42 27 24 22 -14 -3 -35 -170 -202 -110 -78 -65 -48 -123 -166 -86 21 130 164 74 23 34 29 49 40 18 75 62 -5 33 46 12 61 85 76 73
3012G3q1l4P5L6K5l6j62l0J28L2k4k1l4M9P5J9J5J4O8Q7p5j31l8l9N3J78L1r7n6o8o7n3l3
$$ 73 -8 -42 33 69 94 58 -104 -134 -6 26 2 -19 -53 -4 71 90 105 119 187 274 199 68 30 -9 44 222 253 156 100 32 -35 -88 -121
3003a21J17J29n8m2O6J6l1m6n0l8q3MJ66L3j16rqp2M5Q6j4n2m1j6N0Q5K7l3%M5J8L8P2k3j40
$$ -121 -4 125 67 25 91 107 76 30 -20 -58 -141 -137 29 62 -54 -63 -71 -143 -98 -12 -26 -78 -119 -135 -85 0 27 -6 -6 39 57 95 167 144 4
2993Dr7K6M1J5P2J5j30m6P8J2RN2j6k7J8J6L0J4l3l6n9p9j4L9L6M6L1l5k3N2mo7K9O5k2p3
$$ 4 -93 -67 -26 -11 61 76 -54 -100 -22 -10 -1 51 35 8 26 42 72 86 53 17 -42 -121 -135 -96 -60 -14 17 -18 -41 11 7 -60 -31 34 12 -61
2983f1r6n8K3N2R4N6q4m3O1Rjmm7L7M8p6o5J9M7N0L6M7Kr8m6M2O7J27L1j33k1J08L9nm6j27
$$ -61 -157 -215 -192 -140 -46 10 -74 -117 -56 -47 -48 -52 -99 -62 -14 -90 -155 -136 -89 -39 -3 44 46 -52 -98 -56 11 138 169 36 15 123 162 157 111 -16
2973a6o9O2N3m3l0M6%n5lK9J8QL2J14P3n0L4Q7r8j26%k8n1rl3lM8kk7rj4Lj6m4qj9kR7O9K4
$$ -16 -85 -23 30 -13 -43 3 3 -52 -55 -26 -8 0 32 146 219 169 203 290 192 66 66 38 -13 -22 -55 -58 -10 -12 -39 -48 -62 -59 -75 -119 -127 -146 -148 -51 18 42
2961D2N6n2q6Q3P4n2o9j10m4J13M8m6K3M5K8N1L5l3q0j1M9j5j2L5j8j3k0r5l7Ln6NL0l2K4
$$ 42 98 46 -40 43 117 65 -4 -114 -158 -45 3 -43 -20 25 53 104 139 106 26 15 64 49 37 72 54 41 21 -74 -111 -108 -164 -159 -129 -161 -137
2952a37M7j7l6n2L4J43J6r1L0P4lRL5n6r1J9Q0P3O1j1NR3m3j50j7l0j04N9J39J6j7M1jj00
$$ -137 -90 -107 -143 -195 -161 -18 -2 -93 -63 11 8 17 52 -4 -95 -76 4 77 138 127 132 225 182 32 15 -15 -119 -60 79 95 78 119 118 18
2942A8l4Q1k0j03RK4o0l6N5Q1rj6R3J9o3M5jp4M0K3m3J6MJ7O4k5r3j03j05KM9ML2N0J0j0p
$$ 18 -16 65 45 -58 -49 -25 -85 -121 -66 15 6 -10 83 102 39 84 83 9 49 72 29 45 49 66 130 105 12 -91 -196 -194 -145 -141 -109 -59 -49 -59 -66
2932f6Rj9K8J44L2n8J16Q7n4K5m3j79o9l2l2J08P3n6MP8K6n6o8J1M8J7K5%m2K5L7p0o8kj6
$$ -66 -57 -76 -48 96 128 70 186 273 219 244 201 22 -47 -79 -111 -3 70 14 18 96 122 66 -2 9 57 74 99 99 57 82 119 49 -19 -21 -37
2922c7N7J48J4j46j25n1L4O8Jj5j9p4l3K0J0Q4R3l8l8O3L5n5p4l2J8M1M8O0K9q5j24k3K6L0
$$ -37 20 168 182 36 -89 -140 -106 -38 -37 -52 -71 -145 -178 -158 -148 -64 29 -9 -47 16 51 -4 -78 -110 -92 -51 -3 57 86 1 -123 -146 -120 -90
2912i0J09R4k6k0K2ro4j46j06J01J50or1k0R0P7l9k6P7Oj16n1J7l3J0O2k7l5K9J0M0N9m4m0
$$ -90 19 113 87 67 89 80 16 -130 -236 -135 15 9 -82 -102 -12 65 26 0 77 83 -33 -84 -67 -100 -90 -28 -55 -90 -61 -51 -11 48 4 -36
2903c6O5J01M8j21j68M4J12JL2P0j3o7r2p5K6Q3K9l9m0l9j7J00J19n3j15k2M3O9K1l2J4m0
$$ -36 29 130 178 57 -111 -67 45 46 78 148 135 68 -24 -99 -73 10 39 0 -40 -79 -96 4 123 70 -45 -67 -24 45 66 34 48 8
2894Hj33m1L6KL2L4l6lN6K5MK3J4k6q3j39p9J19J91M9k9J4j0j9K9j1k6O8M9n6k5P0N1m1l5
$$ 8 -125 -166 -130 -128 -96 -62 -98 -101 -45 -20 -16 7 21 -5 -88 -227 -306 -187 4 53 24 38 28 9 38 27 1 69 118 62 37 107 158 117 82
2884H2N1Qo5k4l2l9L2l0q1N8P5l0n1l6J5oq2M2J19k0k5M4M8J03K0j29r2q9q3Q1J00k4n7k1
$$ 82 133 141 76 52 20 -19 13 -17 -98 -40 35 5 -46 -82 -67 -73 -155 -113 6 -14 -39 5 53 156 176 47 -45 -134 -217 -136 -36 -60 -117 -138
2874a38O7R6J9k0m9m1M9K8j5M4Nm2L6J4m9Mqn2NJ0qO8L0r1j6O0k5K4J27Mq2PL4k0o0o0k0o
$$ -138 -71 25 44 24 -25 -66 -17 11 -4 40 45 3 39 53 4 8 0 -52 -47 -37 -45 23 53 -38 -54 6 -19 5 132 136 54 61 95 75 15 -45 -65 -71
2864g1JO3J00P7J9m3q1p2RO0ok5k1q6L3K18N7j64m9R0k1j41o4N6P4L1l5kO6o1j20P2J27O7
$$ -71 -70 -7 93 170 189 146 65 -7 2 62 56 31 10 -76 -43 175 232 68 19 109 88 -53 -117 -61 13 44 9 7 73 12 -108 -36 91 158
2854A58Q4J6k1%j16j02qr7l2R7m3n2N8n4n0R9M2m9j7J3K6J1QL7om0L6M6%M2N4l3p1q1p1Q7
$$ 158 242 258 237 237 121 19 11 -86 -118 -21 -64 -116 -58 -112 -162 -63 -21 -70 -87 -74 -48 -37 -29 8 2 -38 -2 44 44 86 140 107 36 -45 -116 -29
2844b9J43o6q1J23M5j57j10kM5L8o0n3L7j2k8Q3R0K3L3Q0P2k8j05q7p2j2Q1L7pM6Jm8L3L2
$$ -29 114 48 -33 90 135 -22 -132 -134 -89 -51 -111 -164 -127 -139 -167 -84 6 29 62 142 214 186 81 -6 -78 -90 -9 28 21 67 68 20 53 85
2835H5o3q0l0K8j4j07%J46O4j5K8Ll4J9L5m3r2o2j3K7M4Pk1J5Mn4l2L7P7R4M8n1o9RM6k7q0
$$ 85 22 -58 -88 -60 -74 -181 -181 -35 29 14 42 45 11 30 65 22 -70 -132 -145 -118 -74 -67 -88 -73 -69 -123 -155 -118 -41 53 101 50 -19 -10 36 9 -71
2824g1k7Nl2%R2R9jp4o0n1n4J4N3L8J11J27j2l2J1p6o6N0K6NM0o8j58n5P3R9N9J4NNM1O4n4
$$ -71 -98 -93 -125 -125 -33 66 65 -9 -69 -120 -174 -160 -107 -69 42 169 157 125 136 60 -6 44 70 75 115 47 -111 -166 -93 6 65 79 84 89 130 194 140
2814A40j28j9L8j1k9l4MO9L5k4k6m1nQ5M5l7J9O1J0nJl5n9o1LJ33J19l2p3m8o1m1lJ1%m8k0
$$ 140 12 -7 31 20 -9 -43 -39 30 65 41 15 -26 -31 54 99 62 81 142 152 147 148 113 54 -7 -4 129 248 216 143 95 34 -7 -10 1 1 -47 -67
2803f7J02J13J1jN2K4m6qQ2L3q2q7l6k1mJ8k6q1lQ0kk5N2n9j33O7J42K1J1K2k2J7K9n7r5m4
$$ -67 35 148 159 158 210 234 188 180 262 295 213 126 90 69 65 83 57 -24 -27 53 51 26 78 19 -114 -47 95 116 127 149 127 144 173 116 21 -23
2793b3J6j0l1M3qj03N0J08o1k7M6MJ27R8j37n9L2q4j7%q9J26K28j2p4j3l4nj4p1q9p2P7J51
$$ -23 -7 -17 -48 -5 -13 -116 -66 42 -19 -46 0 4 131 229 92 33 65 -19 -36 -36 -125 1 229 217 143 130 96 91 77 6 -83 -155 -78 73
2784G3j5n1P0L4k0Ml8o2N4J84R8q4m3N1n3r9k3m1j00q0L2J42Q8k4k3j9o7p2j0K0l3L1K15J27
$$ 73 58 7 77 111 91 95 57 -5 49 233 331 247 204 255 202 103 80 39 -61 -141 -109 33 121 97 74 55 -12 -84 -94 -74 -107 -76 139 266
2774B66p2K0N2j21q1O9O3M2j1j04o7%LN9R6K4lL7L4M8J09J18J37J86R6N3K76M98P17J256K257
$$ 266 194 214 266 145 64 133 196 238 227 123 56 56 59 118 214 238 235 272 306 354 463 581 718 904 1000 1053 1329 1827 2544 3800 6057
2766F057L751M287J731k250l789k910j918j233p71p40o97m70l01j63j05q4J5J4l7J8J8n1q3
$$ 6057 9808 14095 15826 13576 9787 6877 4959 3726 2955 2215 1518 1048 747 584 479 395 410 424 387 405 423 372 289
2759B89j40j57o0M5Q1O7M9N0J9n2r2m1K3JlM3Nk0M1K5k0lm6r6l4L3K8j4OJ02R5n8j47p2J3
$$ 289 149 -8 -68 -23 58 125 174 224 243 191 99 58 81 82 79 122 127 107 148 173 153 150 104 8 -26 7 35 21 27 129 224 166 19 -53 -40
2749d0J6J1j4o1OM6k9O9J53l4o1M9p2o4Q1m9j13P9R9j2l2p7j04L2J73J08KM0J3j09j00n2j9
$$ -40 -24 -13 -27 -88 -82 -36 -65 4 157 123 62 111 39 -25 56 7 -106 -27 72 60 28 -49 -153 -121 52 160 162 202 215 106 6 -46 -65
2740f5P8M8o0RN6p9j19M6J26on1M9K4l0Ok4j8J7o8p8l4o9K1J08J7j4pl4KL1Q3O2j54j44R6
$$ -65 13 61 1 10 66 -13 -132 -86 40 34 -17 32 56 26 32 8 -10 7 -61 -139 -173 -242 -221 -113 -96 -110 -117 -151 -149 -118 -35 27 -127 -271 -175
2730a75Q5L8J36P1m9q0j34j01L2Q0L7k8j9O7Q7J0m5kN1Jl3K5Mq5o4K0K1k0kLjP9O5p4m1K2
$$ -175 -90 -52 84 155 106 26 -108 -209 -177 -97 -60 -88 -107 -40 47 57 12 10 61 62 29 54 58 -27 -91 -71 -50 -70 -72 -69 -70 9 74 0 -41 -19
2720a9p5q9j1M0J03P5K5L8q6k00l6J44J21J6n8j03j30n3M4j7J3J86J03j13j18j5J02J60Jj44
$$ -19 -94 -183 -194 -154 -51 24 49 87 1 -199 -235 -91 30 46 -12 -115 -245 -298 -254 -271 -258 -72 31 -82 -200 -215 -113 47 48 -96
2712i6J3J37n3j25R1R8n2RM7J8O3p1j99n7OrM8mNP0n4m5J01J4l2Q5O6K8L9r3j81l3J13N9j4
$$ -96 -83 54 1 -124 -33 65 13 22 69 87 150 79 -120 -177 -171 -180 -132 -136 -131 -61 -115 -160 -59 -45 -77 8 74 102 141 48 -133 -166 -53 6 -8
2702hJ7K5l3q1p7N6J46L2n2l8p3k2O0lj4N0oo3m5RJ44J69l4j38k4M9J9m1j01n3L7k9j02QR1
$$ -8 9 34 1 -80 -157 -101 45 77 25 -13 -86 -108 -48 -51 -65 -15 -21 -84 -129 -120 24 193 159 21 -3 46 65 24 -77 -130 -93 -122 -224 -216 -125
2692a25O2Q1R3Pm7k6j3PO0O5nn6n8o7l2P7R0m9j11m0PK5O3N2j3o4m7O3J14K5j1L3j3j02j03
$$ -125 -63 18 111 118 71 45 32 39 99 164 159 103 45 -22 -54 23 113 64 -47 -87 -80 -55 8 60 47 -17 -64 -1 113 138 127 160 147 45 -58
2682e8m8kj7n2K3J55J22m4rJ37K0j45p2j4j6K0k8J4J62M9j01j2M3L3L0m5k6L4p3r4K3J4l2
$$ -58 -106 -108 -125 -177 -154 1 123 79 70 207 227 82 10 -4 -20 0 -28 -14 148 197 96 84 127 160 190 145 119 153 80 -14 9 23 -9
2673iQJ3pJ5M9M6on1m0jK0K3Lm7o1J7N4k1m8j8o6j01LJ12R3O5Q7Lq5J4N9o5n5M7K6L2L0q8
$$ -9 -1 12 5 20 69 115 109 58 18 17 37 60 63 16 -45 -28 26 5 -43 -61 -127 -228 -225 -113 -20 45 132 135 50 64 123 58 3 50 76 108 138 50
2662E0r4JJ4N9N4r9q8R5J66J60O7j09r8K1k1n2M5N4m8p9l9l0j0K2nOM1k6o0k9lR9J17pk0l0
$$ 50 -44 -43 -29 30 84 -15 -103 -8 158 318 385 276 178 199 178 126 171 225 177 98 59 29 19 41 36 42 83 57 -3 -32 -35 64 181 174 154 124
2652A24p5M8P3m6k3l0q6l8m0j7N5kK5J11M1j4l0o2J4R0P7o1k42n7K80J78n4q1r9n7Lq0q1R9
$$ 124 49 97 170 124 101 71 -15 -53 -93 -110 -55 -57 -32 79 120 106 76 14 28 118 195 134 -108 -165 115 293 239 158 59 2 5 -75 -156 -57
2643e7J82L5o6K2l5j71k4J02L3P2Q2l2m5J1Po8m9J10R1n6m2n9n5Q3L7p1m9r1n8M7J0RL1J4
$$ -57 125 160 94 116 81 -90 -114 -12 21 93 175 143 98 109 116 48 -1 109 200 144 102 43 -12 71 108 37 -12 -103 -161 -114 -104 -95 -64 -50
2633e0R3Q7J2L5n0j19j1j6m2N7N0j3J8N3%q4p6n2j9J20P9j11J0J44Jm1k7p8k4k9m8J04J29
$$ -50 43 130 142 177 127 8 -3 -19 -61 -4 46 33 51 104 104 20 -56 -108 -127 -7 72 -39 -29 115 116 75 48 -30 -54 -83 -131 -27 102
2624A02nn5n2LK7r4j34k2M0K2j4nL3J6KK2L3M3l1r1O6J67pj29k9J00J24N1m1q1m6Kp3j44j0
$$ 102 97 42 -10 -7 20 -74 -208 -230 -190 -168 -182 -187 -154 -138 -136 -114 -81 -38 -69 -160 -94 73 66 -63 -92 8 132 183 142 61 15 17 -56 -200 -210
2614b10Q9jm3KK4M5K6k8K0Q5J6n9J0Q1L7J2ro4j4j9j25QJ17p2o5Q7qqR3Kk4qq2PJ00L3K4j8
$$ -210 -121 -122 -165 -163 -139 -94 -68 -96 -76 9 25 -34 -24 57 94 106 97 33 19 0 -125 -117 0 -72 -137 -50 -58 -66 27 29 5 -3 -85 -78 22 55 79 61
2604F1j01k5K4l3K1J45J62L6o1j4j0n2MJr8q7j5j1nL4k8j24j8J00PLQ7M3O9R4m5m4M6nn1j06
$$ 61 -40 -65 -41 -74 -53 92 254 290 229 215 205 153 157 158 60 -27 -42 -53 -58 -24 -52 -176 -194 -94 -87 -84 3 46 115 209 164 120 166 161 110 4
2593Dj32PR6Q8Q2o0j41m3k5J2J42R6l1n9r1p0K0L4L3P8O1n8j57j10L5R1Q6J14N9q7j02J6N4
$$ 4 -128 -121 -25 63 145 85 -56 -99 -124 -112 30 126 95 36 -55 -125 -105 -71 -38 40 101 43 -114 -224 -189 -98 -12 102 161 74 -28 -12 42
2584D2k9o5L2R2M6L7J2j08r9J0K5L9N2k0J9J13K8r6r3o3l8j0%L2M3k6o0J6N2Lj3%RL7N5L5
$$ 42 13 -52 -20 72 118 155 167 59 -40 -30 -5 34 86 66 85 198 226 130 37 -26 -64 -74 -74 -42 1 -25 -85 -69 -17 -14 -27 -27 -18 19 74 109
2574A09Ll5m9m8n9n9m0L1J42J26J2n4o0m7q6r3K6K4l8Q5P5n8L8O2k3M4L6j0O2k8j15j5K9K4
$$ 109 112 77 28 -20 -79 -138 -178 -147 -5 121 133 79 19 -28 -114 -207 -181 -157 -195 -110 -35 -93 -55 7 -16 28 64 54 116 88 -27 -42 -13 11
2565A1j1m2P9N8j33q6K0k7n3j2Q2J24L1k1k7oP3Nn7P8Q3qK2J6pm0j58j11N8N2k7j9K5J4k0
$$ 11 0 -42 37 95 -38 -124 -104 -131 -184 -196 -114 10 41 20 -7 -13 60 65 8 86 169 161 183 199 192 152 -6 -117 -59 -7 -34 -53 -28 -14 -34
2555c4L4L1p8l9M1K0L1L0L4N4o3p9O5K8p0n5l3O9R6n8o1M5K4NK9K6J0m8j11j28o0J02J33j
$$ -34 0 31 -47 -86 -45 -25 6 36 70 124 61 -18 47 75 5 -50 -83 -14 82 24 -37 8 32 37 66 92 102 54 -57 -185 -245 -143 -10 -11
2545a1KJ16Q5oMJq3l0J20ok04r6K1JO8P0qL2kr6nQ0N6M9k7r4%L9n7o9K4O2J2k9nRj3m9o7%
$$ -11 -9 107 192 186 190 191 108 78 198 192 -12 -108 -87 -86 -18 52 44 76 74 -22 -27 53 109 158 131 37 37 76 19 -50 -26 36 48 19 14 23 10 -39 -106 -106
2534a06O5qo9jN4K0m4l7Q6J37L3n1r1j12OJ28N3o4o1k7j3J4J4K4J21J53Lj18r8m3L2M0p2o4
$$ -106 -41 -49 -118 -119 -65 -45 -89 -126 -40 97 130 79 -12 -124 -118 10 63 -1 -62 -89 -102 -88 -74 -50 71 224 227 109 11 -32 0 40 -32 -96
2524i6M8L2J6M7j4l2J4k1QJ18P4o7j83j96oJ51J07J21J63j4j82j07M3R7M8k5o2k0O4j9j72
$$ -96 -48 -16 0 47 33 1 15 -6 2 120 194 127 -56 -252 -258 -107 0 121 284 270 88 -19 24 121 169 144 82 62 126 107 -65
2516f5r0K1l6K6J26K7l8j8n6o8lQ5Q4l0%R6pm0K4p0k6J16k9q9P6K4n1M8Qn6M0L3n8LN4n4j00
$$ -65 -155 -134 -170 -144 -18 9 -29 -47 -103 -171 -174 -89 -5 -35 -35 61 54 14 38 -32 -58 58 29 -60 16 40 -11 37 45 -11 29 62 4 7 61 7 -93
2505i3J9R6L7m9q0k7M4K0K2M4o6r4O9R7J4%qL9O2p4q5O1L6l5M1M5m9p8l8J5L7l7r6J2J02J4
$$ -93 -74 22 59 10 -70 -97 -53 -33 -11 33 -33 -127 -58 39 53 53 45 84 146 72 -13 48 84 49 90 135 86 8 -30 -15 22 -15 -111 -99 3 17
2495A7k9Qk9j4L5j0NK3qP3N9p7k8l0q3Q7Q0j24p8K4O8J21J0n1K0o5n4Q9jr1N2J21Lo8L4J08
$$ 17 -12 -4 -33 -47 -12 -22 -17 6 -2 71 130 53 25 -5 -88 -1 79 -45 -123 -99 -31 90 100 49 69 4 -50 39 38 -53 -1 120 123 55 89 197
2485A97K3p5j26o3P0k7j40J9N4j9N3J8%J32N0j14q1k7j4l1m2L8O2pm8l6N9R2l7r2l5RM8K3
$$ 197 220 145 19 -44 26 -1 -141 -122 -68 -87 -34 -16 -16 116 166 52 -29 -56 -70 -101 -143 -105 -43 -50 -98 -134 -75 17 -20 -112 -147 -138 -90 -67
2476f7K3R6L3k3Q4N7r2j10p2k8P9J37O4j8NM1J4n4j10m3K1q1p2M6lM5J82L8j06l1J5kn5r4
$$ -67 -44 52 85 62 146 203 111 1 -71 -99 -20 117 181 163 168 209 223 169 59 16 37 -44 -116 -70 -73 -28 154 192 86 55 70 68 13 -81
2466h1m5k7j5L7J8L8Q3Lk9J8K0j0o5j1R4J6l0M9L9K4k7q1M0K7q8J2oj03M5R6K4Rj01p0R2J8
$$ -81 -126 -153 -168 -131 -113 -75 8 11 -18 0 20 10 -55 -66 28 44 14 63 102 126 99 18 58 85 -3 9 3 -100 -55 41 65 74 -27 -97 -5 13
2456A3n9k6J8J47J02p6m0o0j28M6J27k2j07q1J5N5K2M6J9j8L9no6j0j2L3J28M2l3j6n9n4j7
$$ 13 -46 -72 -54 93 195 119 79 19 -109 -63 64 42 -65 -146 -131 -76 -54 -8 11 -7 32 27 -39 -49 -61 -28 100 142 109 93 34 -20 -37
2447c7k6L2P3Nn0k9K6N3R1Q7r3j90j8P3J2jk3l4k7q7n2R9J27J9o5l9J3k4m6j3%M3N8OM6O4
$$ -37 -63 -31 42 47 -3 -32 -6 47 138 225 132 -58 -76 -3 9 8 -15 -49 -76 -163 -215 -116 11 30 -35 -74 -61 -85 -131 -144 -144 -101 -43 -37 9 73
2437G3r0j40K7J08M3qn9l0J37J12r0p1j4n7O1Q9k6Q5P2j93j68L3Q0P1N9P7M5r5o8Jp5J6J39
$$ 73 -17 -157 -130 -22 21 13 -46 -76 61 173 83 12 -2 -59 2 91 65 150 222 29 -139 -106 -26 45 104 181 226 131 63 64 -11 5 144
2427A44oj05l8mK1Q8J21M0m0ml3r3l4j8j2L0m6n1M1jk9OJ0Q0M7p7kM8pO7K9j43q8K4OM0L8
$$ 144 138 33 -5 -9 12 100 221 261 221 217 184 91 57 39 27 57 11 -40 1 0 -29 -23 -13 67 114 37 35 83 76 143 172 29 -59 -35 -29 11 49
2417D9j09j29j2j3%J20J07L1L3l7j00k1M2N8M9l0l8M0M8%J2N8Mn9k3j07j60P7J47k8m0p1j11
$$ 49 -60 -189 -201 -214 -214 -94 13 44 77 40 -60 -81 -39 19 68 38 0 40 88 88 100 158 162 103 80 -27 -187 -110 37 9 -31 -102 -213
2408b13M3N1l8N6R0M7j0j16mJ18q5j22J01J30P2J0j20l9J27Pj07j8k3l5R5N8o9J7O0l5nN0
$$ -213 -170 -119 -157 -101 -11 36 26 -90 -94 24 -61 -183 -82 48 120 130 10 -29 98 105 -2 -20 -43 -78 17 75 6 23 83 48 43 93
2399I3lo0o7J0R7J08P6k4m6J06P8j51j66MR4N3k7n7p9o3ol3KQ9orJ01n1j21M6M9M3P3p4p6
$$ 93 90 30 -37 -27 70 178 254 230 184 290 368 217 51 55 149 202 175 118 39 -24 -30 -63 -61 28 22 13 114 63 -58 -12 37 80 153 79 3
2389CN6k1m6P1L1o5m9n1o5L2J05j1j38o6O5J12M1o8j0J11L5o0k2%O8J53Mj73o9N2Ll5m4q5
$$ 3 59 38 -8 63 94 29 -20 -71 -136 -104 1 -10 -148 -214 -149 -37 4 -64 -74 37 72 12 -10 -10 58 211 215 42 -27 25 28 -7 -51 -136
2379a36m1M8O5N6Pp2k3Q0M1l5m1o3n4L7M4QP2M9p7l8N6L0K0J0m9m0M9J18N1r9j16m2qK8K5
$$ -136 -177 -129 -64 -8 -1 -73 -96 -16 25 -10 -51 -114 -168 -131 -87 -79 -7 42 -35 -73 -17 13 33 43 -6 -46 3 121 172 73 -43 -85 -93 -65 -40
2370d0qlk0rL7L0M8L6k1K3rr1J9P1oPj0jO0k2l4O5L7L2Po5Q6J51l5p0p7j93j29jPK3O2Q0N0
$$ -40 -48 -51 -71 -80 -43 -13 35 71 50 73 64 -27 -8 63 57 64 54 53 113 91 57 122 159 191 198 133 219 370 335 265 188 -5 -134 -135 -128 -105 -43 37 87
2359H7%J4rn3K8N9l4j8R5P8o9j29m4L2M0j9r5k9J02P6m4j24j31p0L5J74J97Q3K7o0j44K2O0
$$ 87 87 101 92 39 67 126 92 74 169 247 178 49 5 37 77 58 -37 -66 36 112 68 -56 -187 -257 -222 -48 149 232 259 199 55 77 137
2349A37j64q6J57R9k8j6K2m2j66p9Q4J3j7N6L4P4Q6n0n1J6l3p7j00l3Q9%q1K8L6j1K1k7n5
$$ 137 -27 -113 44 143 115 99 121 79 -87 -166 -82 -69 -86 -30 4 78 164 114 63 79 46 -31 -131 -164 -75 -75 -156 -128 -92 -103 -82 -109 -164
2340a64RLnL7L2J6N4J18P6r6j05N5P2j4l4m0o3p1j0P8M0kN3lp1M7J08l7j32k2J12J8j26k2
$$ -164 -155 -152 -157 -120 -88 -72 -18 100 176 80 -25 30 102 88 54 14 -49 -120 -130 -52 -12 -14 39 36 -35 12 120 83 -49 -71 41 59 -67 -89
2331h9J02O0N9R8M7l5r8r7l8J0L8j8j15n7O1K7m3n4k4N4M9m8kJ06L2o0KO6N9L0j8k5Qoj8j2
$$ -89 13 73 132 230 277 242 144 47 9 19 57 39 -76 -133 -72 -45 -88 -142 -166 -112 -63 -111 -113 -7 25 -35 -33 33 92 122 104 79 87 81 63 51
2320E1l7KP4L3l3m4l8j0j8j5Q5Q9q6j33k3mk7O0J12qj18m8M5pp1mO9J2m1M0J25O7l8l4K0k0
$$ 51 14 16 90 123 90 46 8 -2 -20 -35 50 139 53 -80 -103 -107 -134 -74 38 30 -88 -136 -91 -98 -169 -173 -104 -92 -133 -93 32 99 61 27 47 27
2310B7o2l3n6r9l1O3Q5L5J3J17J15r1j06L1J3J6P9K7Oj7r3nQ0k6n1Lk1J6N1m4r0l7j1K5P8
$$ 27 -35 -68 -124 -223 -254 -191 -106 -71 -58 59 174 83 -23 8 21 37 116 143 149 132 39 34 114 88 37 40 19 35 86 42 -48 -85 -96 -71 7
2301GK5p9k8L5o9k4J46N7j4R6Mq0J5m6q2L2k9p5N2P6M3j7j11k5J03O8Lq5j11L9O5m9%Q2M6
$$ 7 32 -47 -75 -40 -109 -133 13 70 56 152 156 76 91 45 -37 -5 -34 -109 -57 19 62 45 -66 -91 12 80 83 -2 -113 -74 -9 -58 -58 24 70
2291G0J3om8m9j2L2O1K7n1p4q9j27k3J27R1Qm2m1J14J39n6q2MPM3K0n8l6J2O2P9J3Jn7j01
$$ 70 83 77 29 -20 -32 0 61 88 37 -37 -126 -253 -276 -149 -58 -50 -92 -133 -19 120 64 -18 -14 -7 36 56 -2 -38 -26 36 115 128 129 72 -29
2281b9O4M8j91j32J00J45L7q1l3K9k3P2J18m5rJ13L6p0j47q9P1Mj03nM1O8J41K4j27m2Q7P4
$$ -29 35 83 -108 -240 -140 5 42 -39 -72 -43 -66 6 124 79 70 183 219 149 2 -87 -16 -12 -115 -120 -79 -11 130 154 27 -15 72 146
2272A46Rk0k6nj5r8p4K5k4o0N8R8L6j2m1m2J2J21J64mj61r2J4Kk2O5R2n6p3O0O6J3p0j42J7
$$ 146 155 135 109 104 89 -9 -83 -58 -82 -142 -84 14 50 38 -3 -45 -33 88 252 248 87 -5 9 11 -11 54 146 90 17 77 143 156 86 -56 -39
2262c9J50L3k1J7%m7j17r5LJ2N2J28R2j1j15p4L8o4j01J25J66K4j3l4n9l0RK8JJ0K6n6o6J0
$$ -39 111 144 123 140 140 93 -24 -119 -116 -104 -52 76 168 157 42 -32 6 -58 -159 -34 132 156 143 109 50 20 29 57 58 68 94 38 -28 -18
2253a8L5P8M1p4k5P0M2m7j70j45L6P7K9M3J0k1L1M4j1l8k0l7p2K5J82J52m3j31r3r7o3K7M7
$$ -18 17 95 136 62 37 107 149 102 -68 -213 -177 -100 -71 -28 -18 -39 -8 36 25 -13 -33 -70 -142 -117 65 217 174 43 -50 -147 -210 -183 -136
2243a36J13J47l8j19j5L5R6K5j56p9K7K2J05Lj33oj3p8N3Q7J05J11o6r3LL9J12L1j04n8j01
$$ -136 -23 124 86 -33 -48 -13 83 108 -48 -127 -100 -78 27 30 -103 -109 -122 -200 -147 -60 45 156 90 -3 0 39 151 182 78 20 -81
2235h1j16M0Q8J01K5j64l2J32j9l0O4qm6j8M4R4J2n8r1j11L1J19M8O4M7m7j7L4N6P6m4j72
$$ -81 -197 -157 -69 32 57 -107 -139 -7 -26 -56 8 0 -46 -64 -20 74 86 28 -63 -174 -143 -24 24 88 135 88 71 105 161 237 193 21
2226B1j05J1K8L0Q8O7n9p8KN2N8ok4R2R6l0p2r6j49q3N6M7q2l7R9J9m4J24J35n5o1J4k4j1
$$ 21 -84 -73 -45 -15 73 140 81 3 5 57 115 109 85 177 273 243 171 75 -74 -157 -101 -54 -136 -173 -74 -55 -99 25 160 105 44 58 34 23
2216B3L3n1j09n1%O5J09J9j1P6N9J8K4o4o9L6j1p4oNk0K3J7m1o3m6j8KRK4P0Q4l0j71r5O7
$$ 23 56 5 -104 -155 -155 -90 19 38 27 103 162 180 204 140 71 107 96 22 16 21 1 24 41 0 -63 -109 -127 -125 -116 -92 -22 62 32 -139 -234 -167
2206a67Pp6O4J40L9K2M0MM6Q7K6l8r6j14j8L8k2n5RR1P2qj5l1q4l3M0K6M2L7n1p2l9m3l7N
$$ -167 -160 -236 -172 -32 7 29 69 73 119 206 232 194 98 -16 -34 4 -18 -73 -64 27 99 91 76 45 -39 -72 -32 -6 36 73 22 -50 -89 -132 -169 -164
2196a64P2R8ko5j4l9m2P2N0LP3l5j55lR1L7j1l9J16K07p3k32j33j15J1J99J03m6l4O2J29K2
$$ -164 -92 6 4 -61 -75 -114 -156 -84 -34 -31 42 7 -148 -151 -60 -23 -34 -73 43 250 177 -55 -188 -303 -292 -93 10 -36 -70 -8 121 143
2187A43p0k9q1p0R1P2l1o5r4M9J87Pj17Qjj07k5M2j2L4R7L5jj7j0J14Q3j17q4J9l2J2N7l9
$$ 143 73 44 -37 -107 -16 56 25 -40 -134 -85 102 109 -8 0 -1 -108 -133 -91 -103 -69 28 63 62 45 35 149 232 115 31 50 18 30 87 48
2177D8m3K0J6lj3K8M6m5m6M9Qq7o1J5N9N8J9lJ2K2Kj00j81jJ78k6j19J56J49j25j53j01k1
$$ 48 5 25 41 38 25 53 99 54 8 57 65 -22 -83 -68 -9 49 68 65 77 99 101 1 -180 -181 -3 -29 -148 8 157 32 -121 -222 -243
2168b43J79J65M7J03N9r1r5q9q2L1L8j01r1P8J48O9n4q8j2k5r6oP3Lm6o4k7L7l1nJ72J15p
$$ -243 -64 101 148 251 310 219 124 35 -47 -16 22 -79 -170 -92 56 125 71 -17 -29 -54 -150 -156 -83 -80 -126 -190 -217 -180 -211 -216 -44 71 64
2159F4K1omN0on1r7j25L2J10Qm1r2r7L6Q6L9j0o8kJ20P7n1o1L4K4n0QK1n9KK5p2m9J9K7L1
$$ 64 85 79 75 125 119 68 -29 -154 -122 -12 -4 -45 -137 -234 -198 -112 -73 -83 -151 -153 -33 44 -7 -68 -34 -10 -60 -52 -31 -90 -88 -63 -135 -184 -165 -138 -107
2149a07Nqj5j1Q0Q1oM3R6L0l9o8k2J6k4mJ4k4j0k7m7Mj2nQ3O1j8j7K1J7m3k5Mj18j02R1Q2
$$ -107 -102 -110 -125 -136 -56 25 19 62 158 188 149 81 59 75 51 47 61 37 27 0 -47 -43 -55 -60 23 84 66 49 70 87 44 19 23 -95 -197 -106 -24
2138b4L2J33J05o8j19K2J09k7q8L8Q3M4Lk1K3l7j52n7L2K2O4Kq8PM3k5j0m2j01j1Q2M9Nk4
$$ -24 8 141 246 178 59 81 190 163 75 113 196 240 243 222 245 208 56 -1 31 53 117 119 31 38 81 56 46 4 -97 -108 -26 23 28 4
2129DMO9k1j20%P9J4K4j8j02k5M2M2J0j24o2J62P8p5m4j1P1P8m4L3J26L4j0n5p3N5O1m6o3
$$ 4 8 77 56 -64 -64 15 29 53 35 -67 -92 -50 -8 2 -122 -184 -22 56 -19 -63 -74 -3 75 31 64 190 224 214 159 86 141 202 156 93
2119I3l7J7mq8n6l3j0P7kp6M5P0Pl2p5J2M8j0J03J13n2J7R8Pk3q3j12K8L8j18j57o2O4R0R
$$ 93 56 73 69 -19 -75 -108 -118 -41 -43 -119 -74 -4 3 -29 -104 -92 -44 -54 49 162 110 127 225 232 209 126 14 42 80 -38 -195 -257 -193 -103 -94
2109i4L8Q2l1q3K8Q3N9L6n1j48r0M4Q1N8K2m3l3M8K5m4k4n0j10rJ06P0L9K3l7l1J1KqJ1O8
$$ -94 -56 26 -5 -88 -60 23 82 118 67 -81 -171 -127 -46 12 34 -9 -42 6 31 -13 -37 -87 -197 -206 -100 -30 9 32 -5 -36 -25 -23 -31 -20 48
2099D8O2r2j30K3Q8M8K8PL8P9Ko6nM7l0r6l8mm5l5L3R3O1j05j48L0J31N1p0j22k6N9k4k4J50
$$ 48 110 18 -112 -89 -1 47 75 82 120 199 201 135 130 177 147 51 13 9 -36 -71 -38 55 116 11 -137 -107 24 75 5 -117 -143 -84 -108 -132 18
2090A8J65k8j17l3M9O9Qr9n3P0M7K7O6k4o2K7Jj3Q0j0j91j21O9P9J2L9K4j01j25k7KPQ6J18
$$ 18 183 155 38 5 54 123 131 32 -21 49 96 123 189 165 103 130 131 118 198 188 -3 -124 -55 24 36 75 99 -2 -127 -154 -152 -145 -59 59
2080E9L7m6o2m2kL1N2O6np7qL7k3m1r2j29K4J59J35P0m6j03j3N7P0J6q2k2M0n5j5Q4J4QN8
$$ 59 96 50 -12 -54 -56 -25 27 93 88 11 3 40 17 -24 -116 -245 -221 -62 73 143 97 -6 -19 38 108 124 42 20 60 5 -10 74 88 96 154
2070A54Nj7q8j97m1J47N1k5K0MJ8O8or8m1N1k3j43m0J07N2mL7K6j7m2M0J37J2p4N1Np6K3n1
$$ 154 159 142 54 -143 -184 -37 14 -11 9 13 31 99 93 -5 -46 5 -18 -161 -201 -94 -42 -46 -9 17 0 -42 -2 135 147 73 124 129 53 76 25
2060B5j02P7K0j34k8Q7Q8K6l9N5P9q0o8K8LJ0K9L6Q9O7k7o6m8kJ7m4j33r2P7N4r8pQ5j9L9
$$ 25 -77 0 20 -114 -142 -55 33 59 20 75 154 74 6 34 37 47 76 112 201 268 241 175 127 125 142 98 -35 -127 -50 4 -94 -101 -16 -35 4
2051DJ42j3j17kN8k5o1j1k4mJ19P1m5Lk5q2OOrR9Q0n0o2j6j6m2J6J01J5q2m2q3r6N3R5J6J1
$$ 4 146 133 16 14 72 47 -14 -25 -49 -53 66 137 92 95 70 -12 -6 0 -9 90 170 120 58 42 26 -16 0 101 116 34 -8 -91 -187 -134 -39 -23 -12
2040a2Mj9J1J6j4k6l0k4RO1O9k4o9Mm9j27N8J51LJ2L6n8M0M8j48o6N4o5j7R0M7M2n1j58J5
$$ -12 -8 -27 -16 0 -14 -40 -70 -94 -85 -24 45 21 -48 -44 -93 -220 -162 -11 -8 4 40 -18 22 70 -78 -144 -90 -155 -172 -82 -35 7 -44 -202 -187
2030a87J25K5N8J24K0n7k5kJ9N2K8j3k2q4j07l3n1n7Q4J03J2k1n6pR1K2o5k4J4M8N2J8K5l7
$$ -187 -62 -37 21 145 165 108 83 81 100 152 180 167 145 61 -46 -79 -130 -187 -103 0 12 -9 -65 -72 19 41 -24 -48 -34 14 66 84 109 72
2021G2j16KJ13M9pm9j22m7R1K7p1oO9L6n0o9P0J03q6q3P8L0m4m1q2qO4k6K5J20pm5J05J33
$$ 72 -44 -42 71 120 113 64 -58 -105 -14 13 -58 -64 5 41 -9 -78 -8 95 9 -74 4 34 -10 -51 -133 -141 -77 -103 -78 42 35 -10 95 228
2011B28J8o1k8Rr3j29J5N8l6l1jp5j19k8J17J80Q5k2KKq3l0J02Q9l6j44j43%P4K7L2K5mK9
$$ 228 246 185 157 166 73 -56 -41 17 -19 -50 -51 -126 -245 -273 -156 24 109 87 89 91 8 -22 80 169 133 -11 -154 -154 -80 -53 -21 4 0 29
2002B9J2j3K6k2m1J9q2j06J16J27pJ8pj8P7j2j02k1r4j41N6R3l6k2%j4O6R9L1j2o0q3L4J85
$$ 29 41 28 54 32 -9 10 -72 -178 -62 65 58 76 69 51 128 116 14 -7 -101 -242 -186 -93 -129 -151 -151 -165 -99 0 31 19 -41 -124 -90 95
1992I5J88J6j64r7R3Kj80j05k6NJ44M2j97m6J75Q4j0l6p6KO0lL4J33O1o5m8qj4J0n0j00N3
$$ 95 283 299 135 38 131 133 -47 -152 -178 -173 -29 13 -184 -230 -55 29 19 -17 -93 -91 -31 -34 0 133 194 129 81 73 59 69 19 -81 -28
1983b8J21pn1k9oN8L1K0R7%j24l5J3n5nJ13P7q1q0M5L5k6j8l1l0M1P1j9p7J1k1j30L8J05j53
$$ -28 93 86 35 6 0 58 89 109 206 206 82 47 60 5 0 113 190 109 29 74 109 83 65 34 4 45 116 97 20 31 10 -120 -82 23 -130
1973a30j16Q1PJ02K81O1j40oP7k6o2M8Q4Lj4k6o7J0K4j22j58m4P6J45J33M1k9K9J35J05j4
$$ -130 -246 -165 -158 -56 225 286 146 140 217 191 129 177 261 264 250 224 157 167 191 69 -89 -133 -57 88 221 262 233 262 397 502 488
1965D88j5J34K08J13J40L52N39Q17J347K354L559K915k85k836k722j791j320r00n84n23n00
$$ 488 473 607 815 928 1068 1420 1959 2776 4123 6477 10036 12951 12666 9830 7108 5317 3997 3097 2513 1990 1490
1959A490m02k36j43j53j59j39n0K5J3P3J09l2j15q5m3N6N9p3n3O1Jr3k8O1J8r8q9O3J29M8
$$ 1490 1088 852 709 556 397 258 208 233 246 319 428 396 281 196 153 209 268 195 142 203 204 111 83 144 162 64 -25 38 167 215
1950B15pl5l7J8m5q1O8M0p5O3P7o9mL0k5K2m7j26oK3o5n6L8J19O3JJ18J13p4j23n0K1N7mp1
$$ 215 208 173 136 154 109 28 96 136 61 124 201 132 128 158 133 155 108 -18 -24 -1 -66 -122 -84 35 98 99 217 330 256 133 83 104 161 157 86
1940H6q6o4K2M9pMK6%L2N9Jm7l5l8l9K3L9k6j0K8k3nM7n3j51n4Q9J21Q1M9M3N7J8r1j14m6
$$ 86 0 -64 -42 7 0 4 30 30 62 121 122 75 40 2 -37 -14 25 -1 -11 17 -6 -11 36 -17 -168 -222 -133 -12 69 118 161 218 236 145 31 -15
1930a5k6PM7nm2mM0J6r9j14K2N0K6Q2L3k0O7O5o7j17p7OQ3M6l5j6L4j1m9k3NN3M5n5k4O5k9
$$ -15 -41 -34 13 8 -34 -38 2 18 -81 -195 -173 -123 -97 -15 18 -2 65 130 63 -54 -131 -125 -42 4 -31 -47 -13 -24 -73 -96 -91 -38 7 -48 -72 -7 -36
1920c6p5K3M4N2R0K5l9l8k6K5M3m4n0L8Nm3P3J03k9l1Mq5o8M6O5J4p1j45j09K4J37Q4m2l5
$$ -36 -111 -88 -44 8 98 123 84 46 20 45 88 44 -6 32 37 -6 67 170 141 110 114 29 -39 7 72 86 15 -130 -239 -215 -78 6 -36 -71
1910g1k8l7R1P9o5L1J07o1j01%Mk6LN3J1j04m5J24J09k6n9K3R2L2r1j12m4nK2P9L7n2J8Q5
$$ -71 -99 -136 -45 34 -31 0 107 46 -55 -55 -51 -77 -74 -21 -10 -114 -159 -35 74 48 -11 12 104 136 45 -67 -111 -116 -94 -15 22 -30 -12 73
1901G3j4k9O5J9r6j24p0N3J22J9m6N2K7j27l4J20K9j6L6n4r1J5J07J40J8p2L7pj15RJ5r7j
$$ 73 59 30 95 114 18 -106 -176 -123 -1 18 -28 24 51 -76 -110 10 39 23 59 5 -86 -71 36 176 194 122 159 152 37 46 61 -36 -37
1892c7P5L6L0l1m3K1l1m4M7J8p2j04j21m0J13J26L0j6j8jN5N0J5O4N2n7k3L4r7j60k7R7R4
$$ -37 38 74 104 73 30 51 20 -24 23 41 -31 -135 -256 -296 -183 -57 -27 -43 -61 -62 -7 43 58 122 174 117 94 128 31 -129 -156 -59 35
1882C5j0n4O3J08k5q2j2K9L2K3KRLn0n9k8m2m6%OMN6N9k4o0k2rpk4r4m4J05P4k6M4R5M8K6
$$ 35 25 -29 34 142 117 35 23 52 84 107 109 118 121 71 12 -16 -58 -104 -104 -98 -94 -38 21 -3 -63 -85 -94 -101 -125 -219 -263 -158 -84 -110 -66 29 77 103
1872A03Nrm1j30o1J52J44n6j29m2L5Jo2n2JM1Rm5LO0J9J5O1L2k8j3J2k3j6O2N4k3m4p4r4l3
$$ 103 108 99 58 -72 -133 19 163 107 -22 -64 -29 -28 -90 -142 -141 -100 -91 -136 -133 -73 -54 -39 22 54 26 13 25 2 -14 48 102 79 35 -39 -133 -166
1862a66J5K6J1J3J26R4j66j54P2L6m1L7Ll1P2L0r4J0J40L9o5oN0M3M7L4k8n5nK2j8PO4mp3
$$ -166 -151 -125 -114 -101 25 119 -47 -201 -129 -93 -134 -97 -94 -125 -53 -23 -117 -107 33 72 7 1 51 94 141 175 147 92 87 109 91 98 162 158 85
1852H5j4N6N2k7j04n8J8Pl7m7L0R4n9j94k5R7k2m9L4M1O7Q7K0J6M6n8j11J8Q2j2n2RK7jK9
$$ 85 71 127 179 152 48 -10 8 15 -22 -69 -39 55 -4 -198 -223 -126 -148 -197 -163 -122 -55 32 52 68 114 56 -55 -37 45 33 -19 -10 17 16 45
1842D5Q9P0m6j38n8Q3N3m7k7Jk8m0m7NQ0Qq3j4P3M9on5n3K0O6M7L7J9j1K5K7p9o4P1M3q2n9
$$ 45 134 204 158 20 -38 45 98 51 24 25 -3 -43 -90 -85 -5 3 -80 -94 -21 28 22 -33 -86 -66 0 47 84 103 92 117 144 65 1 72 115 33 -26
1832b6L9L7l9m3k1m8j1O5M3Qj3l9J1N0M6P2K7k4J2j7o7o0k8Q3J10n2j09k3O2J01mo3%o6p0
$$ -26 13 50 11 -32 -53 -101 -112 -47 -4 4 -9 -48 -37 13 59 131 158 134 146 129 62 2 -26 57 167 115 6 -17 45 146 142 79 79 13 -57
1822e7O4qj17QJ11N3l9k9N5O0M0J5o6oO4k5K2O6q4o2J7o1rL9p2k8N9kJ4P4k3j27q5J2L9oo8
$$ -57 7 -1 -118 -110 1 54 15 -14 41 101 141 156 90 84 148 123 145 211 127 65 82 21 12 51 -21 -49 10 8 22 96 73 -54 -139 -127 -88 -94 -162
1811a62o9J5O4N9Q3R7Q1N6l8r7JM5q0r4M0k0j59j1R4o7o5P5R0J02L0q7J0J9r0P4K32R3p7j43
$$ -162 -231 -216 -152 -93 -10 87 168 224 186 89 90 135 55 -39 1 -19 -178 -189 -95 -162 -227 -152 -62 40 70 -17 -7 12 -78 -4 228 321 244 101
1802A01q1M3M5L0J8q8r7PN6O4K5l3k7NJ6j2m8k9o2j15o5j6ML8K9M1O9P6J18Rj73j1J93N2n0
$$ 101 20 63 108 138 156 68 -29 -22 34 98 123 90 63 68 84 72 24 -5 -67 -182 -247 -263 -259 -221 -192 -151 -82 -6 112 121 -52 -63 130 182 132
1792A32Pk3m4k3jP3M0q3k7P8L6mk9q8k9M6k7n1K2K0k7n5j9J16R2r1n5O7J9k7m2o9j9K0J1l
$$ 132 139 116 72 49 48 121 161 78 51 129 165 161 132 44 15 61 34 -17 5 25 -2 -57 -76 40 132 41 -14 53 72 45 3 -66 -85 -65 -54 -57
1782e7l2M4J14k1o2O2Q2N0l4j58l2R3m3j0J43j0k16j38M0Q4Nk7J4N4R4K5j04k5N0r6r4P2N4
$$ -57 -89 -45 69 48 -14 48 130 180 146 -12 -44 49 6 -4 139 129 -87 -225 -185 -101 -96 -123 -109 -55 39 64 -40 -65 -15 -111 -205 -133 -79
1773g9K3J02L3j07p8Nkk3J4N7M9Jm4l7K7M5k4j7J06J10j1k8ok9L8N9q9j17K0P1L3j9k2N6L1
$$ -79 -56 46 79 -28 -106 -101 -103 -126 -112 -55 -6 -5 -49 -86 -59 -14 -38 -55 51 161 150 122 116 87 125 184 95 -22 -2 69 102 83 61 117 148
1763A48j18j21j1L8L1m4q4M4J04n2j42m5M7P1R0O9j8p1m7k3K5R6N0k4j7o5m9J23J10o6n5O
$$ 148 30 -91 -102 -64 -33 -77 -161 -117 -13 -65 -207 -252 -205 -134 -44 25 7 -64 -111 -134 -109 -13 37 13 -4 -69 -118 5 115 49 -6 0
1754@K3O4Ql6J3j6L6J17q6j84L5J01%o8j49r7L2J5j9K3J09J44pr5J9J9j6O4N2mj4o1j3M1o
$$ 0 23 87 95 59 72 56 92 209 123 -61 -26 75 75 7 -142 -239 -207 -192 -211 -188 -79 65 58 -37 -18 1 -15 49 101 97 83 22 9 50 44
1744D4O7P8o6k6K0p8QR3PL9L3j32j15L9Q0rj30r1L4J4RL9o0m1Q9M2j9L3M6L2K2Kk5q7r7l5
$$ 44 111 189 123 97 117 39 47 140 147 186 219 87 -28 11 91 82 -48 -139 -105 -91 -82 -43 -103 -144 -55 -13 -32 1 47 79 101 103 78 -9 -106 -141
1734a41NO3Q4%oJ7q3r8L4J21J11J0p8k5K0k0J2N5k1n8J4km6K5K5m0K1K5q7q1L2J53J64l9r1
$$ -141 -136 -73 11 11 5 22 -61 -159 -125 -4 107 117 39 14 34 14 26 81 60 2 16 14 -32 -7 18 -22 -1 24 -63 -144 -112 41 205 166 75
1724G5R1O7o8m4k1K9J03jr1k4m9j12l9K2K4O6oj32j4J07pk3N0j2j5M7LMM5j4o1l9n2j08n5
$$ 75 166 233 165 121 100 129 232 231 140 116 67 -45 -84 -62 -38 28 22 -110 -124 -17 -24 -47 3 -9 -24 23 26 30 75 61 0 -39 -91 -199 -254
1714b54J08J55J10N4p6p6N9N4O1N3j15j32p4j02K1L2q5Q4J53m5o5J7P5J01k4pJ09op6l5o3
$$ -254 -146 9 119 173 97 21 80 134 195 248 133 1 -73 -175 -154 -122 -207 -123 30 -15 -80 -63 12 113 89 82 191 185 109 74 11
1706A1ML1n7l8n1r0L7O2p6o6N4J09J12O6o8j54o2K7L0J36J73l8j09O4N0j35p8J10Q0m7p7l6
$$ 11 15 46 -11 -49 -100 -190 -153 -91 -167 -233 -179 -70 42 108 40 -114 -176 -149 -119 17 190 152 43 107 157 22 -56 54 134 87 10 -26
1697b6Q1P1q4K1J78L2j12j61j66l2J5k0K3K9J06J62j2o3k2j12k6O3m7jN4n1o7MJ13J19l2k7
$$ -26 55 126 42 63 241 273 161 0 -166 -198 -183 -203 -180 -151 -45 117 105 42 20 -92 -118 -55 -102 -103 -49 -100 -167 -163 -50 69 37 10
1688A0np3M5N3o5L7Qr1R9J11n5%N5N4P0Mj5l0j16p2K1K1Pl5o7o7k7J03J15j0J2J6j51j33Q3
$$ 10 5 -68 -23 30 -35 2 10 -81 18 129 74 74 129 183 253 257 242 212 96 24 45 66 73 38 -29 -96 -123 -20 95 85 97 113 -38 -171 -88
1678h8J31K5k4L0J00P2l0m0Jm1l7N0N5Nm1o1J3P1Q9J11J8l1P7Q7O4R1N5J06J83K82O07Q71
$$ -88 43 68 44 74 174 246 216 176 177 136 99 149 204 209 168 107 120 191 280 391 409 378 455 542 606 697 752 858 1041 1323 1930 2801
1669B801J275J914J279o25j563j284r88o86l44k60k86k86k53j97j37o4m3j6J1q2q7k3j17q9
$$ 2801 4076 5990 7269 6644 5081 3797 2809 2123 1779 1519 1233 947 694 497 360 296 253 237 248 166 79 56 -61 -150
1662a50J04J25P6nj04mO2o0q4l7KR6Q4k2k3J7j4l3JjJ1N7n6j66j2P5LO5N3r5n3N4K6QM3N3
$$ -150 -46 79 155 150 46 42 104 44 -40 -77 -75 21 105 83 60 77 63 30 31 30 41 98 42 -124 -136 -61 -58 7 60 -35 -88 -34 -8 0 43 96
1652I6j3q5n1k4o1j5O0L5j2L0O9j8k6J29J01p6j06q6j3J25O0p7m5n6j16l8L6LN3J78R5j37
$$ 96 83 -2 -53 -77 -138 -153 -93 -58 -70 -40 29 11 -15 114 215 139 33 -53 -66 59 119 42 -3 -59 -175 -213 -177 -174 -121 57 152 15
1643A5j49oM5Q3J01Oq3m0R2J27k7j07l1qK2O2JM6J58k2k36j07N9K9OJ2n2o8nQLL7K6m6p2J2
$$ 15 -134 -140 -95 -12 89 95 12 -28 64 191 164 57 26 18 40 102 103 149 307 285 49 -58 1 30 36 48 -4 -72 -77 -69 -66 -29 -3 -49 -121 -109
1633a09J27J28l5k05j40J11J49m3p9N4M0p5l8P9J7j05l3O5O4O9K8n4o5m8J8M2n5j6O5j7L5
$$ -109 18 146 111 -94 -234 -123 26 -17 -96 -42 -2 -77 -115 -36 -19 -124 -157 -92 -28 41 69 15 -50 -98 -80 -38 -93 -109 -44 -61 -26
1624b6J23k2q6p1j09J7P8m2J0L7p3K3J43O0jj5l5j3K0L0j2k9M6L0o5k0N6J8m2l0rm4mQ8K1
$$ -26 97 75 -11 -82 -191 -174 -96 -138 -128 -91 -164 -141 2 62 61 46 11 -2 18 48 36 7 53 83 18 -2 54 72 30 0 -9 -53 -57 31 52
1614E2l5O4M6q6r1K1J37O8j09j18n9j2Q9O1k8qm3l9J00J04L0M1l4j18o1j1jQ1J51N4p4o4n8
$$ 52 17 81 127 41 -50 -29 108 176 67 -51 -110 -122 -33 28 0 -8 -51 -90 10 114 144 185 151 33 -28 -39 -40 41 192 246 172 108 50
1605E0p5j4K1K4J7r1j03QoRO9J4K1M4LR9J05r7j11j7j8K1K9LK9n6j41m5L3K6L4J8j5nK2k5
$$ 50 -25 -39 -18 6 23 -68 -171 -163 -169 -160 -91 -77 -56 -12 -9 90 195 98 -13 -30 -48 -27 2 5 34 -22 -163 -208 -175 -149 -115 -97 -112 -117 -95 -120
1595a20q0L4J76J25J9l5p7n9m0p2m7K4K0m6m8N8J08L0k8l8l7K0M1l0m0O5J09Ol0P4J1j52n9
$$ -120 -200 -166 10 135 154 119 42 -17 -57 -129 -176 -152 -132 -178 -226 -168 -60 -30 -58 -96 -133 -113 -72 -102 -142 -77 32 38 8 82 93 -59 -118
1586a18P4L7N1J2j27k0J63O3m9K6M9l8o5j6k7p5LJ10L9o5l5L0N5N0L5j7o9k3j5r5KJ21j9p0
$$ -118 -44 -7 44 56 -71 -91 72 135 86 112 161 123 58 42 15 -60 -57 53 92 27 -8 22 77 127 162 145 76 53 38 -57 -55 66 47 -23
1576b3M7KqJ04K6o3J7L6l2j11j65m1J08N4k4rJ3K6j7o2j2j7n0Q1J41ro8m2n8N0J51N9k6o0
$$ -23 24 26 18 122 148 85 102 138 106 -5 -170 -211 -103 -49 -73 -82 -69 -43 -60 -122 -134 -151 -201 -120 21 12 -56 -98 -156 -106 45 104 78 18
1567A8r8l9no2RJ35J68J41J1j09p4j6K1O6%q6n7n9j11m4O1P3P5Q3Jo3l2j4nkk6QL1j7j5j2
$$ 18 -80 -119 -124 -186 -177 -42 126 267 278 169 95 79 100 166 166 80 23 -36 -147 -191 -130 -57 18 101 102 39 7 -7 -12 -14 -40 -32 -1 -18 -33 -45
1557d5J3J16M3j19m5N3O6M8j07j26O3M7l5J3qMM6o9p8M3Ll2M4N1j8p2k4M5mKQ2K2l7j8m5o
$$ -45 -32 84 127 8 -37 16 82 130 23 -103 -40 7 -28 -15 -23 -19 27 -42 -120 -77 -74 -106 -62 -11 -29 -101 -125 -80 -84 -82 0 22 -15 -33 -78 -84
1547h4Q3O4P8P9m3r3o4l6M6Nj05J9J76J36L0q4r8pm3p4K4L6olj1QNk6J8Rm4k3rM5Q9k7oJ44
$$ -84 -1 63 141 220 177 84 20 -16 30 35 -70 -51 125 261 291 207 109 102 59 -15 9 45 39 36 25 33 38 12 30 39 -5 -28 -37 8 97 70 64 208
1536B08N6k4Q5P6lJ8Pn8n1K3O6O9O5P1J61K30K49M80P54J058J755J755J52j309j422j125q18
$$ 208 264 240 325 401 398 416 423 365 314 337 403 472 537 608 769 999 1248 1728 2482 3540 5295 7050 7202 5893 4471 3346 2528
1528B528m87m05l09j83k65k40o1k7p4p5m2l6n0L6P8n6j28q5l7K2K7l4q7o4N3Q6l4j08q5%R4
$$ 2528 2041 1636 1327 1144 879 639 578 551 477 402 360 324 274 310 388 332 204 119 82 104 131 97 10 -54 -1 85 51 -57 -142 -142 -48
1520d8N8qM2P7K3j2ll0q0jQ4l1o8J18J27o3o2N0l5j20njq1N9J08o0o7j0l8oK9Q5J47J9p4j2
$$ -48 10 2 44 121 144 132 129 99 19 18 102 71 3 121 248 185 123 173 138 18 13 12 -69 -10 98 38 -29 -39 -77 -83 -54 31 178 197 123 111
1510A11j3K0J00M6p4j71r7R4N9o0j3j6k4M7or2m6N1N1n5k1R3ro0O5L3l7KJ6N3M3n6J5J34M7
$$ 111 98 118 218 264 190 19 -78 16 75 15 2 -14 -38 9 3 -89 -135 -84 -33 -88 -109 -16 -25 -85 -20 13 -24 -22 -6 47 90 34 49 183 230
1500B30o0o9j02j13KQ4J3JO7Lo9J0J17J00k9j4J27k1k25p1L2o7m3K9L1K6j2J6Q7M5j8k5n7
$$ 230 170 101 -1 -114 -112 -28 -15 -14 53 56 -13 -3 114 214 185 171 298 277 52 -19 13 -54 -97 -68 -37 -11 -23 -7 80 125 107 82 25
1491B5o7J8J02M6l7jJ9j3j3m8o5J1O4O8M1j5l0l7n4m9o7k9O1J7o4nJ00P3p0m2J08L4m7Pq1
$$ 25 -42 -24 78 124 87 86 105 92 79 31 -34 -23 41 109 150 135 105 68 14 -35 -102 -131 -70 -53 -117 -122 -22 51 -19 -61 47 81 34 41 -40
1481d0r7K6m7o9L7L1J08J08j48j75rL7J36J16o2oN6l7N0J10k3NN7m3l7pp7%J22K7q5m0Mk4
$$ -40 -137 -111 -158 -227 -190 -159 -51 57 -91 -266 -275 -238 -102 14 -48 -54 2 -35 15 125 102 107 164 121 84 77 0 0 122 149 64 24 28 4
1471Dm8l2L7Q5M5kNqk8l2p5n4O1K0r7l2J1m9L0R2J0nK2kkJ6M1N8K9K4J7LK4m4j43n8O3O0L8
$$ 4 -44 -76 -39 46 91 89 94 86 58 26 -49 -103 -42 -22 -119 -151 -140 -189 -159 -67 -57 -62 -40 -42 -44 -28 13 71 100 124 141 144 168 124 -19 -77 -14 46 84
1460H4L2M7K0r8j29n3k0K9P1l4j00mJq2L2J59O0M3J28j7j44k7M7N8N7n9j16l1k2o2PJ20J37
$$ 84 116 163 183 85 -44 -97 -117 -88 -17 -51 -151 -155 -154 -236 -204 -45 15 58 186 169 25 -2 45 103 160 101 -15 -46 -68 -130 -123 -3 134
1451A34M9m8q9o1n9j32r5Q1J34N8J8K9O2J6m9J8N3k8r3j00j3P6O8Q1M7n5l8k3m9j8o8k9J44
$$ 134 183 135 46 -15 -74 -206 -301 -220 -86 -28 -10 19 81 97 48 66 119 91 -2 -102 -115 -39 29 110 157 102 64 41 -8 -26 -94 -123 21
1442B1M3j13k0kk2R3O5n6nQ4M5j8KO3J04N3j21j67j6L0l2n1l2L2K2J5J11l1j85M8J16o1kM3
$$ 21 64 -49 -69 -71 -93 0 65 9 4 88 133 115 117 180 284 337 216 49 33 63 31 -20 -52 -20 2 17 128 97 -88 -40 76 15 13 56
1432E6k3j6p7r0lNL5J9k4R7R0k9Rn7j66k4Q5Ko1OJ01M9k6k6j03j01K9L1J3O1M9L9M2M9N6l1
$$ 56 33 17 -60 -150 -153 -148 -113 -94 -118 -21 69 40 49 -8 -174 -198 -113 -111 -172 -166 -65 -16 -42 -68 -171 -272 -243 -212 -199 -138 -89 -50 -8 41 97 66
1422F6o0L1K5m4l0L9J8j23p4J07N8kQo1qJ1j20m0O6K0N8%o7J04J10o2l0K6m0p8kJ23J12j1
$$ 66 6 37 62 18 -12 27 45 -78 -152 -45 13 11 19 -42 -50 -39 -159 -199 -133 -113 -55 -55 -122 -18 92 30 0 26 -14 -92 -94 29 141 130
1413A30p8j08p4K9Q3O5k3q3m6m2J0J17K0j04l8L4M6N2L8j9j11o4O1J0j8P9N4j5j4nPl1nJ35
$$ 130 52 -56 -130 -101 -18 47 24 -59 -105 -147 -137 -20 0 -104 -142 -108 -62 -10 28 9 -102 -166 -105 -95 -113 -34 20 5 -9 -14 -7 -38 -43 92
1403I2J08l9n8l9k0ll8l6j3j1J3J9N5J04j1j21m1J7j4rNJ8M8J4o8p2QN6M1J9K4pr1l8Q5J6
$$ 92 200 161 103 64 44 41 3 -33 -46 -57 -44 -25 30 134 123 2 -39 -22 -36 -45 -40 -22 26 40 -28 -100 -92 -36 5 24 48 41 -50 -88 -3 13
1393A3m5K3mj9Nq3o5Nm8L2P8q4l2R9l0p7O3R8K1l9m9n8l8M4O4N6O7rk8%p3KJ53Q0pl4q5j3
$$ 13 -32 -9 -13 -32 -27 -110 -175 -170 -218 -186 -108 -192 -224 -125 -155 -232 -169 -71 -50 -89 -138 -196 -234 -190 -126 -70 -3 -12 -40 -40 -113 -111 42 122 115 81 -4 -17
1382a7L8j1L0L9l8n8n6KO0j0n2K9R8O2l9k6L0p1j51p4L2J09R9L6J7j6j3K6LL1O2l1p5q3q6
$$ -17 21 10 40 79 41 -17 -73 -71 -11 -21 -73 -44 54 116 77 51 81 10 -141 -215 -183 -74 25 61 78 62 49 75 78 109 171 140 65 -18 -104
1372a04R0J88K3p1m4m5j3Ll6m5lO6Q2ml1L5L9l8q7l6O4M1j03j00M2M0k5K7N2K6P4P7j4n1l3
$$ -104 -14 174 197 126 82 37 24 27 -9 -54 -57 9 91 87 56 91 130 92 5 -31 33 74 -29 -129 -87 -47 -72 -45 7 33 107 184 170 119 86
1363H6k0j5j7K6M4l0m9K2L0j6k6k%j6M0J04M0j9Ql4o9J9K2n6mL9m6j4J19M4j52j19N1K9o1
$$ 86 66 51 34 60 104 74 25 47 77 61 35 33 33 17 57 161 201 182 190 156 87 106 128 72 68 107 61 47 166 210 58 -61 -10 19 -42
1353d2L9J03l6r3l1k2L5J30P4o8j33p6N2Q1j0o9m4M3Q4j1o2J3%l8M9L9p2m4j4j9J24J32r6
$$ -42 -3 100 64 -29 -60 -82 -47 83 157 89 -44 -120 -68 13 3 -66 -110 -67 17 6 -56 -43 -43 -81 -32 7 -65 -109 -123 -142 -18 114 18
1344A8j31OO0J05Q1k6l6n3j07j4R7N6m3p3jM3pl9l3K5O5k7k6J23J00j7l1p2j06l0O1N3j8j7
$$ 18 -113 -107 -47 58 139 113 77 24 -83 -97 0 56 13 -60 -61 -18 -25 -64 -97 -72 -7 -34 -60 63 163 146 115 43 -63 -93 -32 21 3 -14
1334a4K7lk0m2j03j9J13J04N9m0j29m8J6qL2P3M6oj4M2J0n5qL5O8M6q5l8N1p9m7P4p9j17O4
$$ -14 13 10 -10 -52 -155 -174 -61 43 102 62 -67 -115 -99 -107 -75 -2 44 38 24 66 76 21 13 48 116 162 77 39 90 11 -36 38 -41 -158 -94
1324i4Q0j6p6m2O7M4j5M4P5M3l8n9O8J9j67r5Rj6O0Q1k7k3N5M3k9J0J27K3j60j22l0M5J01
$$ -94 -14 -30 -106 -148 -81 -37 -52 -8 67 110 72 13 81 100 -67 -162 -153 -169 -109 -28 -55 -78 -23 20 -9 1 128 151 -9 -131 -161 -116 -15
1315a5Om9K8L0L0K7o1m9M7P0Q0M6p2j63j18L8J22J11L4j17p8O9p9j81J1M0l6N2J30J40J8j21
$$ -15 -9 -58 -30 0 30 57 -4 -53 -6 64 144 190 118 -45 -163 -125 -3 108 142 25 -53 16 -63 -244 -233 -193 -229 -177 -47 93 111 -10
1306a0J6J10n7j03j9N4P3n0p6K8J0O4J18n3n0O8n0p7J2k9l2jj2M6M9k1m1m8K7J18N0j5Qk0
$$ -10 6 116 59 -44 -63 -9 64 14 -62 -34 -24 40 158 105 55 123 73 -4 8 -21 -53 -54 -66 -20 29 8 -33 -81 -54 64 114 99 107 87
1296H7n0m9o8l6M1J02P4o4o8Q7M5j37o4J17P1p2r7o9m5K7P4K4MO6O3K7L0k8q1%P0jq8n9L3
$$ 87 37 -12 -80 -116 -75 27 101 37 -31 56 101 -36 -100 17 88 16 -81 -150 -195 -168 -94 -70 -66 0 63 90 120 92 11 11 81 80 -8 -67 -34
1287c4Nn5L1N1o0j1Q7L7K0O1%o1lJ5r5o2Q4m5j87K9J66R0J06N6n6k4o0j47l7J09Q9j3p2n1
$$ -34 -29 -84 -53 -2 -62 -73 14 51 71 132 132 71 68 83 -12 -74 10 -35 -222 -193 -27 63 169 225 169 145 85 -62 -99 10 99 86 14 -37
1277c7K0P4k1j45m5O1kK5O9j9l1M1O1J0q9r3j5L1Q0M8l4J1L9rj3m2l9N3R3P9J5m5J4J2p3n0
$$ -37 -17 57 36 -109 -154 -93 -95 -70 -1 -20 -51 -10 51 61 -28 -121 -136 -105 -25 23 -11 0 39 30 17 -25 -64 -11 82 161 176 131 145 157 84 34
1267C4J7P4P0n0q1l2l5JjqJ03M6j37o4P2M0m3m7K9M4J4K5l2m8K1m9j07nP1J59J78j6j47j08
$$ 34 51 125 195 145 64 32 -3 -2 -3 -11 92 138 1 -63 9 49 6 -41 -12 32 46 71 39 -9 12 -37 -144 -149 -78 81 259 243 96 -12
1257a2l4Lm8j0J11L0p3l6q8j19L4J26M2m1L3R4o0j55K7J29K6L9J06l2j43m2K5lj3j5N9Q4j4
$$ -12 -46 -43 -91 -101 10 40 -33 -69 -157 -276 -242 -116 -74 -115 -82 12 -48 -203 -176 -47 -21 18 124 92 -51 -93 -68 -71 -84 -99 -40 44 30
1248C0N3R9j05j37n1r4K3J02n0J2J35j8j07L1J02j6p4N4M0j02l7M4L8J02O8K6Q3n6j99m9M3
$$ 30 83 182 77 -60 -111 -205 -182 -80 -130 -118 17 -1 -108 -77 25 9 -65 -11 29 -73 -110 -66 -28 74 142 168 251 195 -4 -53 -10
1239a0o3q5qJ2M9J46J10J1N0Lj11l4J2m3k2k2%O4K4l2r0r2Q9J36Pm6j20j10K6jJ4J03K7L2
$$ -10 -73 -158 -166 -154 -105 41 151 162 212 215 104 70 82 39 17 -5 -5 59 83 51 -39 -131 -42 94 101 55 -65 -175 -149 -150 -136 -33 -6 26
1230B6N6n5KK3j02k1L8n3%O1L1jl6K5N3l9k3ml4L7N1kk7j03m6J06O8Rk4r9nP4l4k3J4m7K3
$$ 26 82 27 29 52 -50 -71 -33 -86 -86 -25 6 5 -31 -6 47 8 -15 -19 -53 -16 35 33 6 -97 -143 -37 31 40 16 -83 -88 -14 -48 -71 -57 -104 -81
1220h1P4K6N5m4j51M8J30o3p3k3q8M1J46o1j65NQ0KOP6K3n8KO8K1k2j3K7N2J7pk0m5JM8k0
$$ -81 -7 19 74 30 -121 -73 57 -6 -79 -102 -190 -149 -3 -64 -229 -224 -144 -142 -136 -60 -37 -95 -93 -25 -4 -26 -39 -12 40 57 50 30 -15 -14 34 14
1209A4j06o6M4J7r3l3O2N7R5M1m9M7K7j03K3Q0l7j7k7j00k2M1K9L6J6K9M3J7O3P6k0p3k1O5
$$ 14 -92 -158 -114 -97 -190 -223 -161 -104 -9 32 -17 30 57 -46 -23 57 20 3 -24 -124 -146 -105 -76 -40 -24 5 48 65 128 204 184 111 90 155
1200A55J4j19m4O2q2j79m6Q2L9j22j02J32J58k1m5L6K2m5l3N9P2%m0p1m2L7Mk8O0O5k8m1R
$$ 155 169 50 6 68 -14 -193 -239 -157 -118 -240 -342 -210 -52 -73 -118 -82 -60 -105 -138 -79 -7 -7 -47 -118 -160 -123 -119 -147 -87 -22 -50 -91 -82
1191h2L0n3j01L5P0m4nM4K4J10N1j07k6N1K0K3j12j43P6N6p2M2R2K1po3m0M4M0K9J0rM1j9
$$ -82 -52 -105 -206 -171 -101 -145 -150 -106 -82 28 79 -28 -54 -3 17 40 -72 -215 -139 -83 -155 -113 -21 0 -7 -70 -110 -66 -26 3 13 4 45 26
1181B6j47n2J32P4p5j9J8r4K8K06O7K7P7j16j31J7n0n6j3l1J77K57o1k09n5N7L4l1nL7J7J7
$$ 26 -121 -173 -41 33 -42 -61 -43 -137 -109 97 164 191 268 152 21 38 -12 -68 -81 -112 65 322 261 52 -3 54 88 57 52 89 106 123
1172A23q0j54K0Q8l8lO1J4Nm3r2K9J61J11m2j08n2JKj5mK9j8q1KJ01L3o1k1K2j4K6P6k1n6
$$ 123 43 -111 -91 -3 -41 -44 17 31 36 -7 -99 -70 91 202 160 52 0 1 3 -12 -16 13 -5 -86 -84 17 50 -11 -32 -10 -24 2 78 57 1
1162AN1R2K2p8q3K5K4k2L1nl1N8Rq2k0N4P3k0j10J8J19K8k4l5m6k4l9n2m8o0J5O5Km3q5o1
$$ 1 52 144 166 88 5 30 54 32 63 58 27 85 94 12 -8 46 119 99 -11 7 126 154 130 95 49 25 -14 -66 -114 -174 -159 -94 -92 -135 -220 -281
1152b81P5O1l4M2J03%p5j0L0l1QR4Nq5m3MM5M6KN4R4k1r7J4J34M7o6K8N6n8m8nj3k6j22j05
$$ -281 -206 -145 -179 -137 -34 -34 -109 -119 -89 -120 -112 -18 -13 -98 -141 -137 -92 -46 -44 10 104 83 -14 0 134 181 115 143 199 141 93 88 75 49 -73 -178
1142a78O5P7M0O6k5p9n6p0N6J64L8pM5l7n6Pk4kM9m3r6k3J4L5L7k5K7J44P8j4rp5q7LJ4P6
$$ -178 -113 -36 4 70 45 -34 -90 -160 -104 60 98 91 136 99 43 50 26 24 73 30 -66 -89 -75 -40 -3 -28 -1 143 221 207 198 123 36 39 53 129
1132A29J37o2j73%P8J0o1j22j7J04K5RL4r1o2P4Oq4o7MJ22P2n9J3O7j1MM9L6j0p7l5J6k5K8
$$ 129 266 204 31 31 109 119 58 -64 -81 23 48 57 91 0 -62 12 18 -66 -133 -129 -7 65 6 19 86 75 79 128 164 154 77 42 58 33 61
1122F1M5o4k3K3o6p5m3PJ06pj65K2K20P0j12p1k4m5K2M3l6K0R3K8J1Pl4k3k3J6N5m4k4R5l
$$ 61 106 42 19 42 -24 -99 -142 -135 -29 -36 -201 -179 41 111 -1 -72 -96 -141 -119 -76 -112 -92 1 29 40 47 13 -10 -33 -17 38 -6 -30 65 62
1112F2n8N1L3m4q0j16p0JM9Q3M7J1j9n3J4M9J3L5nm2L6K4K6J03%j19p2k0L6L8j8Qj7j03j0
$$ 62 4 55 88 44 -36 -152 -222 -221 -172 -89 -42 -31 -50 -103 -89 -40 -27 8 3 -39 -3 21 47 150 150 31 -41 -61 -25 13 -5 3 -14 -117 -127
1103a27P9MOJ10R5k1m0j1r5r3P6J12K1J1K9j0r7j15J1Q3K5%L2P5L1o7j0L4j06j23jJ5oML1
$$ -127 -48 -44 -38 72 167 146 106 95 0 -93 -17 95 116 127 156 146 49 -66 -55 28 53 53 85 160 191 124 114 148 42 -81 -82 -67 -73 -69 -38
1093c8J00P5o5j02m1j0qJ7M2L0N0M3q7j03M3N4k6n9j07j4J64R4OQ7J5j09NR3Po8j01l7P9N2
$$ -38 62 137 72 -30 -71 -81 -89 -72 -30 0 50 93 6 -97 -54 0 -26 -85 -192 -206 -42 52 58 145 160 51 56 149 156 88 -13 -50 29 81
1083H1K6Q1j8r0L3M4l7nJ6Ml2j27p4N4rn1K6jmJ20J08n9j04JO6K7RM4K0n0m6j1p5r7M5N2q9
$$ 81 107 188 170 80 113 157 120 115 131 135 103 -24 -98 -44 -53 -104 -78 -79 -83 37 145 86 -18 -17 49 76 85 129 149 99 53 42 -33 -130 -85 -33 -122
1073a22JR5n8l6J05Mk6R3L1n0n8j41q3Q2M4j0R4P9n3n4j0j5Q4J71O0m9m5p8q3k6qM3R1K3m9
$$ -122 -121 -26 -84 -120 -15 -11 -37 56 87 37 -21 -162 -245 -163 -119 -129 -35 44 -9 -63 -73 -88 -4 167 227 178 133 55 -28 -54 -62 -19 72 95 46
1063D6m6j9om9j3J15P7m0k8l6o8l1J3Q8J13pl6J1l8JJ00K4q8j18r9K0R0ro8jN7N2J8jJrJ0
$$ 46 0 -19 -25 -74 -87 28 105 65 37 1 -67 -98 -85 3 116 109 73 84 46 47 147 171 83 -35 -134 -114 -24 -33 -101 -102 -45 7 25 24 25 16 26
1053B6O1O4kp7p8j4Kj2Loj1ko7q3N2J39N6l4m7o7o8K5M3n9oR5j4o1K9K7P5J48M5o1o2jO9k7
$$ 26 87 151 149 72 -6 -20 -18 -30 -27 -33 -44 -46 -113 -196 -144 -5 51 17 -30 -97 -165 -140 -97 -156 -162 -67 -81 -142 -113 -86 -11 137 182 121 59 58 127 100
1042A00o9P3k2j36P2Q7q4k7l7r7N4J13J7Olq3j37o3N7J2n8M0J09N0j1KN2Km0L1lp3o7j75j33
$$ 100 31 104 82 -54 18 105 21 -6 -43 -140 -86 27 44 50 47 -36 -173 -236 -179 -167 -225 -185 -76 -26 -37 -35 17 19 -21 10 7 -66 -133 -308 -441
1032d41J65J75j7K8R0j6j05o3M6N4lRJ0mpm3nN9K6J3Pl0k5l0J4P8k4m9N9j5n3R4R2k4p8p5
$$ -441 -276 -101 -118 -90 0 -16 -121 -184 -138 -84 -87 -78 -68 -72 -79 -122 -127 -68 -42 -29 -22 -52 -77 -107 -93 -15 -39 -88 -29 -44 -97 -3 89 65 -13 -88
1022h8J2M6j4n1r0oJ43M5p3j5j0J7O9J3K1K2m9j1l0o7N6Lr2M3nq3J15J18rK8o8j30O9J09k2
$$ -88 -76 -30 -44 -95 -185 -191 -48 -3 -76 -91 -101 -84 -15 -2 19 41 -8 -19 -49 -116 -60 -57 -149 -106 -111 -194 -79 39 30 58 -10 -140 -71 38 16
1012A6m1J6O7K3m8K5L8p4o0J3L2L9qm0Ojm0K3N7l1l3P9L8p0kM2k8l2l2o4j9Pm6o2J8J14Q3
$$ 16 -25 -9 58 81 33 58 96 22 -38 -25 7 46 38 -2 4 3 -37 -14 43 12 -21 58 96 26 24 66 38 6 -26 -90 -109 -102 -148 -210 -192 -78 5
1002EnQJ6k2K7O0K0J7Pm9n0j4k7n2m2l3L2J43M9j57r7P6M0l6nM1K8k3RO4j3n2J1j8n1K5L4
$$ 5 0 8 24 2 29 89 109 126 133 84 34 20 -7 -59 -101 -134 -102 41 90 -67 -164 -88 -48 -84 -89 -48 -20 -43 -34 30 17 -35 -24 -42 -93 -68 -34
992c4m9p0l6j9KL5N8P2J9q9p6L8R1J38J37l1j28k4L9k6n2J7K9m1j8%q4J1J55Nj03L7P1oN6
$$ -34 -83 -153 -189 -208 -206 -171 -113 -41 -22 -111 -187 -149 -58 80 217 186 58 34 73 47 -5 12 41 0 -18 -18 -102 -91 64 69 -34 3 74 68 124
982A24R8j9r8l0J1n2o5J3O1Oq3o1J4k4qJ23Q0o6l9lp2n3M7R2P5m2j45o1O7R4R8J3q1K7O2j03
$$ 124 222 203 105 75 86 34 -31 -18 43 49 -34 -95 -81 -105 -113 10 90 24 -15 -18 -90 -143 -96 -4 71 29 -116 -177 -110 -16 82 95 14 41 103 0
972@o6J20R2pk0oN7P4j4m0k8q0o5J2KL2J01n4k10k6J31Pj1J24N8j00o7k1j02m2R0K1%J05K0
$$ 0 -66 54 146 139 119 113 170 244 230 190 162 82 17 29 31 63 164 110 -100 -126 5 12 1 125 183 83 16 -5 -107 -149 -59 -38 -38 67 87
962H7o9Kk0l0M9M5N1N0n5o1J1mn4r5o4Jl8l1L2J6K9J7j1J02J05k7pnp7k0Nn6n1m6k6O9J34
$$ 87 18 20 0 -30 19 64 115 165 110 49 60 56 2 -93 -157 -156 -194 -225 -193 -177 -148 -131 -142 -40 65 38 31 26 -51 -71 -66 -122 -173 -219 -245 -176 -42
951d2M9q6J3J70kj16Q2R6m1L%p3lO3L1l8j12p7N7R6K2l2KM1J%O9J6r7m5N6K1o4j15j09n6o0
$$ -42 7 -79 -66 104 102 -14 68 164 123 126 126 53 50 113 144 106 -6 -83 -26 70 92 60 62 103 104 104 173 189 92 47 103 124 60 -55 -164 -220 -280
941b80o4M6J48J50Q6k3j12o3Q2R2k6J2Q0r7j80%Q1N7N7k2o9pL7Oo0l9K9qkM3l7k2N2j7LM4
$$ -280 -344 -298 -150 0 86 63 -49 -112 -30 62 36 48 128 31 -149 -149 -68 -11 46 24 -45 -52 -15 -9 -69 -108 -79 -87 -89 -46 -83 -105 -53 -70 -67 -23
931b3q1q0M9O7N4N0Op0j19k8Q2L9l2k2L8O2loJ6o1l5O9L6j4nN1P6p1q0R6J6q3L7k3j13K1K2
$$ -23 -104 -184 -135 -68 -14 36 42 -28 -147 -175 -93 -54 -86 -108 -70 -8 -11 -17 -1 -62 -97 -28 8 -6 -11 40 116 45 -35 61 77 -6 31 8 -105 -84 -62
921f2p9l0M9J15J56P7k7m8m6j02q6P4R9n2o5j2l3j8rm7k5J7L5N3M8L4K6K3J2l2k4J9j8l5l
$$ -62 -141 -171 -122 -7 149 226 199 151 105 3 -83 -9 90 38 -27 -39 -72 -90 -99 -146 -171 -154 -119 -66 -18 16 42 65 77 45 21 40 22 -13 -16
911a6j8K5Q5J3l5l0j18j12M3J26J39P9p1q9qk6J5J09M4j7J0k3m3PJ5j1omn5p1L6N7o3n8pn5
$$ -16 -34 -9 76 89 54 24 -94 -206 -163 -37 102 181 110 21 13 -13 2 111 155 138 148 125 82 89 104 93 87 83 28 -43 -7 50 -13 -71 -78 -133
901a33j1R7J20N5r9j32j8k9o2QM9R0L6p3M4J07l6m5m2p0L1Pm1P4K7n3P3J01J1k8j9L2n3j39
$$ -133 -144 -47 73 128 29 -103 -121 -150 -212 -204 -155 -65 -29 -102 -58 49 13 -32 -74 -144 -113 -106 -147 -73 -46 -99 -26 75 86 58 39 71 18 -121
891a21L6R2o1lR7j1j00l9P5O4q3j13MM5rk7M3P9L2J9qn6%qr2j2N3PP9Q8n1j7Q3K4j0Mo3o3
$$ -121 -85 7 -54 -57 40 29 -71 -110 -35 29 -54 -167 -163 -118 -127 -154 -111 -32 0 19 11 -45 -45 -53 -145 -157 -104 -97 -18 70 19 2 85 109 99 103 40 -23
880b3K3N0O0J0j16p9N2J5j0O5L7JM1J0j8J5j2p8j09n9K1Jl8QM9O6K0o7pJ05K5p0OM4o6q6P3
$$ -23 0 50 110 120 4 -75 -23 -8 -18 47 84 85 126 136 118 133 121 43 -66 -125 -104 -103 -141 -133 -84 -18 2 -65 -72 33 58 -12 -6 38 -28 -114 -41
870d1J49L0j14j34k5N4j7o8m4k0R3J91J05k0o3k0L7o1j40K1J25K9m1l6MQ0O7o4p6P6N9j40
$$ -41 108 138 24 -110 -135 -81 -98 -166 -210 -230 -137 54 159 139 76 56 93 32 -108 -87 38 67 26 -10 -6 74 141 77 1 77 136 -4
861dj33QJ9L7Q0Q3J02O5k6j14j73m9P6m0m0J24J11j0j03j17OM0k0PJk3K8P7Q9l8j47L3J59
$$ -4 -137 -129 -110 -73 7 90 192 257 231 117 -56 -105 -29 -69 -109 15 126 116 13 -104 -98 -58 -78 -71 -70 -93 -65 12 101 63 -84 -51 108
852A08Q2P8Lj27p7n5n9L4J4l7Jj4rM6J0l0l0k5K3M4ojP4Pj49m2J06p6j12J53J27r2q8J4Q3
$$ 108 190 268 271 144 67 12 -47 -13 1 -36 -35 -49 -58 -12 -2 -32 -62 -87 -64 -20 -26 -27 47 54 -95 -137 -31 -107 -219 -66 61 -31 -119 -105 -22
842b2M9p0j1J34M7q8k0O0pk2P4M7l7QJ5n6m9m1k2N0K4p9p9j8J8O2O2l9o1P8J01Kk1p0p2N3
$$ -22 27 -43 -54 80 127 39 19 79 72 50 124 171 134 142 157 101 52 11 -11 39 63 -16 -95 -113 -95 -33 29 -10 -71 7 108 110 89 19 -53 0
832@J6n4M9K6n3K8mp1K3J8m1O2Q5qNN1L1M2L7n5o8K3J5m8m6n3n2%Kn1o7j0L0k8k3P3K6p3q2
$$ 0 16 -38 11 37 -16 12 8 -63 -40 -22 -63 -1 84 76 81 132 163 205 242 187 119 142 157 109 63 10 -42 -42 -40 -91 -158 -168 -138 -166 -189 -116 -90 -163 -245
821b45q5pJ07N3j6K3N0R6R9JrM6k7j02k9O4N1NK7N5k2j75j83L6J49Pp1NR2J46K7j59p5N4k4
$$ -245 -330 -337 -230 -177 -193 -170 -120 -24 75 76 67 113 86 -16 -45 19 70 75 102 157 135 -40 -223 -187 -38 -31 -102 -97 -5 141 168 9 -66 -12 -36
811c6k3O8lo7J4M3qMK0k9o8l3L5N2j8m2K3M7L5J7r6j20O7J38Pn2m5m8M2J17Jj01rL7m4j8L4
$$ -36 -59 9 6 -61 -47 -4 -12 -8 12 -17 -85 -118 -83 -31 -49 -91 -68 -21 14 31 -65 -185 -118 20 27 -25 -70 -118 -76 41 42 -59 -68 -31 -75 -93 -59
801e9k3J2R6M2n4r5l8J29J40j2j6J1n5m5j8n1l0J8L0K5K4M1mp3k7pp4pR3O1K1NJ0J9p3r3N0
$$ -59 -82 -70 26 68 14 -81 -119 10 150 138 122 133 78 33 15 -36 -66 -48 -18 7 31 72 68 -5 -32 -39 -113 -120 -27 34 55 60 70 89 16 -77 -27
790b7N3p8m4O3L4j4j8o1o6L7L8n6j2N1QM1Q5K0m3m8K8J09L8j7M0k0j03k0P5O7%m3j8k8QJ21
$$ -27 26 -52 -96 -33 1 -13 -31 -92 -158 -121 -83 -139 -151 -100 -92 -51 34 54 11 -37 -9 100 138 121 161 141 38 18 93 160 160 117 99 71 79 200
780B00N1o0J3k9j30j9L7j4O0L9j34j26L8J20Q0%m2n5p8m4O3R5K2l1k1OL2K7qMK6j8k7pn7l8
$$ 200 251 191 204 175 45 26 63 49 109 148 14 -112 -74 46 126 126 84 29 -49 -93 -30 65 87 56 35 41 73 100 92 96 122 104 77 70 13 -25
770b5O5J8q9l0R3J17K9o7l6L0j9p3l5J6K2o%Mr6j18K6P4O3J01pq1Q0J00n7n0ll4k3k0j9M8
$$ -25 40 58 -31 -61 32 149 178 111 75 105 86 13 -22 -6 16 10 10 14 -82 -200 -174 -100 -37 64 57 -24 56 156 99 49 46 12 -11 -31 -50 -2
760bQ9N1m3j15q1l0PR3R4l7j11o0M7J10Q8M6k7p2J9N1m2m2m9q7N0J06k6l3J1oj2l7K2J12p
$$ -2 87 138 95 -20 -101 -131 -124 -31 63 26 -85 -145 -98 12 100 146 119 47 66 117 75 33 -16 -103 -53 53 27 -6 5 -1 -13 -50 -28 84 77
750G7p7J3l1m3O1pk2J24J08nm9o9qN1J3lJ6Lm5j12j01qM8M2j9p0m1kM5J05Q3L2J0l1n8o3l6
$$ 77 0 13 -18 -61 0 -7 -29 95 203 198 149 80 72 123 136 133 149 152 107 -5 -106 -114 -66 -24 -43 -113 -154 -156 -111 -6 77 109 119 88 30 -33 -69
740f9K0mj3P1O7m0q2kJ15M9r5k7J1o2J9M3q1j5J08O2k5r3n7J07J36qo4L9Q2n9j08K5K2m1J7
$$ -69 -49 -53 -66 5 72 32 -50 -52 63 112 17 -10 1 -61 -42 1 -80 -95 13 75 50 -43 -100 7 143 135 71 110 192 133 25 50 72 31 48
730D8j0r1q3m7Q2J71K7n8L6M9j7n8n2LK7K6J9k7%N8l7j23n1Q3J43J5j28n0L6L0M4lm8j2m2
$$ 48 38 -53 -136 -183 -101 70 97 39 75 124 107 49 -3 0 27 53 72 45 45 103 66 -57 -108 -25 118 133 5 -45 -9 21 65 62 14 2 -40
720d0p1l1m7j3P6O5Lm3k6M7J7m2kk3m8O3J09M0J0Kl4n0rL2L6N6Mr7k5O1m4r4j9m0q1J5J22
$$ -40 -111 -142 -189 -202 -126 -61 -58 -101 -127 -80 -63 -105 -107 -130 -178 -115 -6 34 44 46 12 -38 -47 -15 21 77 81 -16 -41 20 -24 -118 -137 -177 -258 -243 -121
710a21L6j00pJ33R1J1l0J3O7m5n3Q0o1j74N1J38O4Q0lj00m3jOK8Jn3n9L6Q6j1m1L0L1j5k2
$$ -121 -85 -185 -192 -59 32 43 13 26 93 48 -5 75 14 -160 -109 29 93 173 170 70 27 26 32 60 61 8 -51 -15 71 60 19 49 80 65 43
700D3O7J14o8j69j3M8l8p5k5P2P6O3J09Mj20o3n7o2l2r4M8K27K9q4J3o6l1J34Rj19qP4P8N9
$$ 43 110 224 156 -13 -26 22 -16 -91 -116 -44 32 95 204 208 88 25 -32 -94 -126 -220 -172 55 84 0 13 -53 -84 50 59 -60 -68 6 84 143
691A43K3J4j4p0q6n6j9j0OM5j8j03j5J00L5o6l9L4O3P7O7M2K9m3j16p2n7q0lJ6m8J0P5O9J20
$$ 143 166 180 166 96 10 -46 -65 -75 -69 -24 -42 -145 -160 -60 -25 -91 -130 -96 -33 44 111 153 182 139 23 -49 -106 -186 -189 -173 -221 -211 -136 -67 53
681E3J00m1p5k6m7m8N8Q8KkL4l0o2l9jJ11R7m3K4O0j49j31P2L1o4j9llPk2RO7Qo7m0J7R6J71
$$ 53 153 112 37 11 -36 -84 -26 62 64 62 96 66 4 -35 -36 75 172 129 153 213 64 -67 5 36 -28 -47 -50 -53 -46 -68 -59 8 16 -51 -91 -74 22 193
670A93N0j57j52l7RO0R3N8K2o9j53p7N2R1P1nj01j14k2O0L1j6k2rM9J8j29m5J71J38Lj10j48
$$ 193 243 86 -66 -103 -94 -34 59 117 139 70 -83 -160 -108 -17 54 49 -52 -166 -188 -128 -97 -113 -135 -144 -95 -77 -206 -251 -80 58 61 -49 -197
661a97M9J58J9RL5o9n6pJ5O5m4q9J00K7j69k3J04K4P0J30Or1m2L2J6n6j2J12R0m0r6j21j29
$$ -197 -148 10 29 38 73 4 -52 -59 -44 21 -23 -112 -12 15 -154 -177 -73 -49 21 151 157 66 24 56 72 16 4 116 206 166 70 -51 -180
652a80l3O3J08J46P1o1q7o9J5J21K8m7P3M0j21p4O0Q0Jn1JJ4l7j9l9q5lM3jJ3l6j05K6J35
$$ -180 -213 -150 -42 104 175 114 27 -42 -27 94 122 75 148 188 67 -7 53 133 134 83 84 98 61 42 3 -82 -85 -42 -43 -30 -66 -171 -145 -10
642a0L3k7j1m3j3M6nl7k0MQ3L1j08pJ20P6Q8L3j05m9l5j55j05K4Q5N6m1K0J06N4Q4j8k42p7
$$ -10 23 -4 -15 -58 -71 -25 -30 -67 -87 -83 0 31 -77 -84 36 112 200 233 128 79 44 -111 -216 -192 -107 -51 -92 -72 34 88 172 154 -88 -165
632a65Q1n2K9P0j22l0J35P0j4j04m2J47K9j28K8J59J15K2n1o8r1m1M8m1r1J2k5o3km7n6J9
$$ -165 -84 -136 -107 -37 -159 -189 -54 16 2 -102 -144 3 32 -96 -68 91 206 228 177 109 18 -23 25 -16 -107 -95 -120 -183 -185 -232 -288 -269
624b69P0J20L1m6R7P1j25r9pN5J14lo4L6m0j20J3P8M1k2r9n3NOJ52K27J7j30q5m3npo6k6P7
$$ -269 -199 -79 -48 -94 3 74 -51 -150 -157 -102 12 9 -55 -19 -59 -179 -166 -88 -47 -69 -168 -221 -216 -210 -58 169 186 56 -29 -72 -77 -84 -150 -176 -99
614i9O5k4m9k6l0JP9P4K5K1j1j2jr0n9Q9K1m9P2N6n9l3M8R0K3j12p9L7N7M6j9m7N5L8n8j5
$$ -99 -34 -58 -107 -133 -163 -162 -83 -9 16 37 26 14 13 -77 -136 -47 -26 -75 -3 53 -6 -39 9 99 122 10 -69 -32 25 71 52 5 60 98 40 25
604B5k6r6k9Mm1j1pk7K7K9j3O5J32M9rj8q2l9O7nn4M2K6n1n9o3m9k0J8O1j4o1O0Q4L2N7k1
$$ 25 -1 -97 -126 -122 -163 -174 -181 -208 -181 -152 -165 -100 32 81 72 54 -28 -67 0 -5 -59 -17 9 -42 -101 -164 -213 -233 -215 -154 -168 -229 -169 -85 -53 4 -17
593a7p9K2lj08n7N6R3Ln2O2M6o9Q1J95K9m8K0Nl2l3l6l9m0oO9O7n4j41q7oML9R6L8o1l3M5
$$ -17 -96 -74 -77 -185 -242 -186 -93 -90 -142 -80 -34 -103 -22 173 202 154 174 179 147 114 78 39 -1 -7 62 129 75 -66 -153 -159 -155 -116 -20 18 -43 -76 -31
583c1J1k5M0M9k9l5J6L1nq7q9O1J31K1n6k2J1L0L4k1p0l6K1j9j00m2P9O6L9Q8K9l2L9kj04
$$ -31 -20 -45 -5 44 15 -20 -4 27 22 -65 -154 -93 38 59 3 -19 -8 22 56 35 -35 -71 -50 -69 -169 -211 -132 -66 -27 61 90 58 97 95 -9
573inP7j4k4N2j8j37o7P5P8L2j0j08r8L0K0m2RL2NL8M5m6n6R8J41rl6jr9n7J14O8n9m4k6n6
$$ -9 -14 63 49 25 77 59 -78 -145 -70 8 40 30 -78 -176 -146 -126 -168 -159 -127 -122 -84 -39 -85 -141 -43 98 89 53 52 -47 -104 10 78 19 -25 -51 -107
563a07n7j6J7K0K5kl5L4J03N7Pj5m1l1RL7N7O0kp3NP0p4j13J2l4o5Q4P0j1N2J7q6nR2M2pk
$$ -107 -164 -180 -163 -143 -118 -120 -155 -121 -18 39 46 31 -10 -41 -32 5 62 122 120 47 52 122 48 -65 -53 -87 -152 -68 2 -9 43 60 -26 -31 61 103 96 94
552I4j4KL8j8m6L5Kr7l6qq6n0L4O2J03P7j5rJ1m8m9J7K2k9k5P3R2n1q7j0n7k6J13M7J3Q5p3
$$ 94 80 82 120 102 56 91 93 -4 -40 -48 -134 -184 -150 -88 15 92 77 68 79 31 -18 -1 21 -8 -33 40 132 81 -6 -16 -73 -99 14 61 74 159 86
542H6j00R9lj03M0Nj1J40N4p4l8m8o0n6m1L5J1lJ30O9j46j45k8K4N2Q3P9N0M1Km0po1j08P3
$$ 86 -14 85 82 -21 19 24 13 153 207 133 95 47 -13 -69 -110 -75 -64 -67 63 132 -14 -159 -187 -163 -111 -28 51 101 142 144 104 97 36 -72 1
532AJ19l7J8O8l3l7l9j2J07M7n8kJ2n0q1k3P1k4j14N5J42O1L5m4j01oJ8n1m3K0N5%m4ONl3
$$ 1 120 83 101 169 136 99 60 48 155 202 144 142 154 104 23 0 71 47 -67 -12 130 191 226 182 81 75 93 42 -1 19 74 74 30 36 41 8
522HNJ7k2qJ7L0J7n1q1j2K4J1K6k8o5N4N6l3P0N5j15l6P6L1J3n6q7j2n7p2K1L1J05J13n7l8
$$ 8 13 30 8 0 17 47 64 13 -68 -80 -56 -45 -19 -47 -112 -58 -2 -35 35 90 -25 -61 15 46 59 3 -84 -96 -153 -225 -204 -173 -68 45 -12 -50
512e0K5p9n1PpM9jm6M9Ol1M7k1l0P1QmR8O4J1Qk7m3q2q7L7O4k4K6O9k8k5P7Q7L7l0q9n2pk2
$$ -50 -25 -104 -155 -148 -155 -106 -107 -153 -104 -98 -129 -82 -103 -133 -62 -54 -58 40 104 115 123 96 53 -29 -116 -79 -15 -39 -13 56 28 3 80 167 204 174 85 33 26 4
500Dj3%M3J05%r2L7N2q2k9P2K1j2Rj7m2m8p8o3J4J3l6J5N3L7P5L2m9N3O0j51j18J29J04q0
$$ 4 -9 -9 34 139 139 47 84 136 54 25 97 118 106 115 98 56 8 -70 -133 -119 -106 -142 -127 -74 -37 38 70 21 74 134 -17 -135 -6 98 18
491A8n6J1p3q2N0R1K2pM1O9l0j03m4j2J6P8J2l7L1jo5QN5k9j19m6J10P3n5m3lJL2N1M8M2J9
$$ 18 -38 -27 -100 -182 -132 -41 -19 -26 15 84 54 -49 -93 -105 -89 -11 1 -36 -5 -6 -71 -63 -8 -37 -156 -202 -92 -19 -74 -117 -120 -119 -87 -36 12 54 73
480G3k6p0l0kp7j1J40Q8N%n9m8K8ol7K5L2l3o2n4l7M1J44J44K3r7o9Mj00j04J24J12n3pN0
$$ 73 47 -23 -53 -55 -132 -143 -3 85 90 90 31 -17 11 5 -32 -7 25 -8 -70 -124 -161 -120 24 168 191 94 25 29 -71 -175 -51 61 8 1 51
470E1P9R0j01j74k4M5J00J02m7n8k8p7PO0l9q3l2Q1P4o4MJ06l0p2LQN6M8o2q2n2k1Lj3pl0
$$ 51 130 220 119 -55 -79 -34 66 168 121 63 35 -42 -35 25 -14 -97 -129 -48 26 -38 -34 72 42 -30 -27 -19 37 85 23 -59 -111 -132 -129 -142 -149 -179
460a79n5J8N9M6L0m9l6N2M9N6Kj00M1J67N2nm4j26p7QP7Q2q7j06P9Q2J6K0k5j1Rl9L5Q4k0
$$ -179 -234 -216 -157 -111 -81 -130 -166 -114 -65 -9 -7 -107 -66 101 153 148 104 -22 -99 -91 -14 68 -19 -125 -46 36 52 72 47 36 45 6 41 125 105
450A05m5k2k6L6M7j9k7j4k9n1l4O9J22Q3K0j02j25j2k6PJ75O8r7K6K3j21k7J14O3o8j02j2
$$ 105 60 38 12 48 95 76 49 35 6 -45 -79 -10 112 195 215 113 -12 -24 -50 -43 132 200 103 129 152 31 4 118 181 113 11 -1
441ak6p7M8Q8j3rl0o0O9J05J0k3p6o5Q4R3j3j1l9p6L6M8o6N6J77l3j22pn6n4M3k8j6Q0m2q5
$$ -1 -27 -104 -56 32 19 10 -20 -80 -11 94 104 81 5 -60 24 117 104 93 54 -22 14 62 -4 52 229 196 74 67 11 -43 0 -28 -44 36 -6 -91
431i1M7K3n1m8n2K1R4L3l1j5J9J8J4N2L2m2j3J6l1NM9n4j34m3O5Q4O1j8q1lL6j4N8R1n8o2
$$ -91 -44 -21 -72 -120 -172 -151 -57 -24 -55 -70 -51 -33 -19 33 65 23 10 26 -5 0 49 -5 -139 -182 -117 -33 28 10 -71 -74 -38 -52 6 97 39 -23
421b3Q8J14J4o9m1L1QrJ4o7r7k4j5K1Q5Ql8K2Nk8K7O2M0j1o2l8l2j06o3Q6J12L9KJ8K3k8j6
$$ -23 65 179 193 124 83 114 122 113 127 60 -37 -61 -76 -55 30 38 0 22 27 -1 26 88 128 117 55 17 -15 -121 -184 -98 14 53 55 73 96 68 52
411E2M9k9p9Om1j7J81Q0p5P0rj84M0J38l0J4L3j44j46lQp2k6R2Rj08j6L6J0M9J0J1J35P4m6
$$ 52 101 72 -7 -1 -42 -59 122 202 127 197 188 4 44 182 152 166 199 55 -91 -94 -86 -158 -184 -92 -83 -191 -207 -171 -161 -112 -102 -91 44 118 72
401G2J2j6j38p7R0J28K6m9k9MO0N9k1L0R4k7r3n6m2Qjl0N2K2o4k9r1j02P7N2l8J20J42o5r9
$$ 72 84 68 -70 -147 -57 71 97 48 19 23 83 142 121 151 245 218 125 69 27 35 34 4 56 78 14 -15 -106 -208 -131 -79 -117 3 145 80 -19
391a9RNo5j8P9M6m2o0l1K5M7jm1pR4Q0j20j48Q1J72M5q4q5mRj3nk3M2J01kK3J14p2k21j05
$$ -19 -10 -5 -70 -88 -9 37 -5 -65 -96 -71 -24 -25 -66 -73 21 101 -19 -167 -86 86 131 47 -38 -42 -33 -46 -51 -74 -32 69 67 90 204 132 -89 -194
381a94N3J65J22n3j02m9J2L1l7JP4l3m5O7%m4N4N5NJ3l0p7qR9M7j08j02K2L5l5m5J7K6n6q1
$$ -194 -141 24 146 93 -9 -58 -46 -15 -52 -51 23 -10 -55 12 12 -32 22 77 82 95 65 -12 -20 79 126 18 -84 -62 -27 -62 -107 -90 -64 -120 -201
371b01J1J07J13K3p8q1K2J08O1l0J0M3l7o6m0n2NQ4K0p1m5j1j6M8P9k6o8L1P6L5mk8RQ4P2
$$ -201 -190 -83 30 53 -25 -106 -84 24 85 55 65 108 71 5 -35 -87 -82 2 22 -49 -94 -105 -121 -73 6 -20 -88 -57 19 54 50 22 31 115 187
362A87J4jp0j12J0K6j15n8N9K3L1l5j41N1J60pOJ4j45q5K7k3l2m5l1O0N6N3O2JN5M2j24l6
$$ 187 201 200 130 18 28 54 -61 -119 -60 -37 -6 -41 -182 -131 29 22 28 42 -103 -188 -161 -184 -216 -261 -292 -232 -176 -123 -61 -60 -5 37 -87 -123
352a23J41Q8N8M6p3j26q6jP8K6l2K6M9k2n3pPk6K0L7o5q9j9K9N5L5L4O8j3n6M2J2o0Rkq7k4
$$ -123 18 106 164 210 137 11 -75 -76 2 28 -4 22 71 49 -4 -11 -4 -30 -10 27 -38 -127 -146 -117 -62 -27 7 75 62 6 48 60 0 9 7 -80 -104
342a04N6K7OK1nm0j9K2L3K8JpJ9Nl0m0n0J3O5m0p1N3L1p2k0N1L2klP0J05j8j15m7N8Q4J6l6
$$ -104 -48 -21 -15 6 1 -39 -58 -36 -3 25 26 19 38 43 13 -27 -77 -64 1 -39 -110 -57 -26 -98 -118 -67 -35 -37 -40 30 135 117 2 -45 13 97 113 77
331G7n4j05m9P5Kn0O7j4j50lJ30R3M6p3j29M5J58N6m2oN6L4Kmp0j06m8lK0M8N3K5o9j38p6
$$ 77 23 -82 -131 -56 -54 -104 -37 -51 -201 -204 -74 19 65 -8 -137 -92 66 122 80 74 130 164 166 162 92 -14 -62 -65 -45 3 56 81 12 -126 -202
321b02mM9R3L9M7J64J09l8p5j00q3OL8Nl6o5o3m1L2J22J00L3k3o8k8rm5J1O7M5Qo2k1P0r7
$$ -202 -206 -157 -64 -25 22 186 295 257 182 82 -1 5 43 48 12 -53 -116 -157 -125 -3 97 130 107 39 11 2 -43 -32 35 80 88 26 5 75 -22
311b2k17mJ16O3M8k3p8k6j6jN1M2L4L9J2nLL1N4Ml2j2o7j44m5O8j4k6R8J8q8J0L1K9J05j1
$$ -22 -239 -243 -127 -64 -16 -39 -117 -143 -159 -160 -109 -67 -33 6 18 13 16 47 101 105 73 61 -6 -150 -195 -127 -141 -167 -69 -51 -139 -129 -98 -69 36 25
301B5r4J9kk5J6q9l1J79R8o8q1nJ13P5m4om8j50m0P4K5k8PQ6O5k4lN9M9l2r9l5l1j21MR8p7
$$ 25 -69 -50 -52 -77 -61 -150 -181 -2 96 28 -53 -58 55 130 86 80 32 -118 -158 -84 -59 -87 -80 6 71 47 44 103 152 120 21 -14 -45 -166 -162 -64 -141
291a41o3J40R0k6K9M7n9j01JP2K7L0K8n5j0J13L0j13o8k4p1rQ3L6k7j8K7P2J7o6l1QKL6J4
$$ -141 -204 -64 26 0 29 76 17 -84 -83 -11 16 46 74 19 9 122 152 39 -29 -53 -124 -133 -50 -14 -41 -59 -32 40 57 -9 -40 -32 -30 6 20
281B0q8r9J1P2L2L1L3m6j9M2o0m8M9l9l8J03Q1jmL8P8J5k8nj04j29rm3j16j4P8O7L9M9J3j00
$$ 20 -68 -167 -156 -84 -52 -21 12 -34 -53 -11 -71 -119 -70 -109 -147 -44 37 36 32 70 148 163 135 130 26 -103 -112 -155 -271 -285 -207 -140 -101 -52 -39 -139
271a39o1Q6O6K0N0K2j2ML8L6n0n8l0j32l7K17J37n7m1j7JN7M4Km6m7N9Q0l2q5o3k7j5m4k4
$$ -139 -200 -114 -48 -28 22 44 32 36 74 110 60 2 -28 -160 -197 20 157 100 59 42 43 100 144 146 100 53 112 192 160 75 12 -15 -30 -74 -98
261i8M8L6o2p1L7L2q3k3R1MpJ37R1p1p5pK0Kj6K4K1p5o6N7Q1j7q9j8Q6O6J3pq4j45o1O4O4
$$ -98 -50 -14 -76 -147 -110 -78 -161 -184 -93 -89 -96 41 132 61 -14 -21 -1 1 -15 9 30 -45 -111 -54 27 10 -79 -97 -11 55 68 61 -23 -168 -229 -165 -101
251a01j3J8R6N9Jp2k11j37J07J17ON6R9J8oQ0N2q8r7k5J1M3m0j36K0J45L7k9J8M4J8k5K3Q9
$$ -101 -114 -96 0 59 60 -12 -223 -360 -253 -136 -130 -74 25 43 37 117 169 81 -16 -41 -30 13 -27 -163 -143 2 39 10 28 72 90 65 88 177
241A77L1p8j10jQ0l9q0N7O8k5o3n0l9j10m9J81J09q0J1N2NO6pj11j4O8Oq9m4Q0pj43n2J3n0
$$ 177 208 130 20 19 99 60 -20 37 105 80 17 -33 -72 -182 -231 -50 59 -21 -10 42 47 113 106 -5 -19 49 55 -34 -78 2 -5 -148 -200 -187 -237
231b37m5L5J14J15L2m5p1j3K6J1O9P8rl9p3o8N2N3%RJQ6R7o8m4rj20J2J41J7k4m8p0O1L6j44
$$ -237 -282 -247 -133 -18 14 -31 -102 -115 -89 -78 -9 69 60 21 -52 -120 -68 -15 -15 -6 -5 81 178 110 66 57 -63 -51 90 107 83 35 -35 26 62 -82
221h2j01O7J06pr5j3P0N6J2m4m0l0k0R5N6j36m7J32M3m6J5P3M2m4q0p1j2R0P0K1M9l2q7J1
$$ -82 -183 -116 -10 -17 -112 -125 -55 1 13 -31 -71 -101 -121 -26 30 -106 -153 -21 22 -24 -9 64 106 62 -18 -89 -101 -11 59 80 129 97 10 21
212B1k6q7Lj1%J56J06n8o9q4p0O2Q8J8m9j04L0J78N0l9%j04r3P8M1k9J9L1M8J2m8Qn7j43K3
$$ 21 -5 -92 -89 -100 -100 56 162 104 35 -49 -119 -57 31 49 0 -104 -74 104 154 115 115 11 -82 -4 37 8 27 58 106 118 70 78 21 -122 -99
202i9Q9J3Q4Q7m5j12r4JM3K2Q2J6j07K1P9p1q2j9m1o1l0M2K4o2kJ06J00L6KM4K5p4OJ02J7
$$ -99 -10 3 87 174 129 17 -77 -76 -33 -11 71 87 -20 1 80 9 -73 -92 -133 -194 -224 -182 -158 -220 -222 -116 -16 20 22 66 91 17 23 125 142
192A42J1j2j86j14J32L1j87p1N5j08r7J59J47J7O1j7j08M5R3l4MP4jj9N0M6Rm6j52j08R2J23
$$ 142 153 141 -45 -159 -27 4 -183 -254 -199 -307 -404 -245 -98 -81 -20 -37 -145 -100 -7 -41 -37 37 36 17 67 113 122 76 -76 -184 -92 31
183C1no6l3N0N8PM5K8n1M0R4m2j44j66j21k8L6J34J60P2O8rj61o6L5m5k5L1%LM1O1Kp6l2J5
$$ 31 26 -40 -73 -23 35 42 87 115 64 104 198 156 12 -154 -275 -303 -267 -133 27 99 167 158 -3 -69 -34 -79 -104 -73 -73 -70 -29 32 34 -42 -74 -59
173e9J4M0LJ6P8p5j57P1J74j9j33J3J15rk9Q2oq8K5J10J02j0r9MJ8r9o5NM0Q8M4MJ6k0n4o4
$$ -59 -45 -5 -2 14 92 17 -140 -69 105 86 -47 -34 81 72 43 125 119 31 56 166 268 258 159 163 181 82 17 22 62 150 194 198 214 194 140 76
163G6m1k2p0OJ08k3l4J02Mp3L8M9Jj0l3l1JK5o0j44l8J9pR4M8j00k5K9J4L8o0p3O3R7J26J25
$$ 76 35 13 -57 -51 57 34 0 102 106 33 71 120 121 111 78 47 48 73 13 -131 -169 -150 -157 -63 -15 -115 -140 -111 -97 -59 -119 -192 -129 -32 94 219
153B19K8k7j28j14P7%j04M3qq7P0O2k7kj6qok5M6Oq2jL2L4P2k6o2k5j24n3J21J1n8L3l8n6
$$ 219 247 220 92 -22 55 55 -49 -6 -14 -101 -31 31 4 2 -14 -22 -28 -53 -7 -1 -83 -84 -52 -18 54 28 -34 -59 -183 -236 -115 -104 -162 -129 -167 -223
143b23R0O6k7L7P2L1N2P8Pq8p5j3l2jJ23M2j19m4%l6O9L5j34l2J05L9J4M0J5l6r2o6LK7O5
$$ -223 -133 -67 -94 -57 15 46 98 176 183 95 20 7 -25 -26 97 139 20 -24 -24 -60 9 44 -90 -122 -17 22 36 76 91 55 -37 -103 -100 -73 -8
133hN3k7l4m1l1Q4Q5m7n1M5Q4J6p4l5L2k2l7Nm0l3Q5N6q6p3K8Q7J39P4p6n4L6l9r3j2K9oo6
$$ -8 45 18 -16 -57 -88 -4 81 34 -17 28 112 128 54 19 51 29 -8 -3 -43 -76 9 65 -21 -94 -66 21 160 234 158 104 140 101 8 -4 25 19 -47
123d7q3L7J35J0j13m7RmK2j1n6L3O6l9m4M7N3Ll1k8J7M4J5j1K7K8l7J7J10j4j52p7L7Q7J01
$$ -47 -130 -93 42 52 -61 -108 -99 -103 -81 -92 -148 -115 -49 -88 -132 -85 -32 -29 -60 -88 -71 -27 -12 -23 4 32 -5 12 122 108 -44 -121 -84 3 104
113A04M0l6m0MM2J6m3j5O6L7n6n6o1j10l8K8o0n7M4Q1J11N0n3K5K6j44r5O6J6m6M6J30P5j5
$$ 104 144 108 68 72 114 130 87 72 138 175 119 63 2 -108 -146 -118 -178 -235 -191 -110 1 51 -2 23 49 -95 -190 -124 -108 -154 -108 22 97 82
103H2MK9l5o5J1O3k0j18p8lL5R7O7l9l6j8n3n4j8Oj5rJ05J07o4j12QM5n4o8J09J85N4l6p6
$$ 82 86 115 80 15 26 89 69 -49 -127 -130 -95 2 69 30 -6 -24 -77 -131 -149 -143 -158 -167 -62 45 -19 -131 -123 -78 -132 -200 -91 94 148 112 36
93C6r2J7P0j2m1l5j6Nl6J8J45R7pL3O7k9q6MO0j1m4o1r9n3PN2J02K5m0Rp4j57k4N4K4O9N5
$$ 36 -56 -39 31 19 -22 -57 -73 -68 -104 -86 59 156 149 182 249 220 134 138 198 187 143 82 -17 -70 -63 -11 91 116 76 85 11 -146 -170 -116 -92 -23 32
83C2j8L4M6j12j35L3N1lR7J01k0lRo0oL6m5k6P0Jq7M8J15j13j84K3O7J6M1j5j4O1m1q7L9J6
$$ 32 14 48 94 -18 -153 -120 -69 -72 25 126 106 103 112 52 46 82 37 11 81 82 -5 43 158 45 -139 -116 -49 -33 8 -7 -21 40 -1 -88 -49 -33
73c3n3L9J12Q8L0k1l2m9p1l0J5L7J0n5pM1q1q7O3J5l0O6k2p2J33J49Rkq9j06R1N6j27n9L0
$$ -33 -86 -47 65 153 183 162 130 81 10 -20 -5 32 42 -13 -20 21 -60 -147 -84 -69 -99 -33 -55 -127 6 155 164 162 73 -33 58 114 -13 -72 -42
63d2J6M8K9q%l9l9Ql8o6pM2O6L8j9j7KK9P8K0o7j6M7Nn8q7j7Q7L3m6J5L5kJ2l7n3O7L1j14
$$ -42 -26 22 51 43 43 4 -35 -27 -65 -131 -138 -96 -30 8 -11 -28 -26 3 81 101 34 18 65 70 12 -75 -92 -5 28 -18 -3 32 30 42 5 -48 19 50 -64
52f4l1L1q2m0Q1M4L3R2K2j27j17N4J22M2Pl2p8K4P1k6J1J5j25j4J79O7j5M5m0n4P8j0j47J1
$$ -64 -95 -64 -146 -186 -105 -61 -28 64 86 -41 -158 -104 18 60 67 35 -43 -19 52 26 37 52 -73 -87 92 159 144 189 149 95 173 163 16 27
43B7J59L9o3l8p4q7K1M2m4j8M2Rj9l4n6m4n8k8J12J12o3p1R0J15Jl7M5P4Pl5m3j9P7R7Ln0
$$ 27 186 225 162 124 50 -37 -16 26 -18 -36 6 15 -4 -38 -94 -138 -196 -224 -112 0 -63 -134 -44 71 72 35 80 154 161 126 83 64 141 238 241 191
33A91p2p5k3%L5J03L6o1n5n2j2M7k6p5QK2o8p2M3L0q8rN9p6lJ64K2p3L1L2l3p8m8R6J07Mj1
$$ 191 119 44 21 21 56 159 195 134 79 27 15 62 36 -39 -31 -9 -77 -149 -106 -76 -164 -173 -114 -190 -193 -29 -7 -80 -49 -17 -50 -128 -176 -80 27 31 20
22B0k0j8oj6O9M4j35l8J29L2rL9L6N9k3q5N2Qj74n8Q7Nj6Qn1m5k6n3L3J02L9O0Q1l2n9m3o0
$$ 20 0 -18 -24 -40 29 73 -62 -100 29 61 52 91 127 186 163 78 130 138 -36 -94 -7 -2 -18 -10 -61 -106 -132 -185 -152 -50 -11 49 130 98 39 -4 -64
12f4M8O9n3J6J38M3j12j56n6M7K0L9P3k6n2L5M5j9j9J02R0j38j24O3k1j21rO2O9N4K9J3r0
$$ -64 -16 53 0 16 154 197 85 -71 -127 -80 -60 -21 52 26 -26 9 54 35 16 118 208 70 -54 9 -12 -133 -142 -80 -11 43 72 85 -5
2ej02O8N0q0n1JM3P9nn0K8M8k4r2n1M2N1L3Mn9m8J3Q5J59Q0p1r3p3k9N1mq9RJ13mj61n6J10
$$ -5 -107 -39 11 -69 -120 -119 -76 3 -2 -52 -24 24 0 -92 -143 -101 -50 -17 -13 -72 -120 -107 -22 137 217 146 53 -20 -49 2 -2 -91 -82 31 27 -134 -190 -80
-8h0Pn7Q0J0j76p8J32J67O9KJ8j1p8o8o5p1j4K6R0J16k0n6O8M7m5p9j06j0Q0L7N9K7p4L9J07
$$ -80 -73 -130 -50 -40 -216 -294 -162 5 74 76 94 83 5 -63 -128 -199 -213 -187 -97 19 -1 -57 11 58 13 -66 -172 -182 -102 -65 -6 21 -53 -14 93
-18I3n6r9j3N7R8%r5q5j14j1J61P3j4P0K6q8n9K8N1j7m8Pk2r4m4N2O1L5O3M1n4l8m6j15L3
$$ 93 37 -62 -75 -18 80 80 -15 -100 -214 -225 -64 9 -5 65 91 3 -56 -28 23 6 -42 -35 -57 -151 -195 -143 -82 -47 16 57 3 -35 -81 -196 -163
-28a63J50N1P7P8o2nJ2j57j02P9P1n1j18k5L6%P3O3m2qn2m8J61N4j46M1P4q6rK6l5J7M4P7
$$ -163 -13 38 115 193 131 126 138 -19 -121 -42 29 -22 -140 -165 -129 -129 -56 7 -35 -43 -95 -143 18 72 -74 -33 41 -45 -54 -28 -63 -46 -2 75
-37G5R6l2q5k9oN9O2m0n4jM3R7N8p8j04QJ2r3j3J16K6l3j1r0o5O6L2k0ml2l2KJ3K4k7p2L0
$$ 75 171 139 54 25 19 78 140 100 46 45 88 185 243 165 61 69 81 -12 -25 91 117 84 73 -17 -82 -16 16 -4 -8 -40 -72 -70 -57 -33 -60 -132 -102
-48a02J64J37r2k27l1J46N6KL9Pm0n5K1J13M3k5Nn6j07k9O2R3mr9l2J8L8P6o4j70%J11M8r
$$ -102 62 199 107 -120 -151 -5 51 53 92 99 59 4 25 138 181 156 161 105 -2 -31 31 124 120 21 -11 7 45 121 57 -113 -113 -2 46 37
-57C7n8pJ23J14qj08j14k1L5L1M3oq0l7O2K7p9LJ45P8j2m7j07l9J9o3k5L9k2LL3j7nk6rJ55
$$ 37 -21 -28 95 209 201 93 -21 -42 -7 24 67 61 -19 -56 6 33 -46 -43 102 180 168 121 14 -25 -6 -69 -94 -55 -77 -74 -41 -58 -63 -89 -98 57
-67E7J78j8j22l7L4m3r3m2k0K7P9K1ROn8nL2m1lP8N9l6j12J3Q6r5o2J26Nq1P1Q6n7j16k0Q7
$$ 57 235 217 95 58 92 49 -44 -86 -106 -79 0 21 30 36 -22 -27 5 -36 -39 39 98 62 -50 -37 49 -46 -108 18 23 -58 13 99 42 -74 -94 -7
-77gK0k8K6j2q1l1P9R4o1j04N3M2k6N3N2K0%j53j54N5R6J1j6nL6L9Mj0k0N8J19l3j39l6L8
$$ -7 13 -15 11 -1 -82 -113 -34 60 -1 -105 -52 -10 -36 17 69 89 89 -64 -218 -163 -67 -56 -72 -77 -41 -2 2 -8 -28 30 149 116 -23 -59 -21
-87b1K0PM2R0J6j12n9K8k7l4N0Oo5j0L9K7M7M2J6J9l5p5j6pj1N3Nj30r1O1J03N6K8J2PK0l3
$$ -21 -1 6 48 138 154 42 -17 11 -16 -50 0 6 -59 -69 -30 -3 44 86 102 121 86 11 -5 -12 -23 30 35 -95 -186 -125 -22 34 62 74 81 101 68
-98F8q5J1P7QK4P0k4j19j08k7O1M4qK1L0k8l8k4o8n3P3N0k7J16J27j07p4J6j38q5J34Q7j9
$$ 68 -17 -6 71 79 103 173 149 30 -78 -105 -44 0 -8 13 43 15 -23 -47 -115 -168 -95 -45 -72 44 171 64 -10 6 -132 -217 -83 4 -15
-107a5lN5R7J6n1K4L5m1m3K4R0P2Mm7n9L9O6r8q7M7l0o1K7ro5p4NJ33K5j18nM0m9n1m0J3J00
$$ -15 -18 37 134 150 99 123 158 117 74 98 188 260 264 217 158 197 263 165 78 125 95 34 61 52 -13 -87 -82 51 76 -42 -47 -7 -56 -107 -147 -134 -34
-117c4O4ol9l0L4L5J9P5M9q3j15J5P4o4p1R0N0j7N8K5k8k4p1pL2p5m0L4l7mR0M9j4KRq8p2
$$ -34 30 24 -15 -45 -11 24 43 118 167 84 -31 -16 58 -6 -77 13 63 46 104 129 101 77 6 -1 31 -44 -84 -50 -87 -91 -1 48 34 36 45 -43 -115
-128a15J21Q9p2o4j17r1J31J00k9rr0o2J14L4k5J00J9j07j8J0r9p8M9L5qQ4J08M5L3okj4j70
$$ -115 6 95 23 -41 -158 -249 -118 -18 -47 -56 -146 -208 -94 -60 -85 15 34 -73 -91 -81 -180 -258 -209 -174 -182 -98 10 55 88 82 80 66 -104
-137a04j03R0k5l4J54N6o8jK3O0N6m7l8k8m0P3P9j0L2K0n8m2l1j5M3K9k2m1j5P3J32M9j08
$$ -104 -207 -117 -142 -176 -22 34 -34 -35 -12 48 104 57 19 -9 -49 24 103 93 125 145 87 45 14 -1 42 71 49 8 -7 66 198 247 139
-146A39j65n0K5m5k8N5Jn6K0R6N7m9q2nN0N1L2l9r5n2K2K8K7R9J13ml3K9Lk1M2N7Ko1n6Lk5
$$ 139 -26 -76 -51 -96 -124 -69 -68 -124 -104 -8 49 0 -82 -87 -37 14 46 7 -88 -140 -118 -90 -63 36 149 145 112 141 144 123 165 222 224 163 107 110 85
-157H5p2j8k9n9K0Kp2K5R8K6J5N6J6n1m6k5o2l1R4P2o5p5KL2L2%o5r2m6PJ1N5O3o5n8R9L5
$$ 85 13 -5 -34 -93 -73 -71 -143 -118 -20 6 21 77 93 42 -4 -29 -91 -122 -28 44 -21 -96 -94 -62 -30 -30 -95 -187 -233 -226 -215 -160 -97 -162 -220 -121 -86
-167h6p6J9N2J4O0ko3P6J13j6j8J7o3q3j7kj1K3L4K2M9N0n4j10k8J6k5k2k4n5N2J78O6q1l8
$$ -86 -162 -143 -91 -77 -17 -19 -82 -6 107 91 73 90 27 -56 -73 -75 -86 -63 -29 -7 42 92 38 -72 -100 -84 -109 -131 -155 -210 -158 20 86 5 -33
-177c3nk4O5J17Oo9n8l7O2J07p4j81k6R5Q3M3m7n5N6P0j2r0j19K9J20l2o8L1J7M3N3p7m6R2
$$ -33 -38 -62 3 120 126 57 -1 -38 24 131 57 -124 -150 -55 28 71 24 -31 25 95 83 -7 -126 -97 23 -9 -77 -46 -29 14 67 -10 -56 36
-186C6O1nk4j5M3L2j4POk4n8r0k1O3O6P2j3j55j19nJ1j0rK8K0n3pR5N5mNNrl9m2O9J61Q8n4
$$ 36 97 92 68 53 96 128 114 121 127 103 45 -45 -66 -3 63 135 122 -33 -152 -157 -146 -156 -165 -137 -117 -170 -177 -82 -27 -31 -26 -21 -30 -69 -111 -42 119 207 153
-197A53j46j57m2J38J53j3j06l5L6l0j18m7N6O3Q8M3j24j09J01J74R0Jl3l2l6l2j0K7N2J5
$$ 153 7 -150 -192 -54 99 86 -20 -55 -19 -49 -167 -214 -158 -95 -7 36 -88 -197 -96 78 168 169 136 104 68 36 26 53 105 120
-206A20K3N8l6n0M2q7j40J08J69K0l5j31j77m2Mj6N4L8k7O9J27rr2p6p0M3J37qq7N2Q2l5p3
$$ 120 143 201 165 115 157 70 -70 38 207 227 192 61 -116 -158 -154 -170 -116 -78 -105 -36 91 82 -10 -86 -156 -113 24 16 -71 -19 63 28 -45
-215d5L5R9l8j11%L2L4P1pl1M7L9n4j36k5J51mj14R6Q6n2J7K1k8l2q0KP7l2l0M4N0R8Q3j1
$$ -45 -10 89 51 -60 -60 -28 6 77 70 39 86 125 71 -65 -90 61 57 -57 39 125 73 90 111 83 51 -29 -27 50 18 -12 32 82 180 263 252
-225B52j01j74o6Q9Mp9OJ05J00m8j37m2K6L9M2l7q2l1RM9R4R1Nn0M1J9j54q9L6o8q2K5N5P9
$$ 252 151 -23 -89 0 4 -75 -69 36 136 88 -49 -91 -65 -26 16 -21 -103 -134 -125 -76 18 109 114 64 105 124 -30 -119 -83 -151 -233 -208 -153 -74
-234g4K6o3J8N9j0M3P8l0p6l4J9Q5Q2j4q3o3KRp6p2N8Q0j2l5K3N6K3NK7k1m8K2Km9l9o2K2
$$ -74 -48 -111 -93 -34 -44 -1 77 47 -29 -63 -44 41 123 109 26 -37 -35 -26 -102 -174 -116 -36 -48 -83 -60 -4 19 24 51 30 -18 4 6 -43 -82 -144 -122
-245a22J12j1%J30Qq8j2K6N6k1q1Q8R0o9k1m2j02N4O2o5m8o1r4OJ14J35M3n8m4l7KQ1np7K6
$$ -122 -10 -21 -21 109 117 29 17 43 99 78 -3 85 175 106 85 43 -59 -5 57 -8 -56 -117 -211 -205 -91 44 87 29 -15 -52 -50 31 26 -51 -25
-254b5M1m2o5o8n9pN3N5m2m6Q3M5r7l5R2P5K4K2J1o4r9j2L0k9J6J02O2L4M9Ok2m0l0P5O1n9
$$ -25 16 -26 -91 -159 -218 -225 -172 -117 -159 -205 -122 -77 -174 -209 -117 -42 -18 4 15 -49 -148 -160 -130 -159 -143 -41 21 55 104 110 88 48 18 93 154 95
-265I5kJ6j39j28J7P8J03O7j6o0o4L3J04Kj2M0q4j15K9j1r6M8J16j7l6Mp4m7P1L8M0R9l2j20
$$ 95 93 109 -30 -158 -141 -63 40 107 91 31 -33 0 104 106 94 134 50 -65 -36 -47 -143 -95 21 4 -32 -28 -102 -149 -78 -40 0 99 67 -53
-274e3j8J9j9n7m8P4P3k7N7O9r2o9%k0P4R5k1K9Q1k9o3n8r9lJ20J07J00K8j86k05qM8j4k2
$$ -53 -71 -52 -71 -128 -176 -102 -29 -56 1 70 -22 -91 -91 -111 -37 58 37 66 147 118 55 -3 -102 -105 15 122 222 250 64 -141 -149 -101 -115 -137
-284a37k5K4J12Q8Qn1j11m9Q2L2q6k0Q8J0j11j9J00j8j04J8L6j8O4O3n2m6OJ7L8K3L2N2k8
$$ -137 -162 -138 -26 62 70 19 -92 -141 -59 -27 -113 -133 -45 -35 -146 -165 -65 -83 -187 -169 -133 -151 -87 -24 -76 -122 -116 -99 -61 -38 -6 46 18
-293A8o8j7l1m3Mlj8N0R0km6J03J40l0l4J8j26j00J14Q8p6j02k9Q4J17J6r4j30p5J6M7R3J49
$$ 18 -50 -67 -98 -141 -137 -140 -158 -108 -18 -20 -66 37 177 147 113 131 5 -95 19 107 31 -71 -100 -16 101 117 23 -107 -182 -166 -119 -26 123
-302A23N7r3j38j07M6K06R5q3n7n0p7Nj5j5J32L4j22NLr9K3O5N3J13K4K0N9j60j21J48L7p8
$$ 123 180 87 -51 -158 -112 94 189 106 49 -1 -78 -73 -88 -103 29 63 -59 -54 -51 -150 -127 -62 -9 104 128 148 207 47 -74 74 111 33
-311C3Kl3L6N2j55n4J20m2m1Q2k2n1k9j01j2P3j4pN1L0Mn2m4N2K6j3O3L8o4l9J9K4M3L1l2
$$ 33 35 2 38 90 -65 -119 1 -41 -82 0 -22 -73 -102 -203 -215 -142 -156 -163 -112 -82 -78 -130 -174 -122 -96 -109 -46 -8 -72 -111 -92 -68 -25 6 -26
-321b6J6J51O5r2J8N2j46r6J27J11l7j26q8K8M2M9J06J7r1j02q4P4J69Rq7n9o4n5p9p3L1L0
$$ -26 -10 141 206 114 132 184 38 -58 69 180 143 17 -71 -43 -1 48 154 171 80 -22 -106 -32 137 146 59 0 -64 -119 -198 -271 -240 -210
-330b10J0P0Ll7O9R7M3m8j06NO4j2L2J07N5j1p3q2M8J31J2j11q2m9m6Oj2n6K4N0JM8O0J5O
$$ -210 -200 -130 -127 -164 -95 2 45 -3 -109 -104 -40 -52 -20 87 142 131 58 -24 24 155 167 56 -26 -75 -121 -115 -127 -183 -159 -109 -108 -60 0 15 21
-340B1l9qP6J8pM5jJ6O8j9n5l6q0l0L2m5m9L9L3K1N9K2k2K3L3k5k9OKNM7M4l8p6m0m1LR4K6
$$ 21 -18 -26 50 68 61 106 105 121 189 170 115 79 -1 -31 1 -44 -93 -54 -21 0 59 81 59 82 115 90 61 67 69 74 121 165 127 51 11 -30 -27 67 93
-351I3k1Q6J4j30m4rp4N3J51K1n8j0l6o5J8K3n0J4P9k4n2M7P5J2m3l1J1K4J7m8j04j6L9j7
$$ 93 72 158 172 42 -2 -11 -85 -32 119 140 82 72 36 -29 -11 12 -38 -24 55 31 -21 26 101 113 70 39 50 74 91 43 -61 -77 -38 -55
-360e5J0J5q6o0P8J07Oo4LNj40q8J49J80L6k7n9j13n1J8o4j9J26j1r0J07N5j02L3R8ol2n4
$$ -55 -45 -30 -116 -176 -98 9 15 -49 -46 -41 -181 -269 -120 60 96 69 10 -103 -154 -136 -200 -219 -93 -104 -194 -87 -32 -134 -101 -3 -9 -41 -95
-369i5m1P5J41R5k7o9k3o7o5L5Nj8L0ON4J37J6j59j75%J23l1r8O9O1n3k3N2R4Nq6P5J50l8
$$ -95 -136 -61 80 175 148 79 56 -11 -76 -41 -36 -54 -24 -18 36 173 189 30 -145 -145 -22 -53 -151 -82 -21 -74 -97 -45 49 54 -32 43 193 155
-379A55p7J1Q%j5j6J7RM1O4m6j08o7p1p8k6N9J09M6jN4L5m9OQ4Rk4L8l7j32o3nK6J10J13J03
$$ 155 78 89 97 97 82 66 83 92 133 197 151 43 -24 -95 -173 -199 -140 -31 15 14 68 103 54 60 144 153 129 167 130 -2 -65 -70 -44 66 179 282
-389B82P2j31j87K7J13M7n4j47m2O0l8n3J2J6M5L5L1P6n5j30K9Oj13L5J38kp4J7M2p2o6Q4
$$ 282 354 223 36 63 176 223 169 22 -20 40 2 -51 -39 -23 22 57 88 164 109 -21 8 14 -99 -64 74 72 -2 15 57 -15 -81 3
-398CQ2l0m5m1%P9K0p3j4M3m2q9J1N5K6O7L1n5j5m8j07L7O7l9L4P0J0L2LpO0k8q2M8P1J1l
$$ 3 85 55 10 -31 -31 48 68 -5 -19 24 -18 -107 -96 -41 -15 52 83 28 13 -35 -142 -105 -38 -77 -43 27 37 69 72 65 125 97 15 63 134 145 142
-408A42p8j01%L0m0k5O1Jr3K7R3l4l4M2K2mn2j6J38P0o9L7P5o7j01pN6qn3L3Lr2k1j5q6JK3
$$ 142 64 -37 -37 -7 -47 -72 -11 -10 -103 -76 17 -17 -51 -9 13 9 -43 -59 79 149 80 117 192 125 24 17 73 65 12 45 48 -44 -65 -80 -166 -165 -142
-419a42m2RK2nO1R1M7j8q9l4O4%n5L3L1r9p8N2M3J4O7M1l3n6l3K3K1oM9M5RN2ko7kj2k4J2
$$ -142 -184 -175 -153 -158 -97 -6 41 23 -66 -100 -36 -36 -91 -58 -27 -126 -204 -152 -109 -95 -28 13 -20 -76 -109 -86 -65 -71 -22 23 32 84 82 15 13 1 -23 -11
-429a1p4p9M0M3M4Q3M6j2q2l2J17K8j03L2Q3m2n5oo9j63o8J14N5m6M3K1q0J1J03P2N3N2N5
$$ -11 -85 -164 -124 -81 -37 46 92 80 -2 -34 83 111 8 40 123 81 26 20 -49 -212 -280 -166 -111 -157 -114 -93 -173 -162 -59 13 66 118 173
-439A73K7p2j50p4Q6Q4RO0K5p8JJ0j14l6J00M1n6l1M4K3m4k8k1lM6k0n0L7J6RJ01P0JK0K8
$$ 173 200 128 -22 -96 -10 74 83 143 168 90 91 101 -13 -49 51 92 36 5 49 72 28 0 -21 -24 22 2 -48 -11 5 14 115 185 186 206 234
-449B34l6j84j72N3R6mqp9j13J3L5j5L1Q1P4Po9l8j2k8P6J46J0r7m3KOQmJ7J3n4J0J07Mn4
$$ 234 198 14 -158 -105 -9 -13 -21 -100 -213 -200 -165 -180 -149 -68 6 13 -56 -94 -106 -134 -58 88 98 1 -42 -40 -34 -26 -30 -13 0 -54 -44 63 67 13
-459A3M0Q0Q9J0j40q6Rm8kQ6J2p0m8J7Nn5M4J16m6j06K8P6K9lj7l1k5L2J5r7j20o1K4R5O3
$$ 13 53 133 222 232 92 6 15 -33 -35 51 63 -7 -55 -38 -33 -88 -44 72 26 -80 -52 24 53 50 33 2 -23 9 24 -73 -193 -254 -230 -135 -72
-468g2O8O2r9p4J36J11k3j00j28J7P9k1K9L4q4l2Nl8M6N1k5K1J2k3N6J5p4L8J03J0kK1l1m5
$$ -72 -4 58 -41 -115 21 132 109 9 -119 -102 -23 -44 -15 19 -65 -97 -92 -130 -84 -33 -58 -37 -25 -48 8 23 -51 -13 90 100 98 119 88 43
-478D3m2m7J3J3n1l3l5m0P4Q9m3j02n4L9N8K6J17J30j7J9Q4l4m4J5l5q3j21n6Q5Qj07%Q8L9
$$ 43 1 -46 -33 -20 -71 -104 -139 -179 -105 -16 -59 -161 -215 -176 -118 -92 25 155 138 157 241 207 163 178 143 60 -61 -117 -32 -24 -131 -131 -43 -4
-488do6j05O1J56J0l3J7j7M5Q9j9j4K7j01j00J3p5j02O9L9q5NRj14j4J37R1J1oL4Q8M7lK0
$$ -4 -70 -175 -114 42 52 19 36 19 64 153 134 120 147 46 -54 -41 -116 -218 -149 -110 -195 -190 -181 -295 -309 -172 -81 -70 -76 -42 46 93 90 110
-497A10rl2L7K2o3j1M5n0p3K1po3L4O1j2RL4l6r0o5O4J54K9q8l1J1L5J8q0k2R3l6q7P8P6q
$$ 110 101 69 106 128 65 54 99 49 -24 -3 -10 -73 -39 22 10 19 53 17 -73 -138 -74 80 109 21 -10 1 36 54 -26 -48 45 9 -78 0 76 68
-507F8Qm0o7j0j2L2R9J5n9n2o6KP8M1L1j6j52j09O1O0j7m0n0J1N0j9L0J21Kq4KM7O4Q3N0M8
$$ 68 76 36 -31 -41 -53 -21 78 93 34 -18 -84 -82 -4 37 68 52 -100 -209 -148 -88 -105 -145 -195 -184 -134 -153 -123 -2 0 -84 -82 -35 29 112 162 210
-517B10j9j31n2J9n1OO2o5r7M5J51J11m4j04k0J7qm2r1p6QJ02J20Op3k9k1j9L6O0O1%j09j08
$$ 210 191 60 8 27 -24 -18 44 -21 -118 -73 78 189 145 41 21 38 30 -12 -103 -179 -171 -69 51 57 -16 -45 -66 -85 -49 11 72 72 -37 -145
-527a45k4L6M3j9l8j4m9K7J52M9qR6k9j80m5J5k7P5M3r1OQ2J1M7M6o6l8N5O9K0o3o0j3k4K7
$$ -145 -169 -133 -90 -109 -147 -161 -210 -183 -31 18 10 106 77 -103 -148 -133 -160 -85 -42 -133 -127 -45 -34 13 59 -7 -45 10 79 99 36 -24 -37 -61 -34
-537c4Q4N8K0r3j30M2O0p2k9O8O9lj03o2J7K3O7J0p8L4P5K7Q4J9q8l1k2j2Q1K5j02j05J5J31
$$ -34 50 108 128 35 -95 -53 7 -65 -94 -26 43 40 -63 -125 -108 -85 -18 -8 -86 -52 23 50 134 153 65 34 12 0 81 106 4 -101 -86 45
-546D5K1j39j1J54O8q4j20q7p9n9O2J72J21k5o9jjmP9K9q7q5o1P6J89kp8N0n6j19J7k6p6J3
$$ 45 66 -73 -84 70 138 54 -66 -153 -232 -291 -229 -57 64 39 -30 -31 -32 -36 43 72 -15 -100 -161 -85 104 102 24 74 18 -101 -84 -110 -186 -173
-556a73J7N7J22K3n6l9l9nN0M2J8J3j3o3m8N6N7n9n1M4ko0kK1J3K1j0P1J76J2j14K4J5p4J8
$$ -173 -156 -99 23 46 -10 -49 -88 -93 -43 -1 17 30 17 -46 -94 -38 19 -40 -91 -47 -49 -109 -111 -90 -77 -56 -66 5 181 193 79 103 118 44 62
-565F2oj02ON6m1j1N0l0n6J9koJ05P8l8K2Q0j4n3LN4M8j2p6j31o7P8N9qM3l2j36k9O6L6mk2
$$ 62 56 -46 -40 16 -25 -36 14 -16 -72 -53 -55 -61 44 122 84 106 186 172 119 122 176 224 212 136 5 -62 16 75 67 110 78 -58 -87 -21 15 11 -11
-576a1K5Q2Q1M7p3j29j3M5mk8k2K1K5m1o6l7L0L1m9J3N7o0NJ02J0J9J4j54j27N7J28N0q3m6
$$ -11 14 96 177 224 151 22 9 54 50 22 0 21 46 5 -61 -98 -68 -37 -86 -73 -16 -76 -71 31 41 60 74 -80 -207 -150 -22 28 -55 -101
-585a01M2k6PR2K6j4k6j1Q2K1o1j3p3q1J7j7K7J17L0N0J32Jr8k0N9j4j69r3J20J16J4o0j31
$$ -101 -59 -85 -78 14 40 26 0 -11 71 92 31 18 -55 -136 -119 -136 -109 8 38 88 220 221 123 103 162 148 -21 -114 6 122 136 76 -55
-595e5o1M0ll5lJ3R%K5M3K7M4%j08q6J8J8l6j1Q5J24R7N1m2p7j4j7m2o2j32k6J69O7q8l3p
$$ -55 -116 -76 -79 -114 -117 -104 -95 -95 -70 -27 0 44 44 -64 -150 -132 -114 -150 -161 -76 48 145 196 154 77 63 46 4 -58 -190 -216 -47 20 -68 -101 -108
-605a08j6Q6J26Jp6N2J52K9p2o0o9J1O3j00j60k3L1M2O6J3J0Q2N3o1p1N3R7jm1k8o2o0m6l4
$$ -108 -124 -38 88 89 13 65 217 246 174 114 45 56 119 19 -141 -164 -133 -91 -25 -12 -2 80 133 72 1 54 151 150 109 81 19 -41 -87 -121
-614a21Pj2OJ04L1m8M5pj26l0Nn6L3R4O6O2n9j66pR0l3l3O2J3m1qLj0l3l9O4J34L0p7n2Pl7
$$ -121 -114 -126 -120 -16 15 -33 12 5 -121 -151 -146 -202 -169 -75 -9 53 -6 -172 -179 -89 -122 -155 -93 -80 -121 -129 -126 -136 -169 -208 -144 -10 20 -57 -109 -102 -139
-625a39j04K1J53K0p1M2L1l9M9L9j00p3N6M6p4q8J00K35O7j31p4J2K7Q8M7q7p2m5p3M4O5j47
$$ -139 -243 -222 -69 -49 -120 -78 -47 -86 -37 2 -98 -171 -115 -69 -143 -231 -131 104 171 40 -34 -22 5 93 140 53 -19 -64 -137 -93 -28 -175
-634a75j52P8J45P5M4Ok8lMj1L1K6j04j01O8Q8m4j02n6L6R0P3L3l4o2K4N5k9m1L4N7K4rrL4
$$ -175 -327 -249 -104 -29 15 21 -7 -10 -6 -17 14 40 -64 -165 -97 -9 -53 -155 -211 -175 -85 -12 21 -13 -75 -51 4 -25 -66 -32 25 49 40 31 65
-643F5M6k4l7J4m8q0K3Op3J6P6Rm3j5Q1L9j06MJ03o7p8L2m3o3J0L9L4o8n1J40J04k0K2ljJ33
$$ 65 111 87 50 64 16 -64 -41 -35 -108 -92 -16 -7 -50 -65 16 55 -51 -47 56 -11 -89 -57 -100 -163 -153 -114 -80 -148 -199 -59 45 25 47 44 43 176
-654A76O8j14j13l0OQQ%j5N8J07l5q1L6pn9O1N0j8P3J8j69r8O7J8r0p0K3N0k9m6L3N4M5O0
$$ 176 244 130 17 -13 -7 1 9 9 -6 52 159 124 43 79 72 13 74 124 106 179 197 28 -70 -3 15 -75 -145 -122 -72 -101 -147 -114 -60 -15 45
-663D5J0n0j3M7M8j5j7M6n3j80l2J53R8rk2J7J8o8o0M8J6n9L0Q0k6q1nL5m8o5Q1J28pp5J3
$$ 45 55 5 -8 39 87 72 55 101 48 -132 -164 -11 87 78 56 73 91 23 -37 11 27 -32 -2 78 52 -29 -34 1 -47 -112 -31 97 90 15 28
-673B8N8k7m6O1M8n2l7j8%Q6L4o3K4O3k5n9o8l7L0K9ml9j6N9j9o7O6J6q1M0L2l6L3J4K8Q0
$$ 28 86 59 13 74 122 70 33 15 15 101 135 72 96 159 134 75 7 -30 0 29 25 -14 -30 29 10 -57 9 25 -56 -16 16 -20 13 27 55 135
$$ [...]
-2547b00
##END=	
##TITLE=	3314#-C-0328
##JCAMP-DX=	6.0	$$ MestReNova 14.1.2-25024
##BLOCK_ID=	3
##DATA TYPE=	NMR PEAK TABLE
##DATA CLASS=	PEAK TABLE
##CROSS REFERENCE=	NMR SPECTRUM: BLOCK_ID=2                                     
##.OBSERVE FREQUENCY=	150.82960270000000946
##.OBSERVE NUCLEUS=	^13C
##NPOINTS=	8
##FIRSTX=	10.141772145555506768
##LASTX=	65.848214383770326208
##XFACTOR=	1
##YFACTOR=	1
##FIRSTY=	5.3981008316880014775
##XUNITS=	PPM
##YUNITS=	ARBITRARY UNITS
##PEAK TABLE=	(XYW..XYW)
10.141772145555506768,5.3981008316880014775,0.010569778780670429502
11.060053787782388568,4.8922028795225971365,0.010569778780670429502
13.003105966833830465,9.1363138806422679039,0.0089921258573636298622
18.332437887870199233,11.066395786149048064,0.010361492843346297235
31.956196958411769771,6.0236478404440259027,0.010137939725425542878
31.996860886608089913,5.7919052714554926098,0.010701870958250545365
65.808987032399315353,4.3245270523907883842,0.010569778780670429502
65.848214383770326208,4.5037254013476433201,0.01145165593399053057
##$MNOVA/PEAK_DATA_TABLE=	(T,F,A,ST,SP,APT,APC)
$$ Complementary to PEAK TABLE
$$ T: Type
$$ F: Flags
$$ A: Annotation
$$ ST: Shape Type
$$ SP: Shape Parameter
$$ APT: Attached Peaks Type
$$ APC: Attached Peaks Count
Compound,None,,1,0.2000000000000000111,0,0
Compound,None,,1,0.063235157032524511034,0,0
Compound,None,,1,0.39176521924779467154,0,0
Compound,None,,1,0.15481122483343806584,0,0
Compound,None,,1,-0.014792878520563407241,0,0
Compound,None,,1,0.12665327558705719024,0,0
Compound,None,,1,0.10215470085324324101,0,0
Compound,None,,1,0.046996616876772007165,0,0
##END=	
##END=	
