##TITLE=	3314#-H-0302
Sample code: 3314#
CH3P(=O)(OH)(OBu)
2013-03-02
##JCAMP-DX=	6.0	$$ MestReNova 14.1.2-25024
##DATA TYPE=	LINK
##BLOCK_ID=	1
##BLOCKS=	2    
##ORIGIN=	Mestrelab Research S.L.
##OWNER=	HGL
##$MNOVA/LINK_BLOCK_TYPE=	ITEM	$$ NMR Spectrum
##$MNOVA/ITEM/POLYGON=	(XY..XY)
5835,6336
8208,6336
8208,8722
5835,8722
5835,6336
##$MNOVA/ITEM/Z=	0
##$MNOVA/ITEM/ANGLE=	0
##TITLE=	3314#-H-0302
##JCAMP-DX=	6.0	$$ MestReNova 14.1.2-25024
##BLOCK_ID=	2
##DATA TYPE=	NMR SPECTRUM
##DATA CLASS=	XYDATA
##NUMDIM=	1
##ORIGIN=	Varian
##OWNER=	HGL
##.OBSERVE FREQUENCY=	599.77963079999994989
##.OBSERVE NUCLEUS=	^1H
##.SOLVENT NAME=	d2o
##.PULSE SEQUENCE=	s2pul
##LONGDATE=	2013/03/02 11:33:18.000
##.ACQUISITIONMODE=	SIMULTANEOUS
##$ORIGINAL FORMAT=	Varian
##$MNOVA/SCALES_VERSION=	9
##$PARAMETER FILE=	(datafile, ASCII, h:/%E7%A7%91%E7%A0%94/%E9%A1%B9%E7%9B%AE/C4519/AI%E8%B0%B1%E5%9B%BE%E8%A7%A3%E6%9E%90%E8%BD%AF%E4%BB%B6%E5%BC%80%E5%8F%91%E8%AE%A2%E5%88%B6/%E8%BD%AF%E4%BB%B6%E8%AF%84%E4%BB%B7%E6%B5%8B%E8%AF%95%E6%95%B0%E6%8D%AE/DX%E6%A0%BC%E5%BC%8F%E6%95%B0%E6%8D%AE/Butyl%20methylphosphonate-H.dx, 0)
$$ 
##$PARAMETER FILE=	(header, BASE64, h:/OPCW/NMR-Databases/RICD-NMR-fid_Database/Phosphorus%20compounds/Butyl%20methylphosphonate/3314#-H-0302.fid/fid, 0)
AAAAAQAAAAEAAJnkAAAABAACZ5AAAmesAAAAyQAAAAE=
##$PARAMETER FILE=	(log, ASCII, h:/OPCW/NMR-Databases/RICD-NMR-fid_Database/Phosphorus%20compounds/Butyl%20methylphosphonate/3314#-H-0302.fid/log, 0)
$$ Sat Mar  2 11:31:52 2013: Experiment started
$$ Sat Mar  2 11:33:18 2013: Acquisition complete
##$PARAMETER FILE=	(procpar, ASCII, h:/OPCW/NMR-Databases/RICD-NMR-fid_Database/Phosphorus%20compounds/Butyl%20methylphosphonate/3314#-H-0302.fid/procpar, 0)
$$ dotflag 2 2 8 0 0 4 1 0 1 64
$$ 1 "n"
$$ 2 "n" "y" 
$$ date 2 2 9 0 0 2 1 1 1 64
$$ 1 "Mar  2 2013"
$$ 0 
$$ bs 7 1 32767 0 1 2 1 0 1 64
$$ 1 4 
$$ 0 
$$ ap 2 2 1023 0 0 4 1 6 1 64
$$ 1 "1:SAMPLE:date,solvent,file;1:ACQUISITION:sw:1,at:3,np:0,fb:0,bs(bs):0,ss(ss):0,d1:3,d2(d2):6,nt:0,ct:0;1:TRANSMITTER:tn,sfrq:3,tof:1,tpwr:0,pw:3,p1(p1):3;1:DECOUPLER:dn,dof:1,dm,dmm,dpwr:0,dmf:0;2:SPECIAL:temp:1,gain:0,spin:0,hst:3,pw90:3,alfa:3;2:FLAGS:il,in,dp,hs;2:PROCESSING:lb(lb):2,sb(sb):3,sbs(sb):3,gf(gf):3,gfs(gf):3,awc(awc):3,lsfid(lsfid):0,lsfrq(lsfrq):1,phfid(phfid):1,fn:0;2:DISPLAY:sp:1,wp:1,rfl:1,rfp:1,rp:1,lp:1;2:PLOT:wc:0,sc:0,vs:0,th:0,aig*,dcg*,dmg*;"
$$ 0 
$$ acqstatus 7 1 32767 0 0 2 1 0 1 64
$$ 2 101 0 
$$ 0 
$$ MinSW 2 2 8 0 0 3 1 0 1 64
$$ 1 "off"
$$ 3 "off" "auto" "manual" 
$$ Gmap 2 2 8 0 0 2 1 1 1 64
$$ 1 "lk"
$$ 0 
$$ CARBONnt 7 1 32767 0 0 3 1 1 1 64
$$ 1 0 
$$ 0 
$$ Hprescan 2 2 8 0 0 3 1 0 1 64
$$ 6 "off"
$$ "auto"
$$ "off"
$$ ""
$$ "Complete"
$$ "Complete"
$$ 0 
$$ PROTONnt 7 1 32767 0 0 3 1 1 1 64
$$ 1 0 
$$ 0 
$$ PFGflg 4 2 4 0 0 2 1 16385 1 64
$$ 1 "y"
$$ 0 
$$ acqdim 7 1 32767 0 0 2 1 0 1 64
$$ 1 1 
$$ 0 
$$ acqcycles 1 1 9.99999984307e+17 -9.99999984307e+17 0 2 1 0 1 64
$$ 1 1 
$$ 0 
$$ acqpath 2 2 8 0 0 2 1 0 1 64
$$ 1 ""
$$ 0 
$$ [...]
$$ 0 
$$ wtune 4 2 4 0 0 2 1 0 1 64
$$ 1 "st12"
$$ 11 "s" "t" "e" "i" "n" "o" "v" "1" "2" "3" "4" 
$$ wtfile 2 2 15 0 0 3 1 1 1 64
$$ 1 ""
$$ 0 
$$ wshim 4 2 4 0 0 2 1 1 1 64
$$ 1 "n"
$$ 15 "e" "f" "g" "n" "s" "0" "1" "2" "3" "4" "5" "6" "7" "8" "9" 
$$ wtfile1 2 2 15 0 0 3 2 1 1 64
$$ 1 ""
$$ 0 
$$ x2y2 7 1 19 19 19 2 1 8192 1 64
$$ 1 2429 
$$ 0 
$$ x1 7 1 19 19 19 2 1 8192 1 64
$$ 1 4083 
$$ 0 
$$ x3 7 1 19 19 19 2 1 8192 1 64
$$ 1 7604 
$$ 0 
$$ y1 7 1 19 19 19 2 1 8192 1 64
$$ 1 -7073 
$$ 0 
$$ xz 7 1 19 19 19 2 1 8192 1 64
$$ 1 8498 
$$ 0 
$$ xy 7 1 19 19 19 2 1 8192 1 64
$$ 1 -1791 
$$ 0 
$$ xz2 7 1 19 19 19 2 1 8192 1 64
$$ 1 -2031 
$$ 0 
$$ y4 7 1 19 19 19 2 1 8192 1 64
$$ 1 0 
$$ 0 
$$ y3 7 1 19 19 19 2 1 8192 1 64
$$ 1 -7490 
$$ 0 
$$ yz 7 1 19 19 19 2 1 8192 1 64
$$ 1 6297 
$$ 0 
$$ z3xy 7 1 19 19 19 2 1 8192 1 64
$$ 1 0 
$$ 0 
$$ z2xy 7 1 19 19 19 2 1 8192 1 64
$$ 1 -2942 
$$ 0 
$$ z2 7 1 19 19 19 2 1 8192 1 64
$$ 1 -7650 
$$ 0 
$$ z1 7 1 19 19 19 2 1 8192 1 64
$$ 1 20265 
$$ 0 
$$ z0_ 1 1 19 19 19 2 1 73744 1 64
$$ 1 -6520 
$$ 0 
$$ z1c 7 1 19 19 19 2 1 8192 1 64
$$ 1 0 
$$ 0 
$$ z2x2y2 7 1 19 19 19 2 1 8192 1 64
$$ 1 -1183 
$$ 0 
$$ z2c 7 1 19 19 19 2 1 8192 1 64
$$ 1 0 
$$ 0 
$$ z2x3 7 1 19 19 19 2 1 8192 1 64
$$ 1 0 
$$ 0 
$$ z3x 7 1 19 19 19 2 1 8192 1 64
$$ 1 -808 
$$ 0 
$$ z3 7 1 19 19 19 2 1 8192 1 64
$$ 1 17211 
$$ 0 
$$ z2y3 7 1 19 19 19 2 1 8192 1 64
$$ 1 0 
$$ 0 
$$ z3c 7 1 19 19 19 2 1 8192 1 64
$$ 1 0 
$$ 0 
$$ z3x3 7 1 19 19 19 2 1 8192 1 64
$$ 1 0 
$$ 0 
$$ z3x2y2 7 1 19 19 19 2 1 8192 1 64
$$ 1 0 
$$ 0 
$$ z4y 7 1 19 19 19 2 1 8192 1 64
$$ 1 2132 
$$ 0 
$$ z4c 7 1 19 19 19 2 1 8192 1 64
$$ 1 0 
$$ 0 
$$ z3y3 7 1 19 19 19 2 1 8192 1 64
$$ 1 0 
$$ 0 
$$ z3y 7 1 19 19 19 2 1 8192 1 64
$$ 1 973 
$$ 0 
$$ z4 7 1 19 19 19 2 1 8192 1 64
$$ 1 -2604 
$$ 0 
$$ z4x2y2 7 1 19 19 19 2 1 8192 1 64
$$ 1 0 
$$ 0 
$$ z4x 7 1 19 19 19 2 1 8192 1 64
$$ 1 -1761 
$$ 0 
$$ z4xy 7 1 19 19 19 2 1 8192 1 64
$$ 1 0 
$$ 0 
$$ z6 7 1 19 19 19 2 1 8192 1 64
$$ 1 -879 
$$ 0 
$$ z5x 7 1 19 19 19 2 1 8192 1 64
$$ 1 0 
$$ 0 
$$ z5 7 1 19 19 19 2 1 8192 1 64
$$ 1 352 
$$ 0 
$$ z5y 7 1 19 19 19 2 1 8192 1 64
$$ 1 0 
$$ 0 
$$ zx2y2 7 1 19 19 19 2 1 8192 1 64
$$ 1 -4048 
$$ 0 
$$ z8 7 1 19 19 19 2 1 8192 1 64
$$ 1 0 
$$ 0 
$$ z7 7 1 19 19 19 2 1 8192 1 64
$$ 1 7469 
$$ 0 
$$ zxy 7 1 19 19 19 2 1 8192 1 64
$$ 1 -2140 
$$ 0 
$$ zx3 7 1 19 19 19 2 1 8192 1 64
$$ 1 -342 
$$ 0 
$$ zy3 7 1 19 19 19 2 1 8192 1 64
$$ 1 -988 
$$ 0 
##$PARAMETER FILE=	(text, ASCII, h:/OPCW/NMR-Databases/RICD-NMR-fid_Database/Phosphorus%20compounds/Butyl%20methylphosphonate/3314#-H-0302.fid/text, 0)
$$ Sample code: 3314#
$$ CH3P(=O)(OH)(OBu)
$$ 2013-03-02
##XUNITS=	HZ
##YUNITS=	ARBITRARY UNITS
##FIRSTX=	8406.3271460399992066
##LASTX=	-1208.9107502243989529
##DELTAX=	-0.14671912560104369283
##XFACTOR=	1
##YFACTOR=	7.9959690465038650911e-06
##FIRSTY=	-0.0017896457575261592865
##MINY=	-0.0038627195172011852264
##MAXY=	29.800436019897460938
##NPOINTS=	65536
##XYDATA=	(X++(Y..Y))
$$ [...]
4428A12r8L4l1j95j45Q7J71L8p9m2L8M4JNM7L2l1j3R4J21K2l5j4k2m6j0K7j7q0n4L4P5J3o4
$$ 112 14 48 17 -178 -323 -236 -65 -27 -106 -148 -110 -66 -65 -60 -13 19 -12 -25 69 190 212 177 163 141 95 85 112 95 15 -39 -5 70 83 19
4423A9l0M9L3l6oO8J7j18j37J1J45J02o1j21k4O6L4j1OJ8j9n2l8K9Q1M6m7n1M5Q1j1q4m4J5
$$ 19 -11 38 71 35 29 97 114 -4 -141 -130 15 117 56 -65 -89 -23 11 0 6 24 5 -47 -85 -56 25 71 24 -27 18 99 88 4 -40 -25
4418b5K0J9M0J0o4n6K6J3r3q3N7J19N3Ook8rM4J9q0j14m3N8J29J35O1pj1ok7l4k6k3JK1mn0
$$ -25 -5 14 54 64 0 -56 -30 -17 -110 -193 -136 -17 36 42 36 8 -1 43 62 -18 -132 -175 -117 12 147 208 201 190 184 157 123 97 74 75 96 92 42
4413D2m5QO5O8Rk2K3M8k9j28j52j36q7K4J18P8l4m9K9N2L5J04J51j2j76m1J79J01j02o1O9
$$ 42 -3 5 70 138 147 125 148 196 167 39 -113 -249 -336 -312 -194 -116 -150 -199 -170 -118 -83 21 172 160 -16 -57 122 223 121 60 129
4408A29Mr0j4P0K8l1n6n1J6J03R1K0k5p5q6QQ5M1%K9J0m9k8K3jn1o1n0k7J0K8K9K3mj9J7M9
$$ 129 133 43 29 99 127 96 40 -11 5 108 199 219 194 119 33 41 126 167 167 196 206 157 129 152 151 100 39 -11 -38 -28 0 29 52 48 29 46 95
4403I5L1J1mk3pOp6j36k6J01M0o5l4O8Q5Kr6o4J05J59qj40j00o2o0K2Q8J7l8J8K8k8LN3Jl8
$$ 95 126 137 133 110 103 109 33 -103 -129 -28 12 -53 -87 -19 66 68 -28 -92 13 172 164 24 -76 -138 -198 -176 -88 -71 -109 -91 -63 -91 -88 -35 -34 -72
4397g2M4J12O0j1l0m8o8n8k5K0P9J11N2m6n9mQk3k0QJ6K8L2j7m4K7O1m4j06kR3N0MN1O5k6
$$ -72 -28 84 144 133 103 55 -13 -71 -96 -76 3 114 166 120 61 57 65 42 22 30 46 74 106 89 45 72 133 89 -17 -19 74 124 128 179 244 218
4392B18j02n6M3M3o0j09rJ13Q6o0j31l6R6Q7l1o6%J8k3RR8R5Jo1n9n4n0RR2P6k3j9P1M6n1
$$ 218 116 60 103 146 86 -23 -32 81 167 107 -24 -60 36 123 92 26 26 44 21 30 128 223 224 163 104 50 0 9 101 177 154 135 206 252 201
4387B01NJ18K7j44j21J9Q0N0j7n9J6R9j3j43k0J39L2j52j34k2K3L8O6Q5R4N5l9q2l7QK0Nl8
$$ 201 206 324 351 207 86 105 185 235 218 159 175 274 261 118 98 237 269 117 -17 -39 -16 22 88 173 267 322 283 201 164 172 192 197 159
4382A59l9M7Q1jm3K9O5Ko0n3J6N3j5n8O7J79Q9l6l4j1j0N3Q6Qn7o5q0l6M9K2k3J21K44R2j03
$$ 159 120 167 248 247 204 233 298 300 240 187 203 256 241 183 250 429 518 482 448 437 427 480 566 574 517 452 372 336 385 407 384 505 749 841 738
4377G38p2M6Q9N7j6n3J8N7qk2K9K0L2J31J12j1J5J03M1l1pl0l3J12J58K7N0J70N4q0Q7K12
$$ 738 666 712 801 858 842 789 807 864 856 834 863 883 915 1046 1158 1147 1162 1265 1306 1275 1268 1238 1205 1317 1475 1502 1552 1722 1776 1696 1783 1995
4372A995M1l9J23J95J22J34J70J08P4J15J12O6O5J25K17K56J88J44K70M23L92K58K51L54L90
$$ 1995 2036 1997 2120 2315 2437 2571 2741 2849 2923 3038 3150 3216 3281 3406 3623 3879 4067 4211 4481 4904 5296 5554 5805 6159 6549
4369F549L35L60M84N11M57N66P93Q45P50P51Q08Q51R85J178J329J579J995K403K884L571M207
$$ 6549 6884 7244 7728 8239 8696 9262 10055 10900 11650 12401 13209 14060 15045 16223 17552 19131 21126 23529 26413 29984 34191
4366C4191M718N449O307O951P785R269J0853J1879J2316J2077J1233J0655J0743J0643R978
$$ 34191 38909 44358 50665 57616 65401 74670 85523 97402 109718 121795 133028 143683 154426 165069 175047
4363A75047R544R691R838R361P687M778K012O55nj138k527l831n515p566r366j0692j1305
$$ 175047 184591 194282 204120 213481 221168 225946 227958 228613 228608 227470 224943 221112 215597 208031 198665 187973 176668
4361A76668j0778r688r165r253r437r825j0380j0497j0140r813r500q926q196p318o194n139
$$ 176668 165890 156202 147037 137784 128347 118522 108142 97645 87505 77692 68192 59266 51070 43752 37558 32419
4358C2419m421l814l214k758k327j845j584j516j291r80q56p45n13m25n07m75l55l22l07k78
$$ 32419 27998 24184 20970 18212 15885 14040 12456 10940 9649 8669 7813 7068 6555 6130 5623 5148 4793 4471 4164 3886
4356C886l08k74j37j66l45l10j05q2j49l9Q0k0j63j78j40r3k4j5o8o7okn8q4n7j9k6o2m1M5
$$ 3886 3578 3304 3167 3001 2656 2346 2241 2159 2010 1971 2051 2031 1868 1690 1550 1457 1433 1418 1350 1283 1277 1275 1217 1133 1076 1057 1031 969 928 973
4351I73L8p1r0rno0m5l7p7k8O9K6n8j1K3l9L1J71N3j75j06R0K3j42r1L8N2N5Q8L2q2r9k3L3
$$ 973 1011 940 850 841 836 776 731 694 617 589 658 684 626 615 638 599 630 801 854 679 573 663 686 544 453 491 543 598 686 718 636 537 514 547
4346E47J5l8l0N5R3Qo4j1O3K3q5j15n7l7p1m2N3P7K4pk6n6j9O8O5J2Jn0j32p9L1jm8K3L3m6
$$ 547 562 524 494 549 642 650 586 575 638 661 576 461 404 367 296 254 307 384 408 401 375 319 300 368 433 445 446 396 264 185 216 215 167 190 223 177
4341A77J9J17l7k13p4J26J10M4N8J7m1J9P3J3m6k3MJ9K6jl8n1o3m0K8J2r0o4Q6Q8m8o1L9N1
$$ 177 196 313 276 63 -11 115 225 269 327 344 303 322 395 408 362 339 343 362 388 387 349 298 235 195 223 235 145 81 167 255 207 146 185 236
4336B36NJ2J7k3k8K4N2K8k7p1m9K0M7J2olk9o0m0KJ3PK5N0N7K3n2j08n8M7N1m2m5M4N1l0j5
$$ 236 241 253 270 247 219 243 295 323 296 225 176 196 243 255 249 246 217 157 117 119 132 139 164 214 271 294 242 134 76 123 174 132 87 131 182 152 137
4330A37N3Kq0j8O1jo4kN3L5M2K8j07j64nJ12rr6L1J24Nj00m9K2O3J22J24J3q4o8j1L1O9Q3
$$ 137 190 192 112 94 155 154 90 88 141 176 218 246 139 -25 -30 82 73 -23 8 132 137 37 -12 10 73 195 319 332 248 180 169 200 269 352
4325C52L9k6n1k6Kj0m8n7m7m8l4J1M5O4Q2O4K0J8L0qm2m9q5q8K3Q9J3l5jm6j03mR7N0J3M1
$$ 352 391 365 314 288 290 280 232 175 128 80 46 57 102 166 248 312 332 350 380 372 330 281 196 108 131 220 233 198 197 151 48 44 141 191 204 245
4320B45ll8K8J5j09q9L6K0l6L0P3M5N6kj67j60L4Q4j4k7ql9K1J19O2lO7M0j14r2P9Q8j0%L4
$$ 245 242 204 232 247 138 49 85 105 69 99 172 217 273 271 104 -56 -22 62 48 21 13 -26 -5 114 176 173 240 280 166 74 153 241 231 231 265
4315B65Kqmm0m0QJ7MNk2m1RJ0q2r4J0P8P9N5k4q8mJ02K9r8p7J0K8J7K1j3o9o3oK4MJ0P6J09
$$ 265 267 259 255 215 175 183 200 204 209 187 146 155 165 83 -11 -1 77 156 211 187 99 95 197 226 128 51 61 89 106 127 114 45 -18 -24 0 4 14 90 199
4309A99L2o6o8qMl3l8L4J05O4k8k0L7k5j12k4R1%j35n9J00J05j0o4l4J1L1M1N7M2k0q6q0m
$$ 199 231 165 97 89 93 60 22 56 161 225 197 177 214 189 77 53 144 144 9 -50 50 155 145 81 47 58 89 130 187 229 209 123 43 39
4304C9O6L7q0j20mR4K7n0MM5j4lJ03J05qk7L0j4j11r8j0N0J01J24M0o2j6O6Kr3n9l1q4m7O8
$$ 39 105 142 62 -58 -62 32 59 9 13 58 44 41 144 249 241 214 244 230 119 21 11 61 162 286 326 264 248 314 316 223 164 133 49 2 70
4299G0M2n6mQ9N6K8O5%j17p3P0J22Q4j1j09n7Q1L2j43j42j6J4L7J00K3r7mJ40N6r6o7L9N6
$$ 70 112 56 52 141 197 225 290 290 173 100 170 292 376 365 256 199 280 312 169 27 11 25 62 162 185 88 84 224 280 184 117 156 212
4294B12j4r2q6J2L7m7n7M0R7P7L4l7n1N1Q1l1l3R2P0o6n8L1K2j0j8n9o0L3J01R4N6m1j18m3
$$ 212 198 106 20 32 69 22 -35 5 102 179 213 176 125 176 257 226 193 285 355 289 231 262 284 274 256 197 137 170 271 365 421 380 262 219
4289B19L3m4n5P6O1p1%J26jj30kJ00j0p4NM0K1L5L6L5O4N0lQK3l0k6O6P4k0n9p0j04k5J51
$$ 219 252 208 153 229 290 219 219 345 344 214 212 312 302 228 233 273 294 329 365 400 464 514 511 519 542 512 486 552 626 606 547 477 373 348 499
4284D99J79Lj31p6L7L5m7o2j5m8r9jJ32Q4rM1Q0rp0m4l3j1J6l7n5Q4J21q6j58O0J58Km2Q1
$$ 499 678 681 550 474 511 546 499 437 422 374 275 274 406 490 481 522 602 593 523 479 446 435 451 414 359 443 564 478 320 380 538 540 498 579
4279E79M9j15j33rM7J1j6PK9j6r4j03m7J1R3J61P1j12j46k7M2M3N0K4n6q6l6L2N0j8j03m6
$$ 579 628 513 380 371 418 429 413 420 449 433 339 236 189 200 293 454 525 413 267 240 282 325 375 399 343 257 221 253 303 285 182 136
4275A36R2Q3k7j1O9L7j2K4J6o9q2j3J5kk4m5l6j6n0n1M8Q2nj8N0mp7L6J60J05L4L6m0j30q3
$$ 136 228 311 284 273 342 379 367 391 407 338 256 243 258 256 232 187 151 135 85 34 82 164 159 141 191 187 110 146 306 411 445 481 441 311 228
4269B28n5j24m7J50J35n2p6J5J0KO8L9p9q8j4k6o8oP2M5k5k7K3J4n3m8M2O9MJ6R9M9q9j16
$$ 228 173 49 2 152 287 235 159 174 184 186 254 293 214 126 112 86 18 12 84 129 104 77 100 114 61 13 55 124 128 144 243 292 203 87
4264H7o6n2J1J25P6j05r8P0J18L1Nmo7o1L6N0l5p6m2KM7P8O4M5J1q8j19N1J90L1k09j80L0
$$ 87 21 -31 -20 105 181 76 -22 48 166 197 202 198 131 70 106 156 121 45 3 5 52 130 194 239 250 162 43 94 284 315 106 -74 -44
4260d4J13M1l8n3j9M4P7K9k3nK2k9q5l9J6l3o8O4J75P2n3qK6p3q9J3K5k6L9J10K0q6p7m5l8
$$ -44 69 110 72 19 0 44 121 150 127 122 144 115 30 -9 7 -26 -94 -30 145 217 164 156 182 109 20 33 58 32 71 181 201 115 38 -7 -45
4254d5J4N0J8nPJ2L7N5m1j52r8J9Ok3N5J08Q9J16J31oj40j09m2l3LN0K8J6M9qo9N5J68J6j46
$$ -45 -31 19 37 32 39 51 88 143 102 -50 -148 -129 -123 -146 -91 17 106 222 353 347 207 98 56 23 26 76 104 120 169 161 92 147 315 331 185
4249A85n3K5q7r7M8N7m0RN8p1j07N6J07j5j9M8lj4J18J33k3o4rp3j32J6J66Q8q4j53j19l7
$$ 185 132 157 70 -27 21 78 38 47 105 34 -73 -17 90 75 56 104 101 87 205 338 315 251 242 169 37 53 219 307 223 70 -49 -86
4245h6R5J81J06q1j74p4P0J08R1R2L9o8r4k2K2J9Ml7p6o3k0L8J14R1l9q0J1K2n0m2pl6j3N0
$$ -86 9 190 296 215 41 -33 37 145 236 328 367 299 205 183 205 224 228 191 115 52 32 70 184 275 236 156 167 189 139 97 90 54 41 91
4240I1j8j13m6P2P0L8J5l8m4QJ5K0Q1M8o4j5Q3k3j16K4R0m8n6Q9P1m0k4j0p9n2N4N4nk6m1
$$ 91 73 -40 -86 -14 56 94 109 71 27 35 50 70 151 199 135 120 203 180 64 88 178 130 74 163 234 194 170 160 81 29 83 137 132 106 65
4235F5JR1L8j21r7M8M6l6LN8K2PNm5m3M7P2J5MJn8p6k8k5l9L7R8oj29m9J19J09k2l4M8K1n3
$$ 65 66 157 195 74 -23 25 71 35 38 96 118 125 130 85 42 89 161 176 180 181 123 47 19 -6 -45 -8 90 84 -45 -94 25 134 112 78 126 147 94
4229I4k7J4k9l7J5Rj9K0L2l8m3M9P9J7k2rL2P1M4l6q3r2n1O4J14k9j36m9Ml0P8K00M3j14K8
$$ 94 67 81 52 15 30 39 20 40 72 34 -9 40 119 136 114 105 137 208 252 216 133 41 -10 54 168 139 3 -46 -42 -72 6 206 249 135 163
4224A63J01q9j25Q2J08o0r4j7L7J14Q7j39k14K6J65Lj02lM5JJ5L5k4q1o6k2J7L6L5L3J5rl
$$ 163 264 175 50 132 240 180 86 69 106 220 307 168 -46 -20 145 148 46 43 88 89 104 139 115 34 -32 -54 -37 -1 34 67 82 73 70
4219G0j7o3J0J90J50j53k59l3J21L5j5N7O1j6k5J8Qo1j00m0P2R5pp9k7N2N0j7m1KL2j0k8M1
$$ 70 53 -10 0 190 340 187 -72 -105 16 51 36 93 154 138 113 131 139 78 -22 -62 10 105 98 19 -8 44 94 77 36 38 70 60 32 73
4214G3P4j7p3MO9mj01p2L5N9j5k1R9J34k0j11kQ1j2j17r2j1M9N2k4p6l7J0NK8N0k3r2k3N1
$$ 73 147 130 57 61 130 126 25 -47 -12 47 32 11 110 244 224 113 111 192 180 63 -29 -40 9 61 37 -39 -76 -66 -61 -33 17 -6 -98 -121 -70
4209g0J4oN6O4Mj6%l3p2m3K2N5M7L5M7O5L9l2q2p2l4JJ0k4l3M3J10N1m6m1J7K2K5P1M1o9q1
$$ -70 -56 -62 -6 58 62 46 46 13 -59 -102 -80 -25 22 57 104 169 208 176 94 22 -12 -11 -1 -25 -58 -15 95 146 100 59 76 98 123 194 235 166 85
4204H5L3P1ok4L8N4K2Rj6n9m7j2l6m8N0J35O6n8p0nj7r2o7M0O2mJ1N8j2q3oL8n8o1P4Q5m5
$$ 85 118 189 183 159 197 251 273 282 266 207 160 148 112 64 114 249 315 257 187 182 165 73 6 46 108 104 115 173 161 78 72 110 52 -9 65 150 105
4198A05m8K5m2j11j7Q7L9m0l8K3P8N4m4m9P5J17No2pJ5o2j03k7Q1Q9J2%N6L2n9o7l6o8o1M2
$$ 105 57 82 40 -71 -88 -1 38 -2 -40 -17 61 115 71 22 97 214 219 157 150 165 103 0 -27 54 143 155 155 211 243 184 117 81 13 -48 -6
4193fJ06O7%p3j02rN9o2j91r3P1R9N9K6J7Q8J54M6q1l5j1j40j28R8J42o8j66o5qk3M4J40J11
$$ -6 100 167 167 94 -8 -17 42 -20 -211 -304 -233 -134 -75 -49 -32 56 210 256 175 140 129 -11 -139 -41 101 33 -133 -198 -206 -229 -185 -45 66
4188F6rq8p5k0J7M1L8Jj2L4M4Kql3j31r6J13J36q8j61QP1J0M0L2j07p8J58J98l0j38j1Q4R
$$ 66 57 -31 -106 -126 -109 -68 -30 -29 -41 -7 37 39 31 -2 -133 -229 -116 20 -68 -229 -221 -150 -140 -100 -68 -175 -253 -95 103 73 -65 -76 8 17
4183A7r3o8M3R2N6L5L3K5O2Q0n1j66n2O9k7j18o9o4r2L6J46M4k9P6J22M1J4K2k4o9r2j03o
$$ 17 -76 -144 -101 -9 47 82 115 140 202 282 231 65 13 82 55 -63 -132 -196 -288 -252 -106 -62 -91 -15 107 148 162 184 160 91 -1 -104 -110
4178a10J22O5p1n5J1lM7J49P5j02j41q8n8jN3K9J2P3J04N6Nk8l1K0N1j3r0r4k8P2R7l1j21
$$ -110 12 77 6 -49 -38 -41 6 155 230 128 -13 -101 -159 -160 -107 -78 -66 7 111 167 172 144 113 133 184 171 81 -13 -41 31 128 97 -24
4173b4j0J12P7Ok6q4p4O0R9l5q1K3N2k7n4j0L0K3m1o1N6J68P9p9q9qL5K2j3j1N6P1l5j06o4
$$ -24 -34 78 155 161 135 51 -23 37 136 101 20 43 95 68 14 4 34 57 16 -45 11 179 258 179 90 82 117 139 126 115 171 242 207 101 37
4168C7l2m1mN1O6O7L4o0q5J4O5k4j18j12nJ27J35L1mL1m3j24l5K9o1n4J22J31m9q3M3P4Nk5
$$ 37 5 -36 -40 11 77 144 178 118 33 47 112 88 -30 -142 -147 -20 115 146 142 173 130 6 -29 0 -61 -115 7 138 89 6 49 123 128 103
4163A03j5J0L2j1o3k2K4NJ3L6m7j02JO5m7j05J2R4N9K8Mm4m4k0k4L2J45R8r6j30K5R6K3nK6
$$ 103 88 98 130 119 56 34 58 63 76 112 65 -37 -36 29 -18 -123 -111 -17 42 70 74 30 -14 -34 -58 -26 119 217 121 -9 16 112 135 130 156
4158A56J0m3p0p9o4oL2K0K6M3no2mR4L6j11r7N7P6l0l0N7M3PP8P9p3j02M5M5j02q1M5J6n0
$$ 156 166 123 53 -26 -90 -96 -64 -44 -18 25 20 -42 -46 48 84 -27 -124 -67 9 -21 -51 6 49 56 134 213 140 38 83 128 26 -55 -10 6 -44
4153d4oj1p3K7J52M0j08j8R7K9o1l7J8P2P9ml5M5L9q3r0J4M5N6Q7%r3K7J18m9j74m5O2K3%
$$ -44 -50 -61 -134 -107 45 85 -23 -41 56 85 24 -13 5 77 156 152 117 162 201 118 28 42 87 143 230 230 137 164 282 233 59 14 76 99 99
4148I9j7o5oO1n5j23O4J70J2o7M4N2n9o0jj4j3K3Om0n1l7J1N5Qn9k2L3j7o2k0J5J0L0O5P9
$$ 99 82 17 11 72 17 -106 -42 128 140 73 117 169 110 50 49 35 22 45 51 11 -40 -77 -66 -11 -3 -62 -84 -51 -68 -130 -150 -135 -125 -95 -30 49
4143D9Q5N2k4o5n8m3k0J0J1J9L8l0j02%J39O1r7p0Rk0m2K2O9P3N1l1j03o6QL0N1P4K3l6m9
$$ 49 134 186 162 97 39 -4 -24 -14 -3 16 54 24 -78 -78 61 122 25 -45 -36 -56 -98 -76 -7 66 117 86 -17 -83 -75 -45 6 80 103 67 18
4138A8p4p3M9J63J21L9K5k1j11j07l1oRO7O8k7q7l3N7J02N7k6j9O8L2j47j64O4J92K0j43r1
$$ 18 -56 -129 -80 83 204 243 268 247 136 29 -2 -8 1 68 136 109 22 -11 46 148 205 179 160 228 260 113 -51 13 205 225 82 -9
4133ij7k5J7O9J5j2P1O4o9p4K9Qo8mJ03P0n9j31q2L0K8q7o4Q3O3m6P1J91rj91j7J46K3n1O4
$$ -9 -26 -51 -34 35 50 38 109 173 104 30 59 67 -1 -5 98 168 109 -22 -104 -74 -46 -133 -197 -114 -51 -97 -26 165 156 -35 -52 94 117 66 130
4128A30M3j10p6P2Q5J1mk1m2J2N1m3j50j09J2N1K9L4M6Jp1r8n1N5J33R8Pk2l1j07j08N9J53
$$ 130 173 63 -13 59 144 155 151 130 88 100 151 108 -42 -151 -139 -88 -59 -25 21 22 -49 -147 -198 -143 -10 88 95 73 42 -65 -173 -114 39
4123C9M3o1m4l8k9O0P3n3j04lM0ON7J24N3p1q5j6K9L0Pk0l9j5O8J10K2n7%M0n3r6JM2j6kN2
$$ 39 82 21 -23 -61 -90 -30 43 -10 -114 -117 -77 -71 -14 110 163 92 7 -9 20 50 57 37 -2 -17 51 161 183 126 126 166 113 17 18 60 44 42 94
4117I4Mn7k5QPK2j7j23j23K2J06M5k6l7k5mK6J9k1k5K4N3Lo3n3KL0N3P9M2k0j2L8L8Ll6p1
$$ 94 98 41 16 24 31 53 36 -87 -210 -188 -82 -37 -63 -100 -125 -129 -103 -84 -105 -130 -106 -53 -50 -113 -166 -164 -134 -81 -2 40 20 8 46 84 87 51 -20
4112b0n6nj3l1N2J00J5l1M4L9q3j02j1N6Q6R6L4j6Pk9j17p7M5O4Qnok3lL3M7K9m3r8rQ9j1
$$ -20 -76 -81 -94 -125 -73 27 42 11 55 94 11 -91 -102 -46 40 136 170 154 161 132 15 -62 -17 47 55 50 44 21 18 51 98 127 84 -14 -23 66 55
4107E5j36j2J64J09n4q9l9rpk4j7K2J0j6N9J21K4n7rk3j11o5N0K4JQ4P2p4q2L2K7r2j52r6
$$ 55 -81 -93 71 180 126 37 -2 -11 -18 -42 -59 -37 -27 -43 16 137 161 104 95 72 -39 -104 -54 -30 -29 55 127 53 -29 3 30 -62 -214 -310
4102c10L8J60J44M1PNn3n3O0J20L8n3p8o4j1K3j2k2L6L4n7o1L6N1j7l0nl1k8P0J19J4j14j16
$$ -310 -272 -112 32 73 80 85 32 -21 39 159 197 144 66 2 -9 14 2 -20 16 50 -7 -68 -32 19 2 -28 -33 -64 -92 -22 97 111 -3 -119
4097a19k1O6R0N4j1l4j2j0j4J1K5J7P8J55N1j65k02o0J2l9n2%J5JK7Q3O7o0j66p5J10J49N7
$$ -119 -140 -74 16 70 59 25 13 3 -11 0 25 42 120 275 326 161 -41 -101 -89 -128 -180 -180 -165 -164 -137 -54 13 -47 -213 -288 -178 -29 28
4092B8Pj6q2r4J1J02P6nm1J8J16P8r5j88j05lJ9K0J9Jj8j0K5M9J2n3k6O0N6j9l3l8q6k5J36
$$ 28 35 19 -63 -157 -146 -44 32 27 -14 4 120 198 103 -85 -190 -193 -174 -154 -135 -134 -152 -162 -137 -88 -76 -129 -155 -95 -39 -58 -91 -129 -215 -240 -104
4087a04J43j2q4l0K9P2Q1m6j74r3P7O6m7j3J11J00l1r1l8K4O6J22P9j11k17q4O4L4pL7J3o4
$$ -104 39 27 -57 -87 -58 14 95 49 -125 -218 -141 -75 -122 -135 -24 76 45 -46 -84 -60 6 128 207 96 -121 -205 -141 -107 -114 -77 -64 -128
4082a28nJ16Q5m0p3k0Mm2p6qQ8M6p1l7J03J07Nl3qJ9N3M0m7r0n9n9p5OJ38J77Q8p3j54n2P2
$$ -128 -133 -17 68 28 -45 -65 -61 -103 -179 -187 -99 -53 -124 -161 -58 49 54 21 13 32 85 125 78 -12 -71 -130 -205 -199 -61 116 204 131 -23 -75 -3
4077cK1p0j8O4L7MJ4lk0nk4n8k3K3J2K1M2K1K8N0m8j46l6J23P8m1m6m0n6QQ4N8Rk0n1k9N7
$$ -3 18 -52 -70 -6 31 35 49 46 26 21 -3 -61 -84 -61 -49 -28 14 35 63 113 65 -81 -117 6 84 43 -3 -43 -99 -91 -7 51 60 40 -11 -40 17
4071A7P1pm7k9nM6O0k3p9l0mk1J5M2nk8KolM7J0r3m7Q4L6r9p0O3Q4J5J2R0Q7l8r3J3L9j02
$$ 17 88 81 34 5 0 46 106 83 4 -26 -30 -51 -36 6 1 -27 -25 -31 -34 13 23 -70 -117 -33 3 -96 -166 -103 -19 -4 8 98 185 147 54 67 106 4
4066Dj02Q4P9j15j19K6Mp0j5%l9O5J69P3J2J09R1n9q0k4n7l2Q6O0j01j45o1J6N7L1n4k8J08
$$ 4 -98 -14 65 -50 -169 -143 -139 -209 -224 -224 -263 -198 -29 44 56 165 256 197 117 93 36 4 90 150 49 -96 -157 -141 -84 -53 -107 -135 -27
4061b7J21Om8n6r1m2O3N4K7J23J41m2j44m3J2m6k1O3N7K8O4N2l3l8J1k8r6m8L4K0k3qNl6o2
$$ -27 94 100 52 -4 -95 -137 -74 -20 7 130 271 229 85 42 54 8 -13 50 107 135 199 251 218 180 191 163 67 19 53 73 50 42 47 11 -51
4056e1l3K3N8O7N2Po3j12p7J1K9k2k1K1J0%O5J03N0mJ2L8K7pl8oL3l1q8RQ5k7q6L6N1q7m9
$$ -51 -84 -61 -3 64 116 123 60 -52 -129 -118 -89 -111 -132 -111 -101 -101 -36 67 117 113 125 163 190 183 145 139 172 141 53 62 147 120 34 70 121 34 -15
4050a5P9nj15J3J16qp6J9L5k5K3Q0J6m7l1LM8O7k0j05n5J7RKK7Nk9k1m0j02r6RJ30J43jj32
$$ -15 64 59 -56 -43 73 65 -11 8 43 18 41 121 137 90 59 62 110 177 157 52 -3 14 23 25 52 57 28 7 -33 -135 -231 -222 -92 51 50 -82
4045h2m8R9N8k8J7K7p3m7O8j8j67n7J36J16K4ko0r3M5J62M9j08p0M3O4K9K3M4L2m2j23j32
$$ -82 -130 -31 27 -1 16 43 -30 -77 -9 -27 -194 -251 -115 1 25 23 -37 -130 -85 77 126 18 -52 -9 55 84 107 151 183 141 18 -114
4040a14m1Q8J19kj07k6Q8K1n5N8J42Jj09k0K3o5o0L5Pr4p5J7M8L3Kl2j3P0J07M2o2r1k8L7
$$ -114 -155 -67 52 50 -57 -83 5 26 -29 29 171 172 63 43 66 1 -59 -24 -17 -111 -186 -169 -121 -88 -86 -118 -131 -61 46 88 26 -65 -93 -56
4035e6J0l5J8O4Jn1lJp4m4N9L3l0M9R8j4o2M7O4n0m4M9J4n8%M4j7j5M7lo2M0J13j8q5N5Q0
$$ -56 -46 -81 -63 1 2 -49 -52 -51 -125 -169 -110 -77 -107 -58 40 26 -36 11 75 25 -19 30 44 -14 -14 30 13 -2 45 42 -20 20 133 115 30 85 165
4030A65j11j67JQ5j1p0l8k5OR6J21L7l9k6J3ko5r8k4O8M0m5k6L2nm7L1J01K8o4n0LLk0nL4
$$ 165 54 -113 -112 -27 -38 -108 -146 -171 -165 -69 52 89 50 24 37 35 -30 -128 -152 -84 -44 -89 -115 -83 -88 -135 -104 -3 25 -39 -89 -86 -83 -103 -108 -74
4025g4M0pm5j4K9J5%M0N3j3o9m4M8J38J21n7k08j13R1R3k3l2kq6j20L8J66Q5rPk0j17q1P6
$$ -74 -34 -41 -86 -100 -71 -56 -56 -16 37 24 -45 -89 -41 97 218 161 -47 -160 -69 24 1 -31 -33 -119 -239 -201 -35 50 41 48 28 -89 -170 -94
4020i4J01ll0J1j4m0J7O1L3jl7p4j2J22J31kp2l8RM3M4k9q6l1K0J1L3M8m5j14m3K5jJ5P0K5
$$ -94 7 4 -26 -15 -29 -69 -52 9 42 41 4 -70 -82 40 171 169 97 59 68 111 155 126 40 9 29 40 73 121 76 -38 -81 -56 -57 -42 28 53
4014E3n2m7l7l8M5J00nj02k4M0m8o5Q8J59N3k3K6J7q9j00RO9K8j9m9m3N6J22k1j57l2J05r
$$ 53 1 -46 -83 -121 -76 24 19 -83 -107 -67 -115 -180 -92 67 120 97 123 140 51 -49 -40 29 57 38 -11 -54 2 124 103 -54 -86 19 10
4010A0p7Q1J10j04j54PN5J5Q4J03j6m4K1k8q2rK8m9p0kL8N5N6K7K2K0p2j05M2R7o0j20K7Q3
$$ 10 -67 14 124 20 -134 -127 -72 -57 27 130 114 70 91 63 -19 -28 0 -49 -119 -121 -83 -28 28 55 77 97 25 -80 -38 59 -1 -121 -94 -11
4005a1K5M2K4q6n9N2lq0K1N8n8n2Q0P5PL2J8o4l5L9Pl9mJ8mm0q5l7J08Q3j23j48O1J42O0O4
$$ -11 14 56 80 -6 -65 -13 -16 -96 -75 -17 -75 -127 -47 28 35 67 85 21 -14 25 32 -7 -11 7 3 -37 -122 -159 -51 32 -91 -239 -178 -36 24 88
3999H8O2n7r3J4L1l7k0K2J1Kj8n1RR2J3r3j1R1K8l0J8Lq1r3l6J0N0M4J3N2J04K3p0m4m0r7
$$ 88 150 93 0 14 45 8 -12 10 21 23 5 -46 -37 55 68 -25 -36 55 83 53 71 74 -7 -100 -136 -126 -76 -32 -19 33 137 160 90 46 6 -91
3994i1m9M9J7k3P6R3m1p3M6R5K5l8r8j35n5N4O5O1Q8L6n2j1M7p1j74k5J76J10j08j56PJ33
$$ -91 -140 -91 -74 -97 -21 72 31 -42 4 99 124 86 -12 -147 -202 -148 -83 -22 66 102 50 39 86 15 -159 -184 -8 102 -6 -162 -155 -22
3989b2Q3k6m8qnk0M5J06qj78j19R6J20m5p6P0J15Mq0p5l9J6M7K0PK7ll8K0O1k0p6j5J7nM6
$$ -22 61 35 -13 -21 -26 -46 -1 105 97 -81 -200 -104 16 -29 -105 -35 80 84 4 -71 -110 -94 -47 -27 -20 7 4 -34 -14 47 27 -49 -64 -47 -52 -6
3984fQ4j7q9k1j7j16n0J57J53o4j44PJ13K1p8l5N6L6m3m7J2L4J9K6L9J0n8j03n2M1L6o1q9
$$ -6 78 61 -28 -49 -66 -182 -232 -75 78 14 -130 -123 -10 11 -67 -102 -46 -10 -53 -100 -88 -54 -35 -9 30 40 -18 -121 -173 -132 -96 -157 -246
3979b46nM5L8O5Q3J1p1m3N5J06N9m8r1l9J6J9L6M3k3o7J4Q6J5q4p4j9RM8Q5M8j8oM8J8o4m8
$$ -246 -251 -206 -168 -103 -20 -9 -80 -123 -68 38 97 49 -42 -81 -65 -46 -10 33 10 -57 -43 43 58 -26 -100 -119 -110 -62 23 71 53 47 95 113 49 1
3974AL7K0p3n2N8O5rj6Nn4j14o8L0J12J36N9q0j13m2J6K1%m0l8M2O6l2o6L6O2m0p1OK9J0K8
$$ 1 38 58 -15 -67 -9 56 47 31 36 -18 -132 -200 -170 -58 78 137 57 -56 -98 -82 -61 -61 -101 -139 -97 -31 -63 -129 -93 -31 -71 -142 -136 -107 -97 -69
3969f9J9pO8J41J0j62j00L4j5q4K0J23Q4N0M8l3q9pL4q2j59n8O4R6N8PJ4P2Mj61j20J12J44
$$ -69 -50 -57 11 152 162 0 -100 -66 -81 -165 -145 -22 62 112 160 127 38 31 65 -17 -176 -234 -170 -74 -16 -9 5 77 81 -80 -200 -88 56
3964E6n2j27k6J8pJ2L2j0q0j14m2R9J20K1K5Q9Nj08j9J08N9l3m4k6RK7m8r8j6J4p2m2P7M6
$$ 56 4 -123 -149 -131 -138 -126 -94 -104 -184 -298 -340 -241 -121 -100 -75 14 19 -89 -108 0 59 26 -18 -44 -35 -8 -56 -154 -170 -156 -228 -270 -193 -147
3959a47j4P1R6jLN7qk3O3j6j70r3L7l4m9J14J47J7l8l7m0N6J13l0j20j5L3jQ8J37m8j58m9
$$ -147 -161 -90 6 5 8 65 57 34 97 81 -89 -182 -145 -179 -228 -114 33 50 12 -25 -65 -9 104 74 -46 -61 -28 -29 59 196 148 -10 -59
3954e9Lk9L3M6o7m8R2N1o7l2K8j4j1K6l7p6JL4J1O2P7mJ1J12L1j49j17N0R0M8K4l7r6k0R9
$$ -59 -56 -85 -52 -6 -73 -121 -29 22 -45 -77 -49 -63 -74 -48 -85 -161 -160 -126 -115 -53 24 20 31 143 174 25 -92 -42 48 96 120 83 -13 -33 66
3949F6Q1m5r7l3M8O8J9m3o7n4PQ8R7j3j22j02J0P8N2NJ4N7J2j28j70rJ39R2MRl6j80j77K2
$$ 66 147 102 5 -28 20 88 107 64 -3 -57 -50 38 135 122 0 -102 -92 -14 38 43 57 114 126 -2 -172 -181 -42 50 54 63 27 -153 -330 -308
3944c08J19P2J13J77M5j09l3P1j9q6RL0p9n4R3Q7o1q4ql5r7j0J09L8r7n4Q1O2m0j8O4K3n3
$$ -308 -189 -117 -4 173 218 109 76 147 128 42 51 81 2 -52 41 128 67 -17 -25 -60 -157 -167 -58 -20 -117 -171 -90 -28 -68 -86 -22 1 -52
3939e2k1M3J6l7j5L0J8j4J9Q5N2o2n0Q7R8l6m8P8O3r0j21k6j6n9j6O2M1l2m1J8K1p9j18K0
$$ -52 -73 -30 -14 -51 -66 -36 -18 -32 -13 72 124 62 12 99 197 161 113 191 254 164 43 17 1 -58 -74 -12 29 -3 -44 -26 -5 -84 -202 -182
3934a82J45O2n2j7Lj20j34N8J60O3NM2J0n6j6M9K6k3o2j18q8N2R5JJR3K2j23o1R8L9j13p7
$$ -182 -37 25 -27 -44 -41 -161 -295 -237 -77 -14 -9 33 43 -13 -29 20 46 23 -39 -157 -245 -193 -98 -97 -96 -3 19 -104 -165 -67 -28 -141 -218
3929b18L8J2rJ21J84L4j09m9L0l1p2M1J42O3p7j00k5L8O1L2j4RM7j5r1k6N2k6r2L3J56P2m6
$$ -218 -180 -168 -177 -56 128 162 53 4 34 3 -69 -28 114 177 100 0 -25 13 74 106 92 101 148 133 42 16 68 42 -50 -17 139 211 165
3924A65qL7q3j88q7J04J40N8K7K7n1j44j03K4R8J04L3j23j95k1J74Q6j00o3Q8O1l0K3P5n5
$$ 165 157 194 111 -77 -164 -60 80 138 165 192 141 -3 -106 -82 16 120 153 30 -165 -186 -12 74 -26 -89 -1 60 30 53 128 73
3920G3j59k1J60J10p6j30p6n1j1R0J20Pp5OJ07O2o2q9j7L3K0NRJ3N2Q7kj40q3R7R1o7o7J4
$$ 73 -86 -107 53 163 87 -43 -119 -170 -181 -91 29 36 -39 -33 74 136 74 -15 -32 1 21 26 35 48 100 187 185 45 -38 59 150 83 16 30
3915C0o9j38K7J30k3j22K5J39Q7M3J5o3p9kj9j16p5P5J16M3qj6MM6M6j1k3K8K8l1n9o2p5k1
$$ 30 -39 -177 -150 -20 -43 -165 -140 -1 86 129 144 81 2 0 -19 -135 -210 -135 -19 24 16 0 4 50 96 85 62 90 118 87 28 -34 -109 -130
3910a30Q5Q3k3n9MK7j5mN5O6K4lj4k4mL4J9n3p8QR4L7r8j03KJ6p5o3O9R8k7j04m0K1j4l4M8
$$ -130 -45 38 15 -44 -40 -13 -28 -32 23 89 113 110 96 72 68 102 121 68 -10 -2 92 129 31 -72 -70 -54 -129 -192 -123 -25 -52 -156 -196 -175 -189 -223 -175
3905a75J24O5l4m3PK1Qk8r9j06K0J08L8j4N6P5k3o4K2N2m9j38o4P8R2j9m0P1R7j4o6j1Lk4
$$ -175 -51 14 -20 -63 -56 -35 -27 -55 -154 -260 -240 -132 -94 -108 -52 23 0 -64 -42 10 -39 -177 -241 -163 -71 -90 -130 -59 38 24 -42 -53 -50 -74
3900g4kL3L5N5P5Or5j27p6M6J35O7o5p6n3q8k4J56J49l7q6j0k6l5R0J29K2QQ3Mj54j25K7R0
$$ -74 -76 -43 -8 47 122 128 33 -94 -170 -124 11 78 13 -63 -116 -204 -228 -72 77 40 -46 -56 -82 -117 -27 102 124 132 215 219 65 -60 -33 57
3895E7K9r0j43k9J21O4r3n9J10J03o4j25l4L3L4L6J2l9k9M4N0mj0rq1r2L8J16L0m0ML1j3k8
$$ 57 86 -4 -147 -176 -55 9 -84 -143 -33 70 6 -119 -153 -120 -86 -50 -38 -77 -106 -62 -12 -16 -26 -35 -116 -208 -170 -54 -24 -64 -60 -29 -42 -70
3890g0J4M0K6J0Joj7j6PJl2j3L5Om2OM9j2m2L0P0N0J3p6j41k7J14P1PL6o0k32j38J04J10J5
$$ -70 -56 -16 10 20 21 15 -2 -18 -11 -10 -42 -55 -20 -14 -56 -50 -1 -13 -55 -25 45 95 108 32 -109 -136 -22 49 56 92 32 -200 -338 -234 -124 -109
3884a09P4P7q8j37JN7J5M5Q8N8K3J0k1k8RJ5l6q5p8J6R1L3m5nN3K1k3m2o9k7O5M0l9OL5o8
$$ -109 -35 42 -46 -183 -182 -125 -110 -65 23 81 104 114 93 65 74 89 53 -32 -110 -94 -3 30 -15 -20 33 54 31 -11 -80 -107 -42 -2 -41 -35 0 -68
3879f8p3Q9J06n2j01j5M0M4J5n1l3O6L6q3j03l9L5J47J50l7j05N2R5l2k2L5r0j21O0P4p7j5
$$ -68 -141 -52 54 2 -99 -114 -74 -30 -15 -66 -99 -33 3 -80 -183 -222 -187 -40 110 73 -32 20 115 83 61 96 6 -115 -55 19 -58 -73
3874g3J29%j73p3Q0O3Kk3k8L1Q9O4L9N9J2o4n3k9m8k9kk1OM9m4j50n3Q3P4N6O3rn3K5M6k9
$$ -73 56 56 -117 -190 -110 -47 -45 -68 -96 -65 24 88 127 186 198 134 81 52 4 -25 -27 -48 -42 7 -37 -187 -240 -157 -83 -27 36 27 -26 -1 45 16
3869A6k3mj07j16R9K34J08n1p3l0L3N4j4p2qO3J9o9q5l7J2K9L5N3K7k9oL4n5j28j0R8j4j07
$$ 16 -7 -11 -118 -234 -135 99 207 156 83 53 86 140 126 54 46 109 128 59 -26 -63 -51 -22 13 66 93 64 58 92 37 -91 -101 -3 -17 -124
3864a24pN4k8l6N3P2N5J00Q0k6n5Qmq2q5j3K9J7NMl0j04j31l9R3J40J04R2Q5Nr7r0lJ4j3J8
$$ -124 -131 -77 -105 -141 -88 -16 39 139 219 193 138 146 142 60 -25 -38 -9 8 13 17 -13 -117 -248 -287 -194 -54 50 142 227 232 135 45 42 56 43 61
3859F1L3k5l2or2j50M0J89oj73M6K68J09j35j20pLj2L0Q0N3k6j4P8J4j65j05R8L3j47j7J74
$$ 61 94 69 37 31 -61 -211 -171 18 12 -161 -115 153 262 127 7 0 3 -9 21 101 154 128 114 192 206 41 -64 34 67 -80 -97 77
3854G7L3j40m1M8mK0M6q3j29N4J45K8o0m7k5mK5L2O3Q2No0k8j4k0N0N9r9j57qP9K9M8R2J9
$$ 77 110 -30 -71 -23 -27 -7 39 -44 -173 -119 26 54 -6 -53 -78 -82 -57 -25 38 120 125 65 37 23 3 53 112 13 -144 -152 -73 -44 4 96 115
3849A15m4lK8K0nj11j82k8J50O2r6n2O4O6K5J5j1k0J1J3m0o3j0M9N4M6P0P4%o2m0m5r0n2L9
$$ 115 71 68 96 116 111 0 -182 -210 -60 2 -94 -146 -82 -16 9 24 13 -7 4 17 -23 -86 -96 -47 7 53 123 197 197 135 95 50 -40 -92 -53
3844e3M5M3Q6K0q0j0N2r0j40L4P3o8l2P7j8q3M8O0n5K9J35j1j14RK1j22p5P6K7o4nM6M4J11
$$ -53 -8 35 121 141 61 51 103 13 -127 -93 -20 -88 -120 -43 -61 -144 -96 -36 -91 -62 73 62 -52 -43 -22 -144 -219 -143 -116 -180 -185 -139 -95 16
3839A6J22l2j18j0O9nj00j07l2L3K3MO7R3op6nP7O8lj01j40JJ59P6j11j00P4J36O0qk0n8j19
$$ 16 138 106 -12 -22 47 42 -58 -165 -197 -164 -141 -137 -70 23 17 -59 -64 13 81 78 -23 -163 -162 -3 73 -38 -138 -64 72 132 124 104 46 -73
3834g3q7P8J59N2n7k8j9r2r3%N2O5P3K2l9rJ5k8nN7j6j25r1l9n6L9J92J23o5j06l6K6J06J14
$$ -73 -160 -82 77 129 72 44 25 -67 -160 -160 -108 -43 30 52 13 4 19 -9 -14 43 27 -98 -189 -228 -284 -245 -53 70 5 -101 -137 -111 -5 109
3829A09mm8L5k2j54n6J23L6j35j07j0J3N5P9Mj5M8Op5nP2km4K8L7mPl9j23j8J69J31k7n3k2
$$ 109 105 57 92 70 -84 -140 -17 19 -116 -223 -233 -220 -165 -86 -82 -97 -49 -43 -118 -123 -51 -53 -97 -69 -32 -36 -29 -68 -191 -209 -40 91 64 11 -11
3824a1j5O2Q7q3j58K6J21l1r2L2M1o2l1P4N5l1p8l9P5J45L2j31j23j5K9O1J01M0q5r6k0Jj1
$$ -11 -26 36 123 40 -118 -92 29 -2 -94 -62 -21 -83 -114 -40 15 -16 -94 -133 -58 87 119 -12 -135 -150 -121 -60 41 81 -4 -100 -120 -119 -130
3819a30J5N4N4J5j9J1P4O3mokq5j30m5K4JlJ7pJ0Q4M3j01j42n7nK6Q1P6K9N5O8m8j42n9O5
$$ -130 -115 -61 -7 8 -11 0 74 137 133 127 125 40 -90 -135 -111 -110 -113 -96 -103 -93 -9 34 -67 -209 -266 -271 -245 -164 -88 -59 -4 64 16 -126 -185 -120
3814a20O3%k5j0L9Q9O7j7l4J7J8n4q5n8k7jM1N3Kj5K4Lq4p4M1R1N6J9k6o3j5L6qJR8M2j45
$$ -120 -57 -57 -82 -92 -53 36 103 86 52 69 87 33 -52 -110 -137 -138 -97 -44 -42 -57 -33 -30 -114 -188 -147 -56 0 19 -7 -70 -85 -49 -57 -56 42 84 -61
3808f1j19Q9R7n3o4J3OOL6l0p5M3J48P0n3j03j14l3J15J20n0j25mR0K1p2o7k8k6JR7J20k2
$$ -61 -180 -91 6 -47 -111 -98 -92 -86 -50 -80 -155 -112 36 106 53 -50 -164 -197 -82 38 -12 -137 -141 -51 -30 -102 -169 -197 -223 -222 -125 -5 -27
3803b7j20j2R7J5n4L9Q9qq5n0j5l3l1OK4OJ2O6P7j8p4j2L3KK0P1J3p9n0L7N4J4l9o4J0R2O9
$$ -27 -147 -159 -62 -47 -101 -62 27 19 -66 -116 -131 -164 -195 -189 -165 -159 -147 -81 -4 -22 -96 -108 -75 -73 -53 18 31 -48 -98 -61 -7 7 -32 -96 -86 6 75
3798G5J3mn4p9J0M1p0p1P4N6n1L0J11m3j44k8J2p0j8M6o1j11M1J13K5MP7Q7M0Jk2k7m7j06
$$ 75 88 84 30 -49 -39 2 -68 -139 -65 -9 -60 -30 81 38 -106 -134 -122 -192 -210 -164 -225 -336 -295 -182 -157 -153 -76 11 51 52 30 3 -44 -150
3793a50r5L6J12M6k1j7kJ0M1M6J1l9p2l2N4O2%kK4j6n3l2n6r4qP7Rn6oK5kL6R6N7LJ6M0L0
$$ -150 -245 -209 -97 -51 -72 -89 -91 -81 -40 6 17 -22 -94 -126 -72 -10 -10 -12 12 -4 -57 -89 -145 -239 -247 -170 -161 -217 -223 -198 -200 -164 -68 -11 -8 8 48 78
3787G8L2K9j9o8m7Pk0j13r4L9N2n8k3J03M6p5nP5j5m9L9J0r4l0P0M2K5M1l2q7%N1QL1O4j3
$$ 78 110 139 120 52 5 12 -8 -121 -215 -176 -124 -182 -205 -102 -56 -131 -136 -61 -76 -125 -86 -76 -170 -200 -130 -88 -63 -22 -54 -141 -141 -90 -82 -51 13 0
3782@n0J2oo5L6J40N5m1KJ9k2J3N9j4q2m6k5n3%J16J26lj13r6m7m6k1J01J87R7m6n8J6K1m2
$$ 0 -50 -38 -44 -109 -73 67 122 81 83 102 80 93 152 138 56 10 -15 -68 -68 48 174 171 58 -38 -85 -131 -152 -51 136 233 187 129 145 166 124
3777A24q8p3kN6jj00m5J21J24n1r3P8J62j9j98j34N3J28L3j07j32j6P1M5L0O6M0k6qNn5n7
$$ 124 36 -37 -39 17 16 -84 -129 -8 116 65 -28 50 212 193 -5 -139 -86 42 75 -32 -164 -180 -109 -64 -34 32 72 46 38 43 -12 -69
3772f9Ln0j08L3J50kj56o9L7LK2J17R5k3p7m7JN5Q2N2Ol5n0k7nj4J9R4O8o6j21n0J9J2l8n5
$$ -69 -66 -116 -224 -191 -41 -43 -199 -268 -231 -228 -206 -89 6 -17 -94 -141 -140 -85 -3 49 55 20 -30 -57 -62 -76 -57 37 105 39 -82 -132 -113 -101 -139 -194
3767a94L8J44P7p7q3J7lo1qK6n8o6P9J62J02M7J1o5q5RN6k9q0j5L9J8Ljm3n6K0P6L4l1l9j9
$$ -194 -156 -12 65 -12 -95 -78 -81 -142 -150 -124 -182 -248 -169 -7 95 142 153 88 3 12 68 39 -41 -56 -17 1 4 3 -40 -96 -76 0 34 3 -36 -55
3762e5J2N0M0k7m6J0L1m9j25n8P3J07P4J01R7o7j92p7M6o6j48K8J86J04J4L2rr4n5L4K0mO2
$$ -55 -43 7 47 20 -26 -16 15 -34 -159 -217 -144 -37 37 138 235 168 -24 -101 -55 -121 -269 -241 -55 49 63 95 86 -8 -63 -29 -9 -13 49
3757D9R1k6j38o6J13J48j8j45q1M0P1M3nm1j8K5MrM5K6r4j13nJ6n3k1Q1Q0j2o1l5K1M9K6o
$$ 49 140 114 -24 -90 23 171 153 8 -73 -33 38 81 76 35 17 42 46 37 82 108 14 -99 -104 -88 -141 -162 -81 -1 -13 -74 -109 -88 -39 -13 -19
3752a9l5n2J2J12P0p5p5L1J8m2J6N3j5%J08R3j2m2o4j18m4J07J05j1m6k3k1jK1lqL5J7p0p9
$$ -19 -54 -106 -94 18 88 13 -62 -31 -13 -55 -39 14 -1 -1 107 200 188 146 82 -36 -80 27 132 121 75 52 31 30 51 48 40 75 92 22 -57
3747e7JN2J0l3lO4O4j5n5l1j9j9Lj5q5q3K9J11P8J4J1K9jn1l8J4J5MM8N3n0p8L9J11M4j0l1
$$ -57 -56 -4 6 -27 -30 34 98 83 28 -3 -22 -41 -38 -53 -138 -221 -192 -81 -3 11 22 51 50 -1 -39 -25 -10 -6 42 95 45 -33 6 117 161 151 120
3741A20r5q9K7N7n2q6K5J10R8K9n4r0m4j8l2mL4J1KK2k4o4L0J00J8m0NOK0J35J17j21j92j0
$$ 120 25 -64 -37 20 -32 -118 -93 17 115 144 90 0 -44 -62 -94 -98 -64 -53 -51 -29 -53 -117 -87 13 31 -9 -4 2 22 157 274 153 -39 -49
3736d9K8j03k9J57R2q5m6N7J5n0j5L9K2n9j15pJ62J25p6j10J0L2j3K3N9K4K4M2k3o5J8Q3J3
$$ -49 -21 -124 -153 4 96 11 -35 22 37 -13 -28 11 33 -26 -141 -148 14 139 63 -47 -37 -5 -18 5 64 88 112 154 131 66 84 167 180
3731A80r9j25k2J23J28j5q0k7l4p6m0k0m7L8J26jj28j9P6kMR2J4q4J3N4p8o3J11Q5n0lO2m3
$$ 180 81 -44 -66 57 185 170 90 63 29 -47 -87 -107 -154 -116 10 9 -119 -138 -62 -64 -60 32 46 -38 -25 29 -49 -112 -1 84 34 31 93 50
3726E0r3j8lkJ10J55J1j09j03o8mQ1O4k2k9jk1lM0j9r7k9P5Q4P5M0o7q0Q5J43m1j68q8m4j17
$$ 50 -43 -61 -64 -66 44 199 210 101 -2 -70 -74 7 71 49 20 19 -2 -5 35 16 -81 -110 -35 49 124 164 97 17 102 245 204 36 -52 -96 -213
3721b13j21j2Q1J30J25L0l6M1J05j1j29n8N3L2l0k4J6M1N2K8j6l8n5q1k8P8R0J3j7j3m7m6
$$ -213 -334 -346 -265 -135 -10 20 -16 25 130 119 -10 -68 -15 17 -13 -37 -21 20 72 100 84 46 -9 -90 -118 -40 50 63 46 33 -14 -60
3716f0L1L3m0k8M4Qo0oP0N6K0k5r2m5R7N1j48j14J12J17m7l4P6K2p2m2mj2K6L6m6o0M9O3n4
$$ -60 -29 4 -36 -64 -20 -12 -72 -78 -8 48 68 43 -49 -94 3 54 -94 -208 -96 21 -26 -60 16 38 -34 -76 -80 -92 -66 -30 -76 -136 -87 -24 -78
3711g8p3M2O5n8r9M9J75O9j35j43J1N5j6OJ21J69P4j12k26j20O8Q3J7P3J17J5n7m5o5l4Q7
$$ -78 -151 -109 -44 -102 -201 -152 23 92 -43 -186 -175 -120 -136 -130 -9 160 234 122 -104 -224 -156 -73 -56 17 134 149 92 47 -18 -52 35
3707C5N1j02j9J40lj78n4N8m9l6Q7Pp3J02J66n6j45OO9M0P1J2j09pJ65L0k32k24j9R8J15P4
$$ 35 86 -16 -35 105 102 -76 -130 -72 -121 -157 -70 -63 -136 -34 132 76 -69 -63 6 46 117 129 20 13 178 208 -24 -248 -267 -169 -54 20
3702B0l9j40r5N1J26M8p0m6Q2J09J7m4k2K0O9O3l5j17p3J9O1M4k8q7k2R9R2k0o9l2mpk6m0
$$ 20 -19 -159 -254 -203 -77 -29 -99 -145 -63 46 63 19 -3 17 86 149 114 -3 -76 -57 4 48 20 -67 -89 10 102 82 13 -19 -23 -30 -56 -96
3697i6k7rK0P9O7o9j47k8P7L3J6Q3O4k6p1p7k5R9J06m8o7R6R9p6p3M7Mn6P4J50l5j84p2P0
$$ -96 -123 -132 -112 -33 34 -35 -182 -210 -133 -100 -84 -1 63 37 -34 -111 -136 -37 69 21 -46 50 149 73 0 47 51 -5 69 219 184 0 -72 -2
3692bM2k5NL7k8q0l0K6L1P4R4m3j34RJ15k7r5L4J2j68r9J29P2j20o3R3J00O6P5K8j5J0j1r0
$$ -2 40 15 20 57 29 -51 -81 -55 -24 50 144 101 -33 -24 91 64 -31 3 15 -153 -252 -123 -51 -171 -234 -141 -41 25 100 128 113 123 112 22
3687B2r2m5k5K1P3L8LN0M6l9k6M3pq5k1O2J9n9n6NO0M4l5m5L9K5r1o4R0R0l2k6N0K0m6m8o0
$$ 22 -70 -115 -140 -119 -46 -8 -5 45 91 52 26 69 62 -23 -44 18 37 -22 -78 -73 -13 31 -4 -49 -10 15 -76 -140 -50 40 8 -18 32 52 6 -42 -102
3682a02l3J04J44n0j99r0N9M6qj3k8jQ6P7k7j8N9pj26p1N3O4N0N9Kp7o4l8m4N0J44K6j37n4
$$ -102 -135 -31 113 63 -136 -226 -167 -121 -129 -142 -170 -171 -85 -8 -35 -53 6 -1 -127 -198 -145 -81 -31 28 30 -47 -111 -149 -193 -143 1 27 -110 -164
3677a64J00M5m8j0J1j4L0L0q4p3R0J04j3J0N8o4j26K4J13L5j4k2n9j8O1l0j27M3K21J04q5
$$ -164 -64 -19 -67 -77 -66 -80 -50 -20 -104 -177 -87 17 4 14 72 8 -118 -94 19 54 40 18 -41 -59 2 -28 -155 -112 109 213 128
3672A28j03p6o6K5Q2Ko3m0k8%O8N0l0oO1K9k9n1j17j36j4Q6N0M6J05N8m0m6k6m3J3J01O1l2
$$ 128 25 -51 -117 -92 -10 -8 -71 -111 -139 -139 -71 -21 -51 -57 4 33 4 -47 -164 -300 -314 -228 -178 -132 -27 31 -9 -55 -81 -124 -111 -10 51 19
3667A9j8M4J4p5j06j4R0L4j05p2Q2P7k3K0P0l8q0P3J26om7J8m5j30o0J2m6n1M0M8NO0Q4n9
$$ 19 1 45 59 -16 -122 -136 -46 -12 -117 -189 -107 -30 -53 -33 37 -1 -81 -8 118 112 65 83 38 -92 -152 -140 -186 -237 -197 -149 -144 -84 0 -59
3662e9j55k9J27J23L8j9k4K5M6k7q9m4J6J9M3N2l3q5k1Km4J6J07Qj32p3N3O6L3k0j08p2J11
$$ -59 -214 -243 -116 7 45 26 2 27 73 46 -43 -87 -71 -52 -9 43 10 -75 -96 -94 -138 -122 -15 -7 -139 -212 -159 -93 -60 -80 -188 -260 -149
3657a49J47on6K1Mn4nK9k8qO9Rj00m0O6nj06j1J25O4l6N2J35j9j61l6R9Jq5oJ9m5J5J06L7
$$ -149 -2 -8 -64 -43 -39 -93 -98 -69 -97 -105 -36 -27 -127 -167 -101 -106 -212 -223 -98 -34 -70 -18 117 98 -63 -99 0 1 -84 -90 -71 -116 -101 5 42
3652D2m2pj1o4nO3Kj7O2L4q6p2J5KoP3Q4mn6l8pL1K5l6n6j6j4lR6J29%j10o4RL9O4M3n1p0
$$ 42 0 -7 -18 -82 -87 -24 -22 -39 23 57 -29 -101 -86 -84 -90 -17 67 63 7 -31 -38 -7 18 -18 -74 -90 -104 -107 -11 118 118 8 -56 -47 -8 56 99 48 -22
3646b2QL9NJ0L5K0J3nj42k81j63J23K31J14nm9p4k8J07J46J3j13q3J7J6p4p4P2J58L3j18q1
$$ -22 -14 25 30 40 75 95 108 103 -39 -320 -483 -360 -129 -15 -20 -69 -143 -171 -64 82 95 -18 -101 -84 -68 -142 -216 -144 14 47 -71 -152
3642a52K4Mn2l5k9k5N9J08Qp8rN7Mn7l1N4J27P1r6j53j2Q0L6K5L4n0o8P5J10m1n9Q8M3j64
$$ -152 -128 -124 -176 -211 -240 -265 -206 -98 -90 -168 -177 -120 -116 -173 -204 -150 -23 48 -48 -201 -213 -133 -97 -72 -38 -88 -156 -81 29 -12 -71 17 60 -104
3637a04j31P5N6j05l3J64J23m0l5M2no3JL2l3j6Q9P7m2q3q4r0J0J78J55l6j17n0j2j3L6N5
$$ -104 -235 -160 -104 -209 -242 -78 45 5 -30 12 7 -56 -55 -23 -56 -72 17 94 52 -31 -115 -205 -195 -17 138 102 -15 -65 -77 -90 -54 1
3632Aqm3K3Q0N1lQM8Qr0j04j8M9M7K6j6p2m9M5O6Nk3k3o5r3n1j0%M3R0O4L1N0L3p8j29j0J20
$$ 1 -7 -50 -27 53 104 101 109 157 165 75 -29 -47 2 49 75 59 -13 -62 -17 49 54 31 8 -57 -150 -201 -211 -211 -168 -78 -14 17 67 100 22 -107 -117 3
3627CN6j00p9R1J00r0j81k3J51J38L2k7j5Olm2o4l3L0L7l5r6l2R4R1l6q1K1R5O5J9RJ7N0O7
$$ 3 59 -41 -120 -29 71 -19 -200 -223 -72 66 98 71 56 62 59 17 -47 -80 -50 -13 -48 -144 -176 -82 9 -27 -108 -87 8 73 92 101 118 168 235
3621B35%r6p4K8K0j07j59m0J10J01j5o2j6J3J2L5L5k5m2K5M2k1j8M5mj02k1J43P5j62j95%
$$ 235 235 139 65 93 113 6 -153 -193 -83 18 3 -59 -75 -62 -50 -15 20 -5 -47 -22 20 -1 -19 26 22 -80 -101 42 117 -45 -240 -240
3617b40Q5RK4J31R7o1j23o4jJ5j9n7J1J46J36Pk1M1J7l9l4n7j00oJ21N8p6p0jK0M2L2m6n1
$$ -240 -155 -146 -122 9 106 45 -78 -142 -143 -128 -147 -204 -193 -47 89 96 75 116 133 94 60 3 -97 -103 18 76 0 -70 -71 -51 -9 23 -23 -74
3612g4O5P5l5m2K0n3j54o9M5j3q0QJ01N7J0O9J01J3q0p5j3M3R5N7r1j47QJ32M2n7j0N1L9L6
$$ -74 -9 66 31 -11 9 -44 -198 -267 -222 -235 -315 -307 -206 -149 -139 -70 31 44 -36 -111 -124 -81 14 71 -20 -167 -159 -27 15 -42 -52 -1 38 74
3607G4K8l7p5n3m2l5K2O5M4Rj7m5l1K4K9ql7n0k4N4O2l5n4K9L0k5M7J33O5j0jp6j71n5J06
$$ 74 102 65 -10 -63 -105 -140 -118 -53 -9 0 -17 -62 -93 -69 -40 -48 -85 -135 -159 -105 -43 -78 -132 -103 -73 -98 -51 82 147 137 136 60 -111 -166 -60
3602f0pj65k7J57N2j10m3N8J3pP3Q5K1Mpq1j01oN7L9K1J3jK1J0q2q3O2Q4n4k1J49R8p7m1L6
$$ -60 -67 -232 -259 -102 -50 -160 -203 -145 -132 -139 -66 19 40 44 37 -44 -145 -151 -94 -55 -34 -21 -22 -1 9 -73 -156 -94 -10 -64 -85 64 162 85 44 80
3596H0q2j21P3J46j3q3K1O8ko9r0o4kOl0k5mRO9J13K5n9PR2N4k7o4o0j0M2J1pM7L5o0k5O8
$$ 80 -2 -123 -50 96 83 0 21 89 87 18 -72 -136 -138 -132 -162 -187 -191 -182 -113 0 25 -34 -27 65 119 92 28 -32 -42 0 11 4 51 86 26 1 69
3591F9k7j72r8N6O9N0Q2K3j04r1M5R4Mr8j13j6Q1N7jK6M8l3r0j2O8L1k1J8N2kp0m3M5O7ko4
$$ 69 42 -130 -228 -172 -103 -53 29 52 -52 -143 -98 -4 0 -98 -211 -227 -146 -89 -90 -64 -16 -49 -139 -151 -83 -52 -73 -55 -3 -5 -75 -118 -73 -6 -8 -72
3586g2n1omk2J0O1L8l0k5N4O7lm1k1oJ7P4O9n1j08k4M0k5q1l5N5J39J66J5j95j54P9J29ok7
$$ -72 -123 -129 -133 -155 -145 -84 -46 -76 -101 -47 20 17 -24 -45 -51 -34 40 109 58 -50 -74 -34 -59 -140 -175 -120 19 185 200 5 -149 -70 59 53 26
3580B6L2m1j12rQ5K6j4K4J8l5l6OM6L9n6j25k3R5N3%L6J2o8l8L7L2M0N0m5r7j5qq4pP5o0j17
$$ 26 58 17 -95 -104 -19 7 -7 17 35 0 -36 -30 16 55 -1 -126 -149 -54 -1 -1 35 47 -21 -59 -22 10 50 100 55 -42 -57 -65 -149 -156 -81 -141 -258
3575b58J01J76j7q6J1j0n9jRmR6P9j10p9J58R3j63r8J35R0l1M5J09pj10q0j0L9K8k9m2l3n9
$$ -258 -157 19 2 -84 -73 -83 -142 -143 -134 -138 -42 37 -73 -152 6 99 -64 -162 -27 63 32 77 186 179 69 -11 -21 18 46 17 -25 -58 -117
3570a17n5J2K8j1RM0Rj2j4l1KN9No6ON8j4kO6m5j58J3J77M1j02l4K6J4O9Q6j1l3L8k9j66j23
$$ -117 -172 -160 -132 -143 -134 -94 -85 -97 -111 -142 -140 -81 -76 -142 -136 -78 -92 -94 -28 -73 -231 -218 -41 0 -102 -136 -110 -96 -27 59 48 15 53 24 -142 -265
3565b65M9J24O6l7o5M7J15j7j31k2Q7Pp3l6k6m3K3R3N5k5m2K3J10Q0q3j18L6O7q6q4O6J4j16
$$ -265 -216 -92 -26 -63 -128 -81 34 17 -114 -136 -49 -42 -115 -151 -177 -220 -197 -104 -49 -74 -116 -93 17 97 14 -104 -68 -1 -87 -171 -105 -91 -207
3560b07K0J90L3j84j16L1K2K2Q8L4r8q1L6P4P3J00Q3rn4j4Nk7l1ml1r8q0J9L6o0r2K7J44J13
$$ -207 -187 3 36 -148 -264 -233 -211 -189 -101 -67 -165 -246 -210 -136 -63 37 120 111 57 43 48 21 -10 -14 -45 -143 -223 -204 -168 -228 -320 -293 -149 -36
3555c6rp5k5L7Ko5l3L9L4KK2K4lN0J06Qj38j21LN2M9M5Jm7k4J0j3k2J3J7j1j9JN3J08N8r4
$$ -36 -45 -120 -145 -108 -106 -171 -204 -165 -131 -129 -107 -83 -86 -36 70 78 -60 -181 -178 -126 -77 -32 -31 -78 -102 -92 -105 -127 -114 -97 -108 -127 -126 -73 35 93 -1
3550aj06M3N0r5n3J41Q3j50j28R0R7m3l8J6o0r4M0J41R3Rn4q4k9M8M9K8L9K4%M0K8j05j61
$$ -1 -107 -64 -14 -109 -162 -21 62 -88 -216 -126 -29 -72 -110 -94 -154 -248 -208 -67 26 35 -19 -103 -132 -84 -35 -7 32 56 56 96 124 19 -142
3545a42n3L8J4rNK2L6mp1jJ50J09p0q9ok1l4N3O3k0rN1K3j2Oj7k5N0M3r0p6R0Q9q3j20j1L7
$$ -142 -195 -157 -143 -152 -147 -125 -89 -93 -164 -165 -15 94 24 -65 -71 -92 -126 -73 -10 -30 -39 12 35 23 29 12 -13 37 80 -10 -86 4 93 10 -110 -121 -84
3539h4km0p1o9QR6Q8kn7j5L4Kk5N2J04J5n6j3pp5l9N8Oj23j05K5Q9O5Pj2N1R1j4j10k1P7J
$$ -84 -86 -126 -197 -266 -258 -162 -74 -76 -133 -148 -114 -112 -137 -85 19 34 -22 -35 -42 -117 -156 -98 -92 -215 -320 -295 -206 -141 -134 -146 -95 -4 -18 -128 -149 -72 -71
3534g1o6%Np7j4J34Q6o3l0R6N1j15j80q2P2J26K3p4%Q2j4r9L6J90J17l8n8j7m4p6j9N8Q0Q1
$$ -71 -137 -137 -132 -209 -223 -89 -3 -66 -96 0 51 -64 -244 -326 -254 -128 -105 -179 -179 -97 -111 -210 -174 16 133 95 37 20 -24 -100 -119 -61 19 100
3529A00N2m9j20mJ31Kk07j20R7N9m6O5J12p3j29M9P6n9k6Q9L1o1m2j2K1R0P0l4l3or1j22q
$$ 100 152 103 -17 -21 110 112 -95 -215 -118 -59 -105 -40 72 -1 -130 -81 -5 -64 -90 -1 30 -31 -73 -85 -64 26 96 62 29 23 -68 -190 -198
3524a98L6ON9R2PPR3L4r7r9p3p8kP7K4NR4N4j05j12K5N7j1m9m1RP2P0Pl8o2n8k0rj1P1J36
$$ -198 -162 -156 -97 -5 2 9 102 136 39 -60 -133 -211 -213 -136 -112 -107 -13 41 -64 -176 -151 -94 -105 -154 -195 -186 -114 -44 -37 -75 -137 -195 -215 -224 -235 -164 -28
3519b8K4q0jN0m1n2L2J2j7P8R6k4m0P9R6Mn8p0k5O2M8p8j19n0RM7N1l8r7L2J42K9j04o7K3
$$ -28 -4 -84 -85 -35 -76 -128 -96 -84 -101 -23 73 49 9 88 184 188 130 60 35 97 145 67 -52 -102 -93 -46 5 -33 -130 -98 44 73 -31 -98 -75
3514g5M1L3jm4j7L6Rk9jQk6oL4Ll9l7m6m2O1J32L1q6n3J1k2oJ07R5n9j01lJ5m7j3O1M1J0J6
$$ -75 -34 -1 -2 -46 -63 -27 -18 -47 -48 -40 -66 -72 -38 -35 -74 -111 -157 -199 -138 -6 25 -61 -114 -103 -125 -131 -24 71 12 -89 -92 -77 -124 -137 -76 -35 -25 -9
3508ij9m7J5L2p5j01K2P7jrR5J31K8q6q1j1j2o3k5N3Oq1l2M5J5%M7L2j0L3J8j00r2L6J3j05
$$ -9 -28 -75 -60 -28 -103 -204 -182 -105 -106 -115 -20 111 139 53 -28 -39 -51 -114 -139 -86 -80 -161 -193 -148 -133 -133 -86 -54 -64 -31 -13 -113 -205 -169 -156 -261
3503b61m0R7P0j2RK4k0j0L8J7k4J1N4J7k2L1J02P0l4r1r6j14o1J00J78M4j15p8O9O9q0j59
$$ -261 -301 -204 -134 -146 -137 -113 -133 -143 -105 -88 -112 -101 -47 -30 -52 -21 81 151 117 26 -70 -184 -245 -145 33 77 -38 -116 -47 22 -58 -217
3498b17m5J13J32L6l3k4K6M8rr5j05k2M5O4O5M2K4L1Kn8j4J00P2p2q6NPl3J4O3K3l0l4nO4
$$ -217 -262 -149 -17 19 -14 -38 -12 36 27 -68 -173 -195 -150 -86 -21 21 45 76 78 20 6 106 178 106 20 25 32 -1 13 76 99 69 35 30 94
3493I4R9kj47j44l6L5Q4J39R7o4j42l0P5K0n8MP3j3j13n6N3N4J4Kj3j5K4lj15j38qQ8L6k8
$$ 94 193 191 44 -100 -136 -101 -17 122 219 155 13 -17 58 78 20 24 97 84 -29 -85 -32 22 36 38 25 10 34 31 -84 -222 -230 -142 -106 -134
3488a34mM8N5L5K4nm5l8K6O6L1k9l8NO6R1M5j8j9J5k4j21j20M6J92J13q8j35k2K8k3n3p3j04
$$ -134 -138 -90 -35 0 24 19 -26 -64 -38 28 59 30 -8 -3 63 154 199 181 162 177 153 32 -88 -42 150 263 175 40 18 46 23 -30 -103 -207
3483b07o9K6P0P9J03N2q1j29n0K3M3L1rj9K8J4n7l0M9Qm0M2R0Ol4J8No4n2L0R1P4j9o9J8P9
$$ -207 -276 -250 -180 -101 2 54 -27 -156 -206 -183 -140 -109 -118 -137 -109 -95 -152 -182 -133 -125 -165 -123 -33 -27 -61 -43 -38 -102 -154 -124 -33 41 22 -47 -29 50
3478E0j4p6J3O4lm2l0l2j2J7l1o1oOm2RR7L8o5n2l4p2j3J30J43J5q2q4m4mRrk3QM6M4J0J6
$$ 50 36 -40 -27 37 34 -8 -38 -70 -82 -65 -96 -157 -163 -157 -199 -190 -93 -55 -120 -172 -206 -278 -291 -161 -18 -3 -85 -169 -213 -217 -208 -217 -240 -232 -186 -142 -132 -116
3472a16O6N4k6n4%J7PO5J10Pj17r8oJ8j6k6jL2L6J9J4J6RJ9L6j4r4n9P6J11j0j12q7mK6J2
$$ -116 -50 4 -22 -76 -76 -59 -52 13 123 130 13 -85 -91 -73 -89 -115 -116 -84 -48 -29 -15 1 10 29 65 51 -43 -102 -26 85 75 -37 -124 -128 -102 -90
3467i0ojM5Q3L4n3k9N4K4p4o1km1o6J4M0m3o4J5P0M9j6n8L7J74Q9j53j82pL5m8j7R8J24Q1
$$ -90 -96 -97 -52 31 65 12 -17 37 61 -13 -74 -76 -117 -183 -169 -129 -172 -236 -221 -151 -102 -118 -176 -139 35 124 -29 -211 -218 -183 -231 -248 -150 -26 55
3462E5K0n2m2N5P2n5j37n3Q0O5q5j60o3K1J7P1J47O7l5NK8o5o4O8J02N4K3m9r0K8Q4q7j57
$$ 55 75 23 -19 36 108 53 -84 -137 -57 8 -77 -237 -300 -279 -262 -191 -44 23 -12 -7 21 -44 -108 -40 62 116 139 90 0 28 112 25 -132
3457a32K8J31M3MQp1p7K6M8PK1Km6K4R3j0o9L5L2j13j10jl3q5K0J11O4L5J00J12k2j58j00
$$ -132 -104 27 70 74 82 11 -66 -40 8 15 36 38 -8 16 109 99 30 65 97 -16 -126 -127 -160 -245 -225 -114 -50 -15 85 197 175 17 -83
3452h3Q4J10o1j10M1J13M1L0N5k5j06o6l0o0m0K6L8ln8q8l3O0O5J8L8M7l1p3j5Nl9j2R7J01
$$ -83 1 111 50 -60 -19 94 135 165 220 195 89 23 -7 -67 -107 -81 -43 -46 -104 -192 -225 -165 -100 -82 -44 3 -28 -101 -116 -111 -150 -162 -65 36
3447C6k9j11KJ57J04r7j40k4K6j9qK3%j6k1o0k9P8O9m3l6J9m4n2Q7R5n2k7J04K6q6K2R8n4
$$ 36 7 -104 -102 55 159 62 -78 -102 -76 -95 -103 -80 -80 -96 -117 -177 -206 -128 -59 -102 -138 -119 -163 -215 -128 -33 -85 -112 -8 18 -68 -46 52 -2
3442bj36lQ1L4nk6k3K8oj16n3R8Nj45j0J43L0l0J06O9j35j27M3P5M1L7n3j31j2J33J05K1j7
$$ -2 -138 -141 -60 -26 -31 -57 -80 -52 -58 -174 -227 -129 -124 -269 -279 -136 -106 -136 -30 39 -96 -223 -180 -105 -64 -27 -80 -211 -223 -90 15 36 19
3437A9l6J0O8j7j32p1K3l2m8P2J41Q4K0ooJ1m7j62j58l7J2J7Q9J43Q4mn9p0k1K0%PM1j4o3
$$ 19 -17 -7 61 44 -88 -159 -136 -168 -216 -144 -3 81 101 95 89 100 53 -109 -267 -304 -292 -275 -186 -43 41 37 -22 -92 -113 -93 -93 -86 -45 -59 -122
3432a22J8N0p0r5M2J01M6L3J6m6k6L6Jk1O0O6o8j36q3j6N8J24P7n6j24l7J27J77N5o4l0Pm7
$$ -122 -104 -54 -124 -219 -177 -76 -30 3 19 -27 -53 -17 -16 -37 23 89 21 -115 -198 -214 -156 -32 45 -11 -135 -172 -45 132 187 123 93 100 53
3427E3n0%k1k5N1K4j00o0Q4N4n0m1Lok0q3j16L1J65K5j21j3O5n1n3R6R5k0nM9Rj0K4Qk7QN6
$$ 53 3 3 -18 -43 8 32 -68 -128 -44 10 -40 -81 -78 -84 -104 -187 -303 -272 -107 -82 -203 -216 -151 -202 -255 -159 -64 -84 -89 -40 -31 -41 -17 -9 -36 -28 28
3422B8M3k3q0q0n3l2M4J35O5p6m0P6L2j9N7J1j62r7J30J13n2p5m6m9L3Q4n9j49jJ15L1n3l5
$$ 28 71 48 -32 -112 -165 -197 -153 -18 47 -29 -69 7 39 20 77 88 -74 -171 -41 72 20 -55 -101 -150 -117 -33 -92 -241 -242 -127 -96 -149 -184
3417a84%M1P2M7J1J1j1l4%Qm8l9N6R0K7m7q5n2J4K9MK7L2m2o2L9Q6J5k8j0MJ0k2q4l9J02Q3
$$ -184 -184 -143 -71 -24 -13 -2 -13 -47 -47 -39 -87 -126 -70 20 47 0 -85 -137 -123 -94 -90 -63 -31 -73 -135 -96 -10 5 -23 -33 -29 -19 -41 -125 -164 -62 21
3411B1o1n3P3L1r8p3J8J0qRKM9J66J21j01j63NQ5mm5j4l8o7j3M1M9M3J0m8m3nj2QQ5O8j5K2
$$ 21 -40 -93 -20 11 -87 -160 -142 -132 -140 -131 -129 -80 86 207 106 -57 -52 33 29 -16 -30 -68 -135 -148 -107 -58 -15 -5 -53 -96 -101 -113 -105 -20 48 33 55
3406E5Q4k9j24j1N4q7j25O3J17p1j66k9J14J17M8j0m4o2m1L9P1n7j59m0J02M4m4KK1l8nP5
$$ 55 139 110 -14 -25 29 -58 -183 -120 -3 -74 -240 -269 -155 -38 10 0 -44 -106 -147 -108 -37 -94 -253 -293 -191 -147 -191 -189 -168 -206 -211 -136
3401a36L0m9m3k8m9lQ5J01M3j2j0M5M9k4n1Jk2r0j9Q1J7m7N1R3n8j54m1P7N5J1M3P2Lj15j24
$$ -136 -106 -155 -198 -226 -275 -278 -193 -92 -49 -61 -71 -26 23 -1 -52 -51 -73 -163 -182 -101 -84 -131 -80 13 -45 -199 -240 -163 -108 -97 -54 18 21 -94 -218
3396b18j0M5qj3N3M2l9n5K1R8R9J7m6jL8o7j73p0J00Q4o2r4K5J04K8o2k9or7j11M9J24J6l4
$$ -218 -228 -183 -191 -204 -151 -109 -148 -203 -182 -84 15 32 -14 -15 23 -44 -217 -287 -187 -103 -165 -259 -234 -130 -102 -164 -193 -199 -296 -407 -358 -234 -218 -252
3391b52N0P9M7N5M7Kkk4j11q5Q9J43K1l1K8J6q0j24p0J0M9M5N5N5pm7K9P3k7r7n6l7n8k7j6
$$ -252 -202 -123 -76 -21 26 28 26 2 -109 -194 -105 38 59 28 56 72 -8 -132 -202 -192 -143 -98 -43 12 5 -42 -13 60 33 -64 -120 -157 -215 -242 -258
3386b58k7Q3J81L9j17k8J03O7J1Nk4MO3l9j50kJ53oj68lK11J57l7j28q3J4K5m6m4K7K9K4Q5
$$ -258 -285 -202 -21 18 -99 -127 -24 43 54 59 35 39 102 63 -87 -89 64 58 -110 -113 98 255 218 90 7 21 46 0 -44 -17 12 36 121
3381A21O1n0m9np4q2N3O2n6j4Q7nr9n6q6j59rJ71R4qM9L0r6r6j7J0Q2J58M3j10o7L3M2O7R5
$$ 121 182 132 83 78 4 -78 -25 37 -19 -33 54 49 -50 -106 -192 -351 -360 -189 -95 -103 -54 -24 -120 -216 -233 -223 -141 17 60 -50 -117 -84 -42 25 120
3376A20j3j20r4p6q1K1R4j1p0M9J24N0JOj5j3L5L1j8l6o8r1j9P0O4K7mp8o7J09J53r1k52p3
$$ 120 107 -13 -107 -183 -264 -243 -149 -160 -230 -181 -57 -7 -6 0 -15 -28 7 38 20 -16 -84 -175 -194 -124 -60 -33 -37 -115 -182 -73 80 -11 -263 -336
3371c36J24P5k4k0j4j7K3L5jOK5J0O0J52O8j46j64J3R6K5j6j5m6l3M8P8L2k2p1j29j07j0L0
$$ -336 -212 -137 -161 -181 -195 -212 -189 -154 -155 -149 -124 -114 -54 98 166 20 -144 -131 -35 -10 -26 -41 -87 -120 -72 6 38 16 -55 -184 -291 -301 -271
3366b71k0k5M7O8Oj4L7N3J7Nmn9o3L2R0N0K7M5Jn3k0j1q6p0P0J21M8J2J6nJ3M5n8j88j14Q9
$$ -271 -291 -316 -269 -201 -195 -209 -172 -119 -102 -97 -101 -160 -223 -191 -101 -51 -24 21 22 -31 -51 -62 -148 -218 -148 -27 21 33 49 44 57 102 44 -144 -258 -169
3361a69J55O6k9r2j18p4k4OQ3J46O5n6m0M7J5m5J3N6m3j04L1J19j1j10NQ2k6p0M5P3pj3j0
$$ -169 -14 52 23 -69 -187 -261 -285 -279 -196 -50 15 -41 -81 -34 -19 -64 -51 5 -38 -142 -111 8 -3 -113 -108 -26 -52 -122 -77 -4 -11 -24 -34
3356c4j09j27J7P5OO1J72O3j40j15L6K0j00q0N8J24N3m8p1j5L7O0O8M9ok4J5K6k2n5m4l8m7
$$ -34 -143 -270 -253 -178 -172 -111 61 124 -16 -131 -95 -75 -175 -255 -197 -73 -20 -68 -139 -154 -117 -57 11 60 54 30 45 71 49 -6 -50 -88 -135
3351a35k2K2K5mJ2M5Jp5n4K3K6pJ3J4m3k4Q3J01K9K1L4o0j20qJ10N4n6o2j9RL3L6OjL0K0m5
$$ -135 -157 -135 -110 -114 -102 -57 -56 -131 -185 -162 -136 -143 -130 -116 -159 -183 -100 1 30 51 85 25 -95 -103 7 61 5 -57 -76 -67 -34 2 8 7 37 57 12
3346A2p0l9j2J0N7N7k4q4k4N4L1m4p3m6pJ9K9L1K1j4j8M8R8L7o5q8l7K1N0Qo6m7L4J6m7K0
$$ 12 -58 -97 -109 -99 -42 15 -9 -93 -117 -63 -32 -76 -149 -195 -202 -183 -154 -123 -102 -116 -134 -86 12 49 -16 -104 -141 -120 -70 -62 -128 -175 -141 -125 -172 -152
3341a52J00Nj05k8O3J1j0O2J9r8m4Q9L1r9l5R8O6l0l0K2K9Rk5o1n3j0J3J3ll7l7K6P2L3k1
$$ -152 -52 -47 -152 -180 -117 -106 -116 -54 -35 -133 -177 -88 -57 -156 -191 -93 -27 -57 -87 -65 -36 -27 -52 -113 -166 -176 -163 -150 -153 -190 -227 -201 -129 -96 -117
3335a17qM3N2k4r4j3J50J44k9j02l8l5n7K2N4o9j22mP1L0K2N5L6%j6m9p2n1j4M6J05P3nmP
$$ -117 -125 -82 -30 -54 -148 -161 -11 133 104 2 -36 -71 -128 -106 -52 -121 -243 -247 -176 -146 -124 -69 -33 -33 -49 -98 -170 -221 -235 -189 -84 -11 -16 -20 -13
3330a3o4p6J2K0l5K2O5m0n5J11J22p0j26J1N7qmM4L6j2o9q4k5K0k0l3J4J4qN6J00Ro4mL5k7
$$ -13 -77 -153 -141 -121 -156 -134 -69 -109 -164 -53 69 -1 -127 -116 -59 -67 -71 -27 9 -3 -72 -156 -181 -161 -181 -214 -200 -186 -194 -138 -38 -29 -93 -97 -62 -89
3325h9k9O5P3n5j22QJ46P1p2o9JmJ6R0L8r5o5M4jr2p9n3j5J25K06P9n6n1l3jQ3M1j16q7O0
$$ -89 -118 -53 20 -35 -157 -149 -3 68 -4 -73 -72 -76 -60 30 68 -27 -92 -48 -49 -141 -220 -273 -288 -163 43 122 66 15 -18 -19 64 105 -11 -98 -38
3320c8Mj02KP6l1l8M4n1j25P0J52o1q2J75J56j40j76J8K5p5l4K1j9j8L6L9N3Q7K3p5m8L1K4
$$ -38 -34 -136 -134 -58 -89 -127 -83 -134 -259 -189 -37 -98 -180 -5 151 11 -165 -147 -122 -197 -231 -210 -229 -247 -211 -172 -119 -32 -9 -84 -132 -101 -77
3315g7j2J1L7J4m8q5mJ30J15l3j02n9k2jN0P0N3N6K0o9o4J6mr9p7K1K3l2j7O5J08L2r2q9N0
$$ -77 -89 -78 -41 -27 -75 -160 -164 -34 81 48 -54 -113 -135 -136 -86 -16 37 93 113 44 -20 -4 -8 -107 -184 -163 -140 -172 -189 -124 -16 16 -76 -165 -115
3310a15O8n3m5P9O5k6K2P2n7j65o5Q1R9L8l4n5L3J00rj35k8J49Q9j06j11M3O6n5r6%N5Oo3
$$ -115 -47 -100 -145 -66 -1 -27 -5 67 10 -155 -220 -139 -40 -2 -36 -91 -58 42 33 -102 -130 19 108 2 -109 -66 0 -55 -151 -151 -96 -90 -153
3305a53j06j14l7J19J96J13rm0oro0p1%P0O4rq7r7%J14J03J2j5pl2l4J0L0N5J17N3j17j14
$$ -153 -259 -373 -410 -291 -95 18 9 -31 -37 -46 -106 -177 -177 -107 -43 -52 -139 -236 -236 -122 -19 -7 -22 -29 -61 -95 -85 -55 0 117 170 53 -61
3300f1L4K7q7k1R6K5p6m1j0m5%Q4O5Oj2j8%L8pj10p7N7P0k5l9Oj6o4l5J7L0N5R4O1kL2P1o1
$$ -61 -27 0 -87 -108 -12 13 -63 -104 -114 -159 -159 -75 -10 -4 -16 -34 -34 4 -3 -113 -190 -133 -63 -88 -127 -121 -137 -201 -236 -219 -189 -134 -40 21 19 51 122 61
3295F1k07j30K3J0j8O4M9p7m1J07J04L0N3M0m9l5J9l2m2P2R9pm1k9q7r8k8k1j5Q4P8q5j01
$$ 61 -146 -276 -253 -243 -261 -197 -148 -225 -266 -159 -55 -25 28 68 19 -16 3 -29 -71 1 100 93 52 23 -64 -162 -190 -211 -226 -142 -64 -149 -250
3290b50N7P4m1k1R2Q9Km5m6J6J03R7qn1j0k8j12j08K1J09N5j1J6K6o7j03J6R9K9n3o9o6j6
$$ -250 -193 -119 -160 -181 -89 0 2 -43 -89 -73 30 127 119 68 58 30 -82 -190 -169 -60 -5 -16 0 26 -41 -144 -128 -29 0 -53 -122 -188 -204
3285b04P7N5o8m2J02P5p5m7R0N0p4n2M2J9l5j0L0O2J10P5p4j42o5mk6j1M8P1M6j8r3m7J25
$$ -204 -127 -72 -140 -182 -80 -5 -80 -127 -37 13 -61 -113 -71 -52 -87 -97 -67 -5 105 180 106 -36 -101 -105 -131 -142 -94 -23 23 5 -88 -135 -10
3280a0J54m7j77o3O9K8p2p4ML7j0k0M3M9l2l1O2P1K1M2K2j22j84m7N8M7N9R6O2j7p1q7k6O2
$$ -10 144 97 -80 -143 -74 -46 -118 -192 -188 -151 -161 -181 -138 -89 -121 -152 -90 -19 2 44 66 -56 -240 -287 -229 -182 -123 -27 35 18 -53 -140 -166 -104
3275a04Q2N4K7m7r6jQ6Jp3oj4j37j02P0P2l6J0J19O8n0m5K7L7ml5m4k1K6K0m5l0R3J25j3r5
$$ -104 -22 32 59 12 -84 -85 1 2 -71 -77 -91 -228 -330 -260 -188 -224 -214 -95 -27 -77 -122 -95 -58 -62 -97 -141 -162 -136 -116 -161 -191 -98 27 14 -81
3270h1j1L2l9o0k4j8M6J54R8n9n9J2k6o7k2l0l7O8R1n9p9Q6J07l9q2lM1N9N5j8o4j6K2J5L4
$$ -81 -92 -60 -99 -159 -183 -201 -155 -1 97 38 -21 -9 -35 -102 -124 -154 -191 -123 -32 -91 -170 -84 23 -16 -98 -101 -60 -1 54 36 -28 -44 -22 -7 27
3265B7K3o3r3k9Mj0j3j5J0R1R4k6o9L9Q9mq2o9k8K8P3Rq4j2J63J42r4j78oR9k8j22j8O5K0
$$ 27 50 -13 -106 -135 -131 -141 -154 -169 -159 -68 26 0 -69 -30 59 55 -27 -96 -124 -96 -23 -14 -98 -110 53 195 101 -77 -83 16 -12 -134 -152 -87 -67
3260f7nK4j1o5j4O5K9n7l6O8N8r2j39J4Q9l9q4O4J42O6K0J0n2q1l3j5rM1K6l6jM5l3o7M5P7
$$ -67 -72 -48 -59 -124 -138 -73 -44 -101 -137 -69 -11 -103 -242 -228 -139 -178 -262 -198 -56 10 30 40 -12 -93 -126 -141 -150 -109 -83 -119 -120 -75 -108 -175 -130 -53
3254e3j9l2M8N5Qj4l9k0N5O7j5o6o1l7J3P2Q4Q4M8o8j24l8qp9k2J21O0r0p3pn5m6P2Q6%jM9
$$ -53 -72 -104 -56 -1 7 -7 -46 -66 -11 56 41 -25 -86 -123 -110 -38 46 130 178 110 -14 -52 -60 -139 -161 -40 20 -70 -143 -150 -205 -251 -179 -93 -93 -94 -45
3249d5L2rl3n9l5M8R1L5k4oK6k1j08q1M0Q7N6M6J3o4n1K5qn8M0J21N5j4l8j09j22PL9p8q7
$$ -45 -13 -22 -55 -114 -149 -101 -10 25 1 -5 21 0 -108 -189 -149 -62 -6 40 53 -11 -62 -37 -45 -103 -63 58 113 99 61 -48 -170 -163 -124 -202 -289
3244b89J1Pk9L0P4O4R0O3n4q1J3L4J1P1P9n5r3K8O6k8n5kk7r8n6M2M4oK3M8l4p9KMr8k1J96
$$ -289 -278 -271 -300 -270 -196 -132 -42 21 -33 -114 -101 -67 -56 15 94 39 -54 -26 40 12 -43 -45 -72 -170 -226 -184 -140 -146 -123 -75 -109 -188 -186 -182 -280 -301 -105
3238a05J89Lk5K4q6j74n7O2N1J9kk4J9N6k0n8K3K2p1k8R1M9l6L5J09M3m6p5r0l7O9M9j07j52
$$ -105 84 87 62 86 0 -174 -231 -169 -118 -99 -101 -125 -106 -50 -70 -128 -105 -83 -154 -182 -91 -42 -78 -43 66 109 63 -12 -102 -139 -70 -21 -128 -280
3233b80J3J50O7q2n7J06J56L0r0p8l0l6o5l3M2O2om5J5O8M7L4M8J6n1q9j04o2O4J36N7l6n9
$$ -280 -267 -117 -50 -132 -189 -83 73 103 13 -65 -95 -131 -196 -229 -187 -125 -131 -176 -161 -93 -46 -12 36 52 1 -88 -192 -254 -190 -54 3 -33 -92
3229i2n1j0O2M7j4M0Q2n4j16P8J70l6j74n4M9J3kKm5l9L7M6j2l2j5j3j2j8jN7O0m4r8m2k3
$$ -92 -143 -153 -91 -44 -58 -18 64 10 -106 -28 142 106 -68 -122 -73 -60 -62 -60 -105 -144 -107 -61 -73 -105 -120 -133 -145 -163 -164 -107 -47 -91 -189 -231 -254
3223b54l2O3J57O9n7p0m3j0Q8J17j5j04j4O4Rl9k2j1k5m1l9J6O3K5J9J09P6j20j38N2O3q4
$$ -254 -286 -223 -66 3 -54 -124 -167 -177 -89 28 13 -91 -105 -41 -32 -71 -93 -104 -129 -170 -209 -193 -130 -105 -86 23 99 -21 -159 -107 -44 -128
3219a28l2R2j7j17L9J56L7n0k8q1j46m9Q0J04R6O8k1o8j7L1L1L7mq3m7Q0P0n0q8l0rj5NLj8
$$ -128 -160 -68 -85 -202 -163 -7 30 -20 -48 -129 -275 -324 -244 -140 -44 24 3 -65 -82 -51 -20 17 13 -70 -117 -37 33 -17 -105 -135 -144 -159 -154 -151 -169
3214a69j3pj4J2O8O8J0rJ3Pj5J0M5K2m0q0p3j0P6P4k8r9o8KQ8J61J01m9n2P4O3o1o4pp7j52
$$ -169 -182 -189 -203 -191 -123 -55 -45 -54 -41 -34 -49 -39 6 28 -12 -92 -165 -175 -99 -25 -53 -152 -220 -218 -130 31 132 83 31 105 168 107 43 36 -41 -193
3208a93q1J2L9P5R0Qp1m4J0K2L3M7K5kLK5K5j8n4NR2M4j06j41k1P4M3j8mO1P7J1p3r4k6O0
$$ -193 -274 -262 -223 -148 -58 -50 -121 -165 -155 -133 -100 -53 -28 -30 -27 -2 23 5 -49 -44 48 92 -14 -155 -176 -102 -59 -77 -81 -20 57 68 -5 -99 -125 -65
3203f5O0j9k7P5Q4p1j39j5P3J0n0n4p4k7J18J65K9r2m0P6P4m6r7k4Mj00j25M2J84J15l2j06
$$ -65 -5 -24 -51 24 108 37 -102 -117 -44 -34 -84 -138 -212 -239 -121 44 73 -19 -59 17 91 45 -52 -76 -72 -172 -297 -255 -71 44 12 -94
3198i4r8j7Q1P9k4q2j9R1J09j5j50j28QR7J03N1l8o1L8Q7oq3q1r9p3P7J56J8j07k6J07J10
$$ -94 -192 -209 -128 -49 -73 -155 -174 -83 26 11 -139 -267 -259 -162 -59 -8 -46 -107 -69 18 12 -71 -152 -251 -324 -247 -91 -73 -180 -206 -99 11
3194A1mj11j03LN4K7K9L6k5n1NJ3m0l6J0K3M9O6rr2p0k1lN5J01M1m2k9K7N4M3Mk0J1J7n7q2
$$ 11 7 -104 -207 -204 -150 -123 -94 -58 -83 -134 -129 -116 -156 -192 -182 -159 -110 -44 -53 -145 -215 -236 -239 -184 -83 -42 -84 -113 -86 -32 11 15 -5 6 23 -34 -116
3188a16LM5k7p9l4L7L6l9o2L1R2rr4J7J43Q5pJ2L3l5n2L9Q4j9j08n3L2J1m0k8j7k9JL3J2O
$$ -116 -113 -68 -95 -174 -208 -171 -135 -174 -236 -205 -113 -122 -216 -199 -56 29 22 34 67 32 -20 19 103 84 -24 -77 -45 -34 -74 -102 -119 -148 -147 -114 -102 -96
3183i6K1l1o0N0J22J7o4%K7l4l0Nm4o3K7P3K9k7o5n0O9J41M0n3j3j8j12p9M2K9l3L9O1q1j36
$$ -96 -75 -106 -166 -116 6 23 -41 -41 -14 -48 -78 -73 -117 -180 -153 -80 -51 -78 -143 -193 -124 17 57 4 -9 -27 -139 -218 -176 -147 -180 -141 -80 -161 -297
3178b97jO3JM8J71J14n1q2k7lK4L7j6k2O6N1p7m9Q7L8q7l2M9k2l9N3jj27n4Q0L9k4K7K4l4
$$ -297 -298 -235 -234 -186 -15 99 48 -34 -61 -64 -40 -3 -19 -41 25 76 -1 -50 37 75 -12 -44 5 -17 -56 -3 -4 -131 -185 -105 -66 -90 -63 -39 -73
3173g3QP3L2k5k6l3j8M2L3l7l8K7L1k2m8l2J6L9PJ3J08J42J7q9l3M3oj11j29n0K1Rl4k7J5
$$ -73 -65 8 40 15 -11 -44 -62 -20 13 -24 -62 -35 -4 -26 -74 -106 -90 -51 -44 -31 77 219 236 147 114 157 151 40 -89 -139 -118 -109 -143 -170 -155
3168a55M6O4M3QM5O9n9j68n3P6k9j05P0J77Lj33k3O5k9q0K8J02L0n6l3L7L2nJ3N2M9K0l4j33
$$ -155 -109 -45 -2 6 51 120 61 -107 -160 -84 -113 -218 -148 29 32 -101 -124 -59 -88 -168 -140 -38 -8 -64 -97 -60 -28 -33 -20 32 81 101 67 -66
3163f6j54K2J83Q5j03j10L0J29J49R6j1n9KK1n9p2K6R7P9J8q0j62j26n4n2k5N5J0j01j3J32
$$ -66 -220 -198 -15 70 -33 -143 -113 16 165 261 250 191 193 214 155 83 109 206 285 303 223 61 -65 -119 -171 -196 -141 -131 -232 -245 -113
3158a13K0j11M3J81L3q3j2nl5Q6J24p5j21Q3J39mj4N2j6o7J3L1l7n8n4n2J9O0QK4J01J9j04
$$ -113 -93 -204 -161 20 53 -30 -42 -47 -82 4 128 53 -68 15 154 150 136 188 172 105 118 149 112 54 0 -52 -33 27 35 59 160 179 75
3153G5j6Q3l4j39p0j1j2O6R7l7j10J1P5k2n7K1K2o8p1%j5q2n0N9J14J24J11K4j04j01J9N5
$$ 75 59 142 108 -31 -101 -112 -124 -58 39 2 -108 -97 -22 -44 -101 -80 -58 -126 -197 -197 -212 -294 -344 -285 -171 -47 64 88 -16 -117 -98 -43
3149d3k1o7m5j0L6P5L7o6j24o6M3O5J9O9J52M6j53j46j4LK7J41R4q6q0N1Pn5M2M1j08o6J24
$$ -43 -64 -131 -176 -186 -150 -75 -38 -104 -228 -294 -251 -186 -167 -98 54 100 -53 -199 -213 -210 -183 -42 52 -34 -114 -63 -56 -111 -69 -28 -136 -202 -78
3144g8R7n6m9J3n3o9O4J33K5q6l5Q6O4p4j23m0Kk8oP0R2N4j0n7l7jl1l6L9L3n6m6K9J4KP6
$$ -78 19 -37 -86 -73 -126 -195 -131 2 27 -59 -94 -8 56 -18 -141 -181 -179 -207 -213 -143 -51 3 -7 -64 -101 -102 -133 -169 -130 -97 -153 -199 -170 -156 -154 -78
3138g8P7J6M2K0j23j26M7N5p1OJ57O2j12r1Mrn6m0K0P4N6k0k6M9O2j6o6MJ03N7j20j80k5P5
$$ -78 -1 15 57 77 -46 -172 -125 -70 -141 -135 22 84 -28 -119 -115 -124 -180 -220 -200 -126 -70 -90 -116 -67 -5 -21 -87 -83 20 77 -43 -223 -248 -173
3133a73LLJ23J14nrN1pr7o5K6N6J9kL2%j34j19J02J28j28j86N1J16j6L0J34J0j22o0k5p4K3
$$ -173 -170 -167 -44 70 65 56 107 100 3 -62 -36 20 39 37 69 69 -65 -184 -82 46 -82 -268 -217 -101 -117 -87 47 57 -65 -125 -150 -224 -201
3129b01J63R4k9qJ9n0p1J7N1k4q1k4N3K2o9o9MJ8l1n0MJ00J45O2k4LJ1j06j87r3L3J10J62
$$ -201 -38 56 27 19 38 -12 -83 -66 -15 -39 -120 -144 -91 -69 -138 -207 -203 -185 -216 -266 -262 -162 -17 45 21 24 35 -71 -258 -351 -318 -208 -46
3124d6J04o5j31qQ9M0l2m3NN9L1n8q1k3jmJ8Ln0k4O4J13J06M2m5k8N7K0p4k0L3r1j45L8J19
$$ -46 58 -7 -138 -146 -57 -17 -49 -92 -87 -28 3 -55 -136 -159 -160 -164 -146 -143 -193 -217 -153 -40 66 108 63 35 92 112 38 18 51 -40 -185 -147 -28
3119b8l4q9K7J3r8k0J49J21k5n1K0L8J0PJ1k6p0o5l8n4o8rQ0J01N5Ok2m2m7j1Q3J44N1j37
$$ -28 -62 -151 -124 -111 -209 -229 -80 41 16 -35 -15 23 33 40 51 25 -45 -110 -148 -202 -270 -279 -199 -98 -43 -37 -59 -101 -148 -159 -76 68 119 -18
3114a8j63L4J67O2j01j21p2m4MM3J0jP0P2m2o5K6J6p0l1N2L1K1Q7N3l9j9K7k2kJ05P2l8OL6
$$ -18 -181 -147 20 82 -19 -140 -212 -256 -252 -209 -199 -200 -130 -58 -100 -165 -139 -123 -193 -224 -172 -141 -120 -33 20 -19 -38 -11 -33 -35 70 142 104 110 146
3108A46j25j95j1J05Rn3%L9N0M1j6l9J8Qp6n0L9J6m5J2Q3K8n7n2QK0k1j9M6L7r2j17N5J79
$$ 146 21 -174 -185 -80 -71 -124 -124 -85 -35 6 -10 -49 -31 -23 -99 -149 -110 -94 -139 -127 -44 -16 -73 -125 -117 -97 -118 -137 -91 -54 -146 -263 -208 -29
3103b9R1m1o5j7L2M0j1q0q8l7M1P8J9m5kK1p5r7L1O7k5mJ03P2j6J6P0M1k3q9j13kJ06J9j11
$$ -29 62 21 -44 -61 -29 11 0 -80 -168 -205 -164 -86 -67 -112 -114 -93 -168 -265 -234 -167 -192 -196 -93 -21 -37 -21 49 90 67 -22 -135 -137 -31 -12 -123
3098a23q6m0m3L2J08K9nJ24J28o5j34m3l9p6L5J43O6l7l9pJ1M1M8rr2j23l0J11J24%o6mN6
$$ -123 -209 -249 -292 -260 -152 -123 -128 -4 124 59 -75 -118 -157 -233 -198 -55 11 -26 -65 -72 -61 -20 28 19 -73 -196 -226 -115 9 9 -57 -61 -5
3093eJ7o5j22r2RO4L0%K0K2Koj7l2j9qk1JP0R3L3l6l2N0J17R1Nl1m1r0j11p8m9j6P5J14J2
$$ -5 12 -53 -175 -267 -258 -194 -164 -164 -144 -122 -120 -126 -143 -175 -194 -202 -223 -222 -152 -59 -26 -62 -94 -44 73 164 169 138 97 7 -104 -182 -231 -247 -172 -58 -46
3088d6r1n8L6P6N3ko6r8q4k2L9M8L3O1M7n3p8M0J03L6lRKL2P2j1p4K6Q7rj8N0l9j09M5J14
$$ -46 -137 -195 -159 -83 -30 -32 -98 -196 -280 -302 -263 -215 -182 -121 -74 -127 -205 -165 -62 -26 -29 -20 -18 14 86 75 1 27 114 105 87 137 98 -11 34 148
3083A48n0o4Q4J7j21j8L9j31j37R5J40Qm%j08r1N3L7m3M8J22nj02j3O7J4m2k3J8Rm9q5k9P0
$$ 148 98 34 118 135 14 -4 35 -96 -233 -138 2 10 6 6 -102 -193 -140 -103 -146 -98 24 19 -83 -96 -29 -15 -57 -80 -62 -53 -102 -187 -216 -146
3078a46Q4rq2l7M0J8k7K8O6j3m1P2J01j8n5jn3j46o7Q3J04M4J5J8J8jk8k7l5o8j7J04O5q6
$$ -146 -62 -71 -153 -190 -150 -132 -159 -131 -65 -78 -119 -47 54 36 -19 -20 -73 -219 -286 -203 -99 -55 -40 -22 -4 -5 -33 -60 -95 -163 -180 -76 -11 -97
3073i7m5R3j0j97j02R7Q4lPQj7K2K3p3p7M6Q6J3J5R7J12J9q0q2j9lm1j4M9J5l5N5J32Pj66
$$ -97 -142 -49 -59 -256 -358 -261 -177 -180 -173 -165 -182 -160 -137 -210 -287 -241 -155 -142 -127 -30 82 101 21 -61 -80 -83 -124 -138 -89 -74 -109 -54 78 85 -81
3068h1j15Q0J44K8p4k6P6O6n1r9m0J9QJ6Q1Q2n1j34k8J17P3p2r9l4jlj6l0kL4%l1L6N9n0o0
$$ -81 -196 -116 28 56 -18 -44 32 98 47 -52 -92 -73 -65 -49 32 114 63 -71 -99 18 91 19 -80 -114 -115 -118 -134 -164 -166 -132 -132 -163 -127 -68 -118 -178
3062a78R8J16q3j66j7P6K2j3%qOL6j4p4mO9qo7M2J13j9j41o6N3P7Q6J00M1m2l7QK3K8K1l3
$$ -178 -80 36 -47 -213 -230 -154 -132 -145 -145 -153 -147 -111 -125 -199 -203 -134 -142 -209 -167 -54 -73 -214 -280 -227 -150 -64 36 77 35 -2 6 29 57 78 45
3057D5n8J1N6k9r8k0P0oj16o8L4jq0l9M1N7O9R1K9n2n2n0p4J6J53J05o1j12k4O0O7qr1m7N7
$$ 45 -13 -2 54 25 -73 -93 -23 -29 -145 -213 -179 -180 -260 -299 -258 -201 -132 -41 -12 -64 -116 -166 -240 -224 -71 34 -27 -139 -163 -103 -36 -44 -135 -182 -125
3052a25N0J2N7O9Pj1l4j08o0Q0L9p1JM0j16j15R7J04n9j6R2j6j18m4J9M6J07M9r7o6O6N2J0
$$ -125 -75 -63 -6 63 70 59 25 -83 -143 -63 -24 -95 -94 -54 -170 -285 -188 -84 -143 -159 -67 -83 -201 -245 -226 -180 -73 -24 -121 -187 -121 -69 -59
3047e9N4Pj19j17l3pJ5M2QJ6Q6K9j04o7N8O4J3J7Mk9rK4K6J6kRN9J6j34j41M4J03JKR1L6r0
$$ -59 -5 2 -117 -234 -267 -274 -259 -217 -209 -193 -107 -78 -182 -249 -191 -127 -114 -97 -93 -122 -131 -107 -81 -65 -67 -58 1 17 -117 -258 -214 -111 -110 -108 -17 19 -71
3042g1q9L8J31R5n8j54q1J5j4m9J7P6N0Jl1n4m8MQ7J31N5p2q4M1R7jj27j24j5M0j6m7MJ6q
$$ -71 -160 -122 9 104 46 -108 -189 -174 -188 -237 -220 -144 -94 -93 -124 -178 -226 -222 -135 -4 51 -21 -105 -64 33 32 -95 -219 -234 -194 -210 -257 -253 -237 -245
3037b45P7J38j1j39k7P6NJJ06Q6ok2p1j54o8O6pj06J5J61J25N1O2P5L4l1n5PP2K9l9k1j1q2
$$ -245 -168 -30 -41 -180 -207 -131 -126 -125 -19 67 61 39 -32 -186 -254 -188 -195 -301 -286 -125 0 51 113 188 222 191 136 143 215 244 205 184 173 91
3032I1j27q0J2P0M1l2l1L8K7n1o5LJ03J73J04p0j07orp6k3J8m4n0K5mp2l0M6Q7R0k3j40k5
$$ 91 -36 -116 -104 -34 7 -25 -56 -18 9 -42 -107 -104 -1 172 276 206 99 93 84 8 -15 3 -41 -91 -66 -70 -142 -172 -126 -39 51 28 -112 -137
3027a37J25J1j05K1Q1l7j7R0J7o7J4M7k1j6k6j22q8M7M6J7J06Q5p2r3%J7M1R9K4j06r4k8J4
$$ -137 -12 -1 -106 -85 -4 -41 -58 32 49 -18 -4 43 22 6 -20 -142 -230 -183 -137 -120 -14 71 -1 -94 -94 -77 -36 63 87 -19 -113 -141 -127
3022a27R7Q7p9j22N0J12ml9L9P5K4o3q4J4N6p4j00Q2Q7j27j52K0K8n4jP0O4P3N8OL7M7r2j13
$$ -127 -30 57 -22 -144 -94 18 14 -25 14 89 113 50 -34 -20 36 -38 -138 -56 31 -96 -248 -228 -200 -254 -255 -185 -121 -48 10 16 53 100 8 -105
3017a05P1P7r8n3J02l5k08n8J05%r0nM8J3pj6j3N0J00O4J4JJ1L5J3q9j12K0O3o9j02M2R6J2
$$ -105 -34 43 -55 -108 -6 -41 -249 -307 -202 -202 -292 -297 -249 -236 -243 -259 -272 -222 -122 -58 -44 -43 -32 3 16 -73 -185 -165 -102 -171 -273 -231 -135 -123
3012a23NP2M1m6o1k9mN2J09N9n1n7M2P4k5r6o0%OJ4L1qp3m3N1O4k2r3p3K4J31J34oj32q0O1
$$ -123 -118 -46 -5 -51 -112 -141 -145 -93 16 75 24 -33 9 83 58 -38 -98 -98 -92 -78 -47 -55 -128 -171 -120 -56 -78 -171 -244 -220 -89 45 39 -93 -173 -112
3007a12R6L7QNl4q8j08p5QO4J4m0M6J46M4j31r4R1J21j7q3n0p1j13k2J33J62O4koj6l6k1J4
$$ -112 -16 21 29 34 0 -88 -196 -271 -263 -199 -185 -225 -179 -33 11 -120 -214 -123 -2 -19 -102 -152 -223 -336 -358 -225 -63 1 -1 -7 -23 -59 -80 -66
3002f6k2r3n0J05J29l5j08K9R4l7j13l2M2P7J01Rj24p6M6kn7N5J00qj9N3lq0j7M4L4L3m3k09
$$ -66 -88 -181 -231 -126 3 -32 -140 -111 -17 -54 -167 -199 -157 -80 21 30 -94 -170 -124 -126 -183 -128 -28 -36 -55 -2 -5 -85 -102 -58 -24 9 -34 -243
2997b43j71P1J67R4Q2Q2NpL2k3n4L2J8j25j30MO6Q1J01K0j18j48j00k4R9J11j01k16k6J49
$$ -243 -414 -343 -176 -82 0 82 87 80 112 89 35 67 85 -40 -170 -166 -100 -19 82 102 -16 -164 -264 -288 -189 -78 -179 -395 -421 -272
2992b72P2oP2R2j3n7MJ7l0j9M8N0k3k2O3Q2J5k8j9jJ7Qk6K5J19K0j91j63O0J06qk5Oo1r0Q
$$ -272 -200 -206 -134 -42 -55 -112 -108 -91 -121 -140 -92 -42 -65 -87 -24 58 73 45 26 25 42 50 24 49 168 188 -3 -166 -106 0 -8 -33 -27 -88 -178 -170
2987a70O7J7k9nN1Q2K8p7j00j9M1K4l1q3p8%Q5J24J22N8o1j12m4N8J11J04Nj23j32k0P9Q7
$$ -170 -103 -86 -115 -120 -69 13 41 -36 -136 -155 -114 -90 -121 -204 -282 -282 -197 -73 49 107 46 -66 -110 -52 59 163 168 45 -87 -107 -28 59
2982E9K9o9j11n6J0N5J37J56j7j74n9J12K9j60j31L1O8Jm3o8m3N6Q4k1o6M2Q7Qj4K1l4j05
$$ 59 88 19 -92 -148 -138 -83 54 210 193 19 -40 72 101 -59 -190 -159 -91 -90 -133 -201 -244 -188 -104 -125 -191 -149 -62 -54 -68 -47 -81 -186
2978a86o2j2j5M3J24P1m3l4M1M0k3n5rP5O9k4l7M7M6n6o7K9P9M8l5j08r3JM0J3ql5n4J2P0
$$ -186 -248 -260 -275 -232 -108 -37 -80 -114 -73 -33 -56 -111 -120 -45 24 0 -37 10 56 0 -67 -38 41 89 54 -54 -147 -146 -106 -93 -101 -136 -190 -178 -108
2972a08%o1jL6kJ5M7LNR1Q0n9j24p0jL2N2P1Q7M0m2o1l8m6QR9J2j54n8J43O9q5j4O1n4j22
$$ -108 -108 -169 -170 -134 -136 -121 -74 -71 -66 25 105 46 -78 -148 -149 -117 -65 6 93 133 91 30 -8 -54 -46 53 65 -89 -147 -4 65 -20 -34 27 -27 -149
2967a49k0Q3J07L1j39j63L2J01k0JJ05Pp8M1N4r7o7O0k3j03O1J77N6n3l7k6l2pNNLj0QM4J5
$$ -149 -169 -86 21 52 -87 -250 -218 -117 -137 -136 -31 -24 -102 -61 -7 -104 -171 -111 -134 -237 -176 1 57 4 -33 -59 -91 -98 -93 -88 -85 -95 -87 -43 -28
2962b8j2N6P2m6p9J6L7nJ7kj03r2L7O5%k2qJ7P3P0kj4L6J4l3oK4k6q1p2K2J12J10K9j0k0n9
$$ -28 -40 16 88 42 -37 -21 16 11 28 26 -77 -169 -132 -67 -67 -89 -97 -80 -7 63 61 47 83 97 64 58 82 56 -25 -97 -75 37 147 176 166 146 87
2957H7p7l7oM0J04P3k5m5m0q6m7N4pj21j9J14K8p1j3J6k6J2M1l4o6rK3K5L8J3lK0l9j24k2
$$ 87 10 -27 -33 7 111 184 159 114 74 -12 -59 -5 -12 -133 -152 -38 -10 -81 -94 -78 -104 -92 -51 -85 -151 -160 -137 -112 -74 -61 -64 -44 -83 -207 -229
2951b29J35O8q1m4M8J1n7m3J4M2J6j5L4R5M7lM9L8q8j08lJ9l1JN3N1O5N1m8j05l8Qm5p8l8
$$ -229 -94 -26 -107 -151 -103 -92 -149 -192 -178 -136 -120 -135 -101 -6 41 38 87 125 37 -71 -74 -55 -86 -85 -32 19 84 135 87 -18 -56 -48 -93 -171 -209
2946b09K8Q5P5j8o7KO3M1L4M3l8j29n7Q4O4l5pL6q9j77oJ59O6n2PN5%NO2O4N6L5q6j31M2J58
$$ -209 -181 -96 -21 -39 -106 -104 -41 0 34 77 39 -90 -147 -63 1 -34 -41 -5 -94 -271 -277 -118 -52 -104 -97 -42 -42 -37 25 89 145 180 94 -37 5 163
2941A63J8r1j6qj07r9j2mJ3R5P4l1l2N5M3m1l2N6O6l8j05o4j6m3n7J8Q5O0j3l7J0O2L9nK7
$$ 163 181 90 74 66 -41 -140 -152 -156 -143 -48 26 -5 -37 18 61 20 -12 44 110 72 -33 -97 -113 -156 -213 -195 -110 -50 -63 -100 -90 -28 11 6 33
2936C3R4M6p7p7O8J43J7j57j29M9J17J2o1n2p8p1N9J20kr5m2J5jpoK0R4Q4q9j65%J42P4l3
$$ 33 127 173 96 19 87 230 247 90 -39 10 127 139 78 26 -52 -123 -64 56 54 -41 -83 -68 -69 -76 -82 -62 32 116 27 -138 -138 4 78 45
2931D5n9p5o7J1P0M1j6k5O0J89J73n1k19j50m4m5k0R7J39O0NRj8n0j7%m8n3J5J8o1p1KK4j4
$$ 45 -14 -89 -156 -145 -75 -34 -50 -75 -15 174 347 296 77 -73 -117 -162 -182 -85 54 114 119 128 110 60 43 43 -5 -58 -43 -25 -86 -157 -155 -131 -145
2926a45j2K6M4O1P8N1k6p1m6J2K8j1j4N1N0m6o5Ll7j50q1J18J68N0k1qlj5j6j0J3O6R6M7j4
$$ -145 -157 -131 -87 -26 52 103 77 6 -40 -28 0 -11 -25 26 76 30 -35 -32 -69 -219 -300 -182 -14 36 15 7 4 -11 -27 -37 -24 42 138 185 171
2921A71l8q0j28n6J19J53J9l8L2K2o5n8j5l8k9K0rm0M0R2K5l6n1p0j4N3o9j82kJ71J4j36k
$$ 171 133 53 -75 -131 -12 141 160 122 154 176 111 53 38 0 -29 -9 -18 -58 -18 74 99 63 12 -58 -72 -19 -88 -270 -272 -101 -87 -223 -225
2916b25J01J6j2K0l1j7J09P9r4j27k0RLN4P5K7j1j1J3M8M3j2n7o4j3Q0Q7k3o6J7J1q0j9J46
$$ -225 -124 -108 -120 -100 -131 -148 -39 40 -54 -181 -201 -192 -189 -135 -60 -33 -44 -55 -42 6 49 37 -20 -84 -97 -17 70 47 -19 -2 9 -71 -90 56
2911E6J31j3m3%j7n1n4m8j5L1K0J0Q7J04l3j47r3rJ2K6M6lq4q8l5J1M8L6m2p1J7Q6O9O0N4
$$ 56 187 174 131 131 114 63 9 -39 -54 -23 -3 7 94 198 165 18 -75 -84 -72 -46 0 -3 -87 -175 -210 -199 -151 -115 -157 -228 -211 -125 -56 4 58
2906E8m5j12k1O3L2L8P7k3j17j7P3j1o9oqn3J9J00N3JOj1m1l6kP7J55O8r3p9M2L5l5k3ml9
$$ 58 13 -99 -120 -57 -25 13 90 67 -50 -67 6 -5 -74 -80 -88 -141 -122 -22 31 32 38 27 -14 -50 -52 25 180 248 155 76 118 153 118 95 91 52
2900E2o7o5j3Q0R7L2K1K4p6r7M1N5p7j3J69J14m7l5Rj8L0O7n1j08rMp6m3L1J8J9M2KNO2j1
$$ 52 -15 -80 -93 -13 84 116 137 161 85 -12 29 84 7 -6 163 277 230 195 204 186 216 283 232 124 115 119 43 0 31 49 68 110 112 117 179 168
2895A68j15JJ17m1j78k7J16K2p6l4j0j9N9J16j2j63j00O3P9kkM1L4kl6n6L9J73J06r6r0P2
$$ 168 53 54 171 130 -48 -75 41 63 -13 -47 -57 -76 -17 99 87 -76 -176 -113 -34 -36 -38 3 37 35 -1 -57 -18 155 261 165 75 147
2890A47N5r4j19m5J2M6K0n0rR5O9J8J02Q5j50k38k2J41N9j5M2%j89k26QJ83Q6j9K5J0p3K2
$$ 147 202 108 -11 -56 -44 2 22 -28 -37 58 127 145 247 332 182 -56 -78 63 122 107 149 149 -40 -266 -258 -75 11 -8 17 27 -46 -24
2886b4J38j7j60J0J56O0L9J47Q3p5j04r9n4J09J19j16j37J15J25r4j06J1KJ6Q3pj34r0l6m3
$$ -24 114 97 -63 -53 103 163 202 349 432 357 253 154 100 209 328 212 75 190 315 221 115 126 128 144 227 220 86 -4 -40 -83
2881h3N2J13k2r5L0O7n2m4Q4Q9k2n2QJ7m6l6P8R6o6j50k8O5Jo2l9J9P5O4k0j1P8J9j04j8J23
$$ -83 -31 82 60 -35 -5 62 10 -34 50 139 117 65 73 90 44 8 86 182 116 -34 -62 3 4 -58 -97 -78 -3 61 41 30 108 127 23 5 128
2876A28M7p1rM7k9m8R8K02P9j45j62J4L7r3l6J14J7j06J5P4o3l0J17K0r9L1P8r1r3N6L0n1
$$ 128 175 104 95 142 113 65 163 365 444 299 137 151 188 95 59 173 190 84 99 173 110 80 197 217 118 149 227 136 43 99 129 78
2871G8lJ5l6k4j8k2N7Q1j8QQ2p1j63O8J83l0r9M3Pr6k6Rl0O0R7o9q9R3J02j4K5M8m2RQ3o8
$$ 78 75 90 54 30 12 -10 47 128 110 118 200 129 -34 34 217 187 88 131 138 42 16 25 -5 55 152 83 -6 87 189 175 200 248 206 215 298 230
2866B30j53L3Q8j21j65M1J44O7JJ2L3L3J1ll0p5k1J05P8n9k0R6j3j51m4Q4J0n4L0Q0J3q6j33
$$ 230 77 110 198 77 -88 -47 97 164 165 177 210 243 254 251 221 146 125 230 308 249 229 325 312 161 117 201 211 157 187 267 280 194 61
2861F1p4L4Q0O6Q0O1l5j04j13r2NJ15O1n9k4M5l9j10m2M8Q7J12O7pK3Q2K0p4n7KNj8j3L0O1
$$ 61 -13 21 101 167 247 308 273 169 56 -36 -31 84 145 86 62 107 68 -42 -84 -36 51 163 230 223 246 328 348 274 217 219 224 206 193 223 284
2856B84K2l6m3m7q2m9L9O9O9P0j8j22n9M8J1l4L1K0r5q0K0on9L1J25Q8M3M4ln9pO8K7n0j4
$$ 284 306 270 227 180 98 49 88 157 226 296 278 156 97 145 156 122 153 173 78 -2 18 12 -47 -16 109 197 240 284 281 222 215 283 310 260 246
2851B46P5N5o2j04l0K8nl5MK6mQP3L4r4r4K7M4k7K1R9K5p5o0l7k3M9O8JJ2N8l7r2O5J38k2
$$ 246 321 376 314 210 180 208 203 168 172 198 194 202 275 309 215 121 148 192 165 186 285 310 235 175 138 115 164 232 233 245 303 266 174 239 377 355
2846C55j11m5k3jP8J6j13k6J23N1p2o7m4QJ17Q0q4q3M5O7O0Q8mj45r7M2Q7Q1N7J8M4N8n0o6
$$ 355 244 199 176 175 253 269 156 130 253 304 232 165 121 129 246 326 242 159 204 271 331 419 415 270 173 215 302 383 440 458 502 560 510 444
2841D44P7N0j58j55J1L2lK8m0j07M7J83N6p1m2n1j11p2K6Q9J01L9rL6K6o9l1Q7K9o6j2l0j59
$$ 444 521 571 413 258 269 301 298 326 286 179 226 409 465 394 352 301 190 118 144 233 334 373 364 400 426 357 326 413 442 376 364 334 175
2836A75r8M6om2R3R3o0n6M3J8kN3K0n7k5O8J43J63O9j7N8J14K3j8kj04j41K4O6o3qJ33M6o7
$$ 175 77 123 117 75 168 261 201 145 188 206 204 257 277 220 195 263 406 569 638 621 679 793 816 798 796 692 551 575 641 578 570 703 749 682
2831F82j7l9j10j0N1p0p3N4Lr2J0O6l7lJ35R2n1p4n1m0L7J37J38L5p4o9K8K7p1q6n1o9j2J25
$$ 682 665 626 516 506 557 487 414 468 471 379 389 455 418 415 550 642 591 517 466 426 463 600 738 773 699 630 658 685 614 528 477 408 396 521
2826E21J07kLmr6l7J14N2r5o3K0M1Q7P4o8j28n5%O6J18Lr3N8J49k5r7O3J15J7pKk5l2l5j9
$$ 521 628 626 629 625 529 492 606 658 563 500 520 561 648 722 654 526 471 471 537 655 658 565 623 772 747 650 713 828 845 838 840 815 783 748 729
2821G29N5J6j09L5K80J33j46m4J12k1p9M2k2j41k7N3n2l5J05O1p9p4M8J38Q3p0o5O9K3q7J9
$$ 729 784 800 691 726 1006 1139 993 949 1061 1040 961 1003 981 840 813 866 814 779 884 945 866 792 840 978 1061 991 926 995 1018 931 950
2816I50O5j22j13J19J02l7L1L4j10l5Q8n0o5J60J14j13k3J18mn8kj04j07J19J23p6k6R2j0
$$ 950 1015 893 780 899 1001 964 995 1029 919 884 972 922 857 1017 1131 1018 995 1113 1109 1051 1049 945 838 957 1080 1004 978 1070 1060
2812A060m8M6Mj3J45J57pm2PM7J66J58r0j58K7M6m4J4K4l5R0J37o9o4J48O5p6P6Q4j12j3J34
$$ 1060 1012 1058 1062 1049 1194 1351 1344 1302 1309 1356 1522 1680 1590 1432 1459 1505 1461 1475 1499 1464 1554 1691 1622 1558 1706 1771 1695 1771 1855 1743 1730 1864
2807A864o0q6J59N5j77K7J83n5j05R0P6N6J52k6k20J4J77j3l0Q1q1j36R8J13k1R1J09p2J1
$$ 1864 1804 1718 1877 1932 1755 1782 1965 1910 1805 1895 1971 2027 2179 2153 1933 1947 2124 2111 2081 2162 2081 1945 2043 2156 2135 2226 2335 2263 2274
2803B274J37m7k5K73J72j01N5J69m4j2J78L6m7J29P5n2J00Q1j11J20L37oj59J70J69n7J42
$$ 2274 2411 2364 2339 2612 2784 2683 2738 2907 2863 2851 3029 3065 3018 3147 3222 3170 3270 3351 3240 3360 3697 3691 3532 3702 3871 3814 3956
2799C956K77Jk0K02J32Q5K65K33J49K82J41j30J19L62O2RL37K14jL01L71L0J46L81Q5L2M51
$$ 3956 4233 4234 4214 4416 4548 4633 4898 5131 5280 5562 5703 5573 5692 6054 6116 6125 6462 6676 6675 6976 7347 7377 7523 7904 7989 8021 8472
2795H472M14J37L13L33M0K28N06K39J90N19L71J76N35N65K04M70Q08M29L24P62O52L70P24
$$ 8472 8886 9023 9336 9669 9709 9937 10443 10682 10872 11391 11762 11938 12473 13038 13242 13712 14520 14949 15273 16035 16687 17057 17781
2792A7781Q71O05Q18R86O14Q09J384J061P55J426J647J133J356J832J618J765K289K024J939
$$ 17781 18652 19257 20075 21061 21675 22484 23868 24929 25684 27110 28757 29890 31246 33078 34696 36461 38750 40774 42713
2789D2713K764K851K324K872L458L178L787M971M905N116O639P111O891Q383R839J0218J2787
$$ 42713 45477 48328 50652 53524 56982 60160 63947 68918 73823 78939 85578 92689 99580 107963 117802 128020 140807
2787A40807J7234K0674K5852L4676M2945N0971O3002P6048Q8354J06995J32850J61801K02558
$$ 140807 158041 178715 204567 239243 282188 333159 396161 472209 560563 667558 800408 962209 1164767
2785A164767K61912L28519L98968M74140N04018M08847J85761p3538k79513l96196m19465
$$ 1164767 1426679 1755198 2154166 2628306 3132324 3541171 3726932 3653394 3373881 2977685 2558220
2783B558220l74439l12186k63895k24055j87821j62579j45808j29244j14088j01738q8544
$$ 2558220 2183781 1871595 1607700 1383645 1195824 1033245 887437 758193 644105 542367 453823
2781D53823p5600o5195n4014m1873l3343k7581k1340j6592j4405j1971r478q637p634n802
$$ 453823 378223 313028 259014 217141 183798 156217 134877 118285 103880 91909 82431 73794 66160 60358
2779F0358n231n190l996l225l472k965k254k576k459j584j661k023j378j071j505j191p03
$$ 60358 55127 49937 45941 42716 39244 36279 34025 31449 28990 27406 25745 23722 22344 21273 19768 18577 17874
2777A7874j172j305o53o33q96m50k93p24n41j84n36o35j70k32m87j62p6m06k31ol93m80o6
$$ 17874 16702 15397 14744 14111 13215 12765 12472 11748 11207 11023 10487 9852 9682 9450 8963 8801 8725 8319 8088 8082 7689 7209 7143
2773G143r4k56J4J4k75p6Q2k89k92P5j24l90r0n3l82j81J44r0j96L0j03k60qm0l15n1K10j51
$$ 7143 7049 6793 6807 6821 6546 6470 6552 6263 5971 6046 5922 5532 5442 5389 5007 4826 4970 4880 4684 4714 4611 4351 4343 4303 3988 3937 4147 3996
2769C996k89M8K0j75L9J01j84j16J02p0j47R1L9j98j08M8J1qq4j90kJ48j30k62K2N0j47j3
$$ 3996 3707 3755 3775 3600 3639 3740 3556 3440 3542 3472 3325 3416 3455 3257 3149 3197 3208 3200 3116 2926 2924 3072 2942 2680 2702 2752 2605 2592
2765B592J14q7q8R7l1j63PK8j06QN4j57j35J8j50k20Q9J83j3k5j3j27jJ75rj30M4j5k14l9
$$ 2592 2706 2619 2531 2628 2597 2434 2441 2469 2363 2371 2425 2268 2133 2151 2001 1781 1870 2053 2040 2015 2002 1875 1874 2049 2040 1910 1954 1939 1725 1686
2761A686J45Jl8K6j49j53J97J99j63j68L7rk2Q5n8k08j7J23J1kL8n1l7Q0Pp6L9M6r5o8K2l4
$$ 1686 1831 1832 1794 1820 1671 1518 1715 1914 1751 1583 1620 1611 1589 1674 1616 1408 1391 1514 1525 1523 1561 1510 1473 1553 1560 1484 1523 1569 1474 1406 1428 1394
2756A394k7Q1L3q2o0KL1O1L3J2P6J7j55q7J29J00k2Mlj5J33J28j34j60M0pj20j5n5k50r4J97
$$ 1394 1367 1448 1481 1399 1339 1341 1372 1433 1466 1478 1554 1571 1416 1329 1458 1558 1536 1540 1537 1522 1655 1783 1649 1489 1529 1522 1402 1387 1332 1082 988 1185
2751A185J04p1K3P3k8j4J0q7q6j1p1j05j6ol4P1J12l8j22m7M3Q0L1n3mP1m8j23N6J36j6m8
$$ 1185 1289 1218 1241 1314 1286 1272 1282 1195 1109 1098 1027 922 906 900 866 937 1049 1011 889 842 885 965 996 943 939 1010 962 839 895 1031 1015 967
2747I67K3m0m0J00O7n8lJj33n5J12K3l9J08N3j58q8N7qL1J78K0k36j44O1Q7N8rj25q3J9l0
$$ 967 990 950 910 1010 1077 1019 1016 1017 884 829 941 964 925 1033 1086 928 840 897 889 920 1098 1118 882 738 799 886 944 935 810 727 746 716
2742G16L5K65J64j93j92N0L3p1kNp9m7j1o1j8Q5Q8N6Mj06q9Q1R9j3RM1n6p4k2p9q6K8Kn4J02
$$ 716 751 1016 1180 987 795 845 878 807 805 810 731 684 673 612 594 679 767 823 827 721 632 713 812 799 808 849 793 719 697 618 532 560 562 508 610
2737F10J37j21j61R5J08n7J0R2o7j51n7n9o6P9J06o4q7L5mj50j46k9O6J29J77J67Q3j8l1M1
$$ 610 747 626 465 560 668 611 621 713 646 495 438 379 313 392 498 434 347 382 378 228 82 53 119 248 425 592 675 657 626 667
2733F67Q9R1Q0K1n8l5N4L5n4p2j6K5J3l3k7L7J4n2mM3n9p7O7O0r1n9N3rn7J0l4j09J3J22L6
$$ 667 756 847 927 948 890 855 909 944 890 818 802 827 840 807 780 817 831 779 775 818 759 682 749 809 718 659 712 703 646 656 622 513 526 648 684
2727F84j2Jo9o3N7kj42pJ87R7n9o0l4J4J29J30Ml9l4o9m5kn1m2M9oj11lJ14L1k3L5kn8J7O4
$$ 684 672 673 604 541 598 596 454 447 634 731 672 612 578 592 721 851 855 816 782 713 668 666 615 573 622 616 505 502 616 647 624 659 657 599 616 680
2722F80J8J3Nm3kJ4j12j10Q3R8m9oR7J6m2J5j6n4K6j1j56q3J05N9p5n3K2O6J01M9n7l8K7k4
$$ 680 698 711 716 673 671 685 573 463 546 644 595 589 686 702 660 675 659 605 631 620 464 381 486 545 470 417 439 505 606 655 598 560 587 563
2717E63q4l8K7P6R7L4k6j1l3n3P7J50m4j91n6N5rk5L2J8pK3K4K8N9Qj01j21o0J8Q7L2q7m4
$$ 563 479 441 468 544 641 675 649 638 605 552 629 779 735 544 488 543 534 509 541 559 552 575 599 627 686 694 593 472 412 430 517 549 462 418
2712D18P7J2q3lJ9j09q9R1J49R0L7l8p7k5l4r5j7P5J8mN6k6j40m3P5L9J9N7M8Q0J07k7j06
$$ 418 495 507 424 421 440 331 242 333 482 572 609 571 494 469 435 340 323 398 416 412 468 442 302 259 334 373 392 449 497 577 684 657 551
2707E51N8R9j24j74J1M9l2KK7l3k1Po3r4m8l6K5J36P4o4J1J18j3j27nJ13M4p7j15l7P7O9j8
$$ 551 609 708 584 410 421 470 438 440 467 434 413 420 357 263 215 179 204 340 414 350 361 479 466 339 334 447 491 414 299 262 339 408 390
2702C90nK5o1o6R3J48N0ll8j26r6N5O0n8p7l7m5k3M0N2Pl8m6QO3M0K1N7N5jJ6N2ml5M0Q0J1
$$ 390 385 410 349 283 376 524 574 571 533 407 311 366 426 368 291 254 209 186 226 278 285 247 201 209 272 312 333 390 445 444 460 512 508 473 513 593 604
2697F04n5n8o2j02j26l9P8M7n1QQ4k6r4M2R2k0j2Q8M2oM3rr1OR4km7j0q1j01P6J46j5q9qJ6
$$ 604 549 491 429 327 201 162 240 287 236 244 328 302 208 250 342 322 310 398 440 434 477 468 377 383 477 475 428 418 337 236 312 458 443 354 346 362
2692C62kO%M4J09nj85j12P9Q0J0K9J7j5K2J7k9K8O9m4r6pom5M4Q2m4o6L9Lj15q5j3k2J9J24
$$ 362 360 366 366 410 519 514 329 217 296 376 386 415 432 417 439 456 427 455 524 480 384 377 371 326 370 452 408 342 381 384 269 184 171 149 168 292
2686B92J29J9q2r5pQ9P1j7m5lK9J0n6n3O5J00m0j40r2n3l2M5N3o2r1j2LK3J38J61Pj19j18
$$ 292 421 440 358 263 256 345 416 399 354 351 380 390 334 281 346 446 406 266 174 121 89 134 187 125 34 22 25 48 186 347 354 235 117
2682A17o5J2P4N4jj0K8J12J42Mj32l6J01M2l7k0n2p1P8J51k6j46o6j8m5k7l1o8MJ22J18N9
$$ 117 52 64 138 192 191 181 209 321 463 467 335 299 400 442 405 385 333 262 340 491 465 319 253 235 190 163 132 64 68 190 308 367
2677C67Rn1k5J06R8o6j12jO6N0Jq7j23l4N6O2M5Nl8mL8k9p4PM8j3l0j7n4l8M3L9j8J7L0n7
$$ 367 376 325 300 406 504 438 326 325 391 441 442 355 232 198 254 316 361 366 328 324 362 333 259 266 314 301 271 254 200 162 205 244 226 243 273 216
2672B16n2J03J75N8q5j18o9l6n4o2k6JJ3N3Q5N1j4m3k6K1K2o8r9J7R6J8m0Jjm1j8Qj8J6Q6
$$ 216 164 267 442 500 415 297 228 192 138 76 50 51 64 117 202 253 239 196 170 191 213 145 46 63 159 177 137 138 137 96 78 86 68 84 170
2667A70N9k5l8J7Q1J09O0k1o1q7j07m3M6M0J9P9Q6k9j02m5K5J2m0k2O7Q9j0o7k0l2q6k5O7
$$ 170 229 204 166 183 264 373 433 412 351 264 157 114 160 200 219 298 384 355 253 208 233 245 205 183 250 339 329 262 242 210 124 99 166
2662A66N1M2O9mp2K4P0o6j19k5k7q3K7J38M9n8j6L2k7q7l9N3M3l9j8N5l4j54n3P3OOJ56J02
$$ 166 217 259 328 324 252 276 346 280 161 136 109 26 53 191 240 182 166 198 171 84 45 98 141 102 84 139 105 -49 -102 -29 -23 -17 139 241
2657B41j31j16M3K1k0P7O7n3J6J53O3r5o0N2O4Mn4o3qL4L1J5l1q5j8J15J00l0q2o3o4n0j1
$$ 241 110 -6 37 58 38 115 182 129 145 298 361 266 206 258 322 326 272 209 201 235 266 281 250 165 147 262 362 332 250 187 123 73 62
2652F2QL5N8J0m4l2k5k9J2J7m1pQ4Mj20oJ68R6o9o6JPL0O0ko9j5O3K3o2m4K0J5PO1O8j6n2
$$ 62 70 105 163 173 129 97 72 43 55 72 31 24 108 112 -8 -14 154 250 181 115 116 123 153 213 211 142 127 190 213 151 107 127 142 149 210 278 262 210
2646B10m1j03j09N1J59N9l3k9o0m6Q2Q2q2r7J8j3q0KM5l4k8N1K4jQ2P6m5m8O2P9k1j06p8N6
$$ 210 169 66 -43 8 167 226 193 164 104 58 140 222 140 43 61 48 -32 -30 15 -19 -47 4 28 27 109 185 140 92 154 233 212 106 28 84
2641H4J25K6n0K2L6j02j53m4N6R1Q4Jo7k0K7mjL8mo0l9QO4J17M0j27j26RJ6o1l4K6J8K9N9
$$ 84 209 235 185 207 243 141 -12 -56 0 91 175 176 109 89 116 112 111 149 145 85 46 54 118 235 275 148 22 31 47 -14 -48 -22 -4 25 84
2636H4Kq6j02l6R3J82R8n8n7L5L0j0j4n2p0kJ0n9l2O0M9L3Q9L3j00m8R9O6j8Jl6j40j00rl3
$$ 84 86 0 -102 -138 -45 137 235 177 120 155 185 175 161 109 39 37 47 -12 -44 16 65 98 187 220 120 72 171 237 219 220 184 44 -56 -65 -98
2631i8qJ12N9j12o1J05M8q0l4M0K7O2J08J6o7j4J4k5J3M9m4j05j9L6Oj2l5p7PJ37Q9l1NN1
$$ -98 -106 6 65 -47 -108 -3 45 -35 -69 -29 -2 60 168 184 117 103 117 92 105 154 110 5 -14 22 28 16 -19 -96 -89 48 137 106 111 162
2626A62n5j23m6J7L4O6K0q7n0J04J26J9n2j20j96j07J14J83K6j17p9O1J20M6m1l4RK2K6Rl5
$$ 162 107 -16 -62 -45 -11 55 75 -12 -62 42 168 187 135 15 -181 -288 -174 9 35 -82 -161 -100 20 66 25 -9 0 22 48 57 22
2621B2l3Jk5p3j4Q2R1N7J9k4OR5N3q0n2O1Oj08o7j1m3J5J34N5j08k9J53R4j01j17NL5pK7Q2
$$ 22 -11 -10 -35 -108 -122 -40 51 108 127 103 109 204 257 177 125 186 192 84 17 6 -37 -22 112 167 59 30 183 277 176 59 64 99 92 119 201
2616B01K4o2k9K6n8j09M8J80J5j87j10M7L4rN5P5j1l1M3N0j7k1L8L8k8p4o1l1j4j5l6n3j7
$$ 201 225 163 134 160 102 -7 41 221 236 49 -61 -14 20 11 66 141 130 99 142 192 175 154 192 230 202 128 67 36 22 7 -29 -82 -99
2612i9N2R0J04Q3k0j33q4N1N4m5m5j1n4m9M3M4JP1J30K6n4k4m6q2j0j0j26o1J60J41o3q9K
$$ -99 -47 43 147 230 210 77 -7 44 98 53 8 -3 -57 -106 -63 -19 -18 53 183 209 155 131 85 3 -7 -17 -143 -204 -44 97 34 -55 -53
2607e3j0l3J3NmQ9J02j8k0R7N9r5j09K2R6M5l0NQ4Lj84j58M4R1OK4N6n6j26l6O7O8Kr5r6N1
$$ -53 -63 -96 -83 -78 -82 7 109 91 71 168 227 132 23 45 141 186 156 161 245 248 64 -94 -50 41 47 71 127 71 -55 -91 -24 44 46 -49 -145 -94
2601i4J09KJJ16N2j29j12K4N5L7M1j4o4nN3Np6r3j3Q7M3j05j01L8M0l1P4K08J23m4o0ML9J6
$$ -94 15 17 18 134 186 57 -55 -31 24 61 102 88 24 19 72 77 1 -92 -105 -18 25 -80 -181 -143 -103 -134 -60 148 271 227 167 171 210 226
2596B26o1p9M8J45M9r6j36j03j9O5Pj33j12N5J19M2k0nL0nr3o9P7J03Lj2lj26j45J09K59Q6
$$ 226 165 86 134 279 328 232 96 -7 -26 39 46 -87 -199 -144 -25 17 -3 -8 22 17 -76 -145 -68 35 38 26 23 -103 -248 -139 120 206
2592B06r8q1j1M2Q3J4j10j05k0J2L1P0O0J4l0q7p3P1J23mn1N5M0j02j02KKm0K9R1M0j7J5L5
$$ 206 108 27 16 58 141 155 45 -60 -80 -68 -37 33 93 107 77 -10 -83 -12 111 107 56 111 151 49 -53 -51 -49 -89 -60 31 71 54 69 104
2587A04k7m5L6M9q3j36j8N8J8K3K7q3j04P8J47Km8K4ql7J07J75Mj14l5M3N6L5p9j82p7R3N2
$$ 104 77 32 68 117 34 -102 -120 -62 -44 -21 6 -77 -181 -103 44 46 -2 22 14 -23 84 259 263 149 114 157 213 248 169 -13 -90 3 55
2582E5q4p9KL8O8Q9J6q9q3J8P4Lr7p3L8N2k8k7M9O7L4Jn3j04n8L2O1P7J04L5j06j27k6K0O
$$ 55 -29 -108 -106 -68 0 89 105 16 -67 -49 25 28 -69 -142 -104 -52 -80 -107 -58 9 43 44 -9 -113 -171 -139 -78 -1 103 138 32 -95 -121 -101 -95
2577i5N9J06J2j07p7J5J6J4R8J30K1p2n5l1m7l1Mpj5K4L6LMjq2j18J5J22L5n4J7O1m2j10j7
$$ -95 -36 70 82 -25 -102 -87 -71 -57 41 171 192 120 65 34 -13 -44 -40 -47 -62 -38 -2 1 5 4 -78 -196 -181 -59 -24 -78 -61 0 -42 -152 -169
2572a69P7N7pn0l2N3R1oj14p1N6J21R8lr1j7J47J54m5j82r3O0O9n7r0N6J38k7j76p1N6k6j12
$$ -169 -92 -35 -42 -92 -124 -71 20 14 -100 -171 -115 6 104 101 10 -7 140 294 249 67 -26 34 103 46 -44 12 150 123 -53 -124 -68 -94 -206
2567b06k0Q9P3L0K8K0j8m2LO3J1j11r3O8J22K4m3l1JL7J2j02j17N6J80J25J3n3o1MK5q5j15
$$ -206 -226 -137 -64 -34 -6 14 -4 -46 -43 20 31 -80 -173 -105 17 41 -2 -33 -32 5 17 -85 -202 -146 34 159 172 119 58 62 87 2 -113
2562a13L8J03N%P3j1j24o4L3M6N5Nj08o1Q9K0j42p2N6mm7N3P7K1M8L8r4j10N5J23M0oJ4K7
$$ -113 -75 28 33 33 106 95 -29 -93 -60 -14 41 46 -62 -123 -34 -14 -156 -228 -172 -176 -223 -170 -93 -72 -24 14 -80 -190 -135 -12 28 22 36 63
2557F3J8m3j25q7R1K01J30l2j40j05K9P1l3r1j0N3J4k1j1j9l0qK0K8M4N6J4n9p6J7J66K14
$$ 63 81 38 -87 -174 -83 118 248 216 76 -29 0 71 38 -53 -63 -10 4 -17 -28 -47 -77 -85 -65 -37 7 63 77 18 -58 -41 125 339
2552C39P1j37k07j10J3P1O4J4k5J0P9N1o7j17m0K3ml3k5k3j8L0O1Lo9l8O7P7m3j22l3R8R1
$$ 339 410 273 66 -44 -31 40 104 118 93 103 182 233 166 49 9 32 28 -5 -30 -53 -71 -41 20 23 -46 -84 -17 60 17 -105 -138 -40 51
2547E1%l0OL6N3M5k6r9q5j8J8M3P0K4r2q8O8J06n7j38j2P6J8K0R3N1m8k5K6j1qN2J7m5J9Q0
$$ 51 51 21 27 63 116 161 135 36 -49 -67 -49 -6 64 88 -4 -92 -24 82 25 -113 -125 -49 -31 -11 82 133 85 60 86 75 67 119 136 91 110 190
2542A90j3j13q6j0O1P7j3r3l7K5QM6R8m9j89j9J81N2j50j11l2n6K8J89J21r3j27j7J0j4K0
$$ 190 177 64 -22 -32 29 106 93 0 -37 -12 -4 42 140 91 -98 -117 64 116 -34 -145 -177 -233 -205 -16 105 12 -115 -132 -122 -136 -116
2538a16J8m7k3R7R7k6p3kL0J%%l2k4K5Rl5j7Nk2l1l0q6q3M9J03j1n2O4J12L5RN2O8Q0P8oo8
$$ -116 -98 -145 -168 -71 26 0 -73 -75 -45 -44 -44 -44 -76 -100 -75 -66 -101 -118 -113 -135 -166 -196 -282 -365 -316 -213 -224 -276 -212 -100 -65 -56 -4 64 144 222 216 148
2532A48MN9m3j32m3Q4P8l9j25o4Q5J06m9j15k6op6%J25K8j23j9J46R4j4J5M2%K1N9j2q0m3
$$ 148 152 211 168 36 -7 77 155 116 -9 -73 12 118 69 -46 -72 -78 -154 -154 -29 -1 -124 -143 3 97 83 98 140 140 161 220 208 128 85
2527H5k8n0mL6j6pJ15J08m8o3N4K7q8m8M4k0p8L9J18J5m4L2K2q8n9P4N0p3o2J4j9q0m0M3O6
$$ 85 57 7 3 39 23 16 131 239 191 128 182 209 121 73 117 97 19 58 176 191 147 179 201 113 54 128 178 105 43 57 38 -42 -82 -39 27
2522B7K2n3n9M9J01Mn9J0L2l8n2l2o0j1J47J74mj16l2O8M5k5m1k6k1lN7P6%n7pK1m3o9kL5
$$ 27 49 -4 -63 -14 87 91 32 42 74 36 -16 -48 -108 -119 28 202 198 82 50 118 163 138 97 71 50 47 104 180 180 123 116 137 94 25 23 58
2517E8jl8k3L3N4n7j62p3O5Rp7L9J76J35K4l9o0j3M7j3r0k2M1l5o7O0J50J11M0k3q2r1m3K4
$$ 58 57 19 -4 29 83 26 -136 -209 -144 -135 -212 -173 3 138 162 123 63 50 97 84 -6 -28 13 -22 -89 -29 121 232 272 249 167 76 33 57
2512E7P6K8r8r7L4P0k0l9L6Q6R2J5j49j75LR6j7p3K5O0k6p6J1J61J85rj89j08N2O4L7P0K6
$$ 57 133 161 63 -34 0 70 50 11 47 133 225 240 91 -84 -81 15 -2 -75 -50 10 -16 -92 -81 80 265 256 67 -41 11 75 112 182 208
2507B08p3m2N9O2Pj0MM5P7L4m3r2j43j40J4J54J03J3J5k7r6k5P0Ro6k5j4o9o1LL0M4O5L8l0
$$ 208 135 93 152 214 221 211 215 260 337 371 328 236 93 -47 -33 121 224 237 252 225 129 104 174 183 117 92 78 9 -52 -49 -19 25 90 128 98
2502I8q7p9j0L1j7k4N2Lj39q7Q5Q1K2J04R8j13j77j1O4K0O8R6j6q8l2QK2M8J1k6P2J26l1j25
$$ 98 11 -68 -78 -47 -64 -88 -36 -33 -172 -259 -174 -93 -71 33 131 18 -159 -170 -106 -86 -18 78 62 -26 -58 -50 -28 20 31 5 77 203 172 47
2497D7J0Q4j2k2M2l2j12MJ24N1p8j42j54m6R9O5o0%J06J4p4K0L8o9j1J25K4j37n2P5K1l1k
$$ 47 57 141 129 107 149 117 5 9 133 184 106 -36 -190 -236 -137 -72 -132 -132 -26 -12 -86 -66 -28 -97 -108 17 41 -96 -148 -73 -52 -83 -85
2492h5k5k3Q3Q0n9p9L9P1K2Jj4rM4K5r3j09K7J03M0l3m6%M0pn7J9P5k9p8O0J30Pp5l4k0qN6
$$ -85 -110 -133 -50 30 -29 -108 -69 2 24 25 11 2 46 71 -22 -131 -104 -1 39 6 -40 -40 0 -7 -64 -45 30 1 -77 -17 113 120 45 11 -9 -17 39
2487C9O0oJL1m7j04l4K3j6j6M7M4k3l5J2L1K2L6N0J5k0NM2Lq7r6oO2Jq9j8J62J73m4j91j10
$$ 39 99 93 94 125 78 -26 -60 -37 -53 -69 -22 22 -1 -36 -24 7 29 65 115 130 110 115 157 160 73 -23 -29 33 34 -55 -73 89 262 218 27 -83
2481h3K8N9L5M4O7L0q0j17j8M9%J6J35J03r2j55n3LL9J10Q1k0JN1m7j25l8Np1n6Q2J17J5p9
$$ -83 -55 4 39 83 150 180 100 -17 -35 14 14 30 165 268 176 21 -32 -29 10 120 201 181 182 233 186 61 23 28 -43 -99 -17 100 115 36
2476C6j04p5%N4N7N8O5L7j2n6q5o3J7N3K7J6K2k1p4m4L3L1k7j7M8N3K7N9O8k3n7M6P8m5j04
$$ 36 -68 -143 -143 -89 -32 26 91 128 116 60 -25 -88 -71 -18 9 25 47 26 -48 -92 -59 -28 -55 -72 -24 29 56 115 183 160 103 149 227 182 78
2471G8l0NqL2M8k6q4r6j03l5P0M0o4l4O6Q4J02J32Qj71j31N3J12L8l4o1l7M0O1k2p6j7L7L
$$ 78 48 53 45 77 125 99 15 -81 -184 -219 -149 -109 -173 -207 -141 -57 45 177 185 14 -117 -64 48 86 52 -9 -46 -6 55 33 -43 -60 -23 -20
2466b0k9PL1K2Q2J53O8p3l5P8Rj05m2L4n6j14l4K5M1Q2O7l5o4l3n8o7oKm0J0P0Nm9J8N7j3
$$ -20 -49 -42 -11 11 93 246 314 241 206 284 293 188 146 180 124 10 -24 1 42 124 191 156 92 59 1 -66 -72 -70 -110 -100 -30 -25 -74 -56 1 -12
2461a2q1o2%N4P0N6Q2J18Q5pj00j53j15j1L3j9n1jN9Q7P6L1ll5q5m4R2R9r3j62lJ28J18Q5
$$ -12 -93 -155 -155 -101 -31 25 107 225 310 303 203 50 -65 -76 -43 -62 -113 -114 -55 32 108 139 136 101 16 -28 64 163 70 -92 -95 33 151 236
2456B36L4m9n6k5m9l3P7J07K4pl5j42j50K6J36M5o7m3Q0J65O9j51k19n4R1O0mRK2k0m0rJ7
$$ 236 270 221 165 140 91 58 135 242 266 259 224 82 -68 -42 94 139 72 29 109 274 343 192 -27 -81 10 70 66 75 97 77 37 28 45
2451D5oj3L4M4k1m7kLk7nJ4MO0J17J7j04m1N8ln6L5R1Lp5m7j3m3n9qN1M8J7ml6k3O0O1p4p7
$$ 45 39 26 60 104 83 36 34 37 10 5 19 23 83 200 217 113 72 130 127 71 106 197 200 125 78 65 22 -37 -45 6 54 71 67 31 8 68 129 55 -22
2445b2Q3Q7q5o7Q6N8n1k2K5J5P8P8j11j74K2J27J9l1kl1j8N7J2o3J5O7m4r3K8J02M7k2m7q
$$ -22 61 148 63 -4 82 140 89 67 92 107 185 263 152 -22 0 127 146 115 113 82 64 121 133 70 85 152 108 15 43 145 192 170 123 115
2440A15P2K8j65k10oJ42N8qP1Q7n0j05K1Q7l1j03pO8M9L8J2q8j08qK3l6kO8mj01m2O5O7Pk9
$$ 115 187 215 50 -160 -166 -24 34 26 97 184 134 29 50 137 106 3 -4 64 113 151 163 75 -33 -41 -18 -54 -56 12 8 -93 -135 -70 -3 4 -25
2435b5l9m0n8o3kP7Q8N6%j09j47lJ29P2l5l2L4Q9N8q4j60j5J31Q8K6J9l7l1J23J31j28k53
$$ -25 -64 -104 -162 -225 -227 -150 -62 -6 -6 -115 -262 -265 -136 -64 -99 -131 -97 -8 50 -34 -194 -209 -78 10 36 55 18 -13 110 241 113 -140
2430a40o0J44J47O4j2l0J7Pq2q5lM6Q7J26M0j00j00l1l0J2R4M3n6j2M5l1r2n0j4%K2rm3L4
$$ -140 -200 -56 91 155 143 113 130 137 55 -30 -33 13 100 226 266 166 66 35 5 17 111 154 98 86 131 100 8 -42 -56 -56 -34 -43 -86 -52
2425e2R2oj20q6NJ5j1L4R5N1p7j22k3O2P6R2Q4Pk2J3j8o1QO0RJ6P1nq4J0N8r1j49J6J24M2
$$ -52 40 34 -86 -172 -167 -152 -163 -129 -34 17 -60 -182 -205 -143 -67 25 109 116 94 107 89 28 36 96 105 121 192 187 103 113 171 80 -69 -53 71 113
2420A13n3m2J3M6J9l7j3P1R5M5k2p9p6k0k0q1n2M6M5j7j9j2k5J4M9k1p9JQ4M7J4O4R0J9o2
$$ 113 60 18 31 77 96 59 46 117 212 257 235 156 80 60 40 -41 -93 -47 -2 -19 -38 -50 -75 -61 -12 -33 -112 -111 -27 20 34 98 188 207 145
2415A45p9o3n9k4O6Q9qr2n3K0K4Kk4p0m6P5J36O8j4k6j3QM6L2m6q8m5MLpL2P3M6jMmo8p7k2
$$ 145 66 3 -56 -80 -14 75 67 -25 -78 -58 -34 -32 -56 -126 -172 -97 39 107 93 67 54 62 108 140 94 6 -39 -35 -32 -39 -7 66 112 111 115 111 43 -34 -56
2409e6l3o4J9R3K1l3K2Lo9kO9m6j06N0J13j2k6O4nj22m8O8M7J4L6Jm8jN9K9m3o0PP0K9m8k9
$$ -56 -89 -153 -134 -41 -20 -53 -31 -28 -97 -99 -30 -76 -182 -132 -19 -31 -57 7 2 -120 -168 -100 -53 -39 -3 -2 -50 -51 8 37 -6 -66 -59 11 40 -8 -37
2404c7j4q7m7J27R3j17j14O7R0N3J22N2j36m6J67M7j74o9J06N2k0k9j17j18J10J90l9j71m1
$$ -37 -51 -138 -185 -58 35 -82 -196 -129 -39 14 136 188 52 6 173 220 46 -23 83 135 115 86 -31 -149 -39 151 112 -59 -100
2400a00M6opM8O5N8%j08j30lJ12J08M6RPk8j17j31PJ25R2M2M8l0j48j09N0J25O6m9j12m6O3
$$ -100 -54 -60 -67 -19 46 104 104 -4 -134 -137 -25 83 129 138 145 117 0 -131 -124 1 93 135 183 153 5 -104 -54 71 137 88 -24 -70 -7
2395gM1m2j3N9K9l3l3l0k5N0J18P1l8q2k1P3O2o3r1M0R2j8q1k5j1l0K1O2J0j8J0k0m8O0J56
$$ -7 34 -8 -21 38 67 34 1 -29 -54 -4 114 185 147 65 44 117 179 116 25 65 157 139 58 33 22 -8 13 75 85 67 77 57 9 69 225
2390B25L7j28r2K7K7k8l0l2j9O6J18K5o4m4l2m7%K9l3j3J21J24l1r0k0Qljk5j0Q0J04L1J0
$$ 225 262 134 42 69 96 68 38 6 -13 53 171 196 132 88 56 9 9 38 5 -8 113 237 206 116 96 104 101 100 75 65 145 249 280 290
2385B90Qn7m0P4K4j36j00N1K7n6rM6Lk7nK9Q5R8K6jN1J5r1n4J12J90J11j8o9j0K6m9p8N1J61
$$ 290 298 241 201 275 299 163 63 114 141 85 76 122 125 98 93 122 207 305 331 330 381 396 305 251 363 553 664 646 577 567 593 544 466 517 678
2380F78R9l1j15j07LR3K7p0m0K7L8K6m6j34m3J11K8j30l3J27P5LN0K0o9m0Pl4j3Q8J09P4P0
$$ 678 777 746 631 524 527 620 647 577 537 564 602 628 582 448 405 516 544 414 381 508 583 586 636 656 587 547 554 520 507 595 704 778 848
2375H48N8P7J60J29k8l7R6J03L6Q8J07k8p7O2J39M8n0n4m3o9r6m3N6L4r7j20m6q0j42oJ62
$$ 848 906 983 1143 1272 1244 1207 1303 1406 1442 1530 1637 1609 1532 1594 1733 1781 1731 1677 1634 1565 1469 1426 1482 1516 1419 1299 1253 1173 1031 1025 1187
2370A187N0k03k50r3M3Q9N9m5r6MR8K3o6J2J01N5M4J63J77J8k5J11J63P9M3N6j6j04q7j3J7
$$ 1187 1237 1034 784 691 734 823 882 837 741 745 843 866 800 812 913 968 1012 1175 1352 1370 1345 1456 1619 1698 1741 1797 1781 1677 1590 1577 1594
2366A594k1n2j0M2j5j20j17p6j03q3K9L4p3q4l0p2j01k0%p9p6l0q5j13oL9k7oP3Kj14n7M1
$$ 1594 1573 1521 1511 1553 1538 1418 1301 1225 1122 1039 1068 1102 1029 945 915 843 742 722 722 643 567 537 452 339 333 372 345 339 412 414 300 243 284
2361B84L7Q4K04J61k3n2N7L2q4p1kl8q3j0N7Rm1OL7k6n0L5O1n8j11J6O1j14j81K2J35k8j65
$$ 284 321 405 609 770 747 695 752 784 700 629 627 589 506 496 553 562 521 527 564 538 488 523 584 526 415 431 492 378 197 219 354 326 161
2356A61j07l6MQ8Q3m3m5O9L1q9k1R3kj13KJ54J15qm9m2n2l3K2M1rp0q2o2k0L0L8oPP4L7o5
$$ 161 54 18 22 110 193 150 105 174 205 116 95 188 186 73 75 229 344 336 287 245 193 160 182 223 214 144 62 0 -20 10 48 42 49 123 160 95
2351I5k0J23J01m5q3k0ql5k8j0j1k0rN1J16P9k8n4K4O7L9Kk6k9J7N7J1p9r1%J02R3l3j31o6
$$ 95 75 198 299 254 171 151 143 108 80 70 59 39 30 81 197 276 248 194 218 285 324 326 300 271 288 345 356 277 186 186 288 381 348 217 151
2346A51P7J09K5j3L3Pj23j47J8J40R0L6J5r5j82p0O0K8LQ5Q2oJ4Q0K8n0l6j6pK9Mr6q8O3J31
$$ 151 228 337 362 349 382 389 266 119 137 277 367 403 418 323 141 71 131 159 162 247 329 323 337 417 445 395 359 343 336 365 369 273 185 248 379
2340C79K8p3l7O1P6oo9o9o3m9ML7jj9N0J11O7m7r3mP7nn1J40K53lk42j02N2j01k20p4Q8J05
$$ 379 407 334 297 358 434 428 359 290 227 178 182 219 218 199 249 360 427 380 287 283 360 355 304 444 697 694 452 350 402 301 81 7 95 200
2335B00R3O2K%K6j5l4L4O9J6k9j8L0L3o8j28QJ32K8q6k0K3l0%O3J3j0L5n9j58J6K36J43n5
$$ 200 293 355 357 357 383 368 334 368 437 453 424 406 436 469 401 273 281 413 441 355 335 358 328 328 391 404 394 429 370 212 228 464 607 552
2330E52n1K3mm8l1J0N2L1n3q1MQ9R6N4Qqj7o4r7k9L9L9M7L4p8o9J66K06j22k79j9J64L6l3
$$ 552 501 524 520 472 441 451 503 534 481 400 404 493 589 643 651 643 626 562 465 436 475 514 561 595 517 448 614 820 698 419 400 564 600 567
2325E67N8M7j0P2R6p4j52J7J37J0j21k5J41J24k7r2l4J5OkK0M0K1nJ6P9P9Jj3O3R0M1K2K2
$$ 567 625 672 662 734 830 756 604 621 758 768 647 622 763 887 860 768 734 749 755 753 773 813 834 829 845 924 1003 1004 991 1054 1144 1185 1207 1229
2320A229j5lR0J11K7OP4N5l1pR6R8Mm0j4J9N6P6M4L8J03J26N9M3R3L2r3m3J26J78J52J73J04
$$ 1229 1214 1211 1301 1412 1439 1445 1519 1574 1543 1536 1632 1730 1734 1694 1680 1699 1755 1831 1875 1913 2016 2142 2201 2244 2337 2369 2276 2233 2359 2537 2689 2862 2966
2316B966n2JK46K78N8kJ58K35K08K47K58J48J41K96L05J36J47L58M22L47M10N43N66O18Q12
$$ 2966 2914 2915 3161 3439 3497 3495 3653 3888 4096 4343 4601 4749 4890 5186 5491 5627 5774 6132 6554 6901 7311 7854 8420 9038 9850
2312I850R18R12J068J413J725K007K355K675K950L320L769M207M667N039N096M977M971M965
$$ 9850 10768 11680 12748 14161 15886 17893 20248 22923 25873 29193 32962 37169 41836 46875 51971 56948 61919 66884
2309F6884M738M504M501M549M413M094L594K912K220J644J044L51k46o83j202j914k571k992
$$ 66884 71622 76126 80627 85176 89589 93683 97277 100189 102409 104053 105097 105448 105202 104519 103317 101403 98832 95840
2307I5840l307l553l498l147k874k844k808k628k388k034j459p71q6P02J708K911M242N622
$$ 95840 92533 88980 85482 82335 79461 76617 73809 71181 68793 66759 65300 64529 64443 65145 66853 69764 74006 79628
2304G9628O965Q313R704J1020J2038J2636J2896J3115J3465J3674J3464J3101J2916J2634
$$ 79628 86593 94906 104610 115630 127668 140304 153200 166315 179780 193454 206918 220019 232935 245569
2302B45569J1755J0283Q612P027N568M076K352L89j640l552n277o884q400r595j0242j0519
$$ 245569 257324 267607 276219 283246 288814 292890 295242 295631 293991 290439 285162 278278 269878 260283 250041 239522
2300B39522j0788j1132j1470j1715j1662j1222j0678j0196r548q661p685o432m689k823j171
$$ 239522 228734 217602 206132 194417 182755 171533 160855 150659 141111 132450 124765 118333 113644 110821 109650
2297A09650N30K466M328N941P459Q902J0190J1311J2150J2573J2687J2606J2279J1784J1242
$$ 109650 110180 112646 116974 122915 130374 139276 149466 160777 172927 185500 198187 210793 223072 234856 246098
2295B46098J0496R470Q469P561O247M202J839k77k029l672n363p020q442r570j0552j1554
$$ 246098 256594 266064 274533 282094 288341 292543 294382 294105 292076 288404 283041 276021 267579 258009 247457 235903
2293B35903j2487j3003j2923j2561j2315j2184j2014j1845j1659j1198j0380r425q458p421
$$ 235903 223416 210413 197490 184929 172614 160430 148416 136571 124912 113714 103334 93909 85451 78030
2291G8030o262n005l709k474j274n9J042J861K447K868L068L140L294L455L446L363L350L285
$$ 78030 71768 66763 63054 60580 59306 59247 60289 62150 64597 67465 70533 73673 76967 80422 83868 87231 90581 93866
2288I3866L001K478J752R85L63j94q50j511k027k534l185l855m309m466m432m406m424m365
$$ 93866 96867 99345 101097 102082 102445 102251 101401 99890 97863 95329 92144 88289 83980 79514 75082 70676 66252 61887
2285F1887m268m328m465m450m341m269m083l729l456l274k904k384k039j884j674j377j102
$$ 61887 57619 53291 48826 44376 40035 35766 31683 27954 24498 21224 18320 15936 13897 12013 10339 8962 7860
2283G860q65p03o73o66n62m46l93k96j56j25j88j86j38j76k14j27qj3j04j49j14l5J1J9L6
$$ 7860 6995 6292 5619 4953 4391 3945 3552 3256 3100 2975 2787 2601 2463 2287 2073 1946 1938 1925 1821 1672 1558 1523 1534 1553 1589
2279A589L3o5j72j24J4M1j3oM0Rp7j12o1K3O1N6O4N9l6j45j36o6p0j09n7O4J07K7p4q4l7k7
$$ 1589 1622 1557 1385 1261 1275 1316 1303 1297 1337 1346 1269 1157 1096 1119 1180 1236 1300 1359 1323 1178 1042 976 906 797 740 804 911 938 864 780 743 716
2275G16m3j6K0Kl3l2%N0R7O6m3q5RJ13O4r8j44J4J74J33k2j11j10m7Qm4j05J2J42M2q5K2J34
$$ 716 673 657 677 679 646 614 614 664 761 827 784 699 708 821 885 787 643 657 831 964 942 831 721 674 682 638 533 545 687 729 644 666 800
2270H00L6o9p5q8l9R3N5j21r4O6M3n5l6l2o9J3Q5Kk4O6J5j27p2Q5O7o1r8k6P1P3m6r4K4Q2
$$ 800 836 767 692 604 565 658 713 592 498 564 607 552 516 484 415 428 513 515 491 557 572 445 373 458 525 464 366 340 411 484 438 344 368 450
2265D50j3m3N0O8pm1l7m0RR8J02Pm4K5O4n5j32J3J07n9j48K5Q5q6j36k8k5n9Mkn7K8J06K7
$$ 450 437 394 444 512 505 464 427 387 396 494 596 603 559 584 648 593 461 474 581 522 374 399 484 398 262 234 209 150 154 152 95 123 229 256
2260B56J7J11Q0K0O8j1j91r1J23J3j39N0K15K1j80j27nN4N9rm3L5N2m3p3j4OK8P0L2k2j5o9
$$ 256 273 384 464 484 552 541 350 259 382 395 256 306 521 542 362 235 230 284 343 334 291 326 378 335 262 248 254 282 352 384 362 347 278
2255B78j71j04N6O8J5P2R8ko5n2n1j1J10J37rj16j9J32J00n2p9%k7j14n2N5J0k3J00J32o0
$$ 278 107 3 59 127 142 214 312 310 245 193 142 131 241 378 369 253 234 366 466 414 335 335 308 194 142 197 207 184 284 416 356
2250C56j56J4J57O3p7p8k3k3l2J3O4O7N5K8n2r9k7N6M0nk9q5q5L9J00pq2l0jk2QN2N0L0Jk8
$$ 356 200 214 371 434 357 279 256 233 201 214 278 345 400 428 376 277 250 306 346 341 312 227 142 181 281 274 192 162 161 139 147 199 249 279 280 252
2245B52p%o9q6K3Q6L3lK1L0J8k5o9jJ04M7o6l8j3p5lJ44L1j80j08P7Q1L2L7j5k8Q1P0q4p9
$$ 252 245 245 176 90 113 199 232 229 250 280 298 273 204 203 307 354 288 250 237 162 159 303 334 154 46 123 204 236 273 258 230 311 381 297 218
2240B18N4L7l0K1L9n1o0NMjM4J8n1j2Q8P9j4o4m7kK1P%Pj7m7k3J3k3q2l1J09J74P7m4k4P8
$$ 218 272 309 279 300 339 288 228 233 237 236 280 298 247 235 323 402 388 324 277 275 296 303 303 310 293 246 223 236 213 131 100 209 383 460 416 392 470
2235D70J08N9K0J2M0P9M3n0n8J7M9N0N7j9j42r5Q7J22k0j06o4k8l9k7L0N4j1q8o0Kk2m4N7
$$ 470 578 637 657 669 709 788 831 781 723 740 789 839 896 877 735 640 727 849 829 723 659 631 592 565 595 649 638 550 490 492 470 426 483
2230D83J47N4p8j8J32J35Mo7k7J7L9J08J84J60O2j7m6qJ04J61Q7J3N7J19J07M7l3j09q6K3
$$ 483 630 684 606 588 720 855 859 792 765 782 821 929 1113 1273 1335 1318 1272 1264 1368 1529 1616 1629 1686 1805 1912 1959 1926 1817 1731 1754
2225A754N9j7r9j12n9pl1r8j15j05r8nJ25P3j11j77j34j12j9J54J48l8r6oQj6Q1J71J11K6
$$ 1754 1813 1796 1697 1585 1526 1519 1488 1390 1275 1170 1072 1067 1192 1265 1154 977 843 731 712 866 1014 976 880 874 882 866 947 1118 1229 1255
2221A255M6P8L6K4J06J43J9r4l7L1k2jJ42J41k4o8j0q4j59m8M6m8j08j8K1o7j05o3n9q0m6
$$ 1255 1301 1379 1415 1439 1545 1688 1707 1613 1576 1607 1585 1584 1726 1867 1843 1775 1765 1681 1522 1474 1520 1472 1364 1346 1367 1300 1195 1132 1073 993 947
2216I47pm5r6p6n4q5p5J2M0k4l1J0j1%J13J36J1l7K8K3qM3L9p2r8lN2M9L9j0k8N2Q2l7j53
$$ 947 940 895 799 723 669 584 509 521 561 537 506 516 505 505 618 754 765 728 756 779 771 814 853 781 683 680 732 781 820 810 782 834 916 879 726
2211G26j70j44n7N3K2p3k0N6l9j10K0J14J7n1rk5p3MR4J5j21j16k1M9R6P9n5j49m7P6K0n0
$$ 726 556 412 355 408 430 357 337 393 354 244 264 378 395 344 335 310 237 241 335 350 229 113 92 141 237 316 261 112 65 141 161 111
2207A11J1L3l4qN6nm1N2J8j27m0J76J27p4q6k0n0l8M5L2k0oj5o6m8j8l5%O6L0j1O8J16oj36
$$ 111 122 155 121 113 169 164 123 175 193 66 26 202 329 255 169 149 99 61 106 138 118 112 97 31 -17 -35 -70 -70 -4 26 15 83 199 193 57
2201E7j01L7J22O4o2p0K3L2m3n1k9n2m4K8Q4R0N3k3l5M2L3q6j14l1K3P2J46R9l3n3j0k4J9
$$ 57 -44 -7 115 179 117 47 70 102 59 8 -21 -73 -117 -89 -5 85 138 115 80 122 155 69 -45 -76 -53 19 165 264 231 178 168 144 163
2197A63J06J2j78j43K1J4q7m3P7J08P3L0lj5j9k7k0LJ6L2M4j2j02j12k4O8O1l2r3j1J11R0
$$ 163 269 281 103 -40 -19 -5 -92 -135 -58 50 123 153 150 135 116 89 69 72 88 120 164 152 50 -62 -86 -18 43 11 -82 -93 18 108
2192A08l5p9k1N0R3Q3L0rm2j08j22k9O6P6P4L3r0j21%M5m1kJ55J11o0j2J32L6j14lJ43L3j27
$$ 108 73 -6 -27 23 116 199 229 220 178 70 -52 -81 -15 61 135 168 78 -43 -43 2 -39 -41 114 225 165 153 285 321 207 204 347 380 253
2187B53j09n0n7oO7J4p0pJ02O8n3q6oP6N9l6o4K1O7k6j20p3L9Q4M9M2Q6Q1k5j13q7l3k6j5
$$ 253 144 94 37 31 98 112 42 35 137 205 152 66 60 136 195 159 95 116 183 157 37 -36 3 87 136 178 264 345 320 207 120 87 61 46
2182D6NoJ3P3M6m1pN0o4j27R2K59L7k09j05P6L7j5N5M2p4o4J6k9p5M5J28Rq0K4R7j2r8l7J0
$$ 46 51 45 58 131 177 136 129 179 115 -12 80 339 376 167 62 138 175 160 215 257 183 119 135 106 31 76 204 213 133 157 254 242 144 107 117
2177A17j7PQ9Q1n0j79j76l4J14J18M6N8J16O6n1p5j3Qk1l8m4n4j5R0J48N3q8j00k2JmJ9k9
$$ 117 100 107 196 277 227 48 -128 -162 -48 70 116 174 290 356 305 230 217 225 204 166 122 68 53 143 291 344 256 156 134 135 131 150 121
2172A21j40j18L6P6%M7J69J05q8j49n9RJn3r5l1J16J51L1n2PO3J4o7r4o1K5J01P0j1L5J36
$$ 121 -19 -137 -101 -25 -25 22 191 296 208 59 0 9 10 -43 -138 -169 -53 98 129 77 84 147 161 94 0 -61 -36 65 135 124 159 295
2167B95P1j08j39l1LlO7Q9k6p9JQp5j4J55J45k6p9KK6K0P7J03K7j5J0ll0L3Q5L7L4J47J94
$$ 295 366 258 119 88 91 88 155 244 218 139 140 148 73 59 214 359 333 254 256 282 302 379 482 509 494 504 501 471 504 589 626 660 807 1001
2162A001P3o5r5o5m5o0p2j4P0P9L4Mm4q3j5M5l1p3K3L5p3p7m3j23q2J27J12r9l3J84R1j00
$$ 1001 1074 1009 914 849 804 744 672 658 728 807 841 845 801 718 703 748 717 644 667 702 629 552 509 386 304 431 543 444 411 595 686 586
2158E86NJ59J02O8J19N9kP7J08L0M9J16O4J2O6R8P9N4l7j19m4M8k0n0N0K3j21j00rq6j67p1
$$ 586 591 750 852 920 1039 1098 1096 1173 1281 1311 1360 1476 1540 1552 1618 1716 1795 1849 1812 1693 1649 1697 1677 1627 1677 1700 1579 1479 1470 1384 1217 1146
2153A146rq4j06n6p9j10p0n1o2k5k1q0l5J13J00p7j27k0J1j3Q0J87J20j0k0Rk6k3O0R0M7M3
$$ 1146 1137 1053 947 891 812 702 632 581 519 494 473 393 358 471 571 494 367 347 358 345 425 612 732 722 702 711 685 662 722 812 859 902
2148I02N9J2l8l9o9r4J9J41K4j81j41K7nj14j7J02k2j81j21j4j6RP1M0m3m3k1l7k5k5q3p6
$$ 902 961 973 935 896 827 733 752 893 917 736 595 622 617 503 486 588 566 385 264 250 234 243 314 354 311 268 247 210 185 160 77 1
2144AJ9M6j9l2K7O0J5p3o6Q2J41m5j64m1K5m2L5J57M5n9O7Q0j08j12J8k1n1P1M9j03j9J21
$$ 1 20 66 47 15 42 102 117 44 -22 60 201 156 -8 -49 -24 -66 -31 126 171 112 179 259 151 39 57 36 -15 56 105 2 -17 104
2139A04Nj01kKr5j1J05Qq8l0M0Q7J42N2j16j11PK7Jnk5j3M7L2k0%j6q5j8J09R3O5J24K8j80
$$ 104 109 8 6 8 -87 -98 7 15 -73 -103 -63 24 166 218 102 -9 -2 25 26 21 -4 -17 30 62 42 42 26 -59 -77 32 125 190 314 342 162
2134A62j59pj8k6J06J08o4q7L7O9J5l0q3o0P4J45O2l1n7n2j0L7J0l7l7l0m7m0j4J2K9Pj7L9
$$ 162 3 -4 -22 -48 58 166 102 15 52 121 136 106 23 -37 37 182 244 213 156 104 94 131 141 104 67 37 -10 -50 -64 -52 -23 -16 -33 6
2129FJ02M8l6m6m5o5m7qJ4O0P8J3j8M2L6p7j41r2M2J83J43q9j68rO9kPN6Ll4ok7j8Q0M7r8
$$ 6 108 156 120 74 29 -36 -83 -91 -77 -17 61 74 56 98 134 57 -84 -176 -134 49 192 103 -65 -74 -5 -7 0 56 59 25 19 -8 -26 54 101 3
2124Cl8J21N3j00p6j5k3JK2J0Q2J52K2j03k1N0k4n1j7n2n9kn7j26M1K55K00l3j61j13L3J28
$$ 3 -35 86 139 39 -37 -52 -75 -74 -52 -42 40 192 214 111 90 140 116 65 48 -4 -63 -65 -122 -248 -207 48 248 215 54 -59 -26 102
2119A02L0j27q8O9R5Kn3l5%K8J4l1m3j5J8J7j6k5J4L0oj0J8NJ3P0K0j20q1J03J11l3n2K6M1
$$ 102 132 5 -83 -14 81 83 30 -5 -5 23 37 6 -37 -52 -34 -17 -33 -58 -44 -14 -20 -30 -12 -7 6 76 96 -24 -105 -2 109 76 24 50 91
2114I1N8J16O0r1j16OO7k3j18o7M1L3m6MJ13M7j19j16J0O0K8Oj4j6L6Q0N8J4k3n0k5Rm7r1
$$ 91 149 265 325 234 118 124 191 168 50 -17 24 57 11 15 128 175 56 -60 -50 10 38 44 30 14 50 130 188 202 179 129 104 113 66 -25
2109b5J0J02j5j49p4N8M8K2R9J24Pq4o0JM4L6l9q2MQ4J5p6o3m8o4j7O2N4J2L8N9l2j50j49
$$ -25 -15 87 72 -77 -151 -93 -45 -23 76 200 207 123 63 64 108 144 105 23 27 111 126 50 -13 -61 -125 -142 -80 -26 -14 24 83 51 -99 -248
2104b48J3J67J23m8r2K6Q2J8j2K6K5l1n5k1L9O4K0k8j2Ok4o2n6J3J01R8k2q5j7K5RM1L9q3
$$ -248 -235 -68 55 7 -85 -59 23 41 29 55 80 49 -6 -27 12 76 96 68 56 62 38 -24 -80 -67 34 132 110 25 8 33 42 83 122 39
2099C9j38l2L0j0J3P7M9J3K5j0n6J3J01O8nk5j4K5N8Op5q1n9l6M1N8o8p5J39J98o7k30j01
$$ 39 -99 -131 -101 -111 -98 -21 28 41 66 56 0 13 114 182 177 152 138 163 221 227 152 71 12 -24 17 75 7 -68 71 269 202 -28 -129
2094a29K5K9N7O1l2l3R3Q0q5r4L1L0o5n2j5q0p4R2J65J8j09n8L3N3L1Jk0J5N9L6pJ7N1Ro1
$$ -129 -104 -75 -18 43 11 -22 71 151 66 -28 3 33 -32 -84 -99 -179 -253 -161 4 22 -87 -145 -112 -59 -28 -27 -47 -32 27 63 56 73 124 133 72
2089G2p3j6M7N7L9N0L8m2o9K4P3j2p0j3N0N0j9j32j45J0J32N7m9j7M3M2M0J6n2p8l0J2L4L7
$$ 72 -1 -17 30 87 126 176 214 172 103 127 200 188 118 105 155 205 186 54 -91 -81 51 108 59 42 85 127 167 183 131 53 23 35 69 106
2084A06j0m9KM0k3p1k1N4Q2N9j5r4r4l5QK9N4P9Q5M4l5p1jQ7Q3j3j10r0K8O1m5p0M5O0o0p7
$$ 106 96 47 49 89 66 -5 -26 28 110 169 154 60 -34 -69 -61 -32 22 101 186 230 195 124 123 210 293 280 170 80 108 169 124 54 99 159 99 22
2078B2kk6n0N1O7o9n4J35J16j38j80N6J69M7m3k3l4m1P1J47J6j25p2L3K6oqn4q0K0J21O3m5
$$ 22 20 -6 -56 -5 62 -7 -61 74 190 52 -128 -72 97 144 101 78 44 3 74 221 237 112 40 73 99 93 85 31 -49 -29 92 155 110
2074A10l2N8N8m7r8KJ06M6p0m7K5%o1m9J0P2P6ml6M9O4o0j06j4Pj3P9J45N2k8j%j9mk7o6k1
$$ 110 78 136 194 147 49 51 157 203 133 86 111 111 50 1 11 83 159 155 119 168 232 172 66 52 59 46 125 270 322 294 293 293 274 270 243 177 156
2068A56Mp6o7Q5J26Qo4l1K1M0k2j17n5J31J63kj28j22m7O3J35O8n1q1l9npl5k7L2N2K2L2K7
$$ 156 160 84 17 102 228 236 172 141 162 202 180 63 8 139 302 300 172 50 3 66 201 269 218 137 98 93 86 51 24 56 108 130 162 189
2063A89p1j12mP9M5K6K1l9m9R%m6NM9%J2R6Q6Qj7o1j45j24kN3L5L2L5Mj4qj9n2o9k6M8O4M4
$$ 189 118 6 2 81 126 152 173 134 85 94 94 48 53 102 102 114 210 296 304 287 226 81 -43 -45 8 43 75 110 114 100 92 73 21 -48 -74 -26 38 82
2058H2M8L0n8r1l8k4k3P2J38M0p5n1J7N2P3L8n5r2l2M6O2qq7m1Q4J03L7Ol7r4l1N8Ll8N7N6
$$ 82 130 160 102 11 -27 -51 -74 -2 136 176 101 50 67 119 192 230 175 83 51 97 159 151 64 23 107 210 247 253 216 122 91 149 152 114 171 227
2052B27p6p9jm6l2J27J31m9n9M5m1j56m8J21J43O8l2r7j6J11O1r7j35l6M7M4J4L7O5j4j27
$$ 227 151 72 71 25 -7 120 251 202 143 188 147 -9 -57 64 207 275 243 146 130 241 302 205 70 34 81 125 139 176 241 227 100
2048A00j02l4p3p2O4J10J0pM7J6k3J4Kk8L2M3p4p9P2J24M9L1K8m5p9m1j1K9N1m2j35m0J04
$$ 100 -2 -36 -109 -181 -117 -7 3 -4 43 59 36 50 52 24 56 99 25 -54 18 142 191 222 250 205 126 85 74 103 154 112 -23 -63 41
2043D1Q9L4Q2J05j8j49j20K1P8j0o9j1Po1l1N5J0n8L5J06ln6M9O6k3oQ1N9l0q7q7j1N8Jn2
$$ 41 130 164 246 351 333 184 64 85 163 153 84 73 80 19 -12 43 53 -5 30 136 133 77 126 192 169 163 244 303 273 186 99 88 146 147 95
2038I5N0J11j0m8Q6Q9o1p8Nk9o7J4M4m0n1K0M2K9J4o7j34m9P6Q9L2MnpJ1J3mj7mM5P8Rp8p
$$ 95 145 256 246 198 284 373 312 234 239 210 143 157 201 161 110 130 172 201 215 148 14 -35 41 130 162 166 161 154 165 178 174 157 153 198 276 285 207 200
2032B00R1l1k06j40K6O8R0J17Pj08rJ01Mp9K3J13Q5M4k7j44j29PL8j7K4Q7J7o5l0Km9n6J9
$$ 200 291 260 54 -86 -60 8 98 215 222 114 105 206 210 131 154 267 352 396 369 225 96 103 141 124 148 235 252 187 157 159 110 54 73
2027G3O1N7P8Q5Jr2p9j2Kj2j1k4qO4O0o7j13k9ql7O6J75O6p4l2L4NLL1j0l8jj7o7l5jl0J8
$$ 73 134 191 269 354 355 263 184 172 174 162 151 127 119 183 243 176 63 34 26 -11 55 230 296 222 190 224 229 232 263 253 215 214 197 130 95 94 64 82
2022H2J20O9r5j14K2R6M7l1m5NJ6l6j3J00J25K4l8kL5J2n6q2QP7l8j60n7R7N4l8kL6j7n3l6
$$ 82 202 271 176 62 84 180 227 196 151 156 172 136 123 223 348 372 334 332 367 379 323 241 249 326 288 128 71 168 222 184 182 218 201 148 112
2017A12k2J2P0Q8M7pl7k6j7m7k2P9N8q2n9Q2K7j14kJ63N4j10n1K7l3k9O8N3n4k8Q3P4o1j50
$$ 112 90 102 172 260 307 300 263 237 220 173 151 230 288 206 147 229 256 142 140 303 357 247 196 223 190 161 229 282 228 200 283 357 296 146
2012A46j17m7mN9J44J38K5m6m4q0j33n7J03J58L9r1p6K6N8mm2n1r2q6K6J06P5M6N4J4k6L0
$$ 146 29 -18 -22 37 181 319 344 298 254 174 41 -16 87 245 284 193 117 143 201 197 155 104 12 -74 -48 58 133 179 233 247 221 251
2007B51N7j9n3J9M8j4o7m6J5L7k4p0LN1o9j62n4P3M3J7Q3J05M0k4p3o8M1J15%j23o2M3J8m0
$$ 251 308 289 236 255 303 289 222 176 191 228 204 134 137 188 119 -43 -97 -24 19 36 119 224 264 240 167 99 140 255 255 132 70 113 131 91
2002I1k6koMK3K7L1On1n1L6P3Mn4j5K7jj2N8J14L4j08j29PJ17N6p2n8P4R3l6r3j8%p5o7RK
$$ 91 65 63 57 61 84 111 142 148 97 46 82 155 159 105 90 117 116 104 162 276 310 202 73 80 197 253 181 123 197 290 254 161 143 143 68 1 10 12
1996A2l5LJ8m3k0R4J19N1L1K1m9n3M4P1Jk3J9K5j4k1K0L7k9j07n4P1O8l3m5ol5l6N1P4k0p5
$$ 12 -23 -20 -2 -45 -65 29 148 199 230 251 202 149 193 264 265 242 261 286 272 251 271 308 279 172 118 189 257 224 179 173 138 102 153 227 207 132
1991A32l5J3N2O3Lo4n5j4JK4M2L1M3O6K8j0Qno1m9QJ2PJ8k2l7N1O4q5j45j6M0n0l7J00J31
$$ 132 97 110 162 225 228 164 109 95 96 120 162 193 236 302 330 320 328 323 262 213 221 233 240 258 236 199 250 314 229 84 68 108 58 21 121 252
1986B52Nr3o5L2Q9N8Nj1mK1O3M7k6j7O1M9l0n8o2q8n8j6p0j22k5P9J8p9j9J31J72M3q1n1M1
$$ 252 257 164 99 131 220 278 283 272 268 289 352 399 373 356 417 466 436 378 316 228 170 154 84 -38 -63 16 34 -45 -64 67 239 282 201 150 191
1981A91Nq2m1O0M9k3m2l4j8M3J02Q7J7p5j34o2Q3R2l3q1l1j9rN2M9k5k9oo2m1J04R4r9q9J15
$$ 191 196 114 73 133 182 159 117 83 65 108 210 297 314 239 105 43 126 218 185 104 73 54 45 97 146 121 92 86 24 -17 87 181 82 -7 108
1976A08Q9j11o8Q1j3j23QQ2k1K2J81P1j53q4Q7L2o1%L9j4k0lk3k4k3m6K3J31M6j36j13L4M5
$$ 108 197 86 18 99 86 -37 -29 53 32 54 235 306 153 69 156 188 127 127 166 152 132 129 106 82 59 13 36 167 213 77 -36 -2 43
1971D3j7LO0R1R8L6m5j3N2kq6p3n0n6oK9k4k4R2J29K8k2Rl5j01k0R8K5j23q0N7K6q8n0L7M
$$ 43 26 29 89 180 278 314 269 256 308 306 220 147 97 41 35 64 40 16 108 237 265 243 252 217 116 96 194 219 96 16 73 99 11 -39 -2 2
1966Bk8M3Q6M4K3j5j05r3J7L0k1K6O3l9p6M7J28O4l0r4p6M0P2p1j07O6J29on3K1j4o9K0J03
$$ 2 -26 17 103 147 170 155 50 -43 -26 4 -17 9 72 33 -43 4 132 196 166 72 -4 36 108 37 -70 -4 125 119 66 87 73 4 24 127
1961A27K0p6m7J7J8k9m8J9J05P2j7j3L5rp3n6j1Kmk9l3L0P6J7k6L4Oj59j68P4K06Q0k7Pl3
$$ 127 147 71 24 41 59 30 -18 1 106 178 161 148 183 174 101 45 34 36 32 3 -30 0 76 93 67 101 107 -52 -220 -146 60 140 113 120 87
1955H7j36n7J16R3m5l8L6kn7jP3Q3O3L0l3o7l3J1J4j0l1m9o8n7K5R9O5qJ6M3l9r2j9K5k5l3
$$ 87 -49 -106 10 103 58 20 56 54 -3 -4 69 152 215 245 212 145 112 123 137 127 96 47 -21 -78 -53 46 111 103 119 162 123 31 12 37 12 -21
1950b1K4M9L9mr6j16K1J21M7l3mJ0k4j4L2M3J4l0l7K3O4J1k1K9K6n5q9q7j06k9J21J30J1k8
$$ -21 3 52 91 87 -9 -125 -104 17 64 31 27 37 13 -1 31 74 88 58 21 44 108 119 98 127 153 98 9 -78 -184 -213 -92 38 49 21
1945B1J4L3O7Q4l8j49k6J39N1j34j08M2P9%n1j5L0J7pL5Q3J1j18r5N7J07j4r4k7K3j7j3O2
$$ 21 35 68 135 219 181 32 6 145 196 62 -46 -4 75 75 24 9 39 56 49 84 167 178 60 -35 22 129 115 21 -6 17 0 -13 49
1940D9N9l0k2P1P7Lk5k2n7o4qK5j0m6l7J2O8R2K2r3j10JQ1J6n9lP7M2j3Kj1p1n1K5L1j1k3
$$ 49 108 78 56 127 204 207 182 160 103 39 31 56 46 0 -37 -25 43 135 157 64 -46 -45 36 52 -7 -10 67 109 96 98 87 16 -35 -10 21 10 -13
1935a3j6QN8M1p5j20k0N5Ol7K0R0P9K5j0j3OM8N4o3j71o2J07K0j39kK16J03j17n1R5K1q7n4
$$ -13 -29 -21 37 78 3 -117 -137 -82 -76 -113 -93 -3 76 101 91 78 84 132 186 123 -48 -110 -3 17 -122 -124 92 195 78 27 122 143 56 2
1930Bm4q9j2J13O8o4p6K0N9K1jJ3lm6m6kJ7K5N8M6rPO3L4k0%K6%QN2M8k4j33j97n8J86J70
$$ 2 -42 -131 -143 -30 38 -26 -102 -82 -23 -2 -3 10 7 -39 -85 -87 -70 -45 13 59 50 57 120 154 134 134 160 160 168 220 268 244 111 -86 -144 42 212
1924B12q9j43L4P1k5LL1o2j6J69J18j38j82qN6krJ6M%Kn1j10n5J03J86Q4p8q7PJ4m0l3j%K
$$ 212 123 -20 14 85 60 63 94 32 16 185 303 165 -17 -25 31 29 20 36 40 40 42 -9 -119 -174 -71 115 199 121 34 41 55 15 -18 -19 -19 -17
1919a7PMK8L4m1o9L7R3K1LO4K2n1j6oq1l1J10N5j32j25L7J03N2k0q3r1j3O6O8K5j2jM2L8q
$$ -17 -10 -6 22 56 15 -54 -17 76 97 100 164 186 135 119 113 32 1 111 166 34 -91 -54 49 101 81 -2 -93 -106 -40 28 53 41 40 82 120 112
1914A12j7j9o3o1K2M4k1m1k0m1j7P9Q0j3k8J6Nl4n3n8MJ04R2K3M5N4n7r7j3j7n6L4P0n2m0
$$ 112 95 76 13 -48 -26 18 -3 -44 -64 -105 -122 -43 37 24 -4 12 17 -17 -70 -128 -124 -20 72 95 140 194 137 40 27 10 -46 -12 58 6 -34
1909c4J15O5j10n2P6Nn0O2P0r0j08M3J29P2m2j10p6j0QL5N9m7j63m0J53J08j4mj1q9o0N2P1
$$ -34 81 146 36 -16 60 65 15 77 147 57 -51 -8 121 193 151 41 -35 -45 -37 -2 57 10 -153 -193 -40 68 54 50 39 -50 -110 -58 13
1904A3O4M8p8j65m4P9M1M0Q8j9j27mJ14Qq6k7qo7n3j1oO6J41M3j04n1J05P5r3j19N5J50K0
$$ 13 77 125 47 -118 -162 -83 -42 -2 86 67 -60 -64 50 58 -28 -55 -63 -130 -183 -194 -200 -134 7 50 -54 -105 0 75 -18 -137 -82 68 88
1899H8j11l6N5lm2M0M8l5j9L3m8j14jR1J2o4m1l4l5L3R8O5nk1QL1Qk4j7%j8j9J3J2j2%Pj4
$$ 88 -23 -59 -4 -7 -49 -9 39 4 -15 18 -30 -144 -145 -54 -42 -106 -147 -181 -216 -183 -85 -20 -25 -46 -38 -7 1 -23 -40 -40 -58 -77 -64 -52 -64 -64 -57 -71
1893g1J7N9Km8K0N3j8k8L2Ol0M0P0j5l9ll1k5N1j3j71j04J10J12j4NR1R7N3l5j43q4R1R0p7
$$ -71 -54 5 7 -41 -21 32 14 -14 18 24 -6 34 104 89 50 47 16 -9 42 29 -142 -246 -136 -24 -38 -33 58 155 208 173 30 -54 37 127 50
1888E0q4M8P5K4L8K1q2j17m0L0M6K3m1q4j1Q5N3n1o1L9R9L0p1n3N3R8Kj12r5K6Q1lj08j06
$$ 50 -34 14 89 113 151 172 90 -27 -67 -37 9 32 -9 -93 -104 -19 34 -17 -78 -39 60 90 19 -34 19 117 119 7 -88 -62 19 16 -92 -198
1883a98l8%K0N0M0j3j5N5Q8M7L6P1K3j00j15oM7PNJ8m2p1K5P0rm9J3K3k8k6J5K6J1j6k5K7
$$ -198 -236 -236 -216 -166 -126 -139 -154 -99 -11 36 72 143 166 66 -49 -55 -8 -1 4 22 -20 -91 -66 4 -5 -54 -41 -18 -46 -72 -57 -31 -20 -36 -61 -34
1878c4N5k0m5O8J21Mp3k5lk8j7ql8k8Jj5m1m6k3O9J51N0j30j16N0Q8J9RL8M2J9l8o4J9Q7j0
$$ -34 21 1 -44 24 145 149 76 51 48 20 3 -5 -43 -71 -70 -85 -126 -172 -195 -126 25 75 -55 -171 -121 -33 -14 -5 33 75 94 56 -8 11 98 88
1873H8j17o0N4R3Q0mj04n9N7K8o6l7Qn1k9J08J23J2j2K6k2o7j4Pn9o8K2M6l5r8p8l2K0R2J25
$$ 88 -29 -89 -35 58 138 134 30 -29 28 56 -10 -47 -39 -90 -119 -11 112 124 112 138 116 49 35 42 -17 -85 -63 -17 -52 -150 -228 -260 -240 -148 -23
1868b3O7k3o4m3KJ7j3j6M0O4L0L8O6j0r3k2N0j4l2O2L5r2o1L2j7m1O9N9j00p5J14R4j00j06
$$ -23 44 21 -43 -86 -84 -67 -80 -96 -56 8 38 76 142 132 39 17 67 53 21 83 118 26 -35 -3 -20 -61 8 67 -33 -108 6 100 0 -106
1863a06N3J00M0K7K5o5j35n9N3K6n6l4J7j2n0m0m9m6N3J47J14L6mj3J6N3Kp6m2K5Om0m1m8
$$ -106 -53 47 87 114 139 74 -61 -120 -67 -41 -97 -131 -114 -126 -176 -216 -265 -311 -258 -111 3 39 35 22 38 91 93 17 -25 0 6 -34 -75 -123
1858a23k6P1J20N2k1l1l3k7k3m5k4Q5J44M7r2j24n0N2N7l0n6L1O5K3J9K5j3QN5lp7j4L6n1
$$ -123 -149 -78 42 94 73 42 9 -18 -41 -86 -110 -25 119 166 74 -50 -100 -48 9 -21 -77 -46 19 42 61 86 73 81 136 133 56 42 78 27
1853B7j12l0Q3R8%j02m6P8Mj36l3J22Nj29LJ41P9Jk8q1n6O7P0k8k1N4K7n9p9k8Jn2j11k6J12
$$ 27 -85 -115 -32 66 66 -36 -82 -4 0 -136 -169 -47 -42 -171 -168 -27 52 53 25 -56 -112 -45 25 -3 -24 30 57 -2 -81 -109 -108 -160 -271 -297 -185
1848a85Q3k7j0K0n1m3O3M3m5kN5k2r4m3M6J02P1m9o4O8P3j12j53PR7Q2J05J02J2m9o5n7L1
$$ -185 -102 -129 -139 -119 -170 -213 -150 -107 -152 -154 -99 -121 -215 -258 -212 -110 -39 -88 -152 -84 -11 -123 -276 -269 -172 -90 15 117 129 80 15 -42 -11
1843a1J02k3j68p8P6K9q0m2N6O3j4p6l5P6P6o1j06L8J38M0q8o2O0J01J8o3m3K1L9K5K1ko7
$$ -11 91 68 -100 -178 -102 -73 -153 -195 -139 -76 -90 -166 -201 -125 -49 -110 -216 -178 -40 0 -88 -150 -90 11 29 -34 -77 -56 -17 8 29 27 -40
1838d0j05k2R9Q4j7k3L8mq4m3M1J7j4K6N7M2J8k8m8OK3m4m6K3k8j18k6Q8K4l9K4L3k4K7J00
$$ -40 -145 -167 -68 16 -1 -24 14 10 -74 -117 -76 -59 -73 -47 10 52 70 42 -6 0 23 -21 -67 -44 -72 -190 -216 -128 -104 -143 -119 -86 -110 -83 17
1833A7K9o1k9J7opM2M0m5j00l7L5j4p3NP7Rk8O2Q2j1k2M4L4l3n5o4n9k5J1N5J17P6o4p2M2
$$ 17 46 -15 -44 -27 -33 -40 2 42 -3 -103 -140 -105 -119 -192 -187 -110 -101 -129 -67 15 4 -18 26 60 27 -28 -92 -151 -176 -165 -110 7 83 19 -53 -11
1827a1L3o0m4Qk7j0M7k2r3JP6km1K0J2l9j6Kl1L4J48Q0j18j88m4J02Q8qj4N1K4n5j1O3j8j08
$$ -11 22 -38 -82 -74 -101 -111 -64 -86 -179 -178 -102 -104 -145 -125 -113 -152 -168 -166 -197 -163 -15 65 -53 -241 -285 -183 -95 -103 -117 -66 -42 -97 -108 -45 -63 -171
1822a71pJ13P4Rol6j1J01O2j44j34J10J22j04j00J19J33rrL4n7j10l1Mj4K7O5M3L3mr0m2J16
$$ -171 -178 -65 9 18 12 -24 -35 66 128 -16 -150 -40 82 -22 -122 -3 130 121 112 146 89 -21 -52 -48 -62 -35 30 73 106 102 12 -30 86
1817H6O6j54j43M9K4j36o2J39J24o7j53n0R3Q6n4j00L8J37O2l1k7NRJ3K0J0k7l0N2J14J6j00
$$ 86 152 -2 -145 -96 -72 -208 -270 -131 -7 -74 -227 -277 -184 -98 -152 -252 -214 -77 -15 -46 -73 -68 -59 -46 -26 -16 -43 -73 -21 93 109 9
1813Ik4Q5Kr7j0O2m2j26o2oON4O6J7K5N8l8j63p1J27J18o2j26k3M3K6K7L7j6m9J9P4L8pk8
$$ 9 -15 70 72 -25 -35 27 -15 -141 -203 -209 -203 -149 -83 -66 -41 17 -21 -184 -255 -128 -10 -72 -198 -221 -178 -152 -125 -88 -104 -153 -134 -60 -22 -29 -57
1807e7o4o5pqp3n4O1J19P1Mk4j9k1l2j4Om0o4M7J39O6k0RK1j1K4N3j5m1K6L0m5o3k0O4J41
$$ -57 -121 -186 -193 -201 -274 -328 -267 -148 -77 -73 -97 -116 -137 -169 -183 -177 -217 -281 -234 -95 -29 -49 -40 -19 -30 -6 47 32 -9 17 47 2 -61 -81 -17 124
1802A24N6j43j35K2j1j02N1J57k1j04P2N0j79j31J03P1r1k8R7N8K0O1M8jK1L3n3j00l9K9J0
$$ 124 180 37 -98 -76 -87 -189 -138 19 -2 -106 -34 16 -163 -294 -191 -120 -211 -239 -142 -84 -64 -3 45 44 65 98 45 -55 -94 -65 -55
1798e5k0JJ5j6m6k0L0M6ko1n1Lrn0JQ2M4j3K6K3r4r6O7J34K1o7m3mPOn%J0jj9k1k6j4M1Q5
$$ -55 -75 -74 -59 -75 -121 -141 -111 -65 -67 -128 -179 -176 -185 -235 -234 -152 -108 -121 -95 -72 -166 -262 -195 -61 -40 -107 -150 -154 -147 -141 -146 -146 -136 -137 -156 -177 -203 -217 -176 -91
1792i1N5j7p5m5P7J19J2m5K6J7p9l1P2j2j18l6O6O0M0qp1J6J21J7r3PM4q2n7J02N2p9m6k2
$$ -91 -36 -53 -128 -173 -96 23 35 -10 16 33 -46 -77 -5 -17 -135 -171 -105 -45 -5 -13 -84 -68 53 70 -23 -16 28 -54 -111 -9 43 -36 -82 -104
1787a04r2k7J13P3l1k7mJ3Q1O7m5n7J6Kk7K4L6%L0N2j3l0J4k8q1k0M0L5P8J11j5j67j18N0
$$ -104 -196 -223 -110 -37 -68 -95 -99 -86 -5 62 17 -40 -24 -22 -49 -25 11 11 41 93 80 50 64 36 -45 -65 -25 10 88 199 184 17 -101 -51
1782e1J03J2q1p1LL6K2J6K5M9R0P0n0j48j32o7lN7Q5P8O5Mq7j03o9n5j0P0L4o3MJ24M5r0n3
$$ -51 52 64 -17 -88 -85 -49 -27 -11 14 63 153 223 173 25 -107 -174 -177 -120 -35 43 108 112 25 -78 -147 -202 -212 -142 -108 -171 -167 -43 2 -88 -141
1777a41M2J8o6q3PJ12N4j04o4J29J16n7n9N9K2p4l7M8N6Nm2j4N9M8kK3k1k08k27K1J45M2J6
$$ -141 -99 -81 -147 -230 -223 -111 -57 -161 -225 -96 20 -37 -96 -37 -15 -89 -126 -78 -22 -17 -59 -73 -14 34 32 55 34 -174 -401 -380 -235 -193 -177
1772a77O9J0l9K3L2l1j7K3K5O8P7l1r3j0N7K3k1o5n8L2K2j13p4J22R7q1o0M1j5l3P9P2k2N0
$$ -177 -108 -98 -137 -114 -82 -113 -130 -107 -82 -14 63 32 -61 -71 -14 9 -12 -77 -135 -103 -81 -194 -268 -146 -49 -130 -190 -149 -164 -197 -118 -46 -68 -18
1767a8J40Oj65j19M5J12L8o1m7M1L3l6j4M2lo5m3MJ9L3M5M9N5K9j2qJ2l1p7n8m0m0oL6L5p
$$ -18 122 128 -37 -156 -111 1 39 -22 -69 -28 5 -31 -45 -3 -6 -71 -114 -110 -91 -58 -13 36 91 120 108 100 112 81 4 -54 -94 -134 -140 -104 -69 -76
1762g6m8m6%Jl6J6J09O5k2Roj50j28Q7J32pj6N8Jn4K5N0m9p2J9P2J2o1m4K6Lo2pQ1%j13m8
$$ -76 -124 -170 -170 -169 -205 -189 -80 -15 -37 -28 -34 -184 -312 -225 -93 -100 -116 -58 -57 -111 -86 -36 -85 -157 -138 -66 -54 -115 -159 -133 -130 -192 -199 -118 -118 -231 -279
1756b79M5J4MN6K5l5L0J18Q9Ol8k0Km7q9K2J17j1j14L5J22m6j32jL3n7n1j7n8oJ27R5o3j01
$$ -279 -234 -220 -216 -160 -135 -170 -140 -22 67 73 35 15 17 -30 -119 -97 20 9 -105 -70 52 6 -126 -127 -94 -151 -202 -219 -277 -283 -156 -61 -124 -225
1751b25J5J63J92L2j38q0K9l5r7OO8J5K0N0%pN2rj07k7J03O1n4o8j3M6M5n6j32n5M2M3M3P5
$$ -225 -210 -47 145 177 39 -41 -12 -47 -144 -138 -70 -55 -35 15 15 8 60 51 -56 -83 20 81 27 -41 -54 -8 37 -19 -151 -206 -164 -121 -78 -3
1746cM6JOlk6LKm6QJ03nj66n5J36N3j03k9Q2kq6j2N3J5qqm5m5K1M7MlJ9J0qj1l1k5L6M2l7
$$ -3 43 44 50 47 21 24 26 -20 -12 91 86 -80 -135 1 54 -49 -78 4 2 -84 -96 -43 -28 -36 -44 -89 -134 -113 -66 -62 -65 -46 -36 -44 -55 -86 -111 -75 -33 -70
1740g0m2L9L3k9kM1JQO8rj54p3J36J12o6q3L5L8k2K1P5j3j35r3M8P8j8p6k5P1J07L8p1n8O2
$$ -70 -112 -73 -40 -69 -71 -30 -29 -21 47 38 -116 -189 -53 59 -7 -90 -55 -17 -39 -18 57 44 -91 -184 -136 -58 -76 -152 -177 -106 1 39 -32 -90 -28
1735b8O7m8n6N7N3m5j0Q3K4q8n0K9ko0n2k3%M4N9Om9m9k8J7O0K1q5p5O9J18J7j9M6L9k4J2
$$ -28 39 -9 -65 -8 45 0 -10 73 97 9 -41 -12 -14 -74 -126 -149 -149 -105 -46 -40 -89 -138 -166 -149 -89 -68 -153 -228 -159 -41 -24 -43 3 42 18 30
1730C0M5m1p4L3P7qn8o2j04n9P3R0LPJ1q4o4J15J23p1j52n8RL7O8K0m2j0kp0l4Q8O8m0k1L6
$$ 30 75 34 -40 -7 70 62 4 -58 -162 -221 -148 -58 -55 -48 -37 -121 -185 -70 53 -18 -170 -228 -219 -182 -114 -94 -136 -146 -148 -218 -252 -164 -96 -136 -157 -121
1725a21MjK6n6j15N2J92K2j95j32O0O6n3p5K5J18J11J7p2r2m9M6J31R7l6p6J8L3p7p6O7J08
$$ -121 -117 -118 -92 -148 -263 -211 -19 3 -192 -324 -264 -198 -251 -326 -301 -183 -72 -55 -127 -219 -268 -222 -91 6 -30 -106 -88 -55 -132 -208 -141 -33
1720c3qq6o1k8l1k3J4Q2R8jq4l2J2l7k2P8N4m8j8N1j4n8L6P9Oj3L7K9j5l2k0M7Q4k4j45o4
$$ -33 -41 -127 -188 -216 -247 -270 -256 -174 -76 -77 -161 -193 -181 -218 -240 -162 -108 -156 -174 -123 -137 -195 -159 -80 -74 -87 -50 -21 -36 -68 -88 -41 43 19 -126 -190
1715a90P2K0o8mP4L9KJ8J4j6k5PO4O8k5q8n1k3m5JO7L4qL2K7n6o4%mm7oP4P0m6j24k7J09N9
$$ -190 -118 -98 -166 -170 -96 -57 -55 -37 -23 -39 -64 -57 7 75 50 -38 -89 -112 -157 -156 -89 -55 -63 -31 -4 -60 -124 -124 -128 -175 -181 -107 -37 -83 -207 -234 -125 -66
1709f6n5pM4o2o9J02J04p4n3R1K9j06o4R%K9N1%J5R2K3j10q7J4J3l8q2j03j3J08P1kQ7J53
$$ -66 -121 -128 -84 -146 -215 -113 -9 -83 -136 -45 -16 -122 -186 -177 -177 -148 -97 -97 -82 10 33 -77 -164 -150 -137 -175 -257 -360 -373 -265 -194 -196 -109 44
1704D4L1n7Kqj08r7nJ9J6M5M5Ml7p5p3pL7Qj3jQM0Q6N0m1m7K1L1k8m0QJ9m3n3M0R3pj12o8
$$ 44 75 18 20 12 -96 -193 -198 -179 -163 -118 -73 -69 -106 -181 -254 -261 -224 -216 -229 -230 -222 -182 -96 -46 -87 -134 -113 -82 -110 -150 -142 -123 -166 -219 -179 -86 -93 -205 -273
1698b73N0Q4J1p4l8J08J31rm3O1pk09j39J08P1j28m5J89J64j0l8L5L2l2q2p7j2P3J05M7n3
$$ -273 -223 -139 -128 -202 -240 -132 -1 -10 -53 8 1 -208 -347 -239 -168 -296 -341 -152 12 2 -36 -1 31 -1 -83 -160 -172 -99 6 53 0
1694@r9o7l1k2K6P1K0j2O6Q0m6r9NM6qJ5O5nj06q7J5Q4N4m7o9L8J01K8j6K5Lq8r9j1O0Q4N2
$$ 0 -99 -166 -197 -219 -193 -122 -102 -114 -48 32 -14 -113 -108 -62 -70 -55 10 5 -101 -188 -173 -89 -35 -82 -151 -113 -12 16 0 25 28 -60 -159 -170 -110 -26 26
1688B6k2o6m4j7j0K6N2qn5L7J35L5j62j78k0O0L0J8l0j22m6J43J17l8J9J04r1k16PJ28n1m9
$$ 26 4 -62 -106 -123 -133 -107 -55 -63 -118 -81 54 89 -73 -251 -271 -211 -181 -163 -193 -315 -361 -218 -101 -139 -120 -16 -107 -323 -316 -188 -239 -288
1684b88J92J82k7pQ6m9j31M2J43Pp9j8J0l6q0j10p7K6O8J2pM3M0qJ2N3No7o1l1n5n2J9M0k2
$$ -288 -96 86 59 52 138 89 -42 0 143 150 71 53 63 27 -53 -163 -240 -214 -146 -134 -141 -98 -58 -66 -54 -1 4 -63 -124 -155 -210 -262 -243 -203 -225
1679b25k5N1N6jQN9M2mk1m0l5Jk1j11j26k9R1J67J44Jq3K3R6l2j33l2M9j9k1Q6P4o5j04l0
$$ -225 -250 -199 -143 -144 -136 -77 -35 -39 -60 -100 -135 -134 -155 -266 -392 -421 -330 -163 -19 -18 -101 -78 18 -14 -147 -179 -130 -149 -170 -84 -10 -75 -179 -209
1674b09j7l5N6J42N2p9l9M9j2j01n0K4OJ9R3R4L4Qj2m3m5n4o8J4J22P4k3j1k2j18q2Q9R8n8
$$ -209 -226 -261 -205 -63 -11 -90 -129 -80 -92 -193 -243 -219 -213 -194 -101 -7 27 35 23 -20 -65 -119 -187 -173 -51 23 0 -11 -33 -151 -233 -144 -46 -104
1669a04r3J9P8L4l0k1M2M0m9o3K1L4J0Q6J08n0j49n2L1K0K0k7j21o6J06J21ll3J8M3O1O2N
$$ -104 -197 -178 -100 -66 -96 -117 -75 -35 -84 -147 -126 -92 -82 4 112 62 -87 -139 -108 -88 -68 -95 -216 -282 -176 -55 -58 -91 -73 -30 31 93 98
1664I8k7nk9p0n5k2QP2N8q7j61k4J35J39M7n5j04o7k1mK9J9q2r9L2M7j06j03P3J04roR4J35
$$ 98 71 66 37 -33 -88 -110 -102 -30 28 -59 -220 -244 -109 30 77 22 -82 -149 -170 -174 -145 -126 -208 -307 -275 -228 -334 -437 -364 -260 -269 -275 -181 -46
1659d6J17O0p9j69j02MK4J8L4L8K6qo2q6lJ29J30p0k40j07J43J38l1k2Q2L9RJ06P3j23j20
$$ -46 71 131 52 -117 -219 -215 -191 -173 -139 -101 -75 -83 -145 -231 -234 -105 25 -45 -285 -392 -249 -111 -142 -164 -82 -43 -34 72 145 22 -98
1654i8N9O5m7l9Qj4J3M8o6j57l7O9nk8Q3Q8m4q6k1MKL3L9kj3j0m0l7L1O2J7NK7%l2RL2k3l5
$$ -98 -39 26 -21 -60 -52 -66 -53 -5 -71 -228 -265 -196 -201 -229 -146 -58 -102 -188 -209 -205 -203 -170 -131 -133 -146 -156 -196 -233 -202 -140 -123 -118 -91 -91 -123 -114 -82 -105 -140
1648a40K9M9J5K6J1j00j53m7M4J7RP3P5QoL7K6k1JP1P3j2m7J2K6o2j05PJ42J09q6j88m3J48
$$ -140 -111 -62 -47 -21 -10 -110 -263 -310 -266 -249 -240 -167 -92 -84 -90 -53 -27 -48 -47 24 97 85 38 50 76 14 -91 -84 58 167 81 -107 -150 -2
1643bR0j07j28jK2j4M1N6o0j06k1%o5l9O9J25J21P9j3p6l5N1P2J2q7j19n4j9l3O4J75N8j30
$$ -2 88 -19 -147 -148 -126 -140 -99 -43 -103 -209 -230 -230 -295 -334 -265 -140 -19 60 47 -29 -64 -13 59 71 -16 -135 -189 -208 -241 -177 -2 56 -74
1639g4p7O6Rn5Q5J55oj11j1M2p0j56p1O7J02N6L8L0n5j18lJ18L9o4j0J9n8k8J09J15Jn6l3
$$ -74 -151 -85 -76 -131 -46 109 103 -8 -19 23 -47 -203 -274 -207 -105 -49 -11 19 -36 -154 -157 -39 0 -64 -74 -55 -113 -141 -32 83 84 28 -5
1634eK3Q7M8n9n7J8j8n3M5O4r2j22L4Q5j1l4J7K6K2K9Qj3k7n5l3M6L7m6n2j2m3m0M3K2p4l9
$$ -5 18 105 153 94 37 55 37 -16 29 93 1 -121 -87 -2 -13 -47 -30 -4 18 47 55 42 15 -40 -73 -27 10 -36 -88 -100 -143 -183 -140 -118 -192 -231
1628b31N7M5MJ7J2K3R5O4j12j73o1pl8RJ07J14M2k2m3pL1K3K9N4Lo6j8M9l9j42m8J17J37M3
$$ -231 -174 -129 -125 -108 -96 -73 22 86 -26 -199 -260 -267 -305 -296 -189 -75 -33 -55 -98 -105 -74 -51 -22 32 35 -31 -49 0 -39 -181 -229 -112 25 68
1624F8l5q5j10m9N2P4Mk9kj2o0m3QQJ7Q0P3k9p9o3o4j8R6R3l1m5O3Q1J0kK1Pj2k8o9r5o9K0
$$ 68 33 -52 -162 -211 -159 -85 -81 -110 -112 -124 -184 -227 -219 -211 -194 -114 -41 -70 -149 -212 -276 -294 -198 -105 -136 -181 -118 -37 -27 -29 -8 -1 -13 -41 -110 -205 -274 -254
1618b54J37J51j4j88j66k2P0P7J7l4J3O7Rk3N6K9j00n0P3po5Q2P9j65j73R1J41LJ4L9r0j07
$$ -254 -117 34 20 -168 -334 -356 -286 -209 -192 -226 -213 -146 -137 -160 -104 -75 -175 -225 -152 -159 -224 -142 -63 -228 -401 -310 -169 -166 -152 -113 -203 -310
1613c10O6J31L6j1j4m6j5Q2J27J16N6o4j41j02n0l0M0Q6K8l4l5m0m3j8l7m7Q3J64Kj48k4J23
$$ -310 -244 -113 -77 -88 -102 -148 -163 -81 46 162 218 154 13 -89 -139 -169 -129 -43 -15 -49 -84 -124 -167 -185 -222 -269 -186 -22 -20 -168 -192 -69
1609f9L1j10q6K7J02R3Nn3j6Kl6L2J49Q0j14j23L1P8Nm1l8l1l7q7j20j1J51J48J5m0m5q7m6
$$ -69 -38 -148 -234 -207 -105 -12 -7 -60 -76 -74 -110 -78 71 151 37 -86 -55 23 28 -13 -51 -82 -119 -206 -326 -337 -186 -38 -23 -63 -108 -195 -241
1604b41J12J59N7kk9j33j67rP6k4m4O7N4n8k9O4K8l5kLo4m8P6J31N5k8m5m6n9j5J12J74N1
$$ -241 -129 30 87 85 56 -77 -244 -253 -177 -201 -245 -178 -124 -182 -211 -147 -119 -154 -156 -153 -217 -265 -189 -58 -3 -31 -76 -122 -181 -196 -84 90 141
1599A41j14j34m9Nnm1m5J5N3Kl3K5N6J2QK7n0j23n0O7R9P4K7rK8N4m8j51p3L8L9L3O8N0J4
$$ 141 27 -107 -156 -151 -156 -197 -242 -227 -174 -172 -205 -180 -124 -112 -104 -77 -127 -250 -300 -233 -134 -60 -33 -42 -14 40 -8 -159 -232 -194 -155 -122 -54 -4 10
1594A0J9jm0k7l4r0l1R3M7q3o3Rj4KQ2L5p9o8k8o4l4O4M2m0J2J07P4ML0O6kj34j69k3J50J31
$$ 10 29 28 -12 -39 -73 -163 -194 -101 -54 -137 -200 -191 -205 -203 -121 -86 -165 -233 -261 -325 -359 -295 -253 -293 -281 -174 -100 -96 -66 0 -2 -136 -305 -328 -178 -47
1588d7l5j27q5J3J11J30J8q9o2Pkl8o0p0j9R3J43P9j0n8l6N4R0k6j37o2P0P0j7o9n5J1O2J5
$$ -47 -82 -209 -294 -281 -170 -40 -22 -111 -173 -166 -168 -206 -266 -336 -355 -262 -119 -40 -50 -108 -144 -90 0 -26 -163 -225 -155 -85 -102 -171 -226 -215 -153 -138
1583a38m7NO0k3j05j4J06O0n2n0K9M4nj4Nl4r1n7N0J00P8N1K9rm0l5J0L8k2j19r6L3P3J2K6
$$ -138 -185 -180 -120 -143 -248 -262 -156 -96 -148 -198 -169 -125 -130 -144 -139 -173 -264 -321 -271 -171 -93 -42 -13 -22 -62 -97 -87 -49 -71 -190 -286 -253 -180 -168 -142
1578a42P9J2q5o7oK0N7K6j09j43J1R8K3j9J9N%N8M6m2m3qn1l2R5R7n4q9K0N0QJ4pr0j03j6
$$ -142 -63 -51 -136 -203 -209 -189 -132 -106 -215 -358 -347 -249 -226 -245 -226 -221 -221 -163 -117 -159 -202 -210 -261 -293 -198 -101 -155 -244 -224 -174 -166 -152 -159 -249 -352 -368
1573c68O0R6Q9lp3RJ06M0o3l1K8K7O6J10Pj61j51OQ5N1Nl5n6J2J18R0l2n9J4J0p0l6R4P5q6
$$ -368 -308 -212 -123 -126 -199 -190 -84 -44 -107 -138 -110 -83 -17 93 100 -61 -212 -206 -121 -70 -65 -100 -156 -144 -26 64 32 -27 -13 -3 -73 -109 -15 60 -26
1568b6j43j2Q6M9j2k3j3JJ5J0QMm6r3n2mj9%M1k6o9R6K20N8j05n5m3j32k2J52K2j75n0J47
$$ -26 -169 -181 -95 -46 -58 -81 -94 -93 -78 -68 -60 -56 -102 -195 -247 -251 -270 -270 -229 -255 -324 -228 -8 50 -55 -110 -153 -285 -307 -155 -133 -308 -358 -211
1563b11Q5k5nMjO7P3j5j1M4j8r2o4o1n8Q1J58L7J0J51Q8j77j95K2P6n1r1l5K2Q8P4o0j08J
$$ -211 -126 -151 -156 -152 -153 -86 -13 -28 -39 5 -13 -105 -169 -230 -288 -207 -49 -12 -2 149 237 60 -135 -113 -37 -88 -179 -214 -192 -104 -30 -90 -198 -197
1558a97L0m8QJ44N9j53j43N8J41R0Q5O5p5j48j4J31R0m9j23j19m7L0J6l0J6O3j7l1J31J66
$$ -197 -167 -215 -207 -63 -4 -157 -300 -242 -101 -11 74 139 64 -84 -98 33 123 74 -49 -168 -215 -185 -169 -199 -183 -120 -137 -168 -37 129
1554A29n6j83n7K5l9NJ20N2r9o2O6M1o5n2M1N9OJ3O1qj74j73J2R2NJ2J12N7q7n3P1M5m6n3
$$ 129 73 -110 -167 -142 -181 -176 -56 -4 -103 -165 -99 -58 -123 -175 -134 -75 -69 -56 5 -3 -177 -350 -338 -246 -241 -229 -117 -60 -147 -200 -129 -84 -130 -183
1549a83k2J0R0J24M5k4j6l7q8o5j6j1JK8J5j4l%pK3N8P2Q7N3q3j43k1Q8M6pj4n5p9PO9J5l3
$$ -183 -205 -195 -105 19 64 40 24 -13 -101 -166 -182 -193 -192 -164 -149 -163 -166 -166 -173 -150 -92 -20 67 120 37 -106 -127 -39 7 0 -14 -69 -148 -141 -72 -57 -90
1543i0k2l0l6J3L5j8l7PJ3m4n0P1J74N6j71j82K9J02rJ2J40P8p2l6P3K3p7o1ML7M8J1l9qK0
$$ -90 -112 -142 -178 -165 -130 -148 -185 -178 -165 -209 -259 -188 -14 42 -129 -311 -282 -180 -189 -177 -37 41 -31 -67 6 29 -48 -109 -105 -68 -20 -9 -48 -56 -36
1538c6p2j34j8J14R4J4k4o0o0L0J04K9j08j15M3J72J18j8l4L3j9j28n8J24R9r4j49k9M2Nl1
$$ -36 -108 -242 -260 -146 -52 -38 -62 -122 -182 -152 -48 -19 -127 -242 -199 -27 91 73 39 72 53 -75 -133 -9 90 -4 -153 -182 -140 -135 -166
1533a66n5o5J1J05Q0j4n1m7l5LJ2m4l9P4J12qr1j9R4J17N2m1j13j21o5M1J34J10J7j5j9q5
$$ -166 -221 -286 -275 -170 -90 -104 -155 -202 -237 -234 -222 -266 -305 -231 -119 -127 -218 -237 -143 -26 26 -15 -128 -249 -314 -273 -139 -29 -12 -27 -46 -131
1529a31q9M0Q1m8p6O2R9j2l9J4j3n5J5Q0L1k9KM8K2l7n4k7OK6J9pJ6O9K8q8r0J5K8rN1P1n9
$$ -131 -220 -180 -99 -147 -223 -161 -62 -74 -113 -99 -112 -167 -152 -72 -41 -70 -68 -20 2 -35 -89 -116 -110 -84 -65 -72 -56 13 41 -47 -137 -122 -94 -103 -52 19 -40
1523d0j22j1K4l9K2J25N9k3J9J8q9q1P1J22K9l3J7N5k9j37j01K2J1r1o3P5J19N3j2l2NM4j6
$$ -40 -162 -173 -149 -188 -166 -41 18 -5 14 32 -57 -138 -67 55 84 51 68 123 94 -43 -144 -122 -111 -202 -265 -190 -71 -18 -30 -62 -57 -13 -29
1518b9q5nR2J4p1mL0o9q0N9J12J7o2o7o1j0R8J29jj24o1O9M6k1N1J06jq5l0j0o6m6J9K2L5
$$ -29 -114 -119 -27 -13 -84 -88 -58 -127 -207 -148 -36 -19 -81 -148 -209 -219 -121 8 7 -117 -178 -109 -63 -84 -33 73 72 -13 -43 -53 -119 -165 -146 -124 -89
1513h9N8qo1j4k9q8J0J22Qj16m3Kp3n1M4P2J28J70j2k08o5J39K2j20KR7%j4R5N1j15j55n5
$$ -89 -31 -39 -100 -114 -143 -231 -221 -99 -91 -207 -250 -248 -321 -372 -328 -256 -128 42 30 -178 -243 -104 -82 -202 -200 -103 -103 -117 -22 29 -86 -241 -296
1508b96J5K5J4QL2P9P2K5K8M9k2j15p7K9J7m0J8R5M6k5j9JJ7M9K7o3q8j7M1O2L9l8m6O9R7
$$ -296 -281 -256 -242 -234 -202 -123 -51 -26 2 51 29 -86 -163 -134 -117 -157 -139 -44 2 -23 -42 -41 -24 25 52 -11 -99 -116 -75 -13 26 -12 -58 11 108
1503A08k3o4m1j12q6J27J60p3j67m1ll4%j9m4R6J81Kj48o6K4M2P7K3r1m0O6j5q8K9R5J9%L4
$$ 108 85 21 -20 -132 -218 -91 69 -4 -171 -212 -215 -249 -249 -268 -312 -216 -35 -33 -181 -247 -223 -181 -104 -81 -172 -212 -146 -161 -249 -220 -125 -106 -106 -72
1498g2J4J3Mr5j04N4R4k9o0KPM1P8j4o9M5O2p6p4J8k9l1J30J25p3j27l7j6L5J38N0j14o9N9
$$ -72 -58 -45 -41 -136 -240 -186 -92 -121 -181 -179 -172 -131 -53 -67 -136 -91 -29 -105 -179 -161 -190 -221 -91 34 -39 -166 -203 -219 -184 -46 4 -110 -179 -120
1493a20N3L5N4j5r7p0m6n3M4J41P6j6lK2J6L4K5o4j20r5l4K5N5Qo7o8JP4J04Q1M5K6k5q2m5
$$ -120 -67 -32 22 7 -90 -160 -206 -259 -215 -74 2 -14 -17 5 21 55 80 16 -104 -199 -233 -208 -153 -145 -212 -280 -279 -205 -101 -20 25 51 26 -56 -101
1488a01Ro9j30j4P6mk2P8M1q3l4N5k9n0J17J48l5o0Q6M3j19p4P6L1q5l4P2P6N5M9j3n6J3P1
$$ -101 -92 -161 -291 -305 -229 -233 -255 -177 -136 -219 -253 -198 -227 -277 -160 -12 -47 -107 -21 22 -97 -171 -95 -64 -149 -183 -111 -35 20 69 56 0 13 84
1483H4rr7p6pjl3n3k6L4O1K2ML3J7o2j06p5%P6Q2j8q6NJ15P5rJ8Q2O1m3j33j22RQ8kr0qQ2
$$ 84 75 -22 -98 -105 -106 -139 -192 -218 -184 -123 -101 -97 -64 -47 -109 -215 -290 -290 -214 -132 -150 -236 -231 -116 -41 -50 -32 50 111 68 -65 -187 -178 -90 -92 -182 -190 -108
1478a08K0n4j7J9nJ8O3M2K4N1Lj06j11KP9R5R0J8p6o9JK1j0n2r3p4j1j6l8R4K15P9j16o5M8
$$ -108 -88 -142 -159 -140 -145 -127 -64 -22 2 53 56 -50 -161 -159 -80 15 105 123 47 -22 -21 0 -10 -62 -155 -229 -240 -256 -294 -200 15 94 -22 -87 -39
1473c9j1o6prl4P9J33j8r2K7J6j57j21J02J54O3M1k7j85j44J11J65l6j11K8R6K6j5%jj8l9
$$ -39 -50 -116 -123 -132 -166 -87 46 28 -64 -37 -21 -178 -299 -197 -43 20 61 34 -151 -295 -184 -19 -55 -166 -138 -42 -16 -31 -31 -32 -50 -89
1468h9n1j7L4K2kK6Qp1o2K9L3rL0L5o1p4L7M8n7o6J1L4K7M3K6pj6m4o6k2J0JM5P4m2j16J2
$$ -89 -140 -157 -123 -101 -103 -77 -69 -140 -202 -173 -140 -149 -119 -84 -145 -219 -182 -134 -191 -257 -246 -212 -185 -142 -116 -123 -139 -183 -249 -271 -261 -260 -215 -141 -183 -299 -287
1462b87R3j4k7R5M8j11q9Nk2j2R6Q0j7J6Q3M5Nk7j06o7J29J55n7j42nO6Rk3k8k0M1M4o5p3
$$ -287 -194 -208 -235 -140 -92 -203 -292 -287 -309 -321 -225 -145 -162 -146 -63 -18 -13 -40 -146 -213 -84 71 14 -128 -133 -67 -58 -81 -109 -129 -88 -44 -109 -182
1457a82N4O2k4L4Q2p8j79K0J84M7j18r8lO5R7K5q1k6J03N2r8j04MK8nL0Q4N0n1j13q0rJ5k4
$$ -182 -128 -66 -90 -56 26 -52 -231 -211 -27 20 -98 -196 -199 -134 -37 -12 -93 -119 -16 36 -62 -166 -162 -134 -139 -109 -25 25 -26 -139 -219 -228 -213 -237
1452b37q5j01j4J08Q8n0p3N4J13O3K5j5p3j1J13O8r3j04NN5N7J7q4q7O7J03n1q0P2R1n2r3
$$ -237 -322 -423 -437 -329 -241 -291 -364 -310 -197 -134 -109 -124 -197 -208 -95 -27 -120 -224 -219 -164 -107 -90 -174 -261 -194 -91 -142 -222 -150 -59 -111 -204
1448b04k2L0O5O6j8o5j2qp4l6N3K2j9P3J36N1k8k9n7r4l3M8L9MJ9L1LjJ1k1p2m1N0O9j1r3
$$ -204 -226 -196 -131 -65 -83 -148 -160 -168 -242 -278 -225 -203 -222 -149 -13 38 10 -19 -76 -170 -203 -155 -116 -112 -93 -62 -59 -60 -49 -70 -142 -183 -133 -64 -75 -168
1442a68q3MP8O3j9o0k3J0NJ1L2K0j3l7m4kQ9J18K1q0n7K8M1j0j6L8L8m6r2j9M9no7j3N3Rn3
$$ -168 -251 -247 -169 -106 -125 -185 -208 -198 -193 -182 -150 -130 -143 -180 -224 -226 -137 -19 2 -78 -135 -107 -66 -76 -92 -54 -16 -62 -154 -173 -124 -129 -196 -209 -156 -147 -200
1437b00oP3M8k7j5L9Qn5k9K4OpRk4l5P0R4q0j56lO3n7o1P5R2J0J4M2J0qkk8rM1j0p4J7J07
$$ -200 -206 -133 -85 -112 -127 -88 -80 -135 -164 -140 -134 -141 -132 -156 -191 -121 -27 -107 -263 -266 -203 -260 -321 -246 -154 -144 -130 -88 -78 -86 -88 -116 -125 -84 -94 -168 -151 -44
1431d4Lj18l5J09Q0o8j02L4J18J2r9l9M2J1j0J0l6o1L8O2o1q1N2Q0j1l6l7q8o5K9L8J2O0Q8
$$ -44 -41 -159 -194 -85 -5 -73 -175 -141 -23 -11 -110 -149 -107 -96 -106 -96 -132 -193 -155 -93 -154 -235 -183 -103 -114 -150 -187 -275 -340 -311 -273 -261 -201 -113
1426a13L3jJ1Plj6n8m9M8R0L7J4Op4j17qQ5L0n6o3m4l0JN4Q4M5k9k4O7P4l7q8k0J5j4l2m1
$$ -113 -80 -81 -70 -63 -66 -82 -140 -189 -141 -51 -14 0 6 -68 -185 -193 -108 -78 -134 -197 -241 -271 -270 -216 -132 -87 -116 -140 -73 1 -36 -124 -144 -129 -143 -175 -216
1421b16k8N3Q6j3p6kJ6o3qJ49J42rr2q9o8k3J1PM7Q3j0p7M3J16j6p4M1L8r0m6J02R9M3Pj36
$$ -216 -244 -191 -105 -118 -194 -196 -180 -243 -251 -102 40 31 -61 -150 -218 -241 -230 -223 -176 -93 -103 -180 -137 -21 -37 -111 -70 -32 -122 -168 -66 33 76 83 -53
1416e3k34k4K14J02j09o9N7L9j4k4n1m4L3P1L6J1Mj5k1l3n9k6M7O6O2P4Kj26j00M0M7k3J7
$$ -53 -287 -311 -97 5 -104 -173 -116 -77 -91 -115 -166 -210 -177 -106 -70 -59 -55 -70 -91 -124 -183 -209 -162 -96 -34 40 42 -84 -184 -144 -97 -120 -103
1411a03N9m0j13m5K8M2Q5R6rj00n2J5j6m5QM0l0p2J3J15Q4l4q3j1R2R6kp5l4J4m2r0k4M3J2
$$ -103 -44 -84 -197 -242 -214 -172 -87 9 0 -100 -152 -137 -153 -198 -190 -150 -180 -252 -239 -124 -40 -74 -157 -168 -76 20 18 -57 -91 -77 -119 -209 -233 -190 -178
1406a78k6kJ4J1N5R7L9n1o0ok3j19j30%J04N6rL6P4Ml6L4M9n2o3P3J19qq0pJ5p7n8P3N8r7
$$ -178 -204 -206 -192 -181 -126 -29 10 -41 -101 -107 -130 -249 -379 -379 -275 -219 -228 -192 -118 -114 -150 -116 -67 -119 -182 -109 10 2 -78 -85 -70 -147 -205 -132 -74 -171
1401a71j20j2M1N7R3L7q2n1O2J4j07o4Q1J60J45M1j18j63m8N6M0j4l7oM1J0o5k2P4L7j1Q0
$$ -171 -291 -303 -262 -205 -112 -75 -157 -208 -146 -132 -239 -303 -222 -62 83 124 6 -157 -205 -149 -109 -123 -160 -166 -125 -115 -180 -202 -128 -91 -102 -22
1396b2R5p1j26oK6l0JOn9J8J54O4r3o4j0p5p0L1O8P0M5p9j16O8J47k4o1J07Q4q2m0Q8J3j04
$$ -22 73 2 -124 -130 -104 -134 -133 -127 -186 -168 -14 50 -43 -107 -117 -192 -262 -231 -163 -93 -48 -127 -243 -175 -28 -52 -113 -6 78 -4 -44 44 57 -47
1391d7n6L8O4L3o1j22m1J6m1k2R3Q8lj7j6j3N8M6j13j18P2R7m8k6O3k3q2J7M9pK8O2j3l5M
$$ -47 -103 -65 -1 32 -29 -151 -192 -176 -217 -239 -146 -58 -61 -78 -94 -107 -49 -3 -116 -234 -162 -65 -113 -139 -76 -99 -181 -164 -115 -122 -94 -32 -45 -80 -76
1386g6m9o7M6O5n6p2QJ5J6N2ln0M4P3n7p9N5O9j7PM8j5o6m1l0j2K5Ql3pL7M3M2%r3r0L8J04
$$ -76 -125 -192 -146 -81 -137 -209 -201 -186 -170 -118 -121 -171 -127 -54 -111 -190 -135 -66 -83 -76 -28 -43 -109 -150 -180 -192 -167 -159 -192 -199 -162 -119 -77 -77 -170 -260 -222 -118
1380a18N1k1p5r4j4R0P6Rj2m0p2j0Q7Q9L4j5o5p3J1J09J26M3j16k07j02M3L6lN9N9n6m6J02
$$ -118 -67 -88 -163 -257 -271 -181 -105 -96 -108 -148 -220 -230 -143 -54 -20 -35 -100 -173 -162 -53 73 116 0 -207 -309 -266 -230 -233 -174 -115 -171 -217 -115
1375a15J39N8K3J3m6n6j1k4m1K0L0n2l1J03Q0j05j36K1Q3J3PN3Qo9o7o1j06q0L9Q7K8k6l6
$$ -115 24 82 105 118 72 16 5 -19 -60 -40 -10 -62 -93 10 90 -15 -151 -130 -47 -34 -27 26 34 -35 -102 -163 -269 -349 -310 -223 -195 -221 -257
1371b57k0L5J00Q0k8j25j18QJ14O7k5J5P6Ko2K2O8k6n9M9J09M8l8q9q7k4K4J3L7O6j6j06l5
$$ -257 -277 -242 -142 -62 -90 -215 -333 -325 -211 -144 -169 -154 -78 -76 -138 -116 -48 -74 -133 -84 25 73 35 -54 -141 -165 -141 -128 -91 -25 -41 -147 -182
1366a82O6Rp2j0P7N6J5K3or8j32n3M8Q3L8k6l5L7J09O8l0n2K5N3k4j03p5QM8K4j2l0m0k4R
$$ -182 -116 -107 -179 -189 -112 -56 -41 -18 -24 -122 -254 -307 -259 -176 -138 -164 -199 -162 -53 15 -15 -67 -42 11 -13 -116 -191 -183 -135 -111 -123 -153 -193 -217 -208
1361b08J0k0J0P3K8p8n0O1M4o4n2N8R2L9KK6P4P4Ll3%j8j05j01J1M2k6l9J5K7lk0l3k7K6Q4
$$ -208 -198 -218 -208 -135 -107 -185 -235 -174 -130 -194 -246 -188 -96 -57 -55 -29 45 119 122 89 89 71 -34 -135 -124 -82 -108 -147 -132 -105 -108 -128 -161 -188 -162 -78
1355g8N1n4j04o3l5o1j7J04J19Nl2J9j7q7m6J3l1o1RO4N3M8N3L4J7K2L1L4Rk9l0j4n0p9l2
$$ -78 -27 -81 -185 -248 -283 -344 -361 -257 -138 -133 -165 -146 -163 -250 -296 -283 -314 -375 -366 -302 -249 -201 -148 -114 -97 -75 -44 -10 -1 -30 -60 -74 -124 -203 -235
1350b35Nj9oL6Km5%N3Rn6o6l0L3Q3P4N6N1Jo2k4M2J3l5PN6L4Ljlmj0k8k6RRl4n3l0NM6O7K2
$$ -235 -230 -249 -255 -219 -217 -262 -262 -209 -200 -256 -322 -352 -319 -236 -162 -106 -55 -54 -116 -140 -98 -85 -120 -113 -57 -23 -20 -21 -24 -28 -38 -66 -92 -83 -74 -108 -161 -191 -186 -140 -73 -51
1344e1n9p2RP7M8RM4M1q2j43j5Q9N6N6J06L1p2m0Lk3MK1j02j58j2M6o0k8J00M2m4Q3J56Oo8
$$ -51 -110 -182 -173 -96 -48 -39 5 46 -36 -179 -194 -105 -49 7 113 144 72 32 35 12 16 37 -65 -223 -235 -189 -249 -277 -177 -135 -179 -96 60 66 -2
1339bL5L4q3o7L5jj04q9J6O7K3m3j7Q9J11Ko4K8J37R3l4p3j1L3Qm5n8k0%p0j31m8Q6Q0k5p4
$$ -2 33 67 -16 -83 -48 -49 -153 -242 -226 -159 -136 -179 -196 -107 4 6 -58 -30 107 200 166 93 82 115 123 78 20 0 0 -70 -201 -249 -163 -83 -108 -182
1334a82o2k5N1P7j2q2l3J8J4K8N4M8O7P1j7p2lL4j3k8p0j79j14J32J78Mm5J7m0p4M2Q1j8l0
$$ -182 -244 -269 -218 -141 -153 -235 -268 -250 -236 -208 -154 -106 -39 32 15 -57 -60 -26 -39 -67 -137 -316 -430 -298 -120 -116 -161 -144 -184 -258 -216 -135 -153 -183
1329a83O1Q7K9o6j35l6J45J23l2k5P9L3q5r4l8J4M3rq7o5j9m2j1Q2O1lN5J04Jp0j2%m9jQ6
$$ -183 -122 -35 -6 -72 -207 -243 -98 25 -7 -32 47 80 -5 -99 -137 -123 -80 -89 -176 -241 -260 -302 -313 -231 -170 -173 -118 -14 -13 -83 -95 -95 -144 -145 -59
1323e9N5oL0O4m1j53q2P6N2j12j08N0O3o0o1L9O4N3O4lr2l4Q1O0m3n3K6O7j9j11l1Q9j4j65
$$ -59 -4 -10 20 84 43 -110 -192 -116 -64 -176 -284 -234 -171 -231 -292 -253 -189 -136 -72 -75 -167 -201 -120 -60 -103 -156 -130 -63 -82 -193 -224 -135 -149 -314
1318c14l2J60N5q4K0N4j16r0J30Q6j35p1J64J74M5ro8j29k7Q3oj00JR0J7k3N1M8n4o1M9J06
$$ -314 -346 -186 -131 -215 -195 -141 -257 -347 -217 -131 -266 -337 -173 1 46 37 -31 -160 -187 -104 -110 -210 -209 -119 -102 -125 -74 -26 -80 -141 -92 14
1314A4O9J3n1j26j42l8J14J73Q1q2j27j8O0j6r6m0M0L9M2R0N9n4q8k8l6j15r2L7J26J31J10
$$ 14 83 96 45 -81 -223 -261 -147 26 107 25 -102 -120 -60 -76 -172 -212 -172 -133 -91 -1 58 4 -84 -112 -148 -263 -355 -318 -192 -61 49
1309D9N6m8p8JN4%m5K2R5K2j10q6Q5J55J9q4J0J13L9j00j11JQ8N5l7l7M0K1n6lR6K7j06r2
$$ 49 105 57 -21 -20 34 34 -11 11 106 128 18 -68 17 172 191 107 117 230 269 169 58 59 147 202 165 128 168 189 133 130 226 253 147 55
1304E5l7n5l2J1o1j23RJ52J21L8J7lm3q0j21r2J8M3pO0J40Jj59q3K4k4rJ09P7mQ1R5j38k13
$$ 55 18 -37 -69 -58 -119 -242 -233 -81 40 78 95 92 49 -31 -152 -244 -226 -183 -190 -130 10 11 -148 -231 -207 -231 -240 -131 -54 -58 23 118 -20 -233
1299b33M3J50o0j27P3J25n9j27jO1kk9J2M0N7P4L6m2n7jjn7j9R8R5l5q9j6K3j0K4P2l0j94
$$ -233 -190 -40 -100 -227 -154 -29 -88 -215 -216 -155 -157 -186 -174 -134 -77 -3 33 -9 -66 -67 -68 -125 -144 -46 49 14 -75 -91 -68 -78 -54 18 -12 -206
1294b06j54N6J39J3r8j0J65J87K5r1l1K2o5j31l5N7L0J3M9K2l7lN5kr8o4R7J93J01o0p6L6
$$ -206 -360 -304 -165 -152 -250 -260 -95 92 117 26 -5 17 -48 -179 -214 -157 -127 -114 -65 -43 -80 -83 -28 -30 -128 -192 -95 98 199 139 63 99
1290I9N0o1j24r0n3mQ3R5j8q6K2J49P3j38j81RJ33J8j00l7N6K2l6j9M4J09J05Km2O1J02l5
$$ 99 149 88 -36 -126 -179 -183 -100 -5 -23 -109 -87 62 135 -3 -184 -175 -42 -24 -124 -161 -105 -83 -119 -138 -94 15 120 122 80 141 243 208
1285B08q7M8P0j08j45O3J94Q5k2Lpr1p2M8N9k9lJ02P9m6r3n5j8O%m5j6P6M7r2j16m0l9m7M9
$$ 208 121 169 239 131 -14 49 243 328 306 309 302 211 139 187 246 217 214 316 395 349 256 201 183 189 189 144 128 204 251 159 43 3 -36 -83 -34
1280c4Q4k2q4J8J29P8j04k08r8Q4P7l0rP1L2j7K8K9m1k3O4L5p5p4L4P3Pm7k1J7RJ8P7Q2j0
$$ -34 50 28 -56 -38 91 169 65 -143 -241 -157 -80 -110 -119 -48 -16 -33 -5 24 -17 -40 24 59 -16 -90 -56 17 24 -23 -44 -27 -18 0 77 159 149
1275A49o0k3j3m8k4N5P7%n9jP5J0j18p6P3P4o3j02n2j8K6P2K2k5M1N6n5q9J1J2q6l1J05P8
$$ 149 89 66 53 5 -19 36 113 113 54 53 128 138 20 -56 17 91 28 -74 -126 -144 -118 -46 -24 -49 -8 48 -7 -96 -85 -73 -159 -190 -85 -7
1270gm4j5R8N0j32j46P7K00M2j28o6N1J0p2m9Klm0o3l0Q4J71J15j9q7n2j0m9j04m7O9N7k8
$$ -7 -51 -66 32 82 -50 -196 -119 81 123 -5 -71 -20 -10 -82 -131 -129 -132 -172 -235 -265 -181 -10 105 86 -1 -53 -63 -112 -216 -263 -194 -137 -165
1265a65pL1m3n8O7Q7n0o5O1O6k6jN4j4o6L7J30N2q6r1J2N7J9L1R1O3k6l3km4o1J6L6k0J6R3
$$ -165 -172 -141 -184 -242 -175 -88 -138 -203 -142 -76 -102 -103 -49 -63 -129 -92 38 90 4 -87 -75 -18 1 32 123 186 160 127 125 81 20 36 72 52 68 161
1259A61K9o5k1K3n8r2J3P7J4n5n4m6n0m4j6L3P3K6r4j40l7Q8Q8J0j2L9N9J3k5mK0j5q6r7o
$$ 161 190 125 104 127 69 -23 -10 67 81 26 -28 -74 -124 -168 -184 -151 -78 -52 -146 -286 -323 -235 -147 -137 -149 -110 -51 -38 -63 -67 -47 -62 -148 -245 -251
1254b51Q3M9l8mJ05N8r6j12K9P2l4q4k6J6K8P1O8k7q9l1N0M4k8m5M7J30P2m0k6M6Nr9j19q9
$$ -251 -168 -119 -157 -161 -56 2 -94 -206 -177 -105 -139 -223 -249 -233 -205 -134 -66 -93 -182 -213 -163 -119 -147 -192 -145 -15 57 17 -9 37 42 -57 -176 -265
1249b65n9M2J52J14MlK9ql2PJ1l1l0JMKj1n3o2j8ml0k4KLOL4N8O8L7n0r9l4N9O6J9l4o9l7
$$ -265 -324 -282 -130 -16 -12 -15 14 6 -26 -19 -8 -39 -69 -68 -64 -62 -73 -126 -188 -206 -210 -240 -264 -262 -259 -253 -219 -161 -93 -56 -106 -205 -239 -180 -114 -95 -129 -198 -235
1244b35M0O1L5M0J5p0q1J5M6l1p7n0pL7N2J9J8O8O4ll6l2l7k9j8m9n8lO2J00Q9Mo2J9J01P
$$ -235 -195 -134 -99 -59 -44 -114 -195 -180 -134 -165 -242 -292 -299 -262 -210 -191 -173 -105 -41 -44 -80 -112 -149 -178 -196 -245 -303 -306 -244 -144 -55 -51 -113 -94 7 14
1238A4p8J4O9k2l8N8L0q0n8M7Q1P5M5j9l4Lk6o5MM9l6p3K2P3j2j06j19k9R9J14Ll6N2P2m8
$$ 14 -64 -50 19 -3 -41 17 47 -33 -91 -44 37 112 157 138 104 107 81 16 20 69 33 -40 -18 55 43 -63 -182 -211 -112 2 5 -31 21 93 45
1233D5j22o3L5P2K9l7m3MK2K4M8L8l6p7j9P6R2%r5p4qj1mO3L0r3n9R8P1q9j22n3l5NR2O4o5
$$ 45 -77 -140 -105 -33 -4 -41 -84 -80 -58 -34 14 52 16 -61 -80 -4 88 88 -7 -81 -89 -100 -104 -41 -11 -104 -163 -65 6 -83 -205 -258 -293 -288 -196 -132 -197
1228a97r4k4PJ8Q5J53J07k9j21q1%Pk7m8m7%O4K8l7L3J07j4j20j1Q1J8J2O6j8r5nN8PK3O4
$$ -197 -291 -315 -308 -290 -205 -52 55 26 -95 -176 -176 -169 -196 -244 -291 -291 -227 -199 -236 -203 -96 -110 -230 -241 -160 -142 -130 -64 -82 -177 -182 -124 -117 -94 -30
1223c0k4j05n7l0j5O9O8o9o9P7P9l3m0Ork6l6k8P1J33k3j45J5J67N1o0J2M2m9p3lM1M3K6J3
$$ -30 -54 -159 -216 -246 -261 -192 -124 -193 -262 -185 -106 -139 -179 -173 -182 -208 -244 -272 -201 -68 -91 -236 -221 -54 -3 -63 -51 -9 -58 -131 -134 -93 -50 -24 -11
1218a1K9Jj09j30K1J22L9n3n6o3p4j9M8L9lK8R4O5n8q2J7K4p9n9O8N2o7o5QOnL0O1J03J10
$$ -11 18 19 -90 -220 -199 -77 -38 -91 -147 -210 -284 -303 -255 -216 -219 -191 -97 -32 -90 -172 -155 -131 -210 -269 -201 -149 -216 -281 -273 -267 -272 -242 -181 -78 32
1212C2l2j93j13R0J11J1%L7J9j1k5k7J8P6N6JmK1J6j5n2p8m8L0N4qo0j9O2P0J7j0k4q0j06
$$ 32 0 -193 -306 -216 -105 -94 -94 -57 -38 -49 -74 -101 -83 -7 49 50 46 67 83 68 16 -62 -110 -80 -26 -34 -94 -113 -51 19 36 26 2 -78 -184
1207a84l3J6mL3R9Qj56j47JJ03J37J17J0q5p4m2o2l3N6R5P0N2N7O0K5m3p2k6k0q1o4L9L8n6
$$ -184 -217 -201 -205 -172 -73 -65 -221 -368 -367 -264 -127 -10 0 -85 -159 -201 -263 -296 -240 -145 -75 -23 34 94 119 76 4 -22 -42 -123 -187 -148 -110 -166
1202a66n7K1L5k1n7l6K9R1P2ll9k2QK6j7q5l8P6L8q4j9J52J10p3r3M1P9Mj7M0N5rp6p5k0P
$$ -166 -223 -202 -167 -188 -245 -281 -252 -161 -89 -92 -131 -153 -145 -119 -136 -221 -259 -183 -145 -229 -248 -96 14 -59 -152 -111 -32 -28 -45 -5 50 41 -35 -110 -130 -123
1197a23j5k6pJ0K5M8K7n6p9K5J16N1m9j8N4J6m2OL8o8j72j02K2M9M5P9M5p3p3R3J41m8j85
$$ -123 -138 -164 -171 -161 -136 -88 -61 -117 -196 -171 -55 -4 -53 -71 -17 -1 -43 -37 1 -67 -239 -341 -319 -270 -225 -146 -101 -174 -247 -154 -13 -61 -246
1192b46o3R6Q0k2o0j1R1J47L5j44j59k5L5J7M1Q3M2n7j14o8O0J32N7l6qM6Mo1n2rj2m9m3N4
$$ -246 -309 -213 -133 -155 -215 -226 -135 12 47 -97 -256 -281 -246 -229 -188 -105 -63 -120 -234 -302 -242 -110 -53 -89 -97 -51 -47 -108 -160 -169 -181 -230 -273 -219
1187b19J60J40J3q6r1n7k1kk7o9o1mL8K9K2N4Q9M3o3j18q6oQ5J10L4l6JO9Q7Q9K8j13j38K1
$$ -219 -59 81 94 8 -83 -140 -161 -163 -190 -259 -320 -324 -286 -257 -235 -181 -92 -49 -112 -230 -316 -322 -237 -127 -93 -129 -128 -59 28 117 145 32 -106 -85
1182h5R0l5o9O8P0r3j28K7J05J7p1l8K5Pl2RJ2j38k07mJ88J14PO0O8m9r6m7mP6J37K9j01l1
$$ -85 5 -30 -99 -31 39 -54 -182 -155 -50 -33 -104 -142 -117 -110 -142 -133 -121 -259 -466 -470 -282 -168 -161 -101 -33 -82 -178 -225 -229 -153 -16 13 -88 -119
1177a19P5K6oM8j2j26m2J14M8j08q0P3J20J4j23j30MP6ol2P5P4o3q4K2K6m5j9J1l6k3O6N6
$$ -119 -44 -18 -24 24 12 -114 -156 -42 6 -102 -182 -109 11 25 -98 -228 -224 -148 -154 -186 -111 -37 -100 -184 -162 -136 -181 -200 -189 -225 -248 -182 -126
1172a26j3kNn3j8R9Q1k1LO1j0o4L5J08J6r0o7J3J7o8q9M2J38K1j12l2R6L7o8n1k9r3p6O5J19
$$ -126 -139 -141 -136 -189 -207 -108 -27 -48 -45 16 6 -58 -23 85 101 11 -56 -43 -26 -94 -183 -141 -3 18 -94 -126 -30 7 -61 -112 -141 -234 -310 -245 -126
1167a26rj22o4M9O6L7M9M9j0m9m5n0l0N4Q9L0j6k8o3m4L3j7j45o0J34Q4p9mJ35K5j22k1J21
$$ -126 -135 -257 -321 -272 -206 -169 -120 -71 -81 -130 -175 -225 -255 -201 -112 -82 -98 -126 -189 -233 -200 -217 -362 -422 -288 -204 -283 -287 -152 -127 -249 -270 -149
1162a49N2o4l6M9M8k7r0o6K0O7J1o7o2J9R2J02O1Ol3l8j2J8L3jo8p1K6O9j9n7L9Q4K5J4J6
$$ -149 -97 -161 -197 -148 -100 -127 -217 -283 -263 -196 -185 -252 -314 -295 -203 -101 -40 -34 -67 -105 -117 -99 -66 -67 -135 -206 -180 -111 -130 -187 -148 -64 -39 -25 -9
1157iq8j49j6J25J17O1Nq2q3K1J7r3n9Q9J07mp6p2jR6R4j8o5KM3J2j3qRK1Kj2J0%o7o7J0K3
$$ -9 -97 -246 -262 -137 -20 41 46 -36 -119 -98 -81 -174 -233 -144 -37 -41 -117 -189 -190 -94 0 -18 -83 -81 -38 -26 -39 -47 -38 -17 -15 -27 -17 -17 -84 -151 -141 -118
$$ [...]
-1209A88
##END=	
##TITLE=	3314#-H-0302
##JCAMP-DX=	6.0	$$ MestReNova 14.1.2-25024
##BLOCK_ID=	3
##DATA TYPE=	NMR PEAK TABLE
##DATA CLASS=	PEAK TABLE
##CROSS REFERENCE=	NMR SPECTRUM: BLOCK_ID=2                                     
##.OBSERVE FREQUENCY=	599.77963079999994989
##.OBSERVE NUCLEUS=	^1H
##NPOINTS=	60
##FIRSTX=	-0.0054083013928883259466
##LASTX=	7.2758268903991885068
##XFACTOR=	1
##YFACTOR=	1
##FIRSTY=	0.0045807272922981298602
##XUNITS=	PPM
##YUNITS=	ARBITRARY UNITS
##PEAK TABLE=	(XYW..XYW)
-0.0054083013928883259466,0.0045807272922981298602,0.004444193575548547985
0.63192547875355309372,0.012375471948862680135,0.0066204371113915980521
0.64451069532081628477,0.027408030145660046417,0.0069876124377563310006
0.65711488729112044194,0.016370133447041707725,0.0057223780187623295504
0.73519683714637018568,0.72051406019184494056,0.0038475368843449509262
0.73863705243389143895,2.1010287278790800158,0.0054191986529801379133
0.74750409728095024153,1.5536544966359748798,0.0033179821408937425556
0.74946000709514848381,2.0391261931789017581,0.0028484805659320607853
0.75118887715196136501,3.3080176999917139113,0.003737900932254594865
0.75326321829788667195,1.41876450151470479,0.0034007212073338161269
0.76002995297374875694,0.95178572802363892169,0.0033074548506880322059
0.76196747979153856001,1.1087517191252111992,0.0026362949571084094182
0.76359115146230216453,1.662264781691278337,0.0033484139913389234476
0.7656372021870957445,0.90195606770085412496,0.0034864284918381385422
0.84021705496073895159,0.01104731943790678364,0.0069101884826294366834
0.85278780266293596757,0.028471085128078114229,0.0061937896320261231695
0.8656134825951484757,0.01510718149833896809,0.0062096557902627004533
1.0975117633186661781,0.005480617745271270172,0.0082158836471241791094
1.1108249665800007389,0.010005400596515258427,0.0077986464143404666746
1.1235091367047613797,0.0090758491989161426544,0.0069432981242679506217
1.1928927280636956176,0.1717734142576393952,0.0060646686463105550433
1.2053207345995331501,0.82849768565725900871,0.0066048260997153629762
1.2178408060158292248,1.6676627386573836809,0.0071610032071734112252
1.2303783593692252385,1.7398366236161002529,0.0077530583391002922886
1.2430203918490017045,0.86985322758549288302,0.0066638226079236253033
1.2555031285277633568,0.18949166344233922543,0.0060915754583421855006
1.3005552981151187186,1.715929415201451036,0.0036214376532419643474
1.3026256744099609097,2.0926331096430912382,0.0025258234947185629476
1.3044222851131297425,3.1357898504474652768,0.0036400538925240705744
1.3065867446531029827,1.3954527770565527955,0.0035570736392105842087
1.3287383153995071527,1.3132016091198370766,0.0031119887204717026907
1.3310650564260266826,2.7138402280692717206,0.0033763531029474265314
1.3330497773324225808,3.0605788771719897312,0.0034998739506835619545
1.3353262525270159777,1.2995899782527156052,0.0032697505086329808725
1.408670041609607626,0.027524133632178697517,0.006714961260058109789
$$ [...]
$$ APC: Attached Peaks Count
CS Reference,Artifact|Weak,,1,0.28291682824419572828,0,0
Compound,Artifact|Impurity|Weak|13C Sat.,,1,1.0551218369103343431,0,0
Compound,Artifact|Impurity|Weak|13C Sat.,,1,0.79963657054999037754,0,0
Compound,Artifact|Impurity|Weak|13C Sat.,,1,1,0,0
Compound,None,,1,0.93846099168911012445,0,0
Compound,None,,1,1.5337200085040076925,0,0
Compound,None,,1,0.53905007373966662421,0,0
Compound,None,,1,0.5089999976175736407,0,0
Compound,None,,1,0.10885192115401537416,0,0
Compound,None,,1,0.50202569238504124449,0,0
Compound,None,,1,0.78919816725225233611,0,0
Compound,None,,1,0.70554273245407761461,0,0
Compound,None,,1,0.11633031172951772969,0,0
Compound,None,,1,0.92107709659144210157,0,0
Compound,Artifact|Impurity|Weak|13C Sat.,,1,1.3999999999999999112,0,0
Compound,Artifact|Impurity|Weak|13C Sat.,,1,0.59008497774165169503,0,0
Compound,Artifact|Impurity|Weak|13C Sat.,,1,0.37384381322707377349,0,0
Artifact,Artifact|Weak,,1,-0.0308991154607199843,0,0
Impurity,Artifact|Weak,,1,0.034014642918287624207,0,0
Impurity,Artifact|Weak,,1,-0.24485746950964729085,0,0
Compound,None,,1,1.6435472544930358474,0,0
Compound,None,,1,0.88471234512893537349,0,0
Compound,None,,1,0.93259804031538384717,0,0
Compound,None,,1,0.60011500374151727222,0,0
Compound,None,,1,1.0816754443810490116,0,0
Compound,None,,1,1,0,0
Compound,None,,1,1.0336834140288069239,0,0
Compound,None,,1,0.31613484522393953124,0,0
Compound,None,,1,0.22190746753860152163,0,0
Compound,None,,1,0.47932303352017097131,0,0
Compound,None,,1,1.1791389040648663222,0,0
Compound,None,,1,0.28914264495201175142,0,0
Compound,None,,1,0.32904085712698066812,0,0
Compound,None,,1,1.153619518032860114,0,0
Impurity,Artifact|Weak,,1,0.64485618877664052651,0,0
Artifact,Artifact|Weak,,1,1.7999999999999998224,0,0
Compound,None,,1,0.86401134564045301012,0,0
Compound,None,,1,0.35048340844445485809,0,0
Compound,None,,1,0.80787556582512398684,0,0
Compound,None,,1,0.69249190682435979305,0,0
Compound,None,,1,1.9847274634766922663,0,0
Artifact,Artifact|Weak,,1,0.002471579545697114022,0,0
Impurity,Artifact|Weak,,1,0.46178404527993210937,0,0
Impurity,Artifact|Weak,,1,0.40984744079827611918,0,0
Impurity,Artifact|Weak,,1,0.5418730718165368776,0,0
Impurity,Artifact|Weak,,1,0.80000000000000004441,0,0
Impurity,Artifact|Weak,,1,-1,0,0
Compound,Artifact|Impurity|Weak|13C Sat.,,1,0.19219274027942678806,0,0
Compound,Artifact|Impurity|Weak|13C Sat.,,1,0.2000000000000000111,0,0
Compound,None,,1,1.999999999999999778,0,0
Compound,None,,1,0.8731356950073935197,0,0
Compound,None,,1,0.89863436143182529037,0,0
Compound,None,,1,1.999999999999999778,0,0
Compound,Artifact|Impurity|Weak|13C Sat.,,1,0.54860679850445992489,0,0
Compound,Artifact|Impurity|Weak|13C Sat.,,1,-0.030227229119432222348,0,0
Solvent,None,,1,0.70106057337212956959,0,0
Compound,None,,1,0.77912039961616408323,0,0
Compound,None,,1,0.44449219611585649714,0,0
Compound,None,,1,0.48993426769233267004,0,0
Compound,None,,1,0.28703939117152293958,0,0
##END=	
##END=	
