##TITLE=	RM1002-H

##JCAMP-DX=	6.0	$$ MestReNova 14.1.2-25024
##DATA TYPE=	LINK
##BLOCK_ID=	1
##BLOCKS=	2    
##ORIGIN=	Mestrelab Research S.L.
##OWNER=	HGL
##$MNOVA/LINK_BLOCK_TYPE=	ITEM	$$ NMR Spectrum
##$MNOVA/ITEM/POLYGON=	(XY..XY)
5321,5835
8722,5835
8722,8208
5321,8208
5321,5835
##$MNOVA/ITEM/Z=	0
##$MNOVA/ITEM/ANGLE=	0
##TITLE=	RM1002-H
##JCAMP-DX=	6.0	$$ MestReNova 14.1.2-25024
##BLOCK_ID=	2
##DATA TYPE=	NMR SPECTRUM
##DATA CLASS=	XYDATA
##NUMDIM=	1
##ORIGIN=	Varian
##OWNER=	HGL
##.OBSERVE FREQUENCY=	599.77881209999998191
##.OBSERVE NUCLEUS=	^1H
##.SOLVENT NAME=	d2o
##.PULSE SEQUENCE=	presat
##LONGDATE=	2010/05/10 09:49:11.000
##.ACQUISITIONMODE=	SIMULTANEOUS
##$ORIGINAL FORMAT=	JCAMP-DX NMR
##$MNOVA/SCALES_VERSION=	9
##$PARAMETER FILE=	(datafile, ASCII, h:/Bis(2-hydroxyethyl)sulfide-H-TopSpin_ALL_EXPNOS_DIM_1_2-JCAMP_DIFF_DUP.dx, 0)
$$ 
##$PARAMETER FILE=	(header, ASCII, h:/Bis(2-hydroxyethyl)sulfide-H-TopSpin_ALL_EXPNOS_DIM_1_2-JCAMP_DIFF_DUP.dx, 114)
$$ ##TITLE=	RM1002-H
$$ ##JCAMPDX= 6.0         $$ Bruker NMR JCAMP-DX V2.0
$$ ##DATA TYPE= NMR SPECTRUM
$$ ##DATA CLASS= XYDATA
$$ ##ORIGIN= Varian
$$ ##OWNER= HGL
$$ ##LONG DATE= 2010/05/10 09:49:11+0000
$$ $$ TopSpin 4.4.1
$$ $$ 2026-04-26 13:18:44.931 +0800  HGL@NMR20240229
$$ $$ Compression mode = diff/dup
$$ ##.OBSERVE FREQUENCY= 599.7788121
$$ ##.OBSERVE NUCLEUS= ^1H
$$ ##.ACQUISITION MODE= SIMULTANEOUS
$$ ##.ACQUISITION SCHEME= undefined
$$ ##.AVERAGES= 16
$$ ##.DIGITISER RES= 32
$$ ##SPECTROMETER/DATA SYSTEM= 
$$ ##.PULSE SEQUENCE= presat
$$ ##.SOLVENT NAME= d2o
$$ ##.SHIFT REFERENCE= INTERNAL, d2o, 1, 12.78199
$$ ##AUDIT TRAIL= $$ (NUMBER, WHEN, WHO, WHERE, PROCESS, VERSION, WHAT)
$$ $$ ##TITLE= Audit trail, TopSpin 4.4.1
$$ $$ ##JCAMPDX= 5.01
$$ $$ ##ORIGIN= Bruker BioSpin GmbH & Co. KG
$$ $$ ##OWNER= HGL
$$ $$ $$ C:\Bruker\TopSpin4.4.1/1002-H/1/pdata/1/auditp.txt
$$ $$ ##AUDIT TRAIL=  $$ (NUMBER, WHEN, WHO, WHERE, PROCESS, VERSION, WHAT)
$$ (   1,<2026-04-26T12:54:32.973+0800>,<HGL>,<NMR20240229>,<jcamp>,<TopSpin 4.4.1>,
$$       <fromjdx created from
$$        H:\NMR\AI-Test-data\JDX\1002-H.jdx
$$        data hash MD5: 64K
$$        49 5E B4 3D 77 C8 63 F4 4F B3 B0 9B E6 81 CB 90>)
$$ (   2,<2026-04-26T12:54:59.069+0800>,<HGL>,<NMR20240229>,<dataserver>,<TopSpin 4.4.1>,
$$       <Start of interactive peak picking
$$        data hash MD5: 64K
$$        49 5E B4 3D 77 C8 63 F4 4F B3 B0 9B E6 81 CB 90>)
$$ (   3,<2026-04-26T12:55:03.505+0800>,<HGL>,<NMR20240229>,<peak>,<TopSpin 4.4.1>,
$$       <1D Peak picking
$$        data hash MD5: 64K
$$        49 5E B4 3D 77 C8 63 F4 4F B3 B0 9B E6 81 CB 90>)
$$ (   4,<2026-04-26T12:57:47.719+0800>,<HGL>,<NMR20240229>,<dataserver>,<TopSpin 4.4.1>,
$$       <End of interactive peak picking
$$        data hash MD5: 64K
$$        49 5E B4 3D 77 C8 63 F4 4F B3 B0 9B E6 81 CB 90>)
$$ $$ ##END=
$$ $$ 
$$ $$ $$ hash MD5
$$ $$ $$ DA C0 70 03 0E CA DA B5 D4 C5 B2 92 12 62 6B 39
$$ ##$RELAX= 
$$ ##$BRUKER FILE PROC=peaklist.xml
$$ [...]
$$ ##$ABSF1= 10
$$ ##$ABSF2= 0
$$ ##$ABSG= 5
$$ ##$ABSL= 3
$$ ##$ALPHA= 0
$$ ##$AQORDER= 0
$$ ##$ASSFAC= 0
$$ ##$ASSFACI= 0
$$ ##$ASSFACX= 0
$$ ##$ASSWID= 0
$$ ##$AUNMP= <proc_1d>
$$ ##$AXLEFT= 0
$$ ##$AXNAME= <>
$$ ##$AXNUC= <off>
$$ ##$AXRIGHT= 0
$$ ##$AXTYPE= 0
$$ ##$AXUNIT= <>
$$ ##$AZFE= 0.1
$$ ##$AZFW= 0.1
$$ ##$BCFW= 1
$$ ##$BC_mod= 2
$$ ##$BYTORDP= 0
$$ ##$COROFFS= 0
$$ ##$CY= 15
$$ ##$DATMOD= 1
$$ ##$DC= 2
$$ ##$DFILT= <>
$$ ##$DTYPP= 0
$$ ##$ERETIC= no
$$ ##$F1P= 0
$$ ##$F2P= 0
$$ ##$FCOR= 0.5
$$ ##$FTSIZE= 0
$$ ##$FT_mod= 4
$$ ##$GAMMA= 1
$$ ##$GB= 0
$$ ##$INTBC= 1
$$ ##$INTSCL= 1
$$ ##$ISEN= 128
$$ ##$LB= 0.3
$$ ##$LEV0= 0
$$ ##$LPBIN= 0
$$ ##$MAXI= 10000
$$ ##$MC2= 0
$$ ##$MEAN= 0
$$ ##$ME_mod= 0
$$ ##$MI= 0
$$ ##$MddCEXP= no
$$ ##$MddCT_SP= no
$$ ##$MddF180= no
$$ ##$MddLAMBDA= 0
$$ ##$MddMEMORY= 0
$$ ##$MddMERGE= 0
$$ ##$MddNCOMP= 0
$$ ##$MddNITER= 0
$$ ##$MddNOISE= 0
$$ ##$MddPHASE= 0
$$ ##$MddSEED= 0
$$ ##$MddSRSIZE= 0
$$ ##$Mdd_CsALG= 0
$$ ##$Mdd_CsLAMBDA= 1
$$ ##$Mdd_CsNITER= 0
$$ ##$Mdd_CsNORM= 0
$$ ##$Mdd_CsVE= yes
$$ ##$Mdd_CsZF= 0
$$ ##$Mdd_LrLAMBDA= 0
$$ ##$Mdd_LrNITER= 0
$$ ##$Mdd_LrRANK= 0
$$ ##$Mdd_LrZF= 0
$$ ##$Mdd_mod= 0
$$ ##$NCOEF= 0
$$ ##$NC_proc= -23
$$ ##$NLEV= 6
$$ ##$NOISF1= 0
$$ ##$NOISF2= 0
$$ ##$NSP= 1
$$ ##$NTH_PI= 0
$$ ##$NZP= 0
$$ ##$OFFSET= 12.7819915707858
$$ ##$PC= 1
$$ ##$PHC0= 0
$$ ##$PHC1= 0
$$ ##$PH_mod= 1
$$ ##$PKNL= yes
$$ ##$PPARMOD= 0
$$ ##$PPDIAG= 0
$$ ##$PPIPTYP= 0
$$ ##$PPMPNUM= 16384
$$ ##$PPRESOL= 1
$$ ##$PSCAL= 0
$$ ##$PSIGN= 0
$$ ##$PYNMP= <proc.py>
$$ ##$RDF1= 0
$$ ##$RDF2= 0
$$ ##$RDFWHM= 0
$$ ##$RDINT= 0
$$ ##$RDPOS= 0
$$ ##$REVERSE= no
$$ ##$SF= 599.7788121
$$ ##$SI= 65536
$$ ##$SIGF1= 0
$$ ##$SIGF2= 0
$$ ##$SINO= 0
$$ ##$SIOLD= 32768
$$ ##$SPECTYP= <>
$$ ##$SREF_mod= 1
$$ ##$SREGLST= <1H.CDCl3>
$$ ##$SSB= 0
$$ ##$STSI= 0
$$ ##$STSR= 0
$$ ##$SW_p= 9615.38461539
$$ ##$SYMM= 0
$$ ##$S_DEV= 0
$$ ##$TDeff= 0
$$ ##$TDoff= 0
$$ ##$TI= <>
$$ ##$TILT= no
$$ ##$TM1= 0
$$ ##$TM2= 0
$$ ##$TOPLEV= 0
$$ ##$USERP1= <>
$$ ##$USERP10= <>
$$ ##$USERP2= <>
$$ ##$USERP3= <>
$$ ##$USERP4= <>
$$ ##$USERP5= <>
$$ ##$USERP6= <>
$$ ##$USERP7= <>
$$ ##$USERP8= <>
$$ ##$USERP9= <>
$$ ##$WDW= 1
$$ ##$XDIM= 65536
$$ ##$YMAX_p= 2139959968
$$ ##$YMIN_p= 1228469
$$ ##$CURPLOT= <>
$$ ##$CURPRIN= <$>
$$ ##$DFORMAT= <normdp>
$$ ##$LAYOUT= <+/1D_H.xwp>
$$ ##$LFORMAT= <normlp>
$$ ##$PFORMAT= <normpl>
$$ $$ End of Bruker specific parameters
$$ $$ ---------------------------------
$$ ##XUNITS= HZ
$$ ##YUNITS= ARBITRARY UNITS
$$ ##XFACTOR= 0.146719125601044
$$ ##YFACTOR= 1
$$ ##DELTAX= -0.146719125601044
$$ ##NPOINTS= 65536
$$ ##FIRSTX= 9615.2378962644
$$ ##FIRSTY= 1337477
$$ ##LASTX= 0
$$ ##MAXY= 2139959968
$$ ##MINY= 1228469
$$ 
##XUNITS=	HZ
##YUNITS=	ARBITRARY UNITS
##FIRSTX=	7666.3667784740791831
##LASTX=	-1948.8711177903189764
##DELTAX=	-0.14671912560104369283
##XFACTOR=	1
##YFACTOR=	662.9169190289907192
##FIRSTY=	1337477
##MINY=	1228469
##MAXY=	2139959936
##NPOINTS=	65536
##XYDATA=	(X++(Y..Y))
$$ [...]
4358B214L5j8k4NQJ3N5P0M0L8M8k1j16r2L7P8k7r1K2J47R2k5k9j6r2j02J9M7p1j26l9N1Q4
4353B214N9m0j11l1Q4J01P0K5o2r0J4N8m2n7O5O0r7j13L6P4k7l0O4N7m1n8J4L7j0mN9M0p0
4348B248j07k6K8K0L6O8K5k1PK6OJ7jj12j42J6J13Lq9j4Q4J09P2l8j49j14MK8rML7P6J30R8
4343B433m5r9j5L6K3L3K5k0j7Mn4p3J2L7j9J8R9M5n6n7m3o2k2K3j5NJ17J03p5j44m1Qn4n3
4338B057M1Q4M4RK9O2L8m6j00n4L3N2%j9K3M9qp8n9M5J03L6o3p4k7rj7j9k7j4M7N8l6r5j0
4333B055R7P9k5q4m2N3J02O1rn5o9k3N7N1l6n4K4M8j0m7l0jJj4NO5P1MrM3Pq8o3N4Q2lp8n8
4327B161L0O7nm7K7O0j6n0l3o8n8O4J11L4J4K9m4r4m5m0o4J6P2ml2L2J3m5lL6J9O1O5r2j53
4322B018M0J60L6o1l3l0l1J8Nl2N7J49N0p5m7mm0k5M3J5m3K4R8jj13l4Q7K1r9n7P6J20O0l5
$$ y = [2214, 2249, 2231, 2207, 2212, 2220, 2233, 2288, 2358, 2398, 2436, 2484, 2463, 2347, 2255, 2292, 2370, 2343, 2252, 2274, 2421, 2513, 2488, 2459, 2443, 2351, 2249, 2268, 2315, 2244, 2118, 2079, 2130, 2214, 2273, 2233, 2122, 2091, 2175, 2276, 2346, 2371, 2309, 2219, 2233, 2291, 2249, 2192, 2257, 2317, 2220, 2107, 2143, 2217, 2190, 2160, 2224, 2281, 2240, 2182, 2196, 2233, 2223, 2219, 2278, 2318, 2248, 2141, 2115, 2143, 2163, 2199, 2267, 2292, 2271, 2278, 2304, 2310, 2327, 2326, 2214, 2072, 2088, 2201, 2204, 2115, 2101, 2185, 2294, 2366, 2328, 2179, 2065, 2069, 2097, 2088, 2092, 2129, 2205, 2335, 2433, 2388, 2289, 2274, 2310, 2333, 2366, 2391, 2371, 2354, 2358, 2304, 2231, 2243, 2280, 2261, 2279, 2378, 2423, 2367, 2310, 2267, 2205, 2183, 2206, 2191, 2196, 2313, 2416, 2341, 2197, 2156, 2164, 2110, 2057, 2098, 2182, 2226, 2235, 2264, 2326, 2364, 2318, 2218, 2164, 2197, 2249, 2249, 2230, 2253, 2302, 2294, 2216, 2157, 2202, 2305, 2341, 2278, 2204, 2177, 2168, 2151, 2132, 2105, 2091, 2138, 2196, 2160, 2065, 2055, 2152, 2231, 2206, 2122, 2080, 2133, 2235, 2296, 2287, 2232, 2163, 2140, 2197, 2248, 2212, 2158, 2182, 2230, 2220, 2173, 2143, 2142, 2143, 2129, 2134, 2199, 2270, 2274, 2265, 2308, 2315, 2227, 2164, 2218, 2300, 2297, 2219, 2161, 2191, 2258, 2253, 2206, 2233, 2293, 2277, 2227, 2194, 2126, 2068, 2132, 2243, 2277, 2291, 2320, 2276, 2182, 2137, 2097, 2033, 2049, 2121, 2117, 2085, 2117, 2130, 2085, 2082, 2118, 2137, 2198, 2263, 2171, 2018, 2058, 2218, 2254, 2193, 2160, 2130, 2099, 2117, 2122, 2090, 2147, 2296, 2346, 2271, 2224, 2220, 2180, 2155, 2198, 2213, 2170, 2194, 2292, 2291, 2178, 2144, 2231, 2252, 2153, 2096, 2172, 2292, 2352, 2317]
4317B317j03n0Q4R0o6j45n0M9L6KL5P6J8q7q2Qj1j02l7J35J55L7l6k7NL1k1j04m7Q5O4l7j8
4312B204J6n0m0Q6J17M8J8l0j26j11j0j0m9L1J11M7m7k8M8O4Kn5m4rMN1J03L8r1j02k2j6n8
4308B090m3JK1L9M9M9M5K0k0m0m2j4P9J25%j18m0M5n6j21jR0M9K6Rn8k9J11R6r1j38KO7J6
4303B218J2M1on9l0J4K2M4N4k6j00k7O3kp8K0J27L5r5m7Q1O9m4n4M8N9q5j77q7M7J00J04M2
4298B283o8o0O1M3r2o7N1J4o3rOo6OJ57J18KL0N0o6j01M5J23j0j64j28M2J24O0K1M3l0j47
4293B208q0O9M3p1n5Lj1oM8L4j2OQm6k0J15J43j0j20m4K0o6r8O7J68L2j05r4n4J6J71J78p8
4288B359k18m1J23O9rj6l7m6qpk8j0RM5J16Q1n6n1R0P1p5o4L1k9j34p7M7O7j8j05n6J29J90
4283B342j8k03j01R2J24N9J5k6l6L2O2k2q2j9O1N1Kl0l0RK1n6r9KJ01O9L9O1j9j25k3J35O2
$$ y = [2317, 2214, 2164, 2248, 2338, 2272, 2127, 2077, 2126, 2162, 2164, 2199, 2275, 2293, 2206, 2124, 2132, 2121, 2019, 1982, 2117, 2272, 2309, 2273, 2246, 2251, 2282, 2261, 2157, 2110, 2195, 2259, 2222, 2204, 2220, 2170, 2130, 2216, 2333, 2381, 2399, 2369, 2243, 2132, 2122, 2112, 2063, 2094, 2205, 2252, 2205, 2177, 2225, 2289, 2291, 2236, 2192, 2183, 2187, 2238, 2341, 2379, 2288, 2186, 2164, 2148, 2090, 2047, 2048, 2069, 2108, 2157, 2206, 2251, 2271, 2251, 2211, 2169, 2155, 2234, 2359, 2359, 2241, 2201, 2246, 2190, 2069, 2068, 2158, 2207, 2233, 2242, 2184, 2155, 2266, 2362, 2271, 2133, 2135, 2202, 2218, 2230, 2271, 2265, 2206, 2176, 2190, 2212, 2256, 2310, 2284, 2184, 2157, 2220, 2218, 2140, 2160, 2287, 2322, 2227, 2180, 2261, 2330, 2286, 2232, 2280, 2339, 2254, 2077, 1990, 2037, 2137, 2241, 2283, 2215, 2155, 2216, 2259, 2167, 2100, 2151, 2165, 2102, 2093, 2099, 2033, 2039, 2196, 2314, 2316, 2346, 2396, 2330, 2229, 2274, 2397, 2387, 2223, 2095, 2137, 2261, 2321, 2342, 2385, 2355, 2208, 2128, 2197, 2240, 2169, 2114, 2117, 2106, 2100, 2148, 2182, 2170, 2176, 2184, 2138, 2118, 2233, 2376, 2366, 2246, 2202, 2222, 2156, 2058, 2125, 2293, 2325, 2220, 2126, 2072, 2088, 2259, 2437, 2359, 2141, 2100, 2223, 2292, 2283, 2267, 2230, 2184, 2176, 2169, 2141, 2131, 2140, 2185, 2301, 2382, 2326, 2275, 2365, 2436, 2361, 2297, 2328, 2299, 2165, 2088, 2135, 2202, 2184, 2079, 2023, 2152, 2342, 2324, 2121, 2020, 2112, 2236, 2295, 2310, 2284, 2248, 2280, 2342, 2320, 2238, 2219, 2280, 2331, 2333, 2303, 2273, 2282, 2303, 2247, 2148, 2150, 2251, 2320, 2359, 2420, 2401, 2276, 2253, 2388, 2450]
4278B450q0n0j0r5j05j8oJ4J36J36m9q2P1O6j22j34N4J05m8j26lJ04K3r7o3L2L9L8Q9Q2%m5
4274B306o0q2m4K1M%Q9R7k0m7Qo4j57n6Q1M2kQ6J04n4j43m0N7J7j6N5Q2j3o4LM2NJ3M5Kk2
4268B275L1J4o6l6N8L4k9NK0m8n4Nj0n3j8J9j4j9M1P3L6kk4q4j32l5J48J53m6j03O7J16l2
4264B290n0P9L3j20o0J00O5o2o7l3n2m0J8O9J01P1m0j00l2K0r%P6P4j2m5j4lj7QP4Q1mo8k2
4259B309Pq3j60q4K9O9P7M3o5r8L5J47J00L8L4Km0oK1k1k3J8l1j11n2P7P8k4o9j4M8N8L5o
4254B338q7j11J9J47N7r5o3Op2r5L0N8k0M7J40Lj37k9P4j7p1J7O5Rp8j33o6R3J25K8%jo9k6
4249B086J50J34o1p2O0K6o7qO3Nn5m6k8J3O9N0k4n2k1L3O6L5k4n0q3j01kJ27R1l0m2Mj%J1
4243B256k5n1l5n7o1O0J59Q2j4ONq1j10j1J03R4k5o8M9J06l4j17J5Q4n7j53n4O1P7M1kKP7
$$ y = [2450, 2370, 2320, 2310, 2215, 2110, 2092, 2086, 2100, 2236, 2372, 2323, 2241, 2312, 2378, 2256, 2122, 2176, 2281, 2233, 2107, 2104, 2208, 2231, 2134, 2071, 2103, 2142, 2180, 2269, 2351, 2351, 2306, 2246, 2164, 2120, 2141, 2145, 2145, 2234, 2331, 2311, 2264, 2272, 2208, 2051, 1995, 2076, 2118, 2116, 2202, 2306, 2252, 2109, 2069, 2126, 2143, 2127, 2182, 2264, 2251, 2187, 2190, 2232, 2237, 2250, 2295, 2297, 2275, 2306, 2320, 2254, 2218, 2276, 2310, 2281, 2286, 2306, 2258, 2204, 2209, 2199, 2146, 2128, 2147, 2133, 2114, 2155, 2228, 2264, 2262, 2238, 2154, 2022, 1987, 2135, 2288, 2242, 2139, 2206, 2322, 2290, 2240, 2319, 2352, 2232, 2172, 2272, 2337, 2275, 2208, 2175, 2123, 2083, 2101, 2170, 2271, 2342, 2302, 2202, 2170, 2190, 2181, 2181, 2257, 2331, 2319, 2274, 2260, 2257, 2240, 2248, 2322, 2403, 2399, 2331, 2309, 2316, 2233, 2073, 1989, 2018, 2087, 2164, 2207, 2142, 2044, 2079, 2226, 2326, 2364, 2398, 2400, 2360, 2354, 2375, 2354, 2331, 2349, 2318, 2207, 2155, 2232, 2310, 2286, 2217, 2203, 2251, 2309, 2344, 2338, 2251, 2140, 2159, 2306, 2363, 2268, 2205, 2211, 2139, 2044, 2074, 2132, 2112, 2159, 2299, 2302, 2165, 2136, 2210, 2193, 2122, 2139, 2204, 2213, 2135, 2002, 1936, 2029, 2154, 2182, 2182, 2181, 2112, 2086, 2236, 2370, 2309, 2237, 2297, 2323, 2256, 2248, 2311, 2316, 2261, 2215, 2187, 2200, 2269, 2319, 2295, 2243, 2222, 2255, 2321, 2356, 2332, 2282, 2199, 2098, 2096, 2223, 2314, 2284, 2242, 2246, 2245, 2245, 2256, 2231, 2180, 2145, 2088, 2027, 2087, 2246, 2328, 2314, 2320, 2325, 2244, 2134, 2123, 2226, 2320, 2295, 2227, 2276, 2382, 2348, 2231, 2246, 2330, 2273, 2120, 2066, 2127, 2204, 2245, 2243, 2245, 2322]
4239B322J17M3o6j12q5mO0M2m%L3N0K0o8j02J0R8lr2j0K6o1m7N2K4k5O0N8r7r0Q0N7j01n5
4234B130R8R1K6L4j7j16p0N0L0n6l9K4M7M1Qm3l0J5m3j28n6J02J22J8n2m2RP7Q1nq0n9k6l6
4229B105k5L4N3ll7K3P1%p7JJ16P7k5m4m6n1K9O8n5r2R6J54n7j61m2J5LP6O1r6m9J72J23j21
4224B296j03O4J1q9J1P9k5k2R4J0j76j07R8Q8l7rO3Rj5N4J9j13r8K8L5j6N6J05k1j16j1J20
4219B282R4%l2qJ4Kk5k8k5m2l9J2L0k6n3J7R6P1l0p2j2M2K2k6n4o9m3J9L9K0J8Ll1K0J12N9
4214B357q0j04n2k8K8Q4J4l5O1O2j02j06P4Q6n3l9O7N0j2j8l8m7J0L7nk1rj3L7J06O1m8p5
4209B249k9K6O4L9l0k7K1J4LL1Ml3K9L8q8j08K5K3o9M2J57m6k49p4J46M4j33j04j0L7J00J17
4204B209K0o0m5l9n5NQ4O4jKL1Ml4k7jJ7L5M6Qn0l0P5J09kj13r1k5jK8Q6Q8J0n4p5p7m8K4
$$ y = [2322, 2439, 2482, 2416, 2304, 2219, 2215, 2275, 2317, 2313, 2313, 2346, 2396, 2416, 2348, 2246, 2256, 2354, 2351, 2259, 2249, 2275, 2214, 2167, 2219, 2243, 2218, 2278, 2336, 2239, 2149, 2229, 2286, 2185, 2130, 2228, 2319, 2345, 2379, 2362, 2246, 2176, 2226, 2256, 2200, 2161, 2185, 2232, 2273, 2281, 2238, 2208, 2223, 2180, 2052, 1996, 2098, 2220, 2238, 2186, 2144, 2153, 2230, 2311, 2306, 2226, 2167, 2141, 2105, 2080, 2114, 2167, 2164, 2127, 2150, 2221, 2221, 2144, 2145, 2261, 2338, 2313, 2269, 2223, 2172, 2201, 2269, 2214, 2122, 2218, 2372, 2315, 2154, 2112, 2127, 2130, 2206, 2267, 2171, 2122, 2294, 2417, 2296, 2193, 2257, 2268, 2179, 2190, 2269, 2244, 2222, 2316, 2326, 2150, 2043, 2141, 2229, 2192, 2183, 2246, 2255, 2240, 2294, 2313, 2200, 2102, 2130, 2165, 2149, 2205, 2310, 2289, 2173, 2162, 2282, 2376, 2376, 2344, 2336, 2350, 2352, 2327, 2299, 2274, 2232, 2193, 2205, 2235, 2209, 2156, 2173, 2269, 2340, 2310, 2238, 2226, 2268, 2290, 2264, 2210, 2141, 2098, 2117, 2156, 2176, 2194, 2197, 2166, 2186, 2298, 2357, 2277, 2173, 2121, 2093, 2121, 2205, 2219, 2184, 2245, 2307, 2205, 2099, 2173, 2259, 2206, 2167, 2234, 2284, 2272, 2254, 2216, 2169, 2179, 2216, 2211, 2190, 2181, 2168, 2205, 2311, 2372, 2324, 2249, 2220, 2246, 2310, 2349, 2319, 2292, 2313, 2327, 2330, 2361, 2365, 2332, 2361, 2399, 2311, 2203, 2228, 2251, 2182, 2224, 2381, 2335, 2086, 2012, 2158, 2202, 2069, 1965, 1955, 1992, 2092, 2209, 2229, 2169, 2124, 2085, 2030, 2035, 2119, 2183, 2182, 2184, 2215, 2219, 2185, 2158, 2157, 2174, 2209, 2255, 2263, 2213, 2183, 2258, 2367, 2365, 2252, 2161, 2136, 2135, 2163, 2249, 2337, 2347, 2293, 2218, 2141, 2093, 2117]
4199B117R4P4l0p9J4J09K7q0l1L1j7kR1Rj64r8R5Q4j4K6N3n0q7KO7O0Pp2p6OJ9k3L5J10K3
4194B330r0p1oL4Q3O0m0o0ql2n2L3O7KK3J08O1m0oN0m5j69j29QM4j4LQ2L7p0j7R9M9l1J8Q
4188B319j15o4J16J05pM1O9r0j61nR3K0m6n6o0k5K6K5K7M3pp9k1R7P0o5r9JP1M4K6L3j9q5
4183B222l0N1%m4M8Q0n1r8K1Q5K2l8p3p5J9J14N8l2kM7Kn5n8l9NP5Q4j5j07o7O2J05K4l5k
4178B303J0k8l6mM%j7m3MR7P9ljj0j08j04L0L9n0kP5j6p7O2J74R7m4j30j20k0N4J6k7pk2o2
4173B113k2M9N6L6K3Onk3m8MQ0Mj24o9P0N9k1j9J1L4N1lp8k4P3N2kkk3k0N2K1j41j46M8J31
4168B203M1j5J2L9N6L3m9q3k4M1K7n1r3J9J69J08q7r8K6K4o4j06j24o2J13J31o3q8J15J53
4163B303jk5K5m7p2M9J02M5J2k7r2m6P9R2Mo4p1J5J23N9j24j25L1N8j8j1oq0o6L9K2p1l0P7
$$ y = [2117, 2211, 2285, 2255, 2176, 2190, 2299, 2326, 2246, 2215, 2246, 2229, 2227, 2318, 2327, 2163, 2065, 2160, 2244, 2230, 2256, 2309, 2259, 2172, 2174, 2241, 2301, 2308, 2236, 2160, 2166, 2185, 2162, 2197, 2307, 2330, 2240, 2169, 2163, 2197, 2280, 2340, 2300, 2240, 2232, 2200, 2148, 2181, 2248, 2250, 2273, 2381, 2442, 2402, 2396, 2446, 2401, 2232, 2103, 2111, 2155, 2141, 2144, 2226, 2263, 2193, 2176, 2275, 2324, 2293, 2311, 2319, 2204, 2140, 2256, 2361, 2354, 2395, 2464, 2374, 2213, 2208, 2301, 2321, 2275, 2219, 2159, 2134, 2160, 2185, 2212, 2255, 2248, 2169, 2148, 2245, 2315, 2250, 2151, 2152, 2223, 2267, 2293, 2326, 2307, 2222, 2192, 2243, 2243, 2199, 2247, 2327, 2276, 2178, 2199, 2284, 2306, 2268, 2195, 2120, 2139, 2253, 2311, 2279, 2277, 2324, 2326, 2271, 2213, 2174, 2179, 2254, 2338, 2323, 2216, 2149, 2211, 2316, 2340, 2305, 2303, 2313, 2285, 2249, 2245, 2249, 2249, 2232, 2189, 2193, 2290, 2369, 2366, 2365, 2355, 2247, 2143, 2173, 2212, 2162, 2160, 2235, 2219, 2142, 2204, 2378, 2475, 2431, 2301, 2181, 2161, 2215, 2231, 2204, 2197, 2175, 2113, 2091, 2140, 2196, 2232, 2255, 2261, 2256, 2233, 2185, 2189, 2269, 2273, 2149, 2080, 2150, 2209, 2188, 2169, 2180, 2214, 2265, 2262, 2184, 2160, 2233, 2285, 2283, 2281, 2258, 2238, 2290, 2311, 2170, 2024, 2072, 2203, 2244, 2229, 2241, 2280, 2336, 2369, 2320, 2237, 2213, 2254, 2281, 2230, 2137, 2156, 2325, 2433, 2346, 2248, 2274, 2298, 2234, 2128, 2004, 1942, 2055, 2186, 2123, 2035, 2150, 2303, 2302, 2277, 2302, 2255, 2183, 2232, 2334, 2379, 2391, 2364, 2272, 2226, 2305, 2397, 2401, 2337, 2266, 2281, 2404, 2463, 2339, 2214, 2245, 2303, 2285, 2274, 2268, 2188, 2122, 2161, 2183, 2112, 2082, 2159]
4158B159M7l2LP4N3j7l4k6m2n2k8QJ2k1n2lJ10J42Rj18o8N1O0L1Q2R5j0r7o7j5PK5j3j12j26
4153B035qP1M6M7Q7N1l0m6j5k0l4j0L1M1j9q5n3K8Qm4L9J28K4q7J2J15J2r7m5J7KK0P4M9n7
4148B287j47j35j1Q7M9j3K1N0K7M9P7%m6L2M2n8m2M3k6j08oN6o5q1R0J22l6p8L7Q4K2l3m4
4143B246MR2P1q0j58n7P8R7J7o7p3JO1O2O7P5Kp6m1J7m0r3k1L8KJ4O4Mp9j8M1k7l7P5O8o2
4138B267n4N3M4J0P1K3j63j61N5J14l4o2O4R2Mm8o5q0m7pk2RJ04Q9m6o7N6Q0l2p0k6j9pQ0
4133B205J16J8r9j18n7OL1J6K4O1N6j2o5p6p1j3Q5J18O9J8Lj3l0l5m8l9J2M9L1J1L7N9J8o8
4128B299r9j9O6M3j9J0M3k1p0JN4Mj6L1k9j78j56N4J47N6K2Q7O2m3o7m9m9J8J01J1j39j18
4123B037j3L5J11J89R7n8o4k9q1o6J5k2q4MP4rn7J7O1L9J3l7n3N2J19L5k0L9L3q2j13LJ24
$$ y = [2159, 2206, 2174, 2177, 2251, 2304, 2287, 2253, 2227, 2185, 2133, 2105, 2113, 2125, 2104, 2052, 2049, 2159, 2301, 2310, 2192, 2124, 2175, 2235, 2266, 2348, 2443, 2433, 2336, 2269, 2254, 2261, 2286, 2273, 2161, 2035, 2027, 2098, 2144, 2191, 2278, 2329, 2299, 2253, 2238, 2218, 2184, 2174, 2205, 2246, 2227, 2142, 2089, 2117, 2125, 2081, 2120, 2248, 2272, 2185, 2197, 2312, 2324, 2227, 2182, 2199, 2201, 2221, 2295, 2344, 2287, 2140, 2005, 1994, 2081, 2130, 2117, 2138, 2188, 2215, 2264, 2341, 2341, 2295, 2327, 2369, 2311, 2269, 2312, 2286, 2178, 2172, 2228, 2163, 2082, 2172, 2294, 2258, 2180, 2217, 2301, 2323, 2290, 2246, 2250, 2342, 2413, 2333, 2175, 2118, 2196, 2293, 2310, 2243, 2170, 2171, 2232, 2294, 2361, 2436, 2438, 2362, 2321, 2338, 2298, 2205, 2184, 2222, 2224, 2238, 2302, 2306, 2227, 2209, 2250, 2223, 2186, 2261, 2329, 2267, 2213, 2266, 2310, 2320, 2391, 2414, 2251, 2090, 2145, 2259, 2225, 2163, 2227, 2319, 2323, 2275, 2210, 2130, 2083, 2076, 2054, 2063, 2167, 2256, 2210, 2143, 2199, 2279, 2247, 2177, 2151, 2132, 2125, 2205, 2321, 2339, 2240, 2122, 2065, 2071, 2102, 2118, 2142, 2203, 2259, 2247, 2182, 2106, 2035, 2022, 2107, 2225, 2294, 2312, 2315, 2302, 2272, 2237, 2189, 2150, 2162, 2211, 2242, 2253, 2290, 2349, 2367, 2299, 2200, 2181, 2247, 2290, 2271, 2281, 2324, 2303, 2233, 2234, 2288, 2292, 2276, 2307, 2278, 2100, 1944, 1998, 2145, 2201, 2223, 2310, 2372, 2329, 2262, 2213, 2164, 2182, 2283, 2294, 2155, 2037, 2024, 2059, 2170, 2359, 2456, 2398, 2334, 2305, 2224, 2158, 2173, 2151, 2067, 2071, 2145, 2136, 2079, 2096, 2157, 2196, 2209, 2172, 2119, 2171, 2290, 2325, 2305, 2344, 2377, 2295, 2182, 2185, 2309]
4118B309R5o3j51m1N6l1j10l1K5KN7J11J5m8N7Q9n6j40m9O5J08Q4J3k2J7L5Ooj4m2l7mj9o1
4113B219n6j3L2K2p3j12K0J28L9n9kM3k2m5J4N7R8J05lj15o3K8%k5N2Q1Lk6N0Q5Qp3n0J9k
4108B364r3r3KM9J3kN4J08N3r1j51k0R6lj40r2K6L3J5N6O4K5J1j6j02j30k1J02J04L1nJ7L9
4103B303K5k1p7q4j2O7N0l1p4o4k5O0J27O5n2l7L2l9j37l8J31J08j1NP4K2n8l4Jm3o6j4K9
4098B182L3L2Pm3k9L9N0LnK3J8kPJ9j4p3q8j4Q0O5k9n3J2N7M1on0m4Pkn9k6N4Mr5l4P8L7l4
4093B148K2N9l1p2QL4l6m6J7M0J7Lk3m2LO8N7Q%Nk0l7l2l3j9J7J9j5j2L8N4J5mK9M4k1p9M
4087B187J40R8q3j30k2J5n1o1oL7O6O1%k3L9P0Om5k5kpj1KJ1k7j02j04K0J54J61L0j19j06
4082B173P6J34n7j72k5P6k0n6M0R1Q3M2r4j64J5J76Q1m1m1p1r2M6J17l9j35k0P8O0K9k5p2
$$ y = [2309, 2404, 2341, 2190, 2149, 2205, 2174, 2064, 2033, 2058, 2060, 2117, 2228, 2243, 2195, 2252, 2341, 2285, 2145, 2096, 2161, 2269, 2353, 2366, 2344, 2361, 2396, 2402, 2396, 2382, 2340, 2303, 2299, 2280, 2219, 2163, 2150, 2182, 2204, 2131, 2019, 2039, 2167, 2206, 2147, 2145, 2188, 2166, 2121, 2135, 2192, 2290, 2395, 2392, 2277, 2214, 2242, 2242, 2217, 2269, 2350, 2353, 2327, 2377, 2462, 2470, 2397, 2347, 2366, 2364, 2271, 2178, 2180, 2229, 2242, 2240, 2294, 2402, 2455, 2364, 2213, 2193, 2289, 2286, 2146, 2054, 2080, 2113, 2128, 2184, 2248, 2273, 2284, 2268, 2166, 2036, 2015, 2117, 2221, 2252, 2247, 2264, 2303, 2328, 2307, 2230, 2146, 2134, 2201, 2251, 2220, 2146, 2082, 2057, 2117, 2244, 2309, 2257, 2220, 2252, 2213, 2076, 2038, 2169, 2277, 2266, 2271, 2345, 2367, 2309, 2275, 2276, 2233, 2167, 2153, 2182, 2215, 2247, 2254, 2211, 2182, 2221, 2271, 2274, 2269, 2292, 2310, 2308, 2315, 2334, 2320, 2247, 2159, 2145, 2225, 2290, 2261, 2208, 2220, 2277, 2318, 2312, 2262, 2218, 2225, 2223, 2164, 2138, 2192, 2196, 2101, 2067, 2145, 2182, 2148, 2170, 2229, 2198, 2126, 2134, 2168, 2132, 2086, 2103, 2143, 2160, 2163, 2140, 2098, 2101, 2169, 2226, 2234, 2234, 2239, 2219, 2182, 2150, 2117, 2098, 2115, 2134, 2119, 2107, 2145, 2199, 2214, 2210, 2239, 2283, 2262, 2183, 2187, 2327, 2425, 2342, 2212, 2190, 2205, 2154, 2093, 2087, 2124, 2190, 2251, 2251, 2228, 2267, 2337, 2343, 2298, 2273, 2271, 2264, 2253, 2255, 2266, 2239, 2137, 2033, 2053, 2207, 2368, 2398, 2279, 2173, 2249, 2383, 2326, 2154, 2129, 2205, 2185, 2129, 2169, 2260, 2343, 2385, 2291, 2127, 2142, 2318, 2399, 2358, 2317, 2246, 2154, 2200, 2317, 2278, 2143, 2123, 2201, 2261, 2290, 2265, 2193]
4078B193%J07Q9%o9r4m4N1N7J5J1j1p3n4j6n6m5N0L8J1J43J90l3j57nN5p4n9R8Q3m7m8L0K3
4073B359l5m4JM0K8j7n3p7o8qL8J6j4j0J2N6O4l3o6Q4J60rj14lK7p2k2J19Q3n4j02r7o7J8
4068B140N4MkL0k7j17r8OR1R2M1L1K9o5j41l3Q1Jo6J7L5o4p2pkK7J12R9nm8l4KN8N3k7l6K4
4062B183L2K2M8K5j9J4J3o7o0Pk3l4Q4J09k4q3m4l9pP6N1m0k6M9O4K0q5j53k5J64J33j1l7
4058B317mJ2N5M3n9o0Oo7j26L5J57M0p1m0pQL0kk1L9K4n7RJ13K3j08q4m2m9JM4K2N1P7l4j31
4052B144o7K2P2J21N9q1l8J14O1j07j02j2rk3PL0N1K7p6j22l4N0N0K5j4l4Jj5r8l9J49J65
4048B277K3k9k1o3n4K0K7mj6m0PJ29Q7q0n0P4qj01J6Q6j5l5K8J3OK9o0j07J7N3n3jJ15K6m0
4042B256R3Q3j06q0O4j3j23l8K1mQ2J35j2p0Q6J02r2j44rL6l6o5l4pJ2L4N5N4K1J3O5O7n4
$$ y = [2193, 2193, 2300, 2389, 2389, 2320, 2226, 2182, 2233, 2290, 2305, 2316, 2305, 2232, 2178, 2162, 2106, 2061, 2111, 2149, 2160, 2303, 2493, 2460, 2303, 2298, 2353, 2279, 2220, 2318, 2401, 2354, 2306, 2336, 2359, 2324, 2280, 2281, 2321, 2349, 2332, 2279, 2202, 2134, 2126, 2164, 2180, 2166, 2156, 2168, 2224, 2288, 2255, 2189, 2273, 2433, 2424, 2310, 2307, 2334, 2262, 2240, 2359, 2442, 2388, 2286, 2189, 2122, 2140, 2194, 2198, 2196, 2226, 2199, 2082, 1984, 1990, 2081, 2173, 2214, 2245, 2274, 2209, 2068, 2035, 2116, 2117, 2051, 2068, 2103, 2039, 1967, 1960, 1958, 1985, 2097, 2196, 2191, 2143, 2109, 2111, 2169, 2222, 2195, 2159, 2183, 2215, 2237, 2285, 2310, 2291, 2305, 2318, 2251, 2191, 2198, 2175, 2141, 2225, 2334, 2310, 2227, 2183, 2144, 2137, 2213, 2264, 2224, 2198, 2247, 2311, 2331, 2246, 2093, 2068, 2232, 2365, 2354, 2317, 2313, 2325, 2380, 2423, 2364, 2304, 2310, 2243, 2117, 2152, 2309, 2349, 2278, 2238, 2231, 2239, 2269, 2267, 2246, 2285, 2309, 2252, 2261, 2374, 2397, 2289, 2205, 2163, 2114, 2115, 2159, 2181, 2232, 2309, 2275, 2144, 2077, 2099, 2171, 2292, 2351, 2270, 2232, 2346, 2407, 2300, 2198, 2186, 2177, 2154, 2161, 2191, 2242, 2269, 2193, 2071, 2037, 2087, 2137, 2162, 2148, 2114, 2115, 2100, 2002, 1963, 2112, 2277, 2300, 2271, 2250, 2187, 2133, 2153, 2180, 2176, 2160, 2120, 2127, 2256, 2343, 2263, 2213, 2287, 2279, 2178, 2194, 2280, 2265, 2230, 2258, 2271, 2277, 2306, 2246, 2139, 2156, 2209, 2156, 2155, 2270, 2296, 2256, 2349, 2432, 2326, 2246, 2310, 2297, 2174, 2136, 2157, 2153, 2235, 2370, 2358, 2288, 2374, 2476, 2384, 2240, 2231, 2267, 2231, 2166, 2132, 2125, 2137, 2171, 2226, 2280, 2301, 2314, 2379, 2446, 2392]
4038B392j53j00K2P5L6n1j07n0N8Q0K9Mk3p2n4K4K1m2j9N4N4L8Q0N4o9j21m9L0P6P9J4k4L9
4033B325O0m9q0L2N7k9l3J5mrL4Rm1RO2J8k5l4n8m5Rl3j23p7O8J15L3q4j22PJ58Q6p0j5J18
4028B284M0r5l7R2R1K8k6p6p6k0%k5%N5M4j8n7p2p3l1M7Q7O3N6Q8O6nl0n2j34j23K7Q0k7k9
4022B142Q1K9j15o0J10J19J4m1p9j17n8P0J05L4j0K5L4k4l1J8j0p5j8M8j9k6J06R0p3m1O7
4018B295o2j80mJ16rl4R5O4n4k4K5j1QK9l3KJ26P0q6n3L7j1k5O7N2m8n2l7q1o7K1L8qOP3R6
4013B341K9p4p6mk8q7J1J05k7j24N0J79M6m3N4N7q0j10l3pK3J00O0q6j17j7K4mK1L5n7j03
4008B058MO2m4r3K3R5M4M6P9j9j36q8K3P2Q8M4p4q6N3R5oj7M3k1q0N5J49j7j87j20J9N8Q2
4003B204J24Q1m3j16o9K5M6k5m9L4P2j1m7K0L0l0mO2Pj07j30n5M4R6K2q2l1Q2M4k1M6P1m9
$$ y = [2392, 2239, 2139, 2161, 2236, 2272, 2221, 2114, 2064, 2122, 2202, 2231, 2235, 2212, 2140, 2086, 2110, 2131, 2089, 2070, 2124, 2178, 2216, 2296, 2350, 2281, 2160, 2111, 2141, 2217, 2296, 2310, 2286, 2325, 2385, 2336, 2256, 2288, 2345, 2316, 2283, 2298, 2294, 2285, 2319, 2328, 2287, 2296, 2358, 2376, 2351, 2317, 2259, 2214, 2223, 2190, 2067, 1990, 2058, 2173, 2206, 2122, 2000, 2007, 2165, 2251, 2181, 2166, 2284, 2324, 2229, 2192, 2284, 2375, 2403, 2377, 2301, 2225, 2205, 2205, 2180, 2180, 2235, 2279, 2261, 2204, 2132, 2059, 2028, 2075, 2162, 2225, 2281, 2369, 2435, 2430, 2400, 2348, 2214, 2091, 2118, 2198, 2171, 2142, 2223, 2252, 2137, 2077, 2187, 2306, 2320, 2279, 2200, 2083, 2025, 2095, 2200, 2234, 2224, 2249, 2283, 2259, 2228, 2246, 2236, 2161, 2143, 2191, 2172, 2146, 2252, 2342, 2269, 2228, 2295, 2233, 2053, 2049, 2165, 2156, 2122, 2217, 2281, 2227, 2203, 2228, 2217, 2225, 2254, 2221, 2223, 2349, 2419, 2333, 2280, 2317, 2306, 2281, 2348, 2400, 2352, 2300, 2263, 2182, 2115, 2136, 2174, 2166, 2172, 2245, 2341, 2370, 2296, 2220, 2216, 2188, 2101, 2112, 2217, 2190, 2066, 2116, 2295, 2341, 2298, 2352, 2409, 2329, 2219, 2186, 2179, 2202, 2302, 2362, 2276, 2159, 2142, 2166, 2162, 2183, 2218, 2161, 2058, 2062, 2124, 2080, 1987, 2010, 2105, 2149, 2195, 2274, 2255, 2119, 2031, 2054, 2126, 2214, 2258, 2184, 2098, 2151, 2246, 2240, 2223, 2266, 2245, 2165, 2220, 2369, 2352, 2165, 2045, 2064, 2122, 2204, 2328, 2409, 2366, 2250, 2181, 2206, 2252, 2227, 2178, 2212, 2284, 2273, 2226, 2246, 2276, 2246, 2242, 2304, 2311, 2204, 2074, 2019, 2063, 2159, 2181, 2099, 2068, 2150, 2194, 2173, 2219, 2290, 2241]
3998B241r2nOm2qK8RL6N7j1j8P0J3j43p5J17Q3p9o5M5O2L5K5j8p2o7k2J7L7L9L4qq3q4M1J06
3993B209Pp6NJ05Q3j3p9o0K9Q2L8k2n1n6k0L2J9j0Ol8j31p0J07J23K7L9N8l4o3M7Q1jn7n3
3988B263k3K9rj34q2J42J59o4j17M0P7j1J2O6qo5kJ3o8n8M9N4l9m8J1J2K1R4Q2n1q8J5K5p0
3983B227o0M1M2l3n2l9m7k9M8J17R8j4j02n4L0%o8l2M4N8M7L4l0p9m4oj2J3P3P8K5j9oN4P5
3978B378nr2m0N6L6m1l9J6M3L7j0p6p1K3O9or5q4LP2N9J3J7M2k3r7j3J21N3j28r9P6N5r5n0
3973B105R7M7q3l4N3po5OO0L5J5k8r4p1J9L0j0J7P6J00R9L2p5n6P0N9q1j00rOl3l4n5q7PJ39
3967B150Q9o8p1O8J04j5r5k1Q2L9p7n6R6J37j9j60j21RQ0P0K6J8N1L6p2j08L4J55O2j04j40
3963B179j01n3M1J05N1K2Q2K9j45j18R5J09o1l9J18L7j54q5J07Q2n5m2K9Jj6P2J07Jj03o6
$$ y = [2241, 2149, 2144, 2150, 2108, 2100, 2128, 2137, 2173, 2230, 2219, 2201, 2271, 2284, 2141, 2066, 2183, 2266, 2187, 2122, 2167, 2229, 2264, 2289, 2271, 2199, 2132, 2110, 2127, 2164, 2203, 2237, 2229, 2146, 2062, 2103, 2209, 2216, 2140, 2145, 2250, 2333, 2320, 2241, 2181, 2210, 2292, 2330, 2308, 2257, 2201, 2181, 2213, 2232, 2222, 2228, 2190, 2059, 1989, 2096, 2219, 2246, 2285, 2343, 2309, 2246, 2293, 2374, 2373, 2316, 2263, 2240, 2269, 2260, 2126, 2044, 2186, 2345, 2281, 2164, 2204, 2281, 2270, 2282, 2348, 2340, 2275, 2273, 2286, 2218, 2160, 2209, 2263, 2224, 2176, 2187, 2199, 2220, 2314, 2396, 2345, 2257, 2272, 2297, 2227, 2167, 2208, 2250, 2217, 2165, 2126, 2079, 2050, 2098, 2215, 2313, 2299, 2197, 2143, 2173, 2173, 2105, 2073, 2117, 2175, 2222, 2256, 2226, 2147, 2103, 2097, 2085, 2098, 2171, 2249, 2274, 2255, 2249, 2303, 2378, 2373, 2281, 2241, 2297, 2333, 2292, 2253, 2269, 2312, 2349, 2339, 2263, 2192, 2215, 2284, 2278, 2183, 2099, 2102, 2174, 2233, 2246, 2263, 2305, 2282, 2185, 2172, 2293, 2346, 2218, 2119, 2195, 2250, 2155, 2105, 2202, 2249, 2166, 2132, 2185, 2178, 2113, 2119, 2179, 2214, 2229, 2201, 2107, 2036, 2055, 2085, 2075, 2092, 2168, 2268, 2367, 2399, 2324, 2268, 2338, 2397, 2316, 2216, 2207, 2213, 2180, 2146, 2091, 2004, 2011, 2150, 2239, 2171, 2100, 2168, 2272, 2257, 2162, 2141, 2223, 2262, 2185, 2129, 2225, 2362, 2343, 2183, 2062, 2071, 2151, 2221, 2247, 2265, 2316, 2352, 2280, 2172, 2206, 2361, 2423, 2319, 2179, 2078, 2025, 2066, 2171, 2222, 2244, 2326, 2355, 2210, 2092, 2187, 2296, 2235, 2196, 2314, 2351, 2197, 2112, 2219, 2301, 2246, 2204, 2233, 2234, 2218, 2290, 2397, 2398, 2295, 2229]
3958B229N3R2qj15n5Q9R8nm1k1m9n8jlo9l3P4N3o6r2j0N3N2J8j3KN5O6J4n3o8%P7K5j06r1
3953B093O8J14j3j09o3K6P2O9K2l6m8j5ll6l4N5J32P3n7r8m9J1O4Q1L2jK0j3p9m0L6J4k6l
3948B259k2n8J4O5k2n0N9O1n2m4L1Oj5L8K1o1n6k2m6nJ16J34K0n5l5LK0QkJ2J7k9p3r1j04
3943B042m3J01J15l6n8J19J35q5j53M3J44L1m5OOm7l3j3o4r1k7K6L4M0K9j6k3jl3o0NQ0P7
3938B205K5m8q6J9J61Q3j20j06O5P9k4l0nm3m6J2J3l3l6nK7N3N0Rk0kM7O8J2o3n1rl6l9L8
3933B164N0j1K0R2M5k2jk2r1m1O9O1jl5q8p8O1J38N1k7m0p8m8Q7Q9p6j03L1L5o9j9J21R7m0
3928B321n9%l1j08o1M2M8K6P8P3o9j54p3M6J10J13Pj19q8K0M4M9R3L2q7p7j3%P1J25l0j76
3923B153l8J08rj02QP2Pj3k3n4K6J17Qj14%J30N2o9q1o3j9P0R3L6K8O5L3m1p8q7o0K5Q8O0
$$ y = [2229, 2282, 2374, 2366, 2251, 2196, 2285, 2383, 2378, 2337, 2316, 2267, 2209, 2208, 2205, 2136, 2103, 2177, 2230, 2164, 2072, 2062, 2115, 2167, 2185, 2172, 2174, 2229, 2295, 2309, 2256, 2188, 2188, 2265, 2290, 2184, 2093, 2161, 2275, 2262, 2153, 2090, 2116, 2188, 2257, 2279, 2243, 2195, 2180, 2177, 2141, 2107, 2162, 2294, 2367, 2310, 2212, 2163, 2174, 2238, 2319, 2351, 2350, 2370, 2357, 2278, 2238, 2274, 2288, 2262, 2259, 2237, 2179, 2193, 2258, 2236, 2186, 2245, 2306, 2254, 2210, 2241, 2247, 2232, 2270, 2291, 2230, 2174, 2152, 2106, 2101, 2217, 2351, 2371, 2316, 2281, 2284, 2304, 2312, 2310, 2322, 2339, 2310, 2237, 2146, 2042, 1999, 2100, 2215, 2179, 2121, 2240, 2375, 2290, 2137, 2180, 2324, 2355, 2310, 2316, 2322, 2275, 2242, 2229, 2165, 2074, 2047, 2073, 2107, 2147, 2176, 2160, 2137, 2136, 2103, 2043, 2048, 2128, 2205, 2230, 2182, 2096, 2115, 2276, 2359, 2239, 2133, 2198, 2277, 2253, 2223, 2218, 2175, 2129, 2141, 2154, 2121, 2085, 2080, 2107, 2160, 2210, 2219, 2199, 2197, 2244, 2312, 2324, 2261, 2210, 2201, 2165, 2126, 2164, 2214, 2203, 2223, 2315, 2360, 2338, 2337, 2315, 2224, 2183, 2252, 2313, 2312, 2277, 2189, 2111, 2172, 2310, 2361, 2334, 2294, 2216, 2168, 2255, 2344, 2268, 2165, 2196, 2231, 2162, 2143, 2264, 2361, 2321, 2262, 2262, 2231, 2123, 2062, 2104, 2152, 2178, 2256, 2329, 2260, 2106, 2033, 2079, 2189, 2302, 2309, 2190, 2102, 2122, 2166, 2215, 2308, 2340, 2253, 2176, 2163, 2163, 2234, 2359, 2329, 2153, 2115, 2223, 2214, 2112, 2120, 2192, 2199, 2186, 2163, 2109, 2135, 2252, 2260, 2146, 2146, 2276, 2328, 2259, 2178, 2115, 2096, 2166, 2259, 2295, 2323, 2388, 2421, 2380, 2302, 2215, 2155, 2180, 2268, 2328]
3918B328Qj7n7r6n2M4P1J1l3k4pJ1P0J14O9k1o5l9J5M4Qn7o1J1M7Pk8j3RK0K2k8j15j11K6
3913B111J35J05M1K4mn6o4n1o1m4%PM4J37Q5j27j71PO8k4J3J28R1Kj7q0j43m8N0QJ0Q3J7r0
3908B186j1P1ok0P9L2r9o7K8K2J8L1o2j49o0N5N1L2M0OlO8Q9No0o1m9j9K4Qm1j1O9P9J1m7
3903B239n3k8mJ3J8Lk3l6k5nK2L9Ol3K0J09O9o4o5N2M1q9q1K5Lp5k3M6J5K9J04O4m3l1L1L7
3898B307M2K3r4j17N1J36J9o0l9n2l6N8O4k9m0pk6k7j7n4nJ18M4j41o4J41R7m2j9j2r9o4O1
3893B117Q6P2Q1Qo5pM5j3m4j8j3RJ8q5j33L3J53L9o0j5j7o5kO3Jn5k3k3m8K6J32R9l8p6KK6
3888B210n2m3P7Q3k9k2P6M0n0k0Qo4o0N4P1m6j13n2N6P2l4n7J35K58N7k00j96q6l9L7J15N9
3883B245k9mJ8k2J6J03O5l5m4k0o3q7k1N3Q0P7J1q9r9%N3QnN7M8m8o6%Mm4jR5R7J6l6m1l4
$$ y = [2328, 2336, 2319, 2262, 2166, 2114, 2158, 2229, 2240, 2207, 2183, 2176, 2187, 2257, 2371, 2440, 2419, 2354, 2315, 2330, 2374, 2382, 2325, 2264, 2275, 2322, 2329, 2301, 2288, 2297, 2317, 2339, 2311, 2196, 2085, 2111, 2246, 2351, 2392, 2416, 2412, 2356, 2292, 2241, 2180, 2136, 2136, 2143, 2187, 2324, 2409, 2282, 2111, 2118, 2186, 2162, 2175, 2303, 2394, 2396, 2379, 2299, 2156, 2108, 2158, 2166, 2176, 2259, 2276, 2186, 2175, 2246, 2240, 2220, 2299, 2331, 2232, 2165, 2193, 2215, 2233, 2264, 2202, 2053, 1993, 2048, 2099, 2131, 2171, 2177, 2174, 2242, 2331, 2336, 2276, 2215, 2166, 2147, 2171, 2179, 2138, 2127, 2196, 2275, 2286, 2239, 2186, 2158, 2154, 2167, 2185, 2188, 2165, 2129, 2104, 2099, 2121, 2160, 2166, 2133, 2153, 2262, 2331, 2267, 2202, 2254, 2295, 2206, 2125, 2150, 2153, 2078, 2055, 2101, 2116, 2145, 2249, 2313, 2270, 2239, 2270, 2307, 2349, 2372, 2278, 2161, 2212, 2348, 2367, 2307, 2268, 2216, 2180, 2238, 2302, 2273, 2233, 2226, 2200, 2173, 2156, 2102, 2097, 2215, 2259, 2118, 2054, 2195, 2292, 2250, 2231, 2219, 2120, 2056, 2117, 2203, 2275, 2356, 2364, 2299, 2292, 2337, 2324, 2280, 2262, 2249, 2258, 2276, 2191, 2058, 2091, 2244, 2283, 2223, 2208, 2191, 2126, 2124, 2187, 2188, 2133, 2110, 2087, 2039, 2065, 2197, 2296, 2258, 2182, 2184, 2210, 2158, 2115, 2192, 2275, 2246, 2224, 2300, 2340, 2290, 2270, 2278, 2214, 2154, 2208, 2279, 2233, 2120, 2068, 2124, 2196, 2162, 2105, 2240, 2498, 2555, 2355, 2159, 2073, 2034, 2071, 2186, 2245, 2216, 2212, 2230, 2208, 2224, 2327, 2392, 2357, 2313, 2293, 2230, 2143, 2122, 2175, 2255, 2332, 2343, 2254, 2155, 2155, 2208, 2216, 2211, 2268, 2316, 2268, 2202, 2202, 2206, 2162, 2161, 2256, 2353, 2369, 2333, 2292, 2258]
3877B258j5jj5j8RPn0n8K6O6j5o3K2Q1Lo8l3krK8O3K7OM2j4j42j05R2J53qj01L6J63O7p3n0
3872B309Mm6n4O4J07J9m7r5j76j46QN0J2J10K01O3q5l7J6l4k9Ok7rP4L1p4l2M3rk1Q3P9n9
3867B299q9K3O0j6l7K9L2j00j91o9J26J30l2j05rQ0N5rj1K4Pn1n9k4lL3R1Q4J8NK5j9o1lN2
3862B285J0j7L9M0o0p6N2R7n1j39oJ16M2n4m3l9n4J4Q6M0l4k2L2P8M2j14k00m2J42J01mrj6
3857B236l5N0J18L0n8k5K9K8j8q1n7M6J6j33j06P4Q5l9l8M8M6LpJ3P1J03M0mK4lp6n0Oj0j9
3852B307l0j11j10N4J08k6p5j2j9l6O2J43J02pr1n5O1K9j27r8M3l0j22N9K13P6l9M9O7l3o3
3848B289k8lL7K5n2o2k0l7l3Qn1j07J4J03Ll5Q3J24N5%q2j40l4R4Q0N4M5n2q0N4Q1l3j5N2
3843B337m4r0L7M2q4o6M0Q6J62J53j06k68m7J59P6kK3o6j43j3Q4k8j14j9P8N1m8p2L5J24N2
$$ y = [2258, 2243, 2242, 2227, 2209, 2218, 2225, 2175, 2117, 2143, 2209, 2194, 2131, 2153, 2234, 2237, 2169, 2136, 2134, 2125, 2153, 2216, 2243, 2249, 2291, 2277, 2135, 2030, 2122, 2275, 2267, 2166, 2202, 2365, 2432, 2359, 2309, 2313, 2267, 2213, 2277, 2384, 2403, 2356, 2261, 2085, 1939, 1947, 1997, 2009, 2119, 2320, 2383, 2298, 2261, 2277, 2243, 2214, 2220, 2193, 2184, 2258, 2289, 2215, 2183, 2226, 2217, 2196, 2279, 2358, 2299, 2210, 2233, 2293, 2277, 2240, 2269, 2301, 2201, 2010, 1941, 2067, 2197, 2165, 2060, 2051, 2131, 2186, 2177, 2166, 2190, 2197, 2146, 2087, 2063, 2060, 2093, 2184, 2268, 2286, 2291, 2316, 2297, 2236, 2233, 2285, 2295, 2278, 2317, 2357, 2297, 2221, 2273, 2370, 2319, 2180, 2174, 2290, 2332, 2278, 2235, 2196, 2142, 2156, 2242, 2282, 2248, 2226, 2258, 2336, 2378, 2264, 2064, 2022, 2164, 2265, 2261, 2252, 2236, 2201, 2251, 2369, 2399, 2341, 2316, 2345, 2373, 2355, 2274, 2217, 2263, 2279, 2146, 2040, 2114, 2199, 2160, 2122, 2170, 2216, 2219, 2212, 2225, 2296, 2399, 2439, 2435, 2459, 2456, 2380, 2330, 2336, 2326, 2307, 2277, 2166, 2056, 2110, 2218, 2192, 2117, 2105, 2086, 2050, 2112, 2255, 2357, 2350, 2259, 2204, 2265, 2294, 2167, 2069, 2112, 2082, 1960, 2019, 2232, 2308, 2269, 2318, 2385, 2352, 2289, 2261, 2258, 2295, 2320, 2268, 2206, 2186, 2149, 2116, 2124, 2073, 1966, 1980, 2083, 2086, 2051, 2134, 2258, 2313, 2313, 2231, 2091, 2057, 2151, 2231, 2285, 2330, 2278, 2198, 2252, 2333, 2300, 2285, 2337, 2293, 2203, 2240, 2282, 2198, 2132, 2172, 2258, 2420, 2573, 2467, 2199, 2152, 2311, 2387, 2385, 2408, 2342, 2199, 2186, 2270, 2242, 2128, 2109, 2187, 2238, 2190, 2118, 2153, 2277, 2329]
3838B329k3L7N6o2j14j7O9N7j6r3p0N0P3l2n6M2R1O2Kp1o6M3N8n9q7OK5j4ql8j00m9M6K9j5
3833B085J3J7j1L5Q2L9j3l1o4n6K0K8m3j3J18J45N1LK6kj16j76o7J04J30L7pk4q1p0L0K3o1
3828B151K7J90J05j24j48j1J3m9j6O4N2j1qL6J3o3n7J0qp0j3R2O7qJ1J6p5j13l1K2%J2N9N3
3823B188ll0NM8L1ML6J2j48j97J7J76N3q9n3j4k0O7J29K7n5J0L6l0j8L9J8j9J6M2J4j6l0k7
3818B219J0L1jk2j3k8m4oL2J2J3M9J4q0p0N1Q9lk6P6R4n1j43p5m%J6J1o0o3N5J12L8%M9M7
3813B329m7j00m0On6q6N0J53Rj25K3J83O1j21j10k3L3Q9N4p9j10%P9R5Q1Ko6l5k3n2K5J02
3808B301rr3L0Q3o3j32m3mj1L0N0N1Q0N0l3l5j2n6j5J06P2p1o2L2N0M7K9o7p1N3L3j19q9P1
3803B183P9j0l1l6m5j3J4K5P5P4l1p4j6ml1j4j7l9J3L5l5j7J06R9MJ3J9o0m5N2J7o2qL3p0
$$ y = [2329, 2306, 2343, 2399, 2337, 2223, 2206, 2275, 2332, 2316, 2223, 2153, 2203, 2276, 2244, 2188, 2230, 2321, 2383, 2385, 2314, 2248, 2291, 2349, 2290, 2203, 2209, 2234, 2220, 2212, 2174, 2074, 2025, 2071, 2100, 2085, 2098, 2115, 2104, 2139, 2221, 2260, 2247, 2216, 2152, 2096, 2116, 2144, 2101, 2088, 2206, 2351, 2402, 2405, 2431, 2429, 2313, 2137, 2070, 2174, 2304, 2341, 2334, 2310, 2229, 2159, 2189, 2212, 2151, 2178, 2368, 2473, 2349, 2201, 2190, 2203, 2154, 2138, 2202, 2254, 2243, 2235, 2271, 2284, 2221, 2164, 2174, 2166, 2096, 2083, 2175, 2242, 2234, 2245, 2261, 2186, 2073, 2042, 2064, 2064, 2076, 2135, 2188, 2185, 2155, 2160, 2208, 2239, 2243, 2279, 2291, 2143, 1946, 1963, 2139, 2192, 2103, 2050, 2036, 2016, 2083, 2212, 2239, 2184, 2194, 2230, 2200, 2182, 2221, 2239, 2220, 2236, 2278, 2292, 2276, 2246, 2219, 2229, 2260, 2259, 2237, 2224, 2196, 2152, 2146, 2178, 2190, 2203, 2252, 2266, 2186, 2116, 2167, 2256, 2253, 2227, 2303, 2397, 2346, 2203, 2128, 2124, 2124, 2140, 2151, 2091, 2028, 2083, 2195, 2233, 2233, 2282, 2329, 2282, 2182, 2142, 2148, 2092, 2006, 2056, 2209, 2218, 2093, 2116, 2299, 2360, 2239, 2129, 2106, 2139, 2228, 2282, 2203, 2093, 2093, 2172, 2267, 2348, 2350, 2284, 2249, 2226, 2174, 2199, 2301, 2292, 2199, 2229, 2312, 2249, 2117, 2074, 2070, 2059, 2089, 2139, 2190, 2270, 2320, 2287, 2252, 2240, 2184, 2169, 2275, 2347, 2276, 2214, 2246, 2296, 2343, 2372, 2305, 2234, 2287, 2320, 2201, 2112, 2183, 2262, 2252, 2221, 2185, 2140, 2127, 2141, 2166, 2241, 2315, 2284, 2210, 2194, 2190, 2159, 2145, 2128, 2089, 2102, 2137, 2102, 2085, 2191, 2290, 2294, 2307, 2326, 2266, 2221, 2273, 2290, 2228, 2220, 2253, 2183]
3798B183j19j0O7mr1l7R8R2o8r5Q0J25n3j09N5J32M4rj6q9j23mJ12O2m0KJ22J06l8j04o7n0
3793B154m9NL1nnM0M5L3L9lq0j01o1lP3J12O0j3l0pN5R8J0j19q0L3kq3qJ03O5l1m8pK0J3M
3788B258J0NoK8M7k6q0pO4L1ol4j21j37NJ13O6j6o3q6k8N3K2k3M9R8M1K0K7m9q6LP1N2L9N
3783B339o7l9N5K3n8JJ04M7j01j23LP4l1j03L4J35Kr3K6P9l7m4N3L2k7J1Jq2n9K7L8L3L9n0
3778B242j30n5L6Lk2L8O8M6M5P5Q8M1n8j16o0K7M7pq0r4j5N1L1K1K7l1o3M2J27O3k3o5q3m
3773B212R8K0j16n6K3o0n7R3R2k4KM7n9r6K4O9J2NNj8L6J01M4n0q8q7qJ11Q0q3j17mM5j0m6
3767B140j5M4M1j2QP8J8j12q3K3K9J5L2l0q0K1J00N6O0O9o0j06M2M1j44r5J45J18q9n9R5M6
3763B336r4q5PKn9l1P0P9k0o2l0m1m5M9R6po4K6J03P0J0k8l6j1k3o1k8M9L4k4mN5O3L5J2P
$$ y = [2183, 2064, 2054, 2121, 2117, 2026, 1989, 2087, 2179, 2111, 2016, 2096, 2221, 2168, 2059, 2114, 2246, 2290, 2281, 2265, 2176, 2053, 2049, 2161, 2223, 2183, 2185, 2307, 2413, 2375, 2271, 2204, 2154, 2105, 2110, 2141, 2136, 2131, 2171, 2216, 2249, 2288, 2285, 2205, 2104, 2043, 2040, 2113, 2225, 2285, 2272, 2242, 2235, 2290, 2388, 2398, 2279, 2199, 2232, 2230, 2147, 2139, 2242, 2307, 2276, 2228, 2221, 2241, 2254, 2258, 2268, 2273, 2267, 2295, 2342, 2316, 2236, 2229, 2293, 2324, 2318, 2284, 2163, 2026, 2031, 2144, 2210, 2194, 2131, 2045, 2017, 2070, 2092, 2069, 2118, 2216, 2257, 2277, 2304, 2255, 2169, 2172, 2243, 2295, 2334, 2339, 2272, 2233, 2288, 2311, 2253, 2254, 2358, 2405, 2304, 2181, 2184, 2258, 2227, 2124, 2158, 2293, 2295, 2202, 2228, 2307, 2270, 2226, 2279, 2311, 2284, 2295, 2296, 2214, 2155, 2182, 2220, 2253, 2292, 2242, 2112, 2057, 2093, 2096, 2074, 2112, 2180, 2226, 2271, 2346, 2434, 2475, 2417, 2301, 2241, 2268, 2315, 2308, 2228, 2134, 2119, 2170, 2201, 2222, 2249, 2218, 2155, 2197, 2324, 2387, 2364, 2299, 2216, 2212, 2310, 2330, 2214, 2158, 2181, 2121, 2064, 2157, 2249, 2225, 2227, 2274, 2215, 2119, 2143, 2212, 2224, 2229, 2234, 2216, 2252, 2353, 2397, 2347, 2259, 2172, 2164, 2275, 2355, 2272, 2155, 2151, 2196, 2186, 2140, 2125, 2169, 2210, 2198, 2206, 2284, 2302, 2190, 2107, 2130, 2159, 2174, 2206, 2176, 2096, 2117, 2217, 2273, 2333, 2402, 2342, 2236, 2278, 2319, 2175, 2080, 2225, 2343, 2254, 2195, 2290, 2336, 2242, 2157, 2164, 2166, 2107, 2076, 2146, 2225, 2205, 2143, 2113, 2072, 2027, 2076, 2172, 2165, 2101, 2127, 2230, 2300, 2310, 2282, 2246, 2235, 2212, 2151, 2123, 2172, 2206, 2182, 2178, 2233, 2296, 2331, 2343, 2350]
3757B350%m9q7k8M5K3J4O4Mj31j01J3ll7L5M0k6J9N9l6m1Q3M0q8rQ5n8j41NN2l3N5J91O9r2
3752B286m3J8l4m0qn8m2R0J07rj8O5N2k2o1r8p4N5J16Qp5m9l7j9N5L4r7j13j2lk6P7J58P7
3747B260k0k1K3O9O4l6r1%M7l6n2K2K9QL6mj04r1rJ4M1R9P0j5m4n6o0J6N8k6n6L8M9l1k9K3
3742B185L0K8J0m4j5P9K7j02q2qj9RP7K8l2K9M1n2k1Q3J8j01l3Q1L3k5N2J15J4j12r8k8p4
3737B093j21QJ68J33J7oj5o1m5QNkK0L0M5L6p7j20N6J57Np0L2j9j69r7M0MK3J52Q4r0m8N5
3732B231j1l4O3J5j36j00N4R2M0mo0r0j4Q3R6M4J1J5K6L4L8j7j39j57K2J50N7k9M4M8r5j13
3728B164M3Q5o4j33qJ08P1KK1L0m8r7o7o3o9JM9K6P7J51M0r7rR7Oq3l9%RK0o1j29J5J70R1
3722B309k9MK6j8kJ0n0m5J1ml0rk6m1L7R7O4L7Jo6k7R3P4l6m0j0l3l1j5k8J1M0o3r0J03J70
$$ y = [2350, 2350, 2301, 2214, 2186, 2231, 2254, 2268, 2332, 2336, 2205, 2104, 2117, 2114, 2077, 2112, 2152, 2126, 2145, 2204, 2168, 2127, 2210, 2250, 2162, 2153, 2238, 2180, 2039, 2044, 2096, 2063, 2118, 2309, 2378, 2286, 2243, 2261, 2227, 2187, 2179, 2121, 2079, 2169, 2276, 2267, 2249, 2314, 2366, 2344, 2283, 2185, 2111, 2166, 2282, 2290, 2215, 2166, 2129, 2110, 2165, 2199, 2102, 1989, 1977, 1974, 1948, 2025, 2183, 2260, 2240, 2219, 2242, 2311, 2375, 2339, 2248, 2248, 2295, 2259, 2207, 2229, 2258, 2266, 2302, 2298, 2194, 2103, 2094, 2108, 2149, 2248, 2318, 2303, 2259, 2203, 2143, 2159, 2217, 2191, 2135, 2173, 2222, 2191, 2162, 2185, 2215, 2243, 2253, 2209, 2194, 2273, 2300, 2198, 2116, 2108, 2089, 2098, 2175, 2203, 2171, 2200, 2241, 2189, 2168, 2251, 2269, 2168, 2135, 2216, 2249, 2224, 2276, 2391, 2405, 2293, 2195, 2167, 2093, 1972, 1980, 2148, 2281, 2298, 2292, 2277, 2216, 2171, 2179, 2184, 2182, 2202, 2232, 2277, 2313, 2236, 2116, 2172, 2329, 2334, 2264, 2296, 2277, 2108, 2011, 2051, 2055, 2078, 2230, 2314, 2224, 2176, 2231, 2220, 2186, 2249, 2264, 2128, 2028, 2082, 2174, 2214, 2210, 2150, 2060, 2046, 2129, 2225, 2269, 2280, 2295, 2321, 2355, 2393, 2376, 2237, 2080, 2102, 2252, 2309, 2280, 2324, 2372, 2277, 2164, 2207, 2292, 2228, 2095, 2087, 2195, 2266, 2268, 2289, 2319, 2271, 2174, 2107, 2044, 1975, 1976, 2025, 2051, 2128, 2279, 2319, 2222, 2213, 2310, 2316, 2233, 2194, 2194, 2203, 2223, 2162, 2033, 2048, 2218, 2309, 2280, 2284, 2310, 2292, 2290, 2300, 2250, 2205, 2216, 2212, 2182, 2173, 2147, 2106, 2143, 2240, 2304, 2341, 2342, 2276, 2249, 2342, 2416, 2380, 2340, 2330, 2297, 2266, 2251, 2223, 2234, 2274, 2211, 2121, 2224, 2394]
3717B394k6j21j2J7k9JK3RN7P0j9n3m2j23j14R7J99M4j02r2m2J1K8k6j9O0L0m1L4Q6n3j32
3712B114l4L2L7R7R3k9o8qK3O7R8l2j69p3Q8N1m0jP5Q9K8q3j28k2Q1J5j07j10j8O3O4Om0n5
3707B104m2L0P7Nm4O0Q6q2j13Q7J23p1r8P2R2m2p2rJ1RM7M9m0j12mJ66J10r8j01M6%j20j3
3703B113J14K4m0N8O1o6n1P2O8l5r6j10n4Q0J20k5j49o9O6N8j6%O5P3N8K8r1j63j6J50O4q2
3698B209m2J5l1jP5Qq3l6M7J18J97J03j42j71J8K6j06n3P7P7P7P9q6k22p9J01M7p6q0j7O4
3693B113J30J07L4ql0l6j8m1p5kQ2Qr2l8M0K3K7N8J9m4n1m2QJ06R2p0j34l4Kq8q7M8J10L3
3688B150lP4R4rq2m1j8n5k3P3Q0rm0L7J00M6o1o2Kk8n8P2J64%j49l3R6M8k4o2j22o0J09Q8
3683B294p7o1N4J6o0k3J3K9P2lj42o8J04M4q1J3J27N3mK9no0j8no8l9O3P4K6J8ro0%J02N9
$$ y = [2394, 2368, 2247, 2235, 2252, 2223, 2224, 2247, 2256, 2313, 2383, 2364, 2311, 2269, 2146, 2032, 2129, 2328, 2372, 2270, 2178, 2136, 2147, 2175, 2149, 2130, 2190, 2220, 2179, 2213, 2299, 2246, 2114, 2080, 2112, 2149, 2246, 2339, 2310, 2242, 2234, 2257, 2324, 2422, 2390, 2221, 2148, 2236, 2287, 2247, 2246, 2321, 2410, 2438, 2355, 2227, 2205, 2286, 2301, 2194, 2084, 2066, 2129, 2193, 2199, 2159, 2104, 2062, 2092, 2169, 2174, 2130, 2190, 2276, 2194, 2081, 2168, 2291, 2220, 2122, 2194, 2286, 2244, 2172, 2163, 2174, 2183, 2230, 2279, 2239, 2127, 2123, 2289, 2399, 2301, 2200, 2246, 2246, 2126, 2113, 2227, 2251, 2211, 2269, 2330, 2264, 2213, 2285, 2353, 2318, 2222, 2112, 2058, 2138, 2258, 2233, 2084, 2015, 2081, 2139, 2123, 2123, 2188, 2261, 2319, 2347, 2256, 2093, 2077, 2227, 2291, 2209, 2167, 2182, 2151, 2150, 2225, 2233, 2150, 2114, 2161, 2279, 2476, 2579, 2437, 2266, 2284, 2310, 2204, 2151, 2228, 2305, 2382, 2461, 2375, 2153, 2074, 2175, 2222, 2146, 2066, 2049, 2113, 2243, 2350, 2384, 2376, 2346, 2310, 2292, 2251, 2176, 2174, 2256, 2264, 2172, 2134, 2174, 2197, 2224, 2282, 2301, 2257, 2206, 2164, 2172, 2278, 2370, 2300, 2166, 2132, 2134, 2046, 1959, 2007, 2117, 2150, 2147, 2221, 2315, 2306, 2224, 2183, 2165, 2110, 2087, 2160, 2240, 2231, 2191, 2228, 2328, 2374, 2313, 2251, 2253, 2225, 2167, 2239, 2403, 2403, 2254, 2221, 2317, 2365, 2341, 2279, 2157, 2097, 2206, 2294, 2217, 2156, 2210, 2226, 2166, 2143, 2156, 2185, 2257, 2254, 2112, 2044, 2148, 2192, 2111, 2124, 2251, 2304, 2300, 2329, 2324, 2264, 2246, 2241, 2173, 2134, 2197, 2271, 2297, 2315, 2306, 2246, 2246, 2348, 2407]
3678B407q9j29n6j6k7rJ5J5M5P8Rq2l0N1on0L1L7m3L3J62J6k02q9J33O7q4mJ06L5l1ml3q5
3673B171JJ16O3l3oK3m5p4k0j4m2RP5M1%L2M1jj7k4p9j01l6M4Q8J00N4j6k5j6o4p9J9Q7J4
3668B286p1j4R9Q7j4l1K0m6j46o6O1pq3N4J48Kj01j1N1M1Q8R4j0n2nl6r2n4j4j2M5R3L9m%
3663B339n3r2j0O7M4L3L6m8j00j6M3j4m4OK1MJ6J5j4j7Kj2l0pJ7J1K8Q5Q4qn2J5L5p0j22l2
3658B160M1Km4j2O5J02L6p6o2P0J05j8j11o5PJ0j5J2P1O0j2j4K8k9j17o3L9M0K8M5l2j34p8
3653B039N5P8L2L1L5J6ol0m0m1n3k5N6M4p7r0K5N4RL4N0j0k0L4M6L7J9p4j11K4J33R0M1%j04
3648B301r2O1N2q7l9Q9Nj01jJ08N0o1j21o6Q8R3j24j70R0K34N6j23j12j5N4K8n8l5N0On1N6
3643B165R9m1m8J14J03l7k8%j07j10M8Q0mJ2L2o4p8M1O4j9k2Pl7l4Q6J24pj09p5j7JL8O4J8
$$ y = [2407, 2318, 2189, 2133, 2117, 2090, 2081, 2096, 2111, 2156, 2234, 2243, 2161, 2131, 2182, 2176, 2126, 2157, 2194, 2151, 2184, 2346, 2362, 2160, 2071, 2204, 2271, 2187, 2183, 2289, 2324, 2293, 2289, 2256, 2171, 2172, 2288, 2351, 2318, 2312, 2335, 2290, 2216, 2196, 2182, 2140, 2149, 2224, 2265, 2265, 2297, 2338, 2337, 2320, 2296, 2217, 2116, 2080, 2124, 2212, 2312, 2366, 2350, 2325, 2309, 2245, 2166, 2185, 2272, 2286, 2215, 2201, 2300, 2387, 2373, 2342, 2362, 2316, 2170, 2104, 2165, 2158, 2075, 2129, 2277, 2279, 2178, 2167, 2218, 2259, 2347, 2441, 2431, 2379, 2374, 2338, 2246, 2192, 2178, 2166, 2211, 2304, 2343, 2339, 2339, 2286, 2194, 2184, 2251, 2295, 2328, 2364, 2316, 2216, 2200, 2243, 2229, 2185, 2191, 2212, 2216, 2232, 2247, 2233, 2216, 2218, 2206, 2176, 2169, 2186, 2197, 2225, 2310, 2394, 2386, 2334, 2349, 2384, 2314, 2192, 2160, 2201, 2203, 2159, 2147, 2212, 2314, 2350, 2274, 2212, 2282, 2387, 2369, 2258, 2193, 2200, 2210, 2195, 2207, 2278, 2338, 2326, 2312, 2340, 2311, 2194, 2131, 2170, 2210, 2238, 2283, 2251, 2117, 2039, 2094, 2172, 2204, 2235, 2270, 2286, 2280, 2250, 2210, 2169, 2116, 2091, 2147, 2191, 2114, 2024, 2049, 2103, 2112, 2146, 2196, 2186, 2166, 2200, 2246, 2283, 2302, 2228, 2117, 2141, 2274, 2364, 2405, 2405, 2301, 2209, 2270, 2322, 2235, 2196, 2285, 2290, 2189, 2188, 2296, 2346, 2285, 2164, 2098, 2186, 2279, 2155, 1985, 2075, 2309, 2365, 2242, 2130, 2115, 2169, 2197, 2139, 2104, 2154, 2160, 2109, 2165, 2264, 2223, 2175, 2289, 2392, 2355, 2327, 2327, 2220, 2110, 2158, 2238, 2234, 2246, 2278, 2214, 2136, 2177, 2241, 2222, 2200, 2207, 2170, 2136, 2222, 2346, 2339, 2230, 2155, 2138, 2139, 2177, 2241, 2259]
3638B259k4JL0K7K6qj00j19pQ4N2Llj7m1l5j0%mJ0P0P9l3j14k9L6l8m2R5J06l5p1LK4K9N4
3633B258J2k8J6J2o9m2N3M4%kn0n6Q6J30n6j48nO9k5o2JN9P7K4n5k2N9Jq6l6j0o8k0J02P8
3628B241J7O1M5o4n2K2o3j45k6Q5K6k3K8K8j3K6Q8M0m7m2J4mj02j55j07rQ3J64J95J26qj01
3623B328j03n5pK9N7M0n3j37q4O9J23Qr3k9O6N3N6J58J11j48k26kR1p1r5M9K7o6J8N9o3m4
3618B066J15P3n7k3j0r1QJ54J5j43LJ16l4p4J02J33j0p5p8o1O2J47Qj33o4L5J1j9nJ8N3J7
3614B259j08j04Q2J32m3j05K6P4lk3j%L0K4o2l7J24J05q4o2J19P3j14r3K0k9o6N6J17Pq6q6
3609B142m3L5J05O4j9rN0M5k3q5p2J4L9n5j12k7P9J11P6np5l4L2J3K2J09O1j44k12m6J12J16
3604B264K0o2l1O1K9p6l8M9l6j59p3Q8J03J6n2p3j4J02J59R0m4j11k6J12Q6n9p6K8K6o4n1
$$ y = [2259, 2235, 2236, 2266, 2293, 2319, 2311, 2211, 2092, 2085, 2169, 2221, 2224, 2221, 2204, 2163, 2128, 2118, 2118, 2114, 2124, 2194, 2273, 2240, 2126, 2097, 2133, 2095, 2053, 2148, 2254, 2219, 2148, 2151, 2175, 2204, 2258, 2270, 2242, 2258, 2270, 2201, 2159, 2212, 2256, 2256, 2254, 2204, 2148, 2234, 2364, 2308, 2160, 2155, 2224, 2199, 2137, 2138, 2197, 2274, 2298, 2243, 2221, 2280, 2281, 2195, 2159, 2149, 2081, 2061, 2163, 2241, 2258, 2319, 2364, 2300, 2248, 2270, 2207, 2062, 2036, 2121, 2147, 2124, 2152, 2180, 2167, 2193, 2281, 2321, 2274, 2232, 2246, 2242, 2140, 1985, 1878, 1869, 1952, 2116, 2311, 2437, 2429, 2328, 2225, 2170, 2163, 2192, 2249, 2289, 2236, 2099, 2015, 2084, 2207, 2215, 2122, 2093, 2159, 2212, 2268, 2426, 2537, 2389, 2163, 2161, 2252, 2181, 2086, 2135, 2162, 2096, 2114, 2173, 2110, 2066, 2181, 2254, 2197, 2174, 2164, 2073, 2081, 2235, 2250, 2107, 2110, 2226, 2192, 2118, 2220, 2353, 2343, 2268, 2190, 2129, 2191, 2338, 2346, 2213, 2149, 2184, 2195, 2176, 2171, 2189, 2242, 2259, 2151, 2047, 2129, 2261, 2218, 2113, 2139, 2213, 2210, 2187, 2186, 2186, 2216, 2240, 2178, 2141, 2265, 2370, 2286, 2224, 2343, 2416, 2302, 2209, 2229, 2200, 2134, 2190, 2307, 2314, 2228, 2142, 2099, 2134, 2239, 2303, 2284, 2275, 2325, 2370, 2347, 2262, 2190, 2204, 2243, 2188, 2076, 2049, 2128, 2239, 2315, 2310, 2235, 2201, 2233, 2246, 2268, 2377, 2438, 2294, 2082, 2036, 2148, 2264, 2284, 2222, 2191, 2252, 2281, 2205, 2167, 2216, 2180, 2021, 1948, 2036, 2139, 2155, 2103, 2030, 2016, 2118, 2277, 2367, 2323, 2212, 2186, 2298, 2384, 2325, 2249, 2277, 2303, 2239, 2188]
3600B188M0O0K5K0J7j8m1l3m3p7k0J31J45l5j22j1L5k0M1J04m5j71n7K8m0j5R2M7l1M3R5J8
3595B350m3n9q7p0mJ2L3R4N0o9n2N7O9Qk7l7k1Ml3o3J1O3J9K7P8J6n4knj20j08L3N5l7m8L7
3590B077J29J68Q7p0j21n0J1L7L7k2p1l4J2L1O9M7o7q8J7L5m6oP4K5l0M4Q5j4j22j13mR2M4
3585B263q1o3N0J0j03m4P4L5j0O1O1o3p6L4N5qk3m6j07p8M4R9Q3P3K9m1k7L2Lm5oK3j0J2O7
3580B277L8oOLj4L6M4m5l7Q1M2j49j73j1J02R6M3j9m3j3J5K5K3k9p4OR3M2l6m1o4o1L5K8j32
3575B088j17J03J54Kl7M7O1M1K4m6j00o7k1J6O6L1r5j16l0KQQ7J26L1q8j21m5P6Q7NJ9R6K6
3570B313r4p1j7k9L0J19N8m9n2n1m7N2Q3m8r2K8P1Pqj7o1l2J6l9n7M0P4J1jL5M4P2P7l1r6
3565B238NQ9K6m8m9m2l2Opp5q6qM5J5k7QO9M0m2l7K8L0k0l7j2K2K7NJ5O4N1k2j3N1Mj04r6
$$ y = [2188, 2228, 2288, 2313, 2333, 2350, 2332, 2291, 2258, 2215, 2138, 2118, 2249, 2394, 2359, 2237, 2226, 2261, 2241, 2282, 2386, 2341, 2170, 2113, 2141, 2101, 2086, 2178, 2225, 2194, 2237, 2332, 2350, 2307, 2248, 2161, 2091, 2087, 2099, 2132, 2226, 2276, 2207, 2155, 2212, 2281, 2289, 2262, 2225, 2204, 2208, 2175, 2112, 2123, 2186, 2205, 2232, 2310, 2326, 2272, 2270, 2265, 2145, 2037, 2070, 2125, 2088, 2040, 2077, 2206, 2374, 2461, 2391, 2270, 2220, 2231, 2268, 2305, 2283, 2212, 2178, 2190, 2221, 2290, 2337, 2270, 2182, 2199, 2234, 2188, 2182, 2256, 2281, 2251, 2295, 2380, 2366, 2244, 2131, 2127, 2219, 2263, 2182, 2119, 2169, 2179, 2076, 2032, 2106, 2141, 2131, 2192, 2253, 2190, 2114, 2148, 2203, 2195, 2172, 2126, 2019, 1941, 1985, 2084, 2167, 2240, 2269, 2228, 2201, 2233, 2236, 2191, 2185, 2208, 2198, 2210, 2277, 2315, 2309, 2315, 2318, 2304, 2340, 2384, 2339, 2302, 2383, 2425, 2276, 2103, 2092, 2194, 2290, 2333, 2314, 2271, 2258, 2273, 2298, 2321, 2292, 2218, 2224, 2317, 2359, 2323, 2282, 2218, 2157, 2192, 2220, 2088, 1971, 2074, 2228, 2230, 2193, 2240, 2301, 2342, 2366, 2320, 2220, 2153, 2132, 2148, 2214, 2245, 2150, 2034, 2004, 2006, 2014, 2101, 2227, 2258, 2170, 2049, 2004, 2080, 2167, 2172, 2191, 2287, 2313, 2219, 2148, 2131, 2102, 2132, 2251, 2309, 2260, 2208, 2157, 2110, 2162, 2245, 2197, 2105, 2133, 2204, 2211, 2203, 2186, 2125, 2093, 2109, 2070, 2013, 2053, 2127, 2138, 2137, 2172, 2216, 2288, 2365, 2334, 2238, 2243, 2332, 2358, 2310, 2261, 2219, 2187, 2193, 2186, 2111, 2025, 2017, 2062, 2077, 2050, 2058, 2127, 2167, 2125, 2088, 2116, 2146, 2126, 2089, 2077, 2099, 2126, 2131, 2146, 2210, 2261, 2239, 2226, 2277, 2281, 2177, 2081]
3559B081J8R6J02O1J8Kk0n1k4J1m6p0L4Q3j1m0K1j0p3k5Rk8mK9l7m3P0Q1j5LR4P2k5j08j53
3554B102q0Q5J17j2o7J2Q0N6k4o1L6J31L3j29j15k2j0j4Kk5j0R9J13k7j00j5R6J11Pj12p2
3549B185O5N7p6j08l5OJ0k2o8j5J12J02Mlnq1k5J31P4j27j30oQJ3J07J06j5m5K5N0M3O1M7
3545B445j7m9j1K4Kl6j0L2j5p3lQ7K7q1o8j9l4k2M0L2m7m8L6P2J3m5k6L1L5j1k0L6P0J9l3
3539B333l2n0r6o3N3Q1pl9K6M7LK4Q0K3r7q6L8N5m8p0K8P4L9L1Jj05j15K1L5j11j06P6J23
3535B166J2l2rrRJ1l1J6J07K0j18o0Nr7r3Q5J18L7J03J21q3j65RO8n2j8J13N1o8MJ34J03k1
3530B436n6RJ1q3r8J8N5l6m6L6L3k5l9p1r1K6J47O9p5q5k7nlkK4Q0M1q2q3L7N4NL6J5j25j20
3524A980P3J30lm7M4N6k7p7p6l5N5J23P2l2m3L4Q2N7Jn7o6J9J15P6n0r4m2K1O3N6j3m1%j6
$$ y = [2081, 2099, 2195, 2297, 2358, 2376, 2378, 2358, 2307, 2283, 2294, 2248, 2178, 2212, 2295, 2284, 2244, 2265, 2255, 2182, 2157, 2166, 2138, 2134, 2163, 2126, 2083, 2153, 2234, 2219, 2222, 2316, 2388, 2363, 2255, 2102, 2022, 2107, 2224, 2212, 2145, 2157, 2237, 2293, 2269, 2208, 2244, 2375, 2408, 2279, 2164, 2142, 2132, 2118, 2120, 2095, 2085, 2184, 2297, 2270, 2170, 2155, 2251, 2362, 2369, 2257, 2185, 2250, 2307, 2231, 2123, 2088, 2094, 2104, 2082, 2014, 1999, 2111, 2213, 2217, 2214, 2209, 2128, 2103, 2234, 2308, 2181, 2051, 2045, 2053, 2066, 2173, 2279, 2264, 2219, 2244, 2294, 2337, 2398, 2445, 2428, 2379, 2368, 2392, 2394, 2358, 2348, 2380, 2365, 2292, 2289, 2376, 2403, 2322, 2254, 2235, 2201, 2179, 2219, 2251, 2204, 2156, 2192, 2264, 2277, 2232, 2206, 2237, 2272, 2261, 2241, 2277, 2347, 2366, 2333, 2301, 2251, 2155, 2092, 2145, 2226, 2219, 2180, 2206, 2253, 2256, 2280, 2360, 2383, 2286, 2200, 2238, 2293, 2245, 2175, 2203, 2277, 2316, 2347, 2348, 2243, 2128, 2149, 2184, 2073, 1967, 2043, 2166, 2178, 2146, 2137, 2128, 2137, 2148, 2117, 2133, 2240, 2260, 2142, 2082, 2087, 1990, 1897, 1982, 2100, 2137, 2240, 2361, 2278, 2113, 2122, 2190, 2138, 2120, 2233, 2284, 2216, 2220, 2354, 2457, 2436, 2380, 2389, 2400, 2317, 2219, 2237, 2292, 2256, 2210, 2246, 2279, 2254, 2215, 2144, 2053, 2079, 2226, 2295, 2220, 2135, 2108, 2103, 2100, 2098, 2122, 2202, 2243, 2161, 2078, 2115, 2169, 2174, 2210, 2225, 2100, 1980, 2053, 2183, 2180, 2133, 2177, 2233, 2206, 2129, 2053, 2018, 2073, 2196, 2268, 2236, 2193, 2227, 2309, 2366, 2367, 2310, 2244, 2263, 2378, 2454, 2404, 2310, 2268, 2289, 2352, 2408, 2395, 2354, 2354, 2338]
3519B338q3n9K7N3O3O8%o9n3m7l8O8R2q5j39N1R9o8o9O8K6o1K4P4k7o3k5n2n4J3rp8k2P9P9
3514B121N2L3l8j02o4K7R1R8J7p5m9M1N3mk4J0O5P1Pm7k1K6K8L1L0mm2m8n1m1QN2M4kl7l2
3509B224k1l3k1M9P0nl0PoJQ6L6j36q8J09O4r7m0M3k5KJ24N2r4l1L7n0n7O5O9m0p3j6N0N0
3504B275n2j10nO0k6k0R7O2m3PN6l0k5R8N5j19j41k0M4Km8rQ7R6J0l2n3j12o5P3L2j07m9Q7
3499B075M5k4Nk0o8J4Q6M8M4O2JrL6n0j37k7L9o7l4J37Q5p4j2R1K0m4k5l0K2J36P0q8n1O4
3494B320J1m4J3k2j49j15N1J14M7k2l0J9O3M3K9M8lj10j06rK9kl6o3l6Q2J60R8J4kk1n0l6
3489B285m5j00n9P9R0m7r1QO3L3J6Jl8j7M4K4l6kP9O7m3j29q1O4J10Ko5j6ml6PM5K1O2J19
3484B410Or9J2Q1o6j20J7O4Kpm2j07m0O1K3K2J32J10l3n2Kk2m4l2m4qN9op9J8P8k7n3M0M9
$$ y = [2338, 2255, 2196, 2223, 2276, 2339, 2407, 2407, 2338, 2285, 2238, 2200, 2268, 2360, 2275, 2136, 2187, 2286, 2218, 2149, 2217, 2243, 2182, 2206, 2280, 2253, 2190, 2165, 2113, 2059, 2072, 2063, 1985, 1963, 2042, 2121, 2173, 2206, 2168, 2066, 2002, 2029, 2120, 2218, 2235, 2160, 2111, 2152, 2205, 2201, 2177, 2187, 2252, 2323, 2330, 2283, 2262, 2288, 2316, 2347, 2377, 2373, 2331, 2283, 2232, 2191, 2199, 2251, 2295, 2293, 2256, 2224, 2203, 2170, 2149, 2198, 2268, 2263, 2233, 2240, 2234, 2235, 2321, 2357, 2221, 2133, 2242, 2306, 2209, 2169, 2212, 2187, 2189, 2313, 2365, 2271, 2240, 2277, 2227, 2170, 2235, 2304, 2264, 2191, 2175, 2225, 2275, 2223, 2113, 2108, 2168, 2142, 2122, 2219, 2281, 2238, 2245, 2301, 2271, 2246, 2344, 2399, 2280, 2139, 2119, 2163, 2165, 2117, 2108, 2195, 2291, 2301, 2269, 2216, 2104, 2039, 2112, 2144, 2037, 1988, 2075, 2120, 2096, 2101, 2081, 2013, 2027, 2113, 2161, 2205, 2267, 2268, 2259, 2295, 2245, 2108, 2081, 2120, 2053, 2019, 2156, 2241, 2167, 2155, 2246, 2266, 2222, 2197, 2167, 2189, 2325, 2395, 2307, 2256, 2320, 2331, 2287, 2300, 2278, 2129, 2014, 2065, 2179, 2226, 2204, 2174, 2193, 2256, 2299, 2328, 2376, 2373, 2263, 2157, 2148, 2177, 2175, 2139, 2076, 2040, 2122, 2282, 2380, 2394, 2392, 2371, 2321, 2285, 2240, 2140, 2081, 2160, 2250, 2203, 2112, 2120, 2183, 2216, 2232, 2233, 2195, 2178, 2222, 2246, 2210, 2208, 2287, 2354, 2311, 2182, 2101, 2165, 2275, 2277, 2212, 2196, 2192, 2156, 2163, 2208, 2229, 2291, 2410, 2416, 2317, 2329, 2410, 2344, 2224, 2241, 2305, 2307, 2300, 2258, 2151, 2111, 2172, 2195, 2217, 2349, 2459, 2426, 2374, 2376, 2354, 2310, 2278, 2234, 2226, 2285, 2279, 2200, 2218, 2296, 2269, 2216, 2256, 2305]
3479B305J7M0j3r3j5Q0K8m0p1j19k6J66J23p0m4N7j5m1M8j7j16K0J13k4o7N6N6j0L6K1r9r4
3474B192J5M5M0L4l2p1j4PMP4Q5nj5J5q1j16L4P3r2j27L4J18O2jl8n7p0p1J9J51J10m0l3N3
3469B302k1r9OJ03K8q7j24o3O1P7m4n8P5R0j1k4j5n9l0J5l9j2J24M9j78j24J13J28K5N9R0
3465B357rq2o7k1M2M7m5n9O5R6j2n2nPJ3L3nm5J7P4L5J0M9L7m5p5l3j4m3o1m1j7J8O2O8J6
3459B315l5o9r6o8L9J13Q8K8k0o2k8N6M4m6n9%M5M9k3j39j00O9O7p8l4J25O2r5m5J10J30L0
3455B373o7o0M1N1p0o7R6J11l1m8L8L4Lrp9q3O5J07n4j07K2M8n8o0L1O5M7K1j9k7nqk4j7l3
3450B227o8l3M6M9k1m6K7R3M5l4pO7N6K7N5L1p9j17m6QK8N0M2K0Lp9j86j29M4R9M5M4N0j3
3445B298l6L2N2j2m4oRl0m7k8k3k4K2M0k0LJ46J16j27j91J3J02j2m5J0QN5J58N8j62j43O1
$$ y = [2305, 2322, 2362, 2349, 2256, 2241, 2321, 2349, 2309, 2238, 2119, 2093, 2259, 2382, 2312, 2268, 2325, 2310, 2269, 2317, 2300, 2184, 2204, 2317, 2293, 2226, 2282, 2338, 2328, 2364, 2385, 2286, 2192, 2207, 2252, 2292, 2326, 2294, 2223, 2209, 2216, 2220, 2294, 2379, 2374, 2359, 2374, 2293, 2177, 2211, 2284, 2192, 2065, 2099, 2217, 2279, 2278, 2240, 2183, 2113, 2042, 2061, 2212, 2322, 2282, 2249, 2302, 2281, 2182, 2188, 2291, 2319, 2232, 2108, 2045, 2106, 2183, 2139, 2081, 2156, 2246, 2235, 2211, 2196, 2137, 2107, 2122, 2083, 2071, 2195, 2244, 2066, 1942, 2055, 2183, 2208, 2267, 2357, 2348, 2266, 2199, 2178, 2220, 2267, 2222, 2163, 2228, 2324, 2312, 2260, 2255, 2262, 2275, 2308, 2303, 2258, 2275, 2349, 2384, 2394, 2443, 2480, 2435, 2360, 2327, 2313, 2270, 2209, 2168, 2151, 2169, 2231, 2299, 2315, 2280, 2211, 2115, 2047, 2086, 2199, 2287, 2315, 2295, 2233, 2205, 2261, 2305, 2259, 2200, 2200, 2245, 2294, 2271, 2132, 2032, 2101, 2168, 2090, 2056, 2181, 2243, 2148, 2103, 2213, 2343, 2373, 2306, 2246, 2287, 2338, 2268, 2201, 2297, 2408, 2377, 2329, 2367, 2401, 2404, 2395, 2316, 2233, 2298, 2405, 2351, 2244, 2266, 2314, 2256, 2196, 2227, 2292, 2339, 2360, 2341, 2314, 2309, 2301, 2277, 2260, 2227, 2159, 2126, 2172, 2221, 2200, 2154, 2181, 2274, 2319, 2285, 2278, 2345, 2401, 2428, 2483, 2514, 2435, 2318, 2272, 2280, 2308, 2358, 2400, 2420, 2423, 2344, 2158, 2029, 2073, 2172, 2217, 2261, 2311, 2298, 2262, 2294, 2346, 2334, 2290, 2284, 2293, 2263, 2216, 2188, 2165, 2141, 2163, 2203, 2183, 2186, 2332, 2448, 2321, 2130, 2143, 2245, 2233, 2188, 2198, 2206, 2261, 2419, 2477, 2315, 2172, 2233]
3440B233J18K7k3j9QM2J6m9l2J8k4o8J0Q3K4n7l6J3J3J3L3j2j06j07K9J13M1n5k5M9M4j9k6
3435B269O0J10K5r0r6l9k2k0JJ3L7N8rp8lR2M0j2N1O4l9o5J6K2r6j98j36P1J81P8j7L6K0p3
3430B251J1J25k0j56K5J59k0j56o1J4L0J04P4o5m1J01P3m8l3J6nJ8N8j4q8l6K1kJ6N6k0j20
3425B267n9L3n1j53l4J47J18PL9J20O7m7r4o7KL6rqQ5P4q5j41m5KLN1M6k3K5J22M7r7r0oK4
3420B306J0j2k4rl5q2jJ26O5p6o0Pk5k6K9J9K1J01P3o7n9O9N9m2l4L9L0l4r6j14n3N6J14O8
3415B343m1q3nO3L5M0R7L3j10j10j4KJ4R5J06L0j6l5o7p0n3m0MK8l0l3N9L2q5j5J60J25m4
3410B415p1PJ4k8j7M6O3%j8M5j4j71r2J45J01j22q5N7l9j26L4J60P7k6n5j5O3Rj53r7J26J09
3406B342o7m7M1qoP8L8m4oj1r3q0k3k4M4J30N8j2M0j3j72j21O0R5P3R1J2q5l6pp7LJ64O0j85
$$ y = [2233, 2351, 2378, 2355, 2336, 2344, 2386, 2402, 2353, 2321, 2339, 2315, 2247, 2257, 2340, 2364, 2307, 2271, 2284, 2297, 2310, 2343, 2331, 2225, 2118, 2147, 2260, 2301, 2246, 2221, 2270, 2314, 2295, 2269, 2329, 2439, 2464, 2374, 2278, 2239, 2217, 2197, 2198, 2211, 2248, 2306, 2297, 2219, 2216, 2308, 2348, 2336, 2387, 2451, 2412, 2347, 2363, 2385, 2289, 2091, 1955, 2026, 2207, 2285, 2268, 2304, 2324, 2251, 2262, 2387, 2367, 2211, 2236, 2395, 2375, 2219, 2158, 2172, 2202, 2306, 2380, 2315, 2274, 2375, 2448, 2400, 2367, 2383, 2378, 2396, 2454, 2440, 2352, 2316, 2337, 2335, 2351, 2407, 2387, 2267, 2208, 2241, 2190, 2037, 2003, 2150, 2268, 2275, 2314, 2434, 2501, 2454, 2360, 2293, 2295, 2331, 2322, 2314, 2399, 2473, 2388, 2247, 2202, 2204, 2207, 2258, 2304, 2281, 2306, 2428, 2475, 2378, 2288, 2282, 2306, 2316, 2304, 2280, 2271, 2236, 2154, 2153, 2279, 2344, 2268, 2208, 2215, 2190, 2164, 2193, 2212, 2233, 2334, 2407, 2340, 2281, 2350, 2409, 2367, 2333, 2372, 2402, 2368, 2272, 2158, 2105, 2161, 2275, 2343, 2302, 2219, 2214, 2277, 2312, 2352, 2449, 2482, 2372, 2262, 2248, 2250, 2264, 2359, 2465, 2495, 2479, 2444, 2377, 2307, 2254, 2214, 2218, 2246, 2216, 2183, 2242, 2274, 2189, 2174, 2334, 2459, 2415, 2344, 2351, 2365, 2337, 2320, 2366, 2429, 2429, 2411, 2456, 2442, 2271, 2179, 2324, 2425, 2303, 2218, 2275, 2236, 2110, 2144, 2304, 2381, 2355, 2300, 2285, 2348, 2357, 2204, 2107, 2233, 2342, 2275, 2228, 2269, 2261, 2255, 2333, 2371, 2327, 2321, 2310, 2217, 2137, 2114, 2090, 2134, 2264, 2322, 2310, 2350, 2337, 2165, 2044, 2104, 2199, 2272, 2363, 2375, 2290, 2254, 2247, 2170, 2173, 2337, 2397, 2212]
3401B212j63P6K04J39qj19j03PQ0P2K1k3l6n4r0o4PJ4J2R1Q3n6o8N2J9q1NR3po5Nj3p1RO8
3395B248pj6Q0P1j5l6k5k7K4Q5O1l6j18r0N0J31N0m2m5n9p6oN7L4Qk0o1J6J41N3j26p2N3k4
3390B261p6N5O8j01j12P3J50N8l7p5n7j4j0l3pK4NJ2O5N3k9p1n8o3r2p5L2J44J30M6L0L8l6
3386B298r5j8R3J08N6l3j12o8N3O4k9l6K5On7n4j5%%j4l3nL2ll4K9O9kl5M4O3JJ1J9j01j63
3380B064j4P6j4rJ64K05N3p2j03q6k6k2p1nJ24P2m7J8R3k0j25q5k5N3J38O6p1m9j4j05n2J53
3376B264J20p5m1P8lp5k2o7j43j6J19M8j6M6N9nk0LLj6n5m5O1J13J6p8o9k5K6O4J4l5L1R0
3371B349M3J8J9p2j52r7nL8N6J3n8m1mpP8J63J0j59l2R6l8j20NM2k2Onq1K5J83O7r1K0J34
3366B381J9p2qK2j1j4k9m7PM9k1n8L4R4j4j30o4P7P3l4m4Rll4l7m2J4J29P9r7o7J04L8j34
$$ y = [2212, 2049, 2125, 2329, 2468, 2460, 2341, 2238, 2245, 2325, 2397, 2418, 2395, 2359, 2305, 2215, 2151, 2158, 2172, 2184, 2275, 2358, 2302, 2234, 2286, 2305, 2224, 2229, 2322, 2315, 2250, 2255, 2242, 2171, 2180, 2248, 2241, 2225, 2305, 2376, 2361, 2325, 2300, 2273, 2297, 2382, 2443, 2407, 2289, 2199, 2249, 2380, 2430, 2388, 2343, 2284, 2208, 2202, 2259, 2293, 2301, 2281, 2220, 2236, 2377, 2430, 2304, 2232, 2285, 2261, 2185, 2240, 2308, 2207, 2095, 2168, 2318, 2376, 2339, 2264, 2207, 2193, 2183, 2150, 2143, 2167, 2172, 2184, 2249, 2302, 2273, 2202, 2144, 2081, 1989, 1914, 1946, 2090, 2220, 2266, 2296, 2334, 2298, 2203, 2185, 2278, 2386, 2442, 2409, 2297, 2229, 2282, 2346, 2317, 2281, 2306, 2312, 2255, 2201, 2186, 2186, 2186, 2172, 2139, 2134, 2166, 2163, 2129, 2158, 2227, 2225, 2190, 2234, 2297, 2298, 2309, 2328, 2227, 2064, 2050, 2126, 2112, 2103, 2267, 2472, 2525, 2453, 2350, 2264, 2238, 2216, 2145, 2140, 2264, 2336, 2289, 2307, 2400, 2380, 2255, 2170, 2145, 2198, 2336, 2402, 2331, 2282, 2268, 2163, 2111, 2264, 2384, 2309, 2268, 2346, 2343, 2268, 2246, 2179, 2036, 2020, 2139, 2187, 2171, 2217, 2276, 2271, 2251, 2254, 2257, 2241, 2186, 2141, 2202, 2315, 2331, 2253, 2184, 2159, 2185, 2249, 2263, 2228, 2259, 2349, 2392, 2410, 2429, 2357, 2205, 2108, 2103, 2141, 2197, 2210, 2152, 2111, 2107, 2100, 2178, 2341, 2351, 2192, 2160, 2256, 2218, 2098, 2103, 2145, 2123, 2129, 2124, 2043, 2068, 2251, 2318, 2227, 2247, 2381, 2400, 2328, 2320, 2342, 2331, 2317, 2288, 2241, 2248, 2297, 2276, 2218, 2252, 2346, 2332, 2202, 2138, 2215, 2288, 2254, 2210, 2219, 2216, 2182, 2145, 2103, 2117, 2246, 2325, 2228, 2161, 2265, 2303, 2169]
3361B169n4J01N6j1L7M0rMQm1n0j9mK1K4k6j1K2n0p2P2R8r7j47K2Q8K4K4L3nJ2L1m5j03o9
3355B073m3QJ06J09Jm0kL3O1N6J2L1L4j03j63RP5q6m7J99J60j16j64l8l3p0l9l9o0j3M8R1
3351B050J37J23L3njk7l7l0n5j6Q3P3%N1Q1n7j16QL8m9pP1j5r5k3L7NrPJ9P0R6J2p6m2K2O
3345B362n1o5LR9P3p2j12K0R7%q2l0K3pl6j2K2L0Pn8q1OP3Kn9j0Jm0M2J42J6j35l7J22J12
3340B365N9J7j06j66n8jl3P0J87O5j08q4k5o8o0L2M9RJ7N6N0k7o7M3J34kj36J1J71O4p5m6
3336B337j6j5K1k3j12l3O5j3l9O8J6j07PJ10o7j58L2J18J2K6J18Q2M4N6m6j69j17j7j0J1M5
3331B226j4p6j9O5O9K1j0K7Q4M4p2j02m1j8k5L9J14P7n7j45r6K2Q5P2M0J9lm0p4l1P8R3l0
3326B322p0K4K7p3n6L2K1k2l4p5m7R9J28j2m6K4j7m7P1J05m2r4j6pm4k6K3J02J69L9j77j67
$$ y = [2169, 2115, 2216, 2272, 2261, 2298, 2338, 2329, 2333, 2341, 2300, 2250, 2231, 2227, 2248, 2272, 2246, 2235, 2257, 2207, 2135, 2207, 2305, 2208, 2061, 2083, 2171, 2195, 2219, 2252, 2247, 2259, 2290, 2245, 2142, 2073, 2030, 2038, 2144, 2253, 2254, 2214, 2212, 2245, 2306, 2362, 2374, 2405, 2439, 2336, 2173, 2182, 2257, 2171, 2124, 2323, 2483, 2367, 2203, 2165, 2132, 2062, 2023, 1984, 1924, 1911, 1959, 2050, 2187, 2310, 2343, 2338, 2337, 2310, 2273, 2243, 2188, 2172, 2255, 2328, 2328, 2379, 2460, 2403, 2287, 2295, 2333, 2284, 2277, 2348, 2333, 2238, 2215, 2252, 2257, 2248, 2255, 2274, 2344, 2440, 2452, 2376, 2334, 2356, 2362, 2311, 2246, 2249, 2348, 2421, 2349, 2237, 2257, 2354, 2354, 2272, 2242, 2265, 2258, 2222, 2210, 2232, 2262, 2269, 2211, 2130, 2136, 2209, 2211, 2152, 2142, 2143, 2103, 2145, 2287, 2303, 2168, 2131, 2253, 2365, 2424, 2441, 2335, 2169, 2111, 2110, 2077, 2147, 2334, 2399, 2291, 2207, 2182, 2114, 2054, 2086, 2135, 2144, 2161, 2217, 2267, 2240, 2173, 2216, 2350, 2348, 2212, 2223, 2394, 2458, 2383, 2337, 2321, 2306, 2327, 2304, 2192, 2159, 2224, 2211, 2172, 2240, 2256, 2149, 2156, 2266, 2199, 2041, 2073, 2191, 2203, 2229, 2347, 2429, 2473, 2529, 2483, 2314, 2197, 2180, 2170, 2181, 2226, 2212, 2136, 2117, 2182, 2251, 2272, 2262, 2289, 2373, 2417, 2345, 2243, 2202, 2184, 2159, 2198, 2312, 2389, 2332, 2187, 2091, 2113, 2198, 2270, 2310, 2329, 2326, 2286, 2212, 2181, 2259, 2352, 2322, 2252, 2276, 2303, 2230, 2174, 2206, 2227, 2205, 2171, 2096, 2049, 2148, 2276, 2264, 2218, 2242, 2225, 2178, 2249, 2354, 2312, 2218, 2202, 2195, 2151, 2125, 2148, 2250, 2419, 2458, 2281, 2114]
3321B114RN3k3l7j7j5LL0L1lm8qJ00L6j73j35J20J33l1M4J60k2j71j7R5k7r0j0L5J6l2q9l1
3317B000J42J68Kq9m0j1n2o4k0L6O3N4L9Qk2K5Q7J9j13j02J9R5J14N6p8j02J2Kj35j23J1L3
3312B034J0N1O2M1M8Rl1L3O2l2k5Q4M0n5RL4q2q8J4%k2K3n3j49k0J28O8L1J04O4n8p4n0m0
3307B170J5K7l7k4J7m9k8J31J13p8j03Llk5M7P9M8Pn5o2J3pr9k3J20P5k9l8n4l4R5J08j7Q
3302B311N8j22j80Q1J67o0j15L5K6l6L7N4j7L2J11M3o0q1n8%L4j6j1P6L0r0l7N1j2l8L0k5
3297B218j20m1L4l3l4N6M3k0qjk8oK4M5J10J08j5q5l4ppM4N7jl6l8k1P2J31K9r3r2m2K3R5
3292B327M7o1oP0l9j22k4%o9J3J11pj01K5J14K5o5o3j7K5J1k6QJ0p6n3Q3M3r8l1R1J8m4N2
3287B171P2lJ7N2j7n1j3LN1J16L5r9p4j2o0n2O7J03K9OL5M6L1j8p2m7J6J4LK8j4q9l3O6J7
$$ y = [2114, 2123, 2176, 2153, 2116, 2099, 2084, 2087, 2117, 2148, 2145, 2097, 2089, 2189, 2225, 2052, 1917, 2037, 2170, 2139, 2183, 2343, 2321, 2150, 2133, 2228, 2201, 2111, 2101, 2136, 2152, 2120, 2031, 2000, 2142, 2310, 2312, 2223, 2183, 2172, 2120, 2056, 2036, 2072, 2135, 2189, 2228, 2236, 2214, 2239, 2326, 2345, 2232, 2130, 2149, 2244, 2358, 2414, 2336, 2234, 2246, 2248, 2113, 1990, 2001, 2034, 2044, 2095, 2157, 2198, 2246, 2255, 2224, 2257, 2319, 2287, 2262, 2346, 2386, 2331, 2340, 2374, 2292, 2204, 2218, 2218, 2196, 2219, 2166, 2017, 1997, 2125, 2193, 2224, 2328, 2392, 2334, 2260, 2210, 2170, 2185, 2212, 2175, 2151, 2168, 2119, 2091, 2222, 2335, 2257, 2154, 2157, 2154, 2129, 2176, 2255, 2303, 2310, 2255, 2193, 2206, 2199, 2100, 2077, 2197, 2272, 2243, 2205, 2151, 2117, 2212, 2320, 2303, 2311, 2369, 2247, 2067, 2148, 2315, 2255, 2140, 2175, 2201, 2165, 2202, 2256, 2239, 2271, 2382, 2425, 2365, 2284, 2226, 2226, 2260, 2244, 2233, 2309, 2339, 2249, 2212, 2263, 2251, 2213, 2243, 2218, 2098, 2057, 2091, 2058, 2024, 2080, 2123, 2103, 2095, 2094, 2066, 2060, 2084, 2129, 2239, 2347, 2332, 2247, 2213, 2206, 2199, 2243, 2300, 2299, 2263, 2225, 2204, 2276, 2407, 2436, 2343, 2251, 2209, 2232, 2327, 2374, 2313, 2307, 2377, 2338, 2216, 2192, 2192, 2123, 2136, 2247, 2240, 2139, 2164, 2278, 2303, 2238, 2175, 2158, 2183, 2194, 2168, 2176, 2186, 2110, 2057, 2140, 2183, 2085, 2054, 2145, 2163, 2119, 2171, 2243, 2240, 2257, 2309, 2292, 2241, 2228, 2231, 2282, 2398, 2433, 2334, 2260, 2248, 2188, 2136, 2203, 2306, 2335, 2341, 2376, 2422, 2453, 2435, 2363, 2316, 2332, 2346, 2349, 2377, 2363, 2274, 2241, 2307, 2324]
3282B324p2kQ6j5j40n5R9P6k3pL7j9r3j00q3k5P2R7L1jrm9k5M9K1n3nO0L0J1J2k6K2J38O2
3277B425j19q0M4l1j04J2O4j0LL8m1l8R3R6m4j10q5l5N9Q4k2m3P0N8j00j13N3J38P1lk7p0
3272B233j00l2P2N9k3MP3K0m9oK9PL1K1p4k9J28O7j43j61o2m4J3J16O4j0P1R2m5q2jml6rj5
3267B175j8N3K4j01o6M9J7j5P4P4k6j6K4l6m1M5L7k2j2l8j06l6Q9R1L5Mo9j13k5O1N4N9Q0
3262B305J3m9K8J39R1p7j39j3P8j0j02n5j4k9K2P4Lm5rl0l9J04J42r6k63j32J0J8N4J12P6
3258B167K1L4L3LQL3L1j6q9j11m7OOJ9M9O3O9L1o2r5n4l2J8J08N5r3k4J50M9j53o4J35R8o3
3253B283j12m9M7P2J6K8Q8J1q8k2k1j82j25J56J73m6q1J5Nj0Km0RJ33O0q2J5J10n1j26L5Q7
3248B310oQL0p0q3J0j5j05o4M5R6O4m4j18k5R8N1n7l4N1O1Ok2LJ5l3n6JK6kL9R9N1pK3J8n3
$$ y = [2324, 2252, 2250, 2336, 2321, 2181, 2126, 2225, 2301, 2278, 2271, 2308, 2289, 2196, 2096, 2013, 1988, 2060, 2157, 2188, 2187, 2178, 2129, 2104, 2153, 2174, 2121, 2116, 2176, 2206, 2217, 2229, 2203, 2225, 2363, 2425, 2306, 2226, 2270, 2239, 2135, 2147, 2211, 2201, 2204, 2242, 2201, 2163, 2256, 2352, 2308, 2198, 2113, 2078, 2137, 2221, 2199, 2156, 2226, 2284, 2184, 2071, 2124, 2262, 2333, 2330, 2303, 2233, 2133, 2101, 2173, 2232, 2209, 2213, 2286, 2306, 2257, 2251, 2280, 2287, 2318, 2339, 2265, 2236, 2364, 2431, 2288, 2127, 2065, 2021, 2034, 2150, 2214, 2204, 2275, 2367, 2322, 2240, 2239, 2235, 2199, 2190, 2175, 2157, 2210, 2234, 2133, 2067, 2116, 2133, 2118, 2192, 2266, 2240, 2224, 2248, 2212, 2171, 2216, 2253, 2231, 2219, 2181, 2075, 2039, 2128, 2219, 2254, 2258, 2189, 2076, 2051, 2112, 2166, 2225, 2305, 2318, 2269, 2297, 2436, 2527, 2450, 2311, 2298, 2376, 2366, 2264, 2209, 2195, 2166, 2188, 2262, 2265, 2220, 2211, 2181, 2142, 2246, 2388, 2292, 2029, 1897, 1907, 1925, 1979, 2091, 2167, 2188, 2222, 2255, 2258, 2266, 2299, 2330, 2314, 2225, 2114, 2067, 2073, 2079, 2098, 2147, 2210, 2279, 2310, 2248, 2153, 2099, 2067, 2085, 2193, 2248, 2155, 2131, 2281, 2330, 2177, 2113, 2248, 2346, 2283, 2171, 2122, 2169, 2241, 2257, 2285, 2373, 2384, 2296, 2274, 2253, 2071, 1946, 2102, 2275, 2229, 2148, 2163, 2168, 2158, 2160, 2120, 2129, 2262, 2322, 2240, 2255, 2365, 2314, 2188, 2223, 2310, 2304, 2312, 2342, 2272, 2189, 2199, 2184, 2079, 2015, 2060, 2156, 2220, 2176, 2058, 2033, 2131, 2182, 2125, 2091, 2142, 2203, 2209, 2187, 2190, 2205, 2172, 2116, 2117, 2143, 2141, 2180, 2279, 2330, 2323, 2346, 2364, 2311]
3242B311m4K9N0J9l5n2J4L9q8j47LR3Rk1K0%J3Q3M1j4L6k3j60k4K09P8j89j42M2P5M1Nl7K
3238B236M2l6n5N3L9n3mL5m4k2O3ql5R7P3q1m4L4n8k6J50R7o5j9J8j00j14l7m1QQ9k8j23M3
3233B084J05n9k9J38N3p5K9O5p4j01j1K5O7Q9ml8J4q2j66KJ22k7j07lK8QN6L6mP7O9p6l2J31
3228B310N9o1L6O4p5n3O0m4j75p5M6N4O7O0j5k8J8J0k4m5p0k9P2N8l4j3M2Jj1M8J5p6n4J0
3223B148J3J3L5K3j0l5m5nP0O2k8q5o3lJ1o0p3Q3J82N4p3k8Nl8k2J2j1L3R9K8o8k6J5j4J8
3217B217N0k6l8O6N2o8n4M4M1j5l1m0m0k2l5o0k6M6R8R0mj12q6J0K0j7J7N8K6j0L0Q5N6m7
3212B275p2J7N2k4o5m5n1k4O3O3J6O6P4n9r4K6O1N7J40Q8j26j27M9M5l6mm1j24J0J34l7j30
3208B177P5J37o8r1R3J08k5l3K1k9j05o5L5J6j01r7K8L1o2j2O0j9k2J24J32LJ5O7j4o5n0j14
$$ y = [2311, 2267, 2296, 2346, 2365, 2330, 2278, 2292, 2331, 2243, 2096, 2099, 2192, 2201, 2180, 2200, 2200, 2213, 2296, 2337, 2323, 2359, 2336, 2176, 2152, 2361, 2439, 2250, 2108, 2150, 2225, 2266, 2271, 2234, 2236, 2278, 2242, 2187, 2240, 2279, 2226, 2222, 2257, 2213, 2191, 2254, 2246, 2211, 2308, 2381, 2300, 2256, 2290, 2232, 2206, 2356, 2453, 2388, 2369, 2387, 2287, 2173, 2136, 2095, 2103, 2192, 2164, 2041, 2084, 2189, 2130, 2101, 2239, 2292, 2217, 2246, 2311, 2237, 2136, 2125, 2150, 2217, 2306, 2302, 2264, 2278, 2196, 2030, 2032, 2154, 2127, 2020, 2017, 2045, 2053, 2109, 2145, 2141, 2218, 2287, 2211, 2179, 2310, 2369, 2308, 2344, 2408, 2333, 2280, 2340, 2296, 2121, 2046, 2092, 2146, 2213, 2273, 2258, 2230, 2248, 2258, 2234, 2189, 2119, 2090, 2162, 2220, 2186, 2173, 2215, 2216, 2205, 2253, 2268, 2192, 2138, 2148, 2161, 2174, 2209, 2232, 2222, 2187, 2142, 2137, 2207, 2269, 2241, 2156, 2093, 2090, 2101, 2041, 1968, 2051, 2233, 2287, 2214, 2186, 2191, 2153, 2131, 2143, 2132, 2165, 2264, 2292, 2224, 2198, 2213, 2199, 2217, 2267, 2241, 2203, 2269, 2321, 2253, 2199, 2243, 2284, 2269, 2238, 2198, 2158, 2136, 2101, 2041, 2015, 2061, 2159, 2249, 2245, 2133, 2047, 2057, 2077, 2060, 2077, 2135, 2161, 2151, 2181, 2266, 2322, 2275, 2203, 2220, 2272, 2248, 2183, 2138, 2087, 2063, 2126, 2189, 2205, 2271, 2345, 2286, 2192, 2218, 2279, 2336, 2476, 2564, 2438, 2311, 2360, 2405, 2369, 2365, 2324, 2200, 2210, 2344, 2307, 2177, 2252, 2389, 2321, 2230, 2323, 2431, 2406, 2373, 2394, 2365, 2260, 2195, 2230, 2246, 2145, 2048, 2076, 2107, 2045, 2033, 2093, 2074, 2052, 2176, 2308, 2311, 2326, 2393, 2379, 2314, 2264, 2150]
3203B150j06P3J24m3r4RO2Q4P2p7j74l4J13R4N9L9k2j3J5r8j64nR9J1k7jn9n0O5K0j08j0J58
3198B162R0m9k9M2L0n7j37j12PK7n2PJ73J73J6o2j0L1l2j19o0J17J92J12K5l9j08r2kM3O2
3194B349P1j5r7j8M2o7j17j6K1j4K6M2lJ6K6n3m2N7J8m0P1R8q2j36k0MjQ7Q2l2k6M4K7J4K4
3188B340m8j01o4n4k1J22J67K2m6K8M7K3Qp1j01OK5p8k0R5l8j88n5J02O9Pj0lQ2J00p2j24
3184B149Q9J44o7j37l9n5o2R8J32o0j34J5J21Q7L8K1Jm5r5p8JN9P8P4J9m1j6J6k9o4qP1J04
3179B387M9q1j04L9R8rn0Qk1p1k3j7p3j0Q0K1l5L1L4n4n5pj5jM7Pn3kO1J8k8K4J00O9n5r7
3174B212J3Q7J0p2m3QK2Nl4k4L6Kj03o1R3J23L6m3j07q7N3J01mk6J7o4r0Q0J31m4j03OL2J1
3169B173O6P6K9K6j4j14j09j2K3K1K8LRM2k8p7O9J37m7j37MM7k4L4J06N0K0K0q3j32j2N7%
$$ y = [2150, 2044, 2117, 2241, 2198, 2104, 2113, 2175, 2259, 2331, 2254, 2080, 2046, 2159, 2253, 2312, 2351, 2329, 2316, 2331, 2233, 2069, 2064, 2163, 2174, 2147, 2146, 2087, 2037, 2102, 2122, 2014, 2004, 2162, 2252, 2203, 2174, 2216, 2246, 2189, 2052, 1940, 1947, 1974, 1922, 1929, 2102, 2275, 2291, 2229, 2219, 2250, 2218, 2099, 2039, 2156, 2348, 2460, 2485, 2446, 2338, 2246, 2244, 2287, 2349, 2420, 2405, 2308, 2290, 2332, 2265, 2148, 2132, 2153, 2139, 2165, 2207, 2204, 2220, 2246, 2193, 2151, 2208, 2226, 2186, 2257, 2355, 2273, 2137, 2117, 2121, 2120, 2207, 2289, 2257, 2231, 2275, 2302, 2316, 2340, 2292, 2191, 2127, 2073, 2052, 2174, 2341, 2363, 2317, 2345, 2392, 2415, 2423, 2352, 2251, 2257, 2282, 2204, 2184, 2279, 2241, 2053, 1998, 2100, 2169, 2176, 2166, 2163, 2245, 2345, 2273, 2149, 2238, 2382, 2315, 2178, 2139, 2084, 2022, 2120, 2252, 2192, 2058, 2073, 2194, 2281, 2319, 2340, 2341, 2296, 2201, 2123, 2124, 2183, 2261, 2335, 2354, 2313, 2297, 2313, 2284, 2220, 2212, 2283, 2387, 2436, 2355, 2251, 2290, 2388, 2379, 2329, 2337, 2316, 2245, 2222, 2205, 2132, 2122, 2202, 2223, 2188, 2219, 2253, 2199, 2144, 2137, 2122, 2121, 2168, 2175, 2122, 2120, 2181, 2199, 2171, 2195, 2295, 2364, 2309, 2212, 2225, 2312, 2322, 2250, 2207, 2215, 2237, 2242, 2208, 2184, 2220, 2222, 2119, 2058, 2151, 2274, 2310, 2267, 2160, 2073, 2126, 2227, 2223, 2197, 2214, 2150, 2060, 2140, 2271, 2227, 2124, 2130, 2162, 2173, 2239, 2315, 2344, 2370, 2356, 2242, 2133, 2121, 2144, 2165, 2193, 2196, 2205, 2247, 2219, 2142, 2211, 2348, 2301, 2164, 2168, 2215, 2191, 2225, 2331, 2381, 2401, 2421, 2338, 2206, 2194, 2251, 2251]
3164B251k2lRM9N4l4o5kPl1l5o6o8K8M9m5k5N7jj4J35J27n8o9L5Mj5M3k4p8Q0J47l0j24o0
3159B206l9K8J39Oj95m7J94J05q2n5Nk3j2L5M5N2M3j9p1p3m2M2J01M2m1k4K6L3J3n7j22q4
3154B129k9qJ09K24P9j49j43l8k2L2J03K2q0n3k7oQ5O8q7q5O3O8j9l2n6o8L8J01N9R3O8j50
3149B289k05M4J00j03o1J47Q5p1QR1k6j30n9Q0J21rj47m9J35J10k8p3q9r6j2N3J5j1pj8M0
3145B124J15L7p0l8om2%N1J1K9Q4j7r5K5N0j00j05K4L5K9N8n4j25P2J97K6r2j7J4ML7Lk5N2
3140B291L6p2KJ20Kr5J4K3r7l8R4N0m2o9q5k1O9Mm9O3O8r2o4Q6L8n0K2K2n5J3Q6K0J0M5k6
3135B323l2O7j6j50j2J53P2j1Oo4r8J5K9o1lO9k4n0N1L5m2lJ9l6j6M9N3O7O3j7k9L8j5j09
3130B321n3J7J2L4Kj24r8O2O5j0J8j6j03j1O9m4l8J31P6p7jK6j51j02J47J03r9n9O2N4L6K0
$$ y = [2251, 2229, 2226, 2235, 2284, 2338, 2304, 2239, 2237, 2244, 2213, 2178, 2112, 2044, 2072, 2121, 2076, 2051, 2108, 2107, 2093, 2228, 2355, 2297, 2228, 2263, 2267, 2252, 2295, 2271, 2193, 2273, 2420, 2390, 2266, 2206, 2167, 2195, 2334, 2340, 2145, 2098, 2292, 2397, 2315, 2260, 2265, 2242, 2230, 2265, 2310, 2362, 2405, 2386, 2315, 2242, 2200, 2242, 2343, 2385, 2344, 2320, 2346, 2379, 2392, 2335, 2213, 2129, 2100, 2092, 2201, 2425, 2504, 2355, 2212, 2174, 2152, 2184, 2287, 2309, 2229, 2176, 2149, 2143, 2228, 2296, 2209, 2124, 2187, 2255, 2236, 2204, 2148, 2080, 2118, 2219, 2278, 2371, 2439, 2289, 2084, 2128, 2228, 2125, 2064, 2211, 2296, 2225, 2233, 2324, 2298, 2168, 2109, 2189, 2310, 2301, 2154, 2105, 2240, 2350, 2322, 2249, 2160, 2064, 2052, 2105, 2120, 2109, 2102, 2084, 2124, 2239, 2276, 2206, 2168, 2162, 2120, 2120, 2171, 2182, 2211, 2295, 2278, 2183, 2208, 2258, 2158, 2053, 2077, 2112, 2141, 2199, 2145, 2020, 2092, 2289, 2315, 2223, 2206, 2220, 2224, 2261, 2264, 2239, 2291, 2327, 2255, 2257, 2377, 2379, 2284, 2298, 2321, 2224, 2186, 2280, 2330, 2288, 2219, 2134, 2113, 2182, 2186, 2137, 2200, 2268, 2176, 2112, 2198, 2236, 2186, 2208, 2230, 2175, 2188, 2274, 2294, 2304, 2349, 2323, 2291, 2358, 2342, 2192, 2180, 2333, 2405, 2394, 2400, 2336, 2238, 2253, 2282, 2221, 2218, 2287, 2263, 2213, 2264, 2299, 2257, 2254, 2273, 2237, 2221, 2270, 2323, 2390, 2453, 2436, 2407, 2445, 2430, 2321, 2268, 2285, 2297, 2331, 2333, 2209, 2111, 2173, 2238, 2228, 2246, 2230, 2127, 2116, 2185, 2141, 2103, 2234, 2310, 2233, 2232, 2258, 2107, 2005, 2152, 2255, 2156, 2097, 2159, 2213, 2249, 2269]
3125B269j8O0J05q6j93j5Q3j8j3M2m1o5K6j1p3M2R8m9r4M0Q5J0k7k2J7N5Mo1NO2m0j30n8O0
3120B049J05P3ol4kl5p7K3J04mr5NJ09Q3J1n2p8m4j8k9K0O7Nk5O8R5J6nK1k6q5q4l5N4R5R
3115B278m6L2N2k2RO9k3r1k2k1n7N7J33k0j46q2nJ9O0N9K3M7N0l4p2j6Rj0k3k6J1O9K2n6j7
3110B210M6K4Kj5o3j7R5M9n9m1o7j62l3J81J17rP0N8j25j16K8Lm7J3l0j16j5J01R7J09Q1q1
3105B288j08M7N7m4%M3l1j7L2m6m7P0Lj31JJ71P1n3l4n4r7l4J8K0O4M8n9n5M5L3k0k8p8j03
3100A972K2J24P1J4k5j13j00L7R1P2R3J9j47j13P2J14O0Q8P7m3r9l1L4J5n5o8RL4o2j01k5
3095B036K8O5R5Np7M3J24k5q6N1L6j01k8R0Lp7l7n3m9P7J02k7n0J6J0J0L2l5o4O2J31K9q0
3090B256j29j14K3J39N5n8j9N4M3qp0o7J1%q5jJ38O1m0K2Kr9OJ45K3r1ML9k7J8K9r3j14j3
$$ y = [2269, 2251, 2311, 2416, 2330, 2137, 2122, 2205, 2187, 2174, 2216, 2175, 2110, 2136, 2125, 2052, 2094, 2192, 2143, 2049, 2089, 2174, 2184, 2157, 2135, 2152, 2207, 2211, 2150, 2155, 2217, 2177, 2047, 1989, 2049, 2154, 2227, 2221, 2187, 2185, 2150, 2073, 2096, 2200, 2196, 2101, 2106, 2215, 2298, 2309, 2257, 2179, 2135, 2117, 2088, 2108, 2175, 2180, 2155, 2223, 2318, 2334, 2329, 2350, 2324, 2239, 2155, 2120, 2174, 2269, 2278, 2232, 2264, 2316, 2294, 2303, 2372, 2349, 2258, 2236, 2215, 2158, 2215, 2348, 2328, 2182, 2100, 2095, 2114, 2174, 2233, 2256, 2303, 2353, 2319, 2247, 2231, 2240, 2230, 2207, 2181, 2192, 2261, 2283, 2227, 2210, 2256, 2280, 2282, 2267, 2204, 2187, 2282, 2331, 2272, 2231, 2164, 2002, 1969, 2150, 2267, 2258, 2328, 2386, 2261, 2145, 2173, 2176, 2129, 2142, 2112, 1996, 1981, 2082, 2179, 2288, 2369, 2288, 2180, 2227, 2284, 2240, 2240, 2283, 2252, 2235, 2267, 2221, 2174, 2244, 2247, 2116, 2117, 2288, 2359, 2306, 2272, 2218, 2121, 2087, 2105, 2125, 2189, 2237, 2178, 2123, 2168, 2201, 2181, 2153, 2075, 1972, 1994, 2118, 2189, 2203, 2178, 2065, 1965, 2002, 2093, 2165, 2258, 2277, 2130, 2017, 2089, 2203, 2263, 2351, 2428, 2385, 2286, 2255, 2289, 2304, 2249, 2181, 2190, 2224, 2162, 2061, 2036, 2064, 2129, 2224, 2229, 2152, 2195, 2319, 2294, 2208, 2259, 2295, 2194, 2166, 2256, 2259, 2182, 2145, 2092, 2043, 2120, 2222, 2195, 2145, 2161, 2171, 2181, 2213, 2178, 2114, 2176, 2307, 2336, 2256, 2127, 2013, 2036, 2175, 2230, 2172, 2153, 2207, 2250, 2242, 2172, 2105, 2116, 2116, 2031, 2030, 2168, 2229, 2189, 2211, 2213, 2114, 2120, 2265, 2288, 2197, 2201, 2240, 2213, 2231, 2260, 2167, 2053, 2040]
3086B040Jj2J5k8l9P5P7n0k3R6P0L3O7j6j18m7J0k5M3Q5m4l3J72J37j00r7L9Jn7K5O3pp3r6
3081B184n0K2QpN5K4p0L7J45m1j47P8J53o4j07J7k3n7O4L7j27j20mP0J55J19j06j48O8J05
3076B270m5k8P1M5L2M3l0j4J13L5j53q0R1L6o3k3qm5pK1k8n3j2K3K5J0nrrM1J14K5j64q8J57
3071B288P9j83j20O8J4j3R1oj59k8Q1n1l9J21N1p7J7O0l7jO3k8j7J19L9j47j15r%L8O8%mO5
3066B228J2o2j2Pl4K5P1k2q1l6NO2Q6n0j46JJ17K5oP8P5K7Oo0r0j0mn4O3J74P2qJ7o5j27l
3061B281J5j16l3J51O8p6k6K2mL5M3k0mrj31j07Q5J29M8K4m2j07J2Q8l6m4P7Qj18n8m0q0O0
3056B095J33n2q5O9j2j13R9J64j26j90L6N7j9P4O7q0l0Q5Pm7J8l0j02KJ07M8p8j56q8J10J67
3051B130L1%N0n8j17K4M6p2J7J55M5n7J7Ro1rJ1p1m3N8P3O2Oj08m5J39N8j16jJ19j9o5L0n2
$$ y = [2040, 2041, 2029, 2044, 2016, 1977, 2052, 2129, 2079, 2056, 2152, 2222, 2255, 2322, 2306, 2188, 2141, 2151, 2126, 2169, 2254, 2210, 2177, 2349, 2486, 2386, 2289, 2328, 2329, 2272, 2297, 2360, 2353, 2280, 2184, 2134, 2156, 2164, 2157, 2212, 2236, 2166, 2203, 2348, 2307, 2160, 2238, 2391, 2327, 2220, 2237, 2214, 2157, 2221, 2258, 2131, 2011, 2007, 2077, 2232, 2351, 2245, 2097, 2165, 2270, 2225, 2197, 2268, 2313, 2345, 2388, 2358, 2344, 2457, 2492, 2339, 2259, 2350, 2386, 2323, 2300, 2292, 2247, 2240, 2261, 2233, 2180, 2168, 2191, 2216, 2226, 2221, 2212, 2203, 2244, 2358, 2383, 2219, 2131, 2288, 2367, 2184, 2064, 2132, 2146, 2133, 2224, 2218, 2059, 2031, 2112, 2061, 2022, 2143, 2194, 2117, 2134, 2194, 2157, 2156, 2219, 2191, 2174, 2293, 2332, 2185, 2070, 2061, 2061, 2099, 2167, 2167, 2163, 2228, 2240, 2178, 2166, 2173, 2139, 2164, 2235, 2213, 2132, 2096, 2101, 2163, 2249, 2199, 2053, 2054, 2171, 2196, 2190, 2268, 2343, 2370, 2376, 2316, 2226, 2216, 2212, 2158, 2221, 2395, 2467, 2459, 2476, 2411, 2284, 2281, 2296, 2180, 2147, 2298, 2366, 2290, 2264, 2286, 2282, 2317, 2360, 2340, 2336, 2327, 2196, 2089, 2174, 2303, 2351, 2375, 2333, 2226, 2238, 2326, 2290, 2246, 2323, 2331, 2213, 2155, 2115, 2035, 2095, 2228, 2176, 2091, 2160, 2148, 2035, 2134, 2298, 2172, 1982, 2018, 2075, 2056, 2130, 2197, 2117, 2087, 2172, 2179, 2132, 2150, 2120, 2018, 2020, 2127, 2175, 2097, 1941, 1853, 1963, 2130, 2161, 2161, 2211, 2153, 2036, 2060, 2106, 2034, 2051, 2206, 2251, 2194, 2211, 2220, 2159, 2150, 2161, 2090, 2047, 2105, 2178, 2240, 2246, 2138, 2093, 2232, 2290, 2174, 2173, 2292, 2273, 2208, 2238, 2186]
3046B186j23L5R1oN6J17j8n4K8p2j31O3J06r0r9Nk8J8J39J5j01O7J08q6m4J04o6k11kJ30K4
3042B161M0J33K3r6j8P0L8n6j10k1J25J12j5m6oJ9J2q0j40K5J66%j37rM9J0J47J72j03j70
3037B295M4J0j23K9P6j46r4J62R9m7K7m6k30p7J65J19O0P6p3j36Q5J41n5p7Oo1n0P2K7n1J2
3033B239k7j16K3J30j5n3Q2K6j06n3k5p6K6J25L9K8J15Pj63j29l7jM8K2n7J8J11K8MP7k5j41
3028B124j1O5n3l4P8J3k3P7Qj37m3P7J8K2P8k0q0N1R4j7r6j24n0J36J08j44j15J43R2r1J6
3024B162J08oK4J49L6q6QL4q4j14q1j8J22J12q6p7R7L0r9J3R6lk6l4j45r9Q2P9N2J71J24q4
3019B457q3j1j02p8Q6O5j3M2k3j43kJ44L3j0N9o6j46M5J01m6pO3o4m8J16J9j10L8Q2j08j02
3014B188L6NL4J60K5j50j0J06l3r1j2LO1J23l9j79m7L9l8k8op2L2J89N3r5L8J20K2mm8j38
$$ y = [2186, 2063, 2098, 2189, 2183, 2239, 2356, 2338, 2284, 2312, 2240, 2109, 2172, 2278, 2188, 2089, 2094, 2066, 2084, 2223, 2238, 2137, 2204, 2312, 2226, 2182, 2286, 2220, 2009, 2007, 2137, 2161, 2201, 2334, 2357, 2261, 2243, 2313, 2351, 2295, 2185, 2164, 2289, 2401, 2386, 2340, 2334, 2353, 2365, 2285, 2145, 2170, 2336, 2336, 2199, 2190, 2239, 2249, 2396, 2568, 2465, 2295, 2339, 2349, 2226, 2255, 2331, 2185, 2091, 2253, 2352, 2305, 2332, 2286, 2056, 1979, 2144, 2263, 2323, 2399, 2326, 2190, 2275, 2416, 2361, 2284, 2290, 2229, 2179, 2251, 2278, 2227, 2239, 2212, 2096, 2119, 2249, 2234, 2181, 2263, 2289, 2183, 2130, 2105, 2029, 2055, 2180, 2219, 2247, 2362, 2369, 2206, 2077, 2040, 2039, 2087, 2109, 2052, 2070, 2181, 2209, 2213, 2290, 2265, 2124, 2113, 2178, 2125, 2091, 2169, 2182, 2159, 2236, 2244, 2107, 2064, 2141, 2159, 2181, 2259, 2239, 2159, 2210, 2304, 2287, 2191, 2067, 2017, 2153, 2261, 2117, 2002, 2145, 2237, 2146, 2162, 2270, 2264, 2288, 2437, 2473, 2387, 2395, 2429, 2345, 2231, 2150, 2132, 2254, 2366, 2280, 2203, 2300, 2330, 2231, 2244, 2340, 2337, 2311, 2277, 2132, 2033, 2115, 2194, 2246, 2417, 2541, 2457, 2374, 2363, 2261, 2183, 2269, 2334, 2321, 2363, 2340, 2197, 2195, 2339, 2372, 2362, 2421, 2355, 2209, 2254, 2355, 2309, 2302, 2365, 2301, 2253, 2369, 2388, 2278, 2316, 2398, 2290, 2188, 2224, 2229, 2263, 2423, 2448, 2298, 2288, 2394, 2361, 2270, 2258, 2261, 2322, 2445, 2406, 2227, 2180, 2219, 2181, 2153, 2147, 2075, 2107, 2296, 2349, 2254, 2292, 2412, 2434, 2430, 2382, 2244]
3010B244N0K87P2j99k2J30o8j49J4M8l3l5k3k2k8q7o2R4P2r0J3J81L6j01L5N7q9n4L4l9l3
3005B233Q3O0j9k7n8k2J07Pj83j5J98Lj70kP1l3J2O3j4M8J21q4k23r3o8j22P7K44J00k7Jj9
3000B249J8J19L4q0J7J7j50p2J42Q2n9n4j04j27M2R7l6J8J37J4p0K1m7j59mJ30N2M7N9j01
2996B232j20Q1R5l6J0O0NM0L5j10n7J17j6j82pR9m6rJ41M2n2K4m0j34L8J48k7j11l6j7L5J14
2991B316qj12K0M6q8j0J49O7l4l5j16j00J13J12r3k4J62N0j21r3j0J15K21L2k15p0J19j9r9
2987B275L0No5N3P3n2J8Q3j19k01oN7j4M2O7lL5N6o8o0Q6P0NM0k3j01M0J08p2q2J26J16n7
2982B462p1k0j0M4L6n4l4J6k2K7R9m6j51mM0p5k3N5l8K2J83J8j75JJ15o9j16k6o7OK05R6j27
2977B297l3P7k5j4K9j24j33R0Q2o2L3Q4r4j17mm0k1J34Q9n2J8Q9J6J4nj19n8P7k8p5J03N2
$$ y = [2244, 2294, 2581, 2653, 2454, 2432, 2562, 2494, 2345, 2359, 2407, 2374, 2339, 2316, 2294, 2266, 2179, 2117, 2211, 2283, 2193, 2206, 2387, 2423, 2322, 2357, 2414, 2325, 2271, 2305, 2266, 2233, 2316, 2376, 2357, 2330, 2272, 2250, 2357, 2364, 2181, 2166, 2364, 2367, 2197, 2195, 2266, 2233, 2245, 2308, 2294, 2342, 2463, 2379, 2156, 2063, 1995, 1873, 1950, 2194, 2294, 2267, 2268, 2249, 2267, 2386, 2420, 2340, 2357, 2374, 2224, 2152, 2294, 2376, 2317, 2263, 2159, 2032, 2074, 2171, 2135, 2153, 2290, 2304, 2234, 2255, 2208, 2049, 2045, 2175, 2227, 2274, 2333, 2232, 2112, 2193, 2288, 2252, 2262, 2322, 2327, 2367, 2402, 2292, 2235, 2352, 2336, 2154, 2147, 2246, 2200, 2191, 2332, 2374, 2322, 2346, 2306, 2172, 2210, 2358, 2331, 2220, 2184, 2167, 2202, 2316, 2308, 2196, 2216, 2262, 2174, 2164, 2313, 2380, 2346, 2311, 2195, 2095, 2208, 2320, 2227, 2203, 2365, 2415, 2294, 2201, 2191, 2306, 2527, 2559, 2344, 2274, 2393, 2374, 2275, 2305, 2310, 2245, 2298, 2371, 2319, 2337, 2420, 2301, 2100, 2094, 2151, 2137, 2179, 2246, 2243, 2278, 2334, 2266, 2206, 2292, 2362, 2367, 2407, 2384, 2283, 2323, 2431, 2359, 2277, 2403, 2519, 2462, 2391, 2371, 2361, 2405, 2441, 2387, 2353, 2369, 2347, 2374, 2473, 2427, 2276, 2272, 2312, 2237, 2214, 2269, 2231, 2253, 2436, 2454, 2279, 2280, 2395, 2326, 2210, 2184, 2117, 2123, 2328, 2424, 2297, 2264, 2341, 2316, 2302, 2331, 2207, 2074, 2164, 2246, 2184, 2217, 2301, 2207, 2090, 2086, 2046, 2025, 2159, 2248, 2196, 2214, 2303, 2319, 2333, 2328, 2209, 2151, 2228, 2200, 2125, 2228, 2280]
2973B280j70o1J34L9j7P3j2n6J11M7j72j5J88qj34N0Q4j7K4l0j63l1J30J4l1Q8M3l1K5l6q9
2968B257Q3N7k14j13J72J2j86%O9m2J12J70j46j66J94J66j50j50j1J2Q6O1j32j14N3L4O2J86
2964B362Mj94L4J49j05p9J69O6n0J04j1k71o5J74k6j11O7Pq0J00R6r3j4P7n5nJ11n8n4K29
2960B478J06j76P2K90nj02J17j8k26l5M7j07K0J78qq3M6n6j28P3N4j54m9M9j56j44J21J16
2956B320J5R1K7r2L7M0j69k0K53N8j53QM1p4M7N9j64r8R0n2r3J16J1j58R3J67j48r2J85J2
2951B357j55K8l2j68J51K58j76j98K23J40j57kR5j16o4J14ro6Q4N2j9P9lj79o1O3k5L4J36
2947B384l7r0J17O7j24%R3o2j6J46K2j06l7q5j08Q0P6j02K0J56k6m3J58L5j48K7R6j01q7L
2942B308o4N0J85o2j65J42J07k23q5J36o4n7K29R5j26P3Q6j99j01R4q3l4K82J04k38n6J21
$$ y = [2280, 2110, 2049, 2183, 2222, 2205, 2278, 2266, 2210, 2321, 2368, 2196, 2181, 2369, 2361, 2227, 2277, 2361, 2344, 2368, 2338, 2175, 2144, 2274, 2288, 2257, 2345, 2388, 2357, 2382, 2346, 2257, 2340, 2397, 2183, 2070, 2242, 2254, 2068, 2068, 2137, 2095, 2207, 2377, 2231, 2065, 2259, 2425, 2275, 2125, 2114, 2126, 2212, 2273, 2141, 2027, 2080, 2114, 2176, 2362, 2366, 2172, 2206, 2355, 2250, 2171, 2340, 2406, 2356, 2460, 2449, 2178, 2113, 2287, 2261, 2150, 2217, 2224, 2144, 2244, 2340, 2247, 2233, 2310, 2255, 2250, 2361, 2303, 2249, 2478, 2584, 2408, 2480, 2770, 2765, 2663, 2780, 2762, 2536, 2501, 2548, 2441, 2461, 2639, 2631, 2548, 2594, 2538, 2410, 2483, 2537, 2383, 2334, 2383, 2227, 2083, 2204, 2320, 2335, 2426, 2453, 2361, 2398, 2438, 2269, 2249, 2502, 2560, 2407, 2415, 2456, 2382, 2429, 2488, 2324, 2226, 2316, 2264, 2171, 2287, 2298, 2140, 2233, 2400, 2252, 2160, 2345, 2357, 2202, 2230, 2198, 2030, 2181, 2439, 2263, 2065, 2288, 2428, 2271, 2269, 2364, 2248, 2184, 2298, 2289, 2223, 2307, 2359, 2340, 2419, 2416, 2237, 2176, 2239, 2214, 2248, 2384, 2347, 2257, 2374, 2441, 2317, 2317, 2410, 2348, 2332, 2478, 2500, 2394, 2357, 2272, 2164, 2244, 2320, 2218, 2238, 2394, 2368, 2325, 2483, 2518, 2370, 2397, 2493, 2392, 2305, 2308, 2244, 2294, 2479, 2417, 2252, 2394, 2501, 2278, 2193, 2329, 2265, 2208, 2437, 2532, 2406, 2479, 2565, 2366, 2265, 2359, 2276, 2242, 2524, 2628, 2390, 2334, 2455]
2938B455k7JM2k13j73J94J43j07kM3j16JJ05j16n4K69R2k49q6Q8o6o0O0mM2J31p5j33J88J91
2934B564j35j27J7m4J2O3j90j69K48K29r2J7J16j57j25J60K4j11J39J23j69p4P9p5l7J23n2
2930B357j15J32O1j37M7Q1j78j3K22j01k29J61J28j92NJ46j66j16J83l8j94J59J80j12M8J95
2926B514j00j02J50l6j84Q9Q8j05J28K28j43j69Q4n7j19J96J36j51K9J48j38r5J53m7j72P5
2922B400j8k20J18L28jr1P1o6r0J24n5k52P4J73j32LK26j13k37R3j1k04K04L22j65j52K01
2919B530qj66J33N0k29M1J70k14j74J92M1j18J44J11j07J02J85j38j22R6o7j10J54O5j24P7
2915B514R4j48OJ39j47q4K45j2k38J67K10k24m9K84m7j62K14O6k91j7J47j77j13J62l7j08
2911B394J72O2j55N9O7j98pJ92j26j65J61K9j74Q4R1j66N9K36j12j29J67l9j92J92K25j02
$$ y = [2455, 2428, 2429, 2471, 2258, 2085, 2279, 2422, 2315, 2313, 2356, 2240, 2241, 2346, 2230, 2176, 2445, 2537, 2288, 2202, 2290, 2224, 2164, 2224, 2220, 2262, 2393, 2318, 2185, 2373, 2564, 2429, 2302, 2319, 2275, 2287, 2350, 2160, 1991, 2239, 2468, 2376, 2393, 2509, 2352, 2227, 2387, 2411, 2300, 2439, 2562, 2393, 2319, 2398, 2323, 2286, 2409, 2357, 2242, 2374, 2435, 2298, 2345, 2426, 2248, 2235, 2457, 2356, 2127, 2288, 2416, 2224, 2229, 2375, 2209, 2093, 2276, 2238, 2044, 2203, 2383, 2271, 2319, 2514, 2414, 2312, 2462, 2426, 2242, 2331, 2419, 2314, 2442, 2670, 2527, 2358, 2442, 2385, 2266, 2462, 2598, 2447, 2476, 2624, 2486, 2391, 2544, 2497, 2325, 2400, 2382, 2162, 2280, 2608, 2607, 2516, 2587, 2521, 2431, 2555, 2500, 2248, 2322, 2495, 2363, 2366, 2592, 2479, 2242, 2335, 2324, 2120, 2324, 2646, 2481, 2329, 2530, 2522, 2356, 2489, 2539, 2310, 2351, 2521, 2307, 2133, 2325, 2366, 2248, 2392, 2503, 2396, 2498, 2683, 2545, 2423, 2519, 2452, 2342, 2496, 2561, 2437, 2514, 2608, 2460, 2466, 2605, 2458, 2374, 2619, 2607, 2369, 2536, 2746, 2522, 2473, 2757, 2710, 2548, 2762, 2828, 2537, 2520, 2667, 2490, 2377, 2539, 2502, 2394, 2566, 2628, 2473, 2532, 2599, 2401, 2394, 2586, 2460, 2295, 2456, 2485, 2311, 2395, 2486, 2320, 2379, 2615, 2503, 2374, 2541, 2502, 2310, 2502, 2727, 2625]
2907B625L6J11k53j27K88K1k05J64P1l97j08L02K0p5J84k1j82J73J19k73m2K34n7q8J80Nj17
2903B588J20m1k54J50K33k55j19K73r8k61K81K14k83k5K31j62j24K20j10k91K12K34j61K7
2900B599J31k53r4L24K5j76J68M0k44J33K15k53n0L18j49k86L00J54l28R3L41k13k05K31l6
2896B785j92K24P6k96L5J07l28nM44q0k89L16K15l05J6K55j32l3K11j76j23M19L2m89N3K98
2892C038k47j12K73j56k34L19R2l11J40J75l79j6M76q4k56L12O9l32J98K50l56KM82j34l08
2888B901K90J1m02J85K36m09j4M82j82k86M25K2n96Q0L52l29r5M77Qj49L44l8m30K50K93m37
2885B989p1M70j09j72M22q0n70K12L69l19N1M82k58l23L89j6m15L55L11n14l8M99k34k06N71
2881C795J3m98L47K90o31o2N91k64l68M93L8m98L30L46n07L1N95k73l13N30qn35L68M06m18
$$ y = [2625, 2661, 2772, 2519, 2392, 2680, 2701, 2496, 2660, 2731, 2334, 2226, 2528, 2548, 2473, 2657, 2636, 2454, 2627, 2746, 2473, 2431, 2665, 2608, 2520, 2700, 2705, 2588, 2708, 2667, 2413, 2563, 2796, 2541, 2422, 2695, 2597, 2336, 2617, 2831, 2548, 2523, 2754, 2592, 2468, 2688, 2578, 2287, 2499, 2733, 2572, 2599, 2730, 2477, 2383, 2707, 2732, 2556, 2724, 2764, 2520, 2653, 2868, 2615, 2565, 2883, 2734, 2448, 2748, 2902, 2574, 2667, 3008, 2795, 2590, 2821, 2785, 2593, 2817, 2893, 2597, 2632, 2739, 2411, 2406, 2850, 2770, 2481, 2797, 3012, 2707, 2723, 2978, 2846, 2813, 3024, 2848, 2725, 3144, 3176, 2687, 2740, 3038, 2791, 2679, 2952, 2796, 2562, 2881, 2973, 2662, 2802, 2977, 2598, 2582, 3058, 2974, 2718, 3030, 3099, 2767, 2965, 3215, 2859, 2861, 3343, 3209, 2901, 3191, 3202, 2800, 2985, 3221, 2812, 2798, 3280, 3098, 2812, 3237, 3259, 2663, 2743, 3095, 2766, 2671, 3148, 3156, 3007, 3351, 3313, 2883, 3133, 3426, 2989, 2918, 3388, 3279, 3107, 3529, 3449, 2879, 3091, 3460, 3141, 3192, 3674, 3416, 3093, 3482, 3466, 3051, 3406, 3717, 3203, 3165, 3664, 3430, 3224, 3795, 3808, 3310, 3657, 3947, 3316, 3254, 3845, 3581, 3213, 3706, 3744, 3246, 3576, 3922, 3415, 3446, 4041, 3768, 3455, 3985, 3977, 3442, 3810, 4216, 3798]
2877C798J37N96l60l60M84m8l98N31K80o40J61O87l78k81O13j70o26M88L42n30L40O59o47
2874D678k92R32jo13O18L36q19K22R02m21k66Q88k3n69O99L93o57M83R02o26j88J102j08o16
2870F956R55M16r58M53J065o87j97J331Kn54J222N51j024O09J286p04m3J718J00n36J586Q15
2867A4362j027Q75J648o59J58K212K95m14K078J175q46J497K243o38M08K886O08m3L061J891
2864C1770l73K771L652K03J830M666J376J079N756M129J163N924P577L625P291J2513R261
2862A04213J1827K2876K5378K8081M4952N6913N8966P3023Q8238Q8181J01558J33523J50328
2860I88057J75245K43692L10606L68695M71092M87078J83631l12524n76701m93865l40239
2858A504767k76999k25242j59507j32778j22354r4755p8568p6041n8299m0312l9486l3689
$$ y = [3798, 3935, 4531, 4171, 3811, 4295, 4247, 3849, 4380, 4660, 4020, 4181, 4868, 4490, 4209, 4822, 4652, 4026, 4514, 4856, 4326, 4666, 5325, 4678, 4386, 5318, 5317, 4704, 5322, 5658, 4839, 5061, 5963, 5542, 5276, 6164, 6141, 5572, 6271, 6664, 6007, 6490, 7392, 6766, 6578, 7680, 7572, 6956, 7911, 8327, 7369, 7822, 8887, 8200, 8003, 9334, 9336, 8782, 10004, 10555, 9531, 10140, 11426, 10722, 10679, 12397, 12497, 11961, 13547, 14362, 13335, 14210, 15858, 15199, 15357, 17569, 17864, 17450, 19528, 20703, 19857, 21354, 23597, 22959, 23367, 26253, 26861, 26818, 29879, 31770, 31397, 34168, 37820, 38023, 39853, 44519, 45895, 46974, 52730, 56859, 58022, 63946, 71523, 75148, 82439, 94952, 104213, 116040, 138916, 164294, 192375, 237327, 294240, 353206, 426229, 514467, 602648, 704206, 837729, 988057, 1163302, 1406994, 1717600, 2086295, 2557387, 3044465, 3228096, 2915572, 2338871, 1845006, 1504767, 1227768, 1002526, 843019, 710241, 587887, 493132, 414564, 338523, 280224, 239912, 200426, 166737]
2856A66737k0467j9847k1425j2666r320j2778q294m033q513q203k376l711n714j061m78m293
2854B3558j980P64k409k501Q99q50k803K21M31k347o94J013j516j498R38n23j743O96M99j740
2851H415j13J240j026j029R51l45j341O93M97j314L6R68r38o51J096k41j211N88M60j034J84
2848E885Q94r19p15Q72j90r62N93M27r09J29P57p30n16P56k26q26N10K78q14J62N98p16l05
2845D033R00q7o82M41J01q48J97O18o48l38O66k52o07N91K15p75J79N69o37l14P31j00n64
2841C389M84K59o01J53M61n39k22O22j49m93M33J66n61J58L56n66k05N72j39m01M14Q5n30
2838C146J98L17n23o4N99k54m72M85K20m81J50L53l70l1M51l65m99M07J44m45K00L15m51r6
2834B934M77j84k95M72J18m89J38L01m28j88L41j21j40M36km45K58L61l72j56K48k60j99M42
$$ y = [166737, 146270, 126423, 104998, 92332, 83012, 70234, 61940, 57907, 49394, 41191, 38815, 35104, 29390, 28329, 27851, 23558, 21578, 22342, 19933, 17432, 18331, 17481, 14678, 14899, 15330, 12983, 12289, 13302, 11786, 10288, 11226, 10703, 8960, 9656, 10155, 8415, 8302, 9542, 8516, 7487, 8438, 8093, 6752, 7445, 7942, 6628, 6664, 7632, 6694, 6043, 7139, 6898, 5687, 6275, 6735, 5701, 5885, 6779, 5860, 5145, 6017, 5827, 4865, 5458, 5885, 4976, 5105, 5862, 5132, 4616, 5372, 5146, 4320, 4830, 5108, 4294, 4456, 5054, 4338, 4033, 4933, 4846, 4164, 4605, 4706, 3858, 4055, 4673, 4025, 3687, 4353, 4101, 3494, 4085, 4300, 3525, 3704, 4273, 3636, 3322, 4053, 3953, 3389, 3873, 4132, 3531, 3684, 4145, 3606, 3384, 4006, 3857, 3364, 3797, 3963, 3402, 3560, 3916, 3350, 3145, 3717, 3578, 3177, 3591, 3676, 3146, 3344, 3661, 3138, 3074, 3673, 3419, 2947, 3432, 3652, 3171, 3321, 3674, 3304, 3273, 3724, 3359, 2860, 3267, 3411, 2966, 3166, 3481, 3030, 2934, 3411, 3227, 2932, 3404, 3522, 3033, 3171, 3472, 3044, 2856, 3197, 3076, 2936, 3372, 3370, 2925, 3183, 3544, 3172, 3016, 3264, 3004, 2805, 3247]
2831C247L4m20J62J72m36KM91j27k67K80k2l82J42J54l46M8M16j01j10L11r9k90L54K10m55
2827B968p3K77k47j24M10r8m35K57K57l81o6K71k32j28M08m9m19J48J39l28J31M44j83j78
2824B769L57o6m41J57K66k28j6J84k54j08L49q6l51K29J71l65kL50j31j86J64j47k53L26K36
2820B924k62P3K94k27j78K55j13l37K16K42j76Q4K12k78j33L76M7k63J10M5l32j8J99j88j23
2816B449K04q1j64K59R4k65J06K40k30j02K75q8k32K60J76k16N9J70k33o8K70j35k67K46J23
2813B850l26MK43j69j17K71N0j15J90O7k15J01J97k19j16K25n5k12R1Mj43K44K18l52k33K33
2809B716K3j69J10L0j76J26J70k45j41K23P5J4K22n8l48M0K24j16q6J25j18j83J10K0j43J17
2805B562J02k28n0K31j7j05J32j7j95R2J65r3j5R9r2mK10o0k17J06J00j52M8J55j54n7K13
$$ y = [3247, 3281, 2861, 3023, 3195, 2759, 2761, 3252, 3125, 2858, 3138, 3116, 2734, 2876, 3030, 2684, 2732, 3148, 3047, 2937, 3248, 3149, 2859, 3213, 3423, 2968, 2895, 3172, 2925, 2801, 3211, 3113, 2678, 2935, 3192, 2811, 2745, 3016, 2784, 2656, 3064, 3015, 2596, 2744, 2883, 2555, 2686, 3130, 2947, 2769, 3126, 3060, 2619, 2776, 3042, 2814, 2798, 2982, 2728, 2620, 2969, 2883, 2532, 2761, 2932, 2567, 2565, 2915, 2784, 2598, 2762, 2615, 2362, 2688, 2924, 2662, 2735, 3029, 2802, 2624, 2879, 2766, 2429, 2645, 2887, 2711, 2795, 3007, 2729, 2596, 2972, 3019, 2756, 2866, 2911, 2579, 2561, 2760, 2572, 2449, 2653, 2572, 2408, 2667, 2761, 2496, 2602, 2842, 2612, 2510, 2785, 2697, 2465, 2725, 2901, 2685, 2744, 2914, 2681, 2613, 2883, 2748, 2481, 2727, 2850, 2524, 2528, 2771, 2602, 2485, 2756, 2806, 2691, 2881, 2948, 2733, 2834, 3031, 2812, 2696, 2921, 2866, 2654, 2745, 2749, 2606, 2850, 3068, 2716, 2483, 2716, 2739, 2570, 2680, 2710, 2534, 2660, 2830, 2585, 2444, 2667, 2742, 2756, 2978, 2920, 2572, 2612, 2836, 2720, 2634, 2759, 2641, 2458, 2568, 2588, 2445, 2562, 2664, 2436, 2386, 2617, 2600, 2495, 2627, 2610, 2415, 2507, 2672, 2579, 2564, 2663, 2571, 2567, 2777, 2717, 2500, 2606, 2706, 2554, 2602, 2757, 2603, 2546, 2759]
2801B759j22k80K17K90j35o8J25r0m6J74j06k56J49J51k34r0J52m1PK48j7k15R6R1k00rJ60
2797B710j52j58J57L5r9J57J04j88%J85n3l9J40j40k85J09J78j58j36J5p8KJ36l9j9K49N2
2793B685k47LJ43j34o4J63n6j24J74M7k27M3K07q3k3K22k1j60J19M7k00L9J50j69q2K51L5
2789B738j66J56K03j53j62Om5K0J43j2r5Qj06j49J54J68j44p7J09p2p1K25J40r9J6J3j95l2
2785B521J97M6J7J30j28k75P1J25j68j5K12p8k04P3M2j20M8M3j50O5K13j47j85K10J18j95
2781B466j2Q8j81q2K26O3j15Q6J24n5m1k8j14j7N0o3N3K24j7j85P1J39n8j2L8j26n6J03o7
2777B502j00J81J25j00N1P9k27j48J10q6j51J92J10k22L1K76n3j39J45L9j47P4J09j03PP8
2773B633j56j2L23N1k49J5N6k60j07K04M0k1K07M2k44n7Q1j14p8J01j5q8M3L8O1K24N9k66
$$ y = [2759, 2637, 2357, 2574, 2864, 2729, 2661, 2786, 2696, 2650, 2824, 2718, 2462, 2611, 2762, 2528, 2438, 2590, 2549, 2556, 2804, 2787, 2572, 2668, 2759, 2559, 2550, 2710, 2558, 2400, 2557, 2592, 2493, 2650, 2754, 2566, 2566, 2751, 2698, 2659, 2799, 2659, 2374, 2483, 2661, 2503, 2367, 2382, 2304, 2306, 2442, 2403, 2384, 2633, 2685, 2438, 2441, 2584, 2450, 2386, 2549, 2493, 2369, 2543, 2590, 2363, 2406, 2613, 2530, 2507, 2729, 2708, 2548, 2667, 2714, 2514, 2553, 2703, 2534, 2452, 2703, 2738, 2572, 2728, 2931, 2778, 2616, 2622, 2577, 2597, 2740, 2728, 2633, 2641, 2535, 2386, 2540, 2708, 2564, 2487, 2596, 2524, 2453, 2678, 2818, 2719, 2735, 2748, 2553, 2521, 2718, 2764, 2781, 2911, 2783, 2508, 2579, 2704, 2536, 2521, 2733, 2655, 2451, 2524, 2566, 2446, 2494, 2537, 2387, 2452, 2665, 2518, 2333, 2543, 2661, 2466, 2454, 2542, 2361, 2279, 2505, 2568, 2453, 2539, 2663, 2608, 2567, 2539, 2425, 2408, 2458, 2395, 2448, 2672, 2655, 2470, 2541, 2680, 2622, 2610, 2648, 2522, 2466, 2569, 2502, 2402, 2583, 2708, 2608, 2659, 2738, 2511, 2363, 2473, 2387, 2236, 2428, 2538, 2316, 2347, 2623, 2570, 2431, 2576, 2615, 2468, 2542, 2651, 2548, 2555, 2633, 2477, 2465, 2788, 2839, 2590, 2605, 2661, 2401, 2294, 2498, 2538, 2517, 2724, 2766, 2522, 2465, 2546, 2432, 2354, 2455, 2440, 2352, 2395, 2433, 2494, 2718, 2777, 2511]
2769B511j35J23N4RM5j00o9K06J11k04j01P3n3k4J19n6j42J04Q7j36KJ39q2j10J01K7q5R4
2765B508J21p3n4J6q3l1J13K8l5N3j2n8R7K2k04k8J74p4j50J71J46j37m5R3o4o9Q5J1l5O1
2761B547p8k09M9J80n5j03J5j00j45J6k4q8J61K51Mm6O0m0l3J38M0j09N6J24l3L4J23r2j50
2756B493N8L3n3J18P3k26j27J66N4q6Q3J03q1r6m9l0J27J36j30j38J24P6q4N9J08j27j57K4
2752B451P2Q5R0o7j09Q2O7r5pM3j54j28J02P1j9M2n3j50R6J83j18j41J15K3j37N0J14p1l9
2748B398M0r8m1J58K0j03J47J93j03j11Q3oj18k3J3N1J75N4k02j28K7p8r1Q2O3l2K7J3p0L0
2744B370P6o5n5P1pq1J0K0J4J43Q3j39o1J23K7j6R8m1j75Q6K02p7r9J48O1j53p2M1L9R4L0
2739B695j62j31j9r0j6K25J31j04pP6j08j18N3L5J0R8qj54j6R2J3P0J14r9j61M0M4m4Q9J02
$$ y = [2511, 2376, 2499, 2553, 2562, 2607, 2507, 2438, 2644, 2755, 2551, 2450, 2523, 2470, 2446, 2565, 2509, 2367, 2471, 2558, 2422, 2424, 2563, 2481, 2371, 2472, 2499, 2414, 2508, 2629, 2556, 2502, 2518, 2435, 2404, 2517, 2545, 2510, 2563, 2551, 2493, 2590, 2612, 2408, 2380, 2554, 2480, 2330, 2501, 2647, 2510, 2465, 2558, 2494, 2425, 2510, 2521, 2486, 2547, 2469, 2260, 2309, 2489, 2434, 2331, 2346, 2246, 2101, 2117, 2093, 2005, 2166, 2417, 2421, 2375, 2435, 2395, 2362, 2500, 2540, 2431, 2487, 2611, 2578, 2612, 2735, 2643, 2493, 2551, 2584, 2531, 2649, 2722, 2496, 2369, 2535, 2589, 2503, 2586, 2689, 2608, 2512, 2463, 2433, 2560, 2696, 2566, 2428, 2552, 2628, 2544, 2603, 2711, 2584, 2427, 2451, 2523, 2608, 2698, 2631, 2522, 2604, 2671, 2576, 2569, 2612, 2458, 2330, 2432, 2503, 2484, 2526, 2473, 2323, 2419, 2602, 2484, 2343, 2458, 2481, 2344, 2394, 2508, 2437, 2398, 2438, 2340, 2299, 2457, 2477, 2374, 2521, 2714, 2611, 2500, 2583, 2577, 2459, 2436, 2449, 2500, 2675, 2729, 2527, 2399, 2426, 2348, 2257, 2339, 2402, 2370, 2397, 2410, 2340, 2370, 2446, 2381, 2326, 2397, 2390, 2309, 2319, 2339, 2353, 2496, 2579, 2440, 2379, 2502, 2529, 2513, 2611, 2570, 2395, 2481, 2683, 2606, 2507, 2655, 2716, 2563, 2491, 2532, 2571, 2665, 2695, 2533, 2402, 2383, 2293, 2277, 2502, 2633, 2529, 2522, 2598, 2490, 2372, 2425, 2460, 2470, 2568, 2560, 2406, 2390, 2482, 2495, 2565, 2679, 2580, 2419, 2459, 2503, 2459, 2548, 2650]
2735B650j05q0N4n2n3J63R9j58j28LJ5Q4P1j41j29J11P5o8N8J13m5k8L8r7m8J91Q8j69q5K6
2730B453o0J5J65O5l3K2m9j18K3N0p0j5Oj69q4J95Q3j69n3Q3nL7J09l8m9J17J6j61l2O2m1
2726B355K4J11o0q8J25Q0j13m4K8o6KJ01m4q5J02N7j34m5J08O1J5k9j50n8J84J28o3kP7k3
2721B554n1j6r6q5L5K9J8J31Q5n8L9J38p4k31j08j0k1J3Ok8M1N0m5K0J48P3k1j2j11j80%J16
2717B349K9P1J40n5j84oP6n8p3K7P9J29O8j21r9O6l1j72OJ49M5L5P1q5j06R0M8j37j7J43K3
2712B500n9L3O7P1L8j48j95N0J29l9j6N8q9r5Q6kj37P9J44j57j62J34J03n8P9J61kn6j6p0
2708B431j5J08K3n3P9Q4r3j28q6j07MJ64O9p6j8L7lmm8j09K5J54L4m0O0K1r1J0J01j1p4m1
2703B407q6p6K5J6%J13P6j11n5J24O2k5O5L8j18j06j7j8K3O4k7n1Q1O9q8q0M7O4J0l5n4kO8
$$ y = [2650, 2545, 2465, 2519, 2467, 2414, 2577, 2676, 2518, 2390, 2393, 2408, 2492, 2563, 2422, 2293, 2404, 2479, 2411, 2469, 2582, 2537, 2509, 2547, 2450, 2402, 2593, 2681, 2512, 2427, 2453, 2393, 2408, 2573, 2638, 2605, 2627, 2578, 2460, 2483, 2533, 2463, 2448, 2454, 2285, 2201, 2396, 2479, 2310, 2257, 2340, 2335, 2372, 2481, 2443, 2394, 2511, 2527, 2366, 2334, 2396, 2355, 2379, 2490, 2430, 2342, 2467, 2547, 2434, 2390, 2418, 2352, 2354, 2455, 2411, 2326, 2428, 2485, 2351, 2306, 2414, 2475, 2490, 2461, 2311, 2253, 2437, 2565, 2502, 2500, 2577, 2554, 2503, 2487, 2391, 2306, 2341, 2370, 2388, 2519, 2604, 2546, 2585, 2723, 2649, 2418, 2310, 2300, 2279, 2292, 2298, 2270, 2311, 2361, 2316, 2336, 2484, 2557, 2536, 2524, 2413, 2233, 2233, 2349, 2378, 2449, 2589, 2534, 2350, 2344, 2420, 2362, 2289, 2316, 2395, 2524, 2592, 2471, 2372, 2438, 2407, 2235, 2241, 2390, 2435, 2470, 2541, 2456, 2350, 2440, 2488, 2351, 2334, 2477, 2500, 2441, 2474, 2541, 2612, 2650, 2502, 2307, 2357, 2486, 2447, 2431, 2489, 2400, 2305, 2391, 2389, 2252, 2331, 2475, 2318, 2156, 2290, 2393, 2335, 2414, 2575, 2573, 2517, 2501, 2431, 2416, 2524, 2547, 2494, 2573, 2657, 2564, 2436, 2350, 2243, 2247, 2411, 2480, 2404, 2386, 2423, 2420, 2416, 2368, 2259, 2284, 2438, 2472, 2432, 2492, 2513, 2422, 2432, 2533, 2522, 2448, 2407, 2321, 2245, 2270, 2286, 2286, 2399, 2475, 2364, 2309, 2433, 2495, 2470, 2535, 2573, 2455, 2349, 2332, 2314, 2337, 2401, 2374, 2323, 2404, 2473, 2385, 2305, 2352, 2416, 2426, 2391, 2337, 2335, 2403]
2698B403M0j7rJ8N3M0r9j50P5K07qj55l0J0p1k8M2J0J8L7LO9J36l1j48J3O6q0j9J48O3m7n
2693B554p5j53PR5l9k5Q5l1j10P9J49ll1Mp2o1O5N7l7o9j04p8M8L6o1P1K02Pj55pJ02J5m5
2688B420n6m4N6O6q6p2J07Q8k7J8Mj15l4J27P3lL9np2%L3lM3Lj76j36O6O0PJ26J03p8n3J5
2683B494j13j03R7J08J7O3Nj30l2P3m9m5J01j4j45L2R5p4k5R4n0o7J69J06j59r9K9r1q5Q4
2679B286J9r6L7J15L4N1M4j36j84m4mpQ0P9qJ5L1l5J1R0%o8ol6n7J25K14Rj27m7j8p3o0j1
2674B223M6R6j5k03j63M2J27Q4L0pK9R9N0n9o9k7L4J50J36o4j16M2Q1j6m0m8m6O4R1p1j08
2670B372Kk5n5P3N6r6NJ80O1p7j7j1m9Rm5j54J3J56n2j34J14J34p0pJ15j3l9R7K4r1LJ1j06
2665B384J0J65L5p0K8J6p4oM0o9q2K9L4l7m5J2R5R2l8p5Nl8r9M6J07p6j02N9K3n9O2M0j70
$$ y = [2403, 2443, 2426, 2417, 2435, 2488, 2528, 2429, 2279, 2354, 2561, 2553, 2398, 2368, 2378, 2307, 2279, 2321, 2331, 2349, 2386, 2389, 2458, 2594, 2563, 2415, 2428, 2494, 2414, 2395, 2543, 2606, 2559, 2554, 2479, 2326, 2333, 2428, 2389, 2364, 2449, 2418, 2308, 2387, 2536, 2533, 2502, 2506, 2434, 2373, 2438, 2495, 2458, 2389, 2285, 2207, 2255, 2291, 2230, 2301, 2503, 2510, 2355, 2348, 2450, 2465, 2420, 2364, 2320, 2376, 2442, 2356, 2284, 2391, 2479, 2452, 2470, 2474, 2359, 2325, 2452, 2525, 2522, 2561, 2556, 2484, 2484, 2517, 2514, 2557, 2560, 2384, 2248, 2314, 2374, 2381, 2507, 2610, 2532, 2479, 2494, 2381, 2278, 2375, 2483, 2500, 2563, 2568, 2438, 2406, 2479, 2430, 2385, 2486, 2472, 2327, 2359, 2454, 2380, 2355, 2449, 2399, 2332, 2501, 2607, 2448, 2349, 2378, 2287, 2202, 2286, 2305, 2209, 2246, 2361, 2395, 2446, 2490, 2354, 2170, 2126, 2122, 2115, 2195, 2274, 2266, 2281, 2312, 2277, 2288, 2378, 2378, 2310, 2304, 2268, 2211, 2336, 2550, 2559, 2432, 2385, 2367, 2294, 2234, 2223, 2269, 2365, 2350, 2147, 1984, 2026, 2153, 2237, 2267, 2260, 2289, 2388, 2438, 2379, 2310, 2283, 2317, 2467, 2603, 2539, 2423, 2465, 2546, 2530, 2490, 2442, 2396, 2460, 2551, 2480, 2372, 2374, 2349, 2294, 2367, 2423, 2327, 2332, 2512, 2573, 2496, 2479, 2468, 2419, 2428, 2383, 2229, 2242, 2398, 2346, 2212, 2326, 2460, 2390, 2383, 2498, 2485, 2446, 2543, 2567, 2476, 2479, 2490, 2384, 2394, 2559, 2594, 2524, 2552, 2568, 2494, 2488, 2528, 2459, 2377, 2406, 2440, 2403, 2358, 2370, 2465, 2557, 2519, 2444, 2449, 2411, 2312, 2358, 2465, 2389, 2287, 2346, 2369, 2310, 2372, 2412, 2242]
2660B242r2J57J08l0Nj6n9P0Q5p9l3R8m9j45O2J24m8m6L3o8q5O1O0k5Qk3j41p1R9J00K3j3
2655B312p0p4QJ0j7O5J21Q2P7M8p7r0K9K9m3m0o3r3KN1k1M1J54M0p9%k6j36J4J88M1p6M5M5
2650B497p2k4Lj19p9Q1M8k5N7Q1J7K9j3j38q9M3l8j32QJ55J10Oo0n2L0M8j9K1Q9Ko0L9N8k5
2645B477J3N9l1m4K7k0o4K3J3j15j02j8k4J9R4L5j0O1K9p6l4oj05n1J28J18L2N8J7q8l4K4
2641B405p3o2O4M0jJ04Q3r7q7L7nm5M1M7j1M0P2%k8k3n7%R7L2o5j1N2K4%l2q0l2L2kpL4k9
2635B457o9M7Q2k4l2Rn9k7J28O8j21q0K5m7n5Q3J00qm0m0l5L6R3N8J3n0j13k6R6J2q1K6N0
2630B476j16j37RL6LN0M1k8kK2k5LM9m0r8J1Q5K4k6j0L0O9L6k5LL1n2p0J3j8q8J7J37R6L3
2625B539k4j13n8J00O2p0l4Kn8L1J47oj48j6O1n2o4L2O4Q6M3j12r6J00M6j46n1Q4m0o0J18
$$ y = [2242, 2150, 2307, 2415, 2385, 2390, 2374, 2315, 2385, 2470, 2391, 2358, 2456, 2407, 2262, 2324, 2448, 2400, 2354, 2387, 2319, 2234, 2295, 2355, 2330, 2338, 2315, 2174, 2103, 2202, 2302, 2325, 2312, 2242, 2168, 2176, 2186, 2169, 2234, 2355, 2437, 2514, 2562, 2485, 2395, 2424, 2453, 2410, 2370, 2307, 2214, 2216, 2267, 2246, 2287, 2441, 2481, 2402, 2402, 2376, 2240, 2254, 2442, 2483, 2407, 2452, 2497, 2425, 2401, 2404, 2285, 2206, 2287, 2335, 2310, 2367, 2448, 2465, 2494, 2481, 2343, 2254, 2297, 2259, 2127, 2135, 2290, 2400, 2406, 2346, 2294, 2324, 2372, 2353, 2374, 2463, 2465, 2405, 2444, 2502, 2477, 2490, 2549, 2518, 2474, 2501, 2481, 2417, 2440, 2453, 2338, 2236, 2218, 2194, 2213, 2307, 2342, 2332, 2393, 2422, 2346, 2312, 2306, 2201, 2150, 2278, 2396, 2428, 2486, 2503, 2415, 2381, 2405, 2332, 2270, 2334, 2374, 2373, 2477, 2560, 2463, 2376, 2413, 2408, 2363, 2404, 2451, 2440, 2480, 2552, 2552, 2524, 2501, 2444, 2444, 2541, 2573, 2508, 2497, 2549, 2573, 2573, 2541, 2461, 2429, 2461, 2459, 2452, 2486, 2457, 2388, 2435, 2517, 2493, 2461, 2470, 2411, 2384, 2512, 2580, 2459, 2379, 2404, 2357, 2302, 2385, 2485, 2477, 2437, 2397, 2362, 2398, 2491, 2549, 2562, 2512, 2399, 2373, 2469, 2481, 2400, 2426, 2476, 2360, 2223, 2232, 2268, 2271, 2321, 2362, 2334, 2332, 2354, 2329, 2332, 2381, 2341, 2243, 2254, 2339, 2363, 2337, 2327, 2357, 2426, 2462, 2437, 2440, 2471, 2419, 2349, 2362, 2344, 2256, 2273, 2410, 2506, 2539, 2515, 2402, 2344, 2444, 2506, 2436, 2402, 2404, 2346, 2377, 2524, 2518, 2370, 2354, 2415, 2363, 2299, 2331, 2395, 2481, 2524, 2412, 2316, 2416, 2462, 2316, 2265, 2349, 2309, 2249, 2367]
2621B367N9j21j3J31K1m8L2J2m9KL2kJ5Lo6l9K2k8p6k6K8P3R1Ko4K7P1l6n3K8Qk7J9l0j20
2615B245k6R8K0r3n0O7J13K2j25p7J01P8n2ML4j03m3J76J00r0J8J18j4k8O7n1j63l6J0q7l1
2611B202P2L2M2R9j2q9L7N4p3n2nr6m9J20N9p9RR9K2lJq5o9O1K1r6j9J03O2j8m2l2N4J06n
2606B431j11q5o7m5Q8J35j1p6K0O5L7Qp1r8K3Q0j5l2M1j1r5k8M8L7N1P3J6p9j38q9P0J33O
2601B311k0J42J41o0j43j00p5J5J17L8n6K8N3o5p4K2L1K8N3ok8P0N0j02q7O2R1L2j4o8m5N6
2596B397L3q6q4nM0R1N5j08j13N8N4o7k9or5kJ53J1j39K4J14m1n6N9Lo3K3L7l1%lp7MJ25L5
2591B311o9j4pp4j0J02J16R1K9o4l8K6o5j35NR4k3j01n0PO6Q3k0o8M4P8l4o3J0M2N0L9kL7
2586B393J05Lj09j7M2p0n8J07J14j2p5j17j07M8J31J9k3P0M6o9r8q9o5M0R4J5m7q6j46o9J13
$$ y = [2367, 2426, 2305, 2292, 2423, 2444, 2396, 2428, 2440, 2391, 2393, 2425, 2423, 2438, 2441, 2375, 2336, 2358, 2330, 2254, 2228, 2256, 2329, 2420, 2422, 2358, 2385, 2456, 2420, 2367, 2395, 2403, 2376, 2395, 2365, 2245, 2219, 2317, 2337, 2244, 2194, 2261, 2374, 2396, 2271, 2194, 2295, 2373, 2321, 2325, 2359, 2256, 2213, 2389, 2489, 2399, 2417, 2535, 2521, 2493, 2560, 2509, 2346, 2310, 2320, 2233, 2202, 2274, 2306, 2348, 2447, 2435, 2346, 2383, 2437, 2364, 2312, 2307, 2211, 2162, 2282, 2341, 2262, 2271, 2370, 2392, 2389, 2390, 2305, 2236, 2297, 2318, 2222, 2203, 2306, 2368, 2350, 2308, 2276, 2330, 2436, 2431, 2320, 2235, 2168, 2123, 2211, 2346, 2335, 2259, 2279, 2344, 2381, 2389, 2318, 2220, 2243, 2323, 2308, 2276, 2317, 2306, 2211, 2183, 2231, 2268, 2319, 2392, 2408, 2329, 2191, 2102, 2172, 2305, 2311, 2291, 2433, 2574, 2514, 2371, 2271, 2196, 2211, 2328, 2366, 2310, 2338, 2391, 2326, 2252, 2274, 2305, 2333, 2386, 2380, 2352, 2422, 2472, 2370, 2283, 2345, 2436, 2468, 2454, 2386, 2341, 2397, 2430, 2344, 2260, 2255, 2295, 2386, 2441, 2333, 2220, 2278, 2332, 2265, 2236, 2230, 2135, 2133, 2286, 2297, 2158, 2182, 2296, 2255, 2199, 2258, 2261, 2198, 2221, 2258, 2227, 2227, 2224, 2147, 2151, 2276, 2311, 2242, 2228, 2221, 2147, 2137, 2239, 2355, 2446, 2475, 2411, 2373, 2399, 2334, 2199, 2204, 2298, 2275, 2174, 2124, 2131, 2197, 2280, 2260, 2192, 2236, 2314, 2280, 2217, 2227, 2269, 2319, 2358, 2356, 2393, 2498, 2501, 2392, 2375, 2417, 2347, 2289, 2396, 2510, 2498, 2423, 2306, 2199, 2247, 2378, 2397, 2374, 2444, 2490, 2421, 2323, 2234, 2169, 2209, 2303, 2318, 2271, 2185, 2039, 1970, 2083]
2582B083J14JK4O4LJ0M0q3j58j8J02P0L6po0mO5j4n0P0J33P6J2o6r8J3N4r0j04P2P5n4jR4
2577B404Qr4r1l9Q9J65Nj31JP7p8j17J4M2K3M8l6j16M1J68K6q4qK4mL0Lp6j4R9P1k2q2j00
2572B246k7N7Jl5P8R7m8p4R%L0J54R9q7r3j1m7n7K1J5k7K1K5n3n1pl5k1Q6J19K0n9j5J03J30
2566B564Nq5j4O7Q4J40J48ko4R7J91P0o6j21j25o3l4q9o2J7o7j60j7J03np3j6m9q1K6O7j3
2562B373MN1j6rJ02P6m0n3n6r0J8J67J58J07J23J05P4R8J02J07J89J96P4K2jj67k79j67j09
2557C159k07j93o6l4n4k7l2m8j5j5k5M4N3o3r2JKn3j0M9K1l0n9k8P0O6o3l7J51J57J1N3J93
2553B879J59L9J0K5lp3j36r2j5r1j84n1R5Mq8j8Km6LL6j1L1R2lp9%K9k2j6n1j47o0J22N2j46
2547B246j17N8Q8k6j20j09j7M4M3Q2J03J3n5%L3ql0m8n5L4Q9%k8M9J1n0P2J40Ko1j5r6j28
$$ y = [2083, 2197, 2198, 2222, 2286, 2289, 2299, 2339, 2256, 2098, 2080, 2182, 2252, 2288, 2281, 2221, 2217, 2282, 2268, 2218, 2288, 2421, 2497, 2509, 2443, 2345, 2358, 2412, 2322, 2218, 2290, 2365, 2311, 2310, 2404, 2412, 2318, 2227, 2188, 2277, 2442, 2447, 2316, 2317, 2394, 2316, 2199, 2213, 2255, 2278, 2326, 2290, 2174, 2215, 2383, 2409, 2325, 2317, 2341, 2337, 2367, 2370, 2294, 2280, 2379, 2450, 2428, 2346, 2246, 2219, 2276, 2277, 2242, 2320, 2417, 2369, 2295, 2304, 2304, 2334, 2488, 2587, 2500, 2407, 2396, 2349, 2292, 2313, 2328, 2301, 2322, 2347, 2294, 2243, 2236, 2201, 2180, 2266, 2385, 2405, 2346, 2331, 2434, 2564, 2569, 2484, 2470, 2537, 2621, 2761, 2909, 2907, 2843, 2940, 3131, 3201, 3135, 3014, 2889, 2826, 2792, 2703, 2641, 2658, 2591, 2431, 2414, 2517, 2512, 2439, 2423, 2374, 2293, 2319, 2386, 2373, 2377, 2428, 2412, 2403, 2505, 2581, 2541, 2488, 2432, 2342, 2360, 2527, 2685, 2792, 2915, 3020, 3094, 3192, 3294, 3401, 3590, 3786, 3860, 3882, 3881, 3714, 3435, 3268, 3159, 2952, 2759, 2693, 2659, 2605, 2578, 2546, 2498, 2483, 2468, 2443, 2487, 2540, 2477, 2385, 2386, 2388, 2335, 2325, 2374, 2395, 2365, 2306, 2278, 2348, 2414, 2351, 2314, 2465, 2622, 2633, 2686, 2879, 3038, 3077, 3087, 3112, 3109, 3036, 2900, 2808, 2793, 2702, 2518, 2467, 2562, 2566, 2478, 2460, 2462, 2416, 2419, 2455, 2444, 2475, 2567, 2564, 2485, 2485, 2514, 2492, 2476, 2425, 2278, 2218, 2340, 2392, 2246, 2129, 2187, 2275, 2249, 2129, 2020, 2003, 2047, 2090, 2172, 2275, 2288, 2233, 2233, 2266, 2258, 2228, 2180, 2125, 2159, 2248, 2248, 2220, 2269, 2280, 2230, 2302, 2442, 2444, 2383, 2368, 2272, 2144]
2543B144M6Q7o6l6J00L1m8P2J39O1%r2j89p9Q8K8o6OJ3q4KJ88J53l4j04k2O9M4n0l7L5m1j48
2538B210n6N4%KJ22J20J0k2l6q4n1K1K9K6j3j13r1O3Q0k2nL5jM1J04pq8K7N0p2l8Q1M8J2R3
2533B529P1p8j31p7kO0%j16m6J27J31N6M0l7j08NQ2m4q4K5pj04l6K8l4j9O2O0N5M3j04j79
2528B168MJ51N7n5o4k9P2J08m0p6J16Q9j91j63J28J30p4n9M7J6mM7J1n6l2Kk5o0m7M2J33P6
2523B422n6n9Jk0oR7R0k9m6Pl7j07p6j6RM5R6Q0j0n2LQj06j11R0J88M1o6j5qm5J2O7M0K3R
2518B463n4m9J5k5r9k1N9qn5RM3Qj0kRJ1l2o8k0M5N8N2%q9n2R0P7n1m3L0jmP1M7m7m7%J4N8
2512B382R8N0k1q6j44n7J26J05q0j02qm3p2M3R7J9j6j8o4k7J03J10mm1J4J2o5r0rO0nr9m7
2507B121P4Q2J0j2L2O2Nr5p6L9L1m8K1R5j6p9N2P6o4q4mnK6J17O8m0LM2n1r1l4JM2O6m1j27
$$ y = [2144, 2190, 2277, 2211, 2175, 2275, 2306, 2258, 2330, 2469, 2530, 2530, 2438, 2249, 2170, 2258, 2286, 2220, 2226, 2239, 2155, 2157, 2345, 2498, 2464, 2360, 2338, 2407, 2451, 2401, 2364, 2399, 2358, 2210, 2154, 2208, 2208, 2210, 2332, 2452, 2462, 2440, 2404, 2320, 2269, 2290, 2319, 2345, 2332, 2219, 2128, 2191, 2271, 2249, 2244, 2279, 2278, 2319, 2423, 2416, 2328, 2355, 2405, 2333, 2295, 2376, 2424, 2436, 2529, 2600, 2522, 2391, 2314, 2312, 2372, 2372, 2256, 2210, 2337, 2468, 2524, 2564, 2527, 2419, 2424, 2506, 2462, 2378, 2403, 2396, 2292, 2256, 2284, 2250, 2231, 2293, 2353, 2408, 2451, 2347, 2168, 2172, 2323, 2380, 2325, 2261, 2232, 2304, 2412, 2372, 2296, 2412, 2501, 2310, 2147, 2275, 2405, 2331, 2272, 2319, 2335, 2331, 2378, 2389, 2333, 2301, 2303, 2278, 2218, 2171, 2213, 2346, 2422, 2366, 2307, 2308, 2288, 2282, 2379, 2469, 2440, 2394, 2401, 2364, 2257, 2181, 2165, 2174, 2219, 2315, 2395, 2385, 2333, 2336, 2344, 2238, 2127, 2217, 2405, 2446, 2380, 2365, 2357, 2312, 2324, 2391, 2431, 2454, 2463, 2409, 2360, 2375, 2350, 2251, 2230, 2289, 2281, 2226, 2235, 2278, 2286, 2276, 2274, 2283, 2294, 2262, 2194, 2174, 2219, 2277, 2329, 2329, 2240, 2188, 2278, 2355, 2304, 2261, 2291, 2290, 2286, 2357, 2404, 2357, 2310, 2310, 2324, 2382, 2480, 2530, 2509, 2423, 2279, 2222, 2348, 2453, 2373, 2271, 2263, 2220, 2148, 2191, 2288, 2307, 2291, 2273, 2209, 2182, 2285, 2395, 2391, 2350, 2364, 2376, 2311, 2221, 2212, 2272, 2267, 2168, 2121, 2195, 2277, 2287, 2275, 2307, 2369, 2374, 2279, 2203, 2242, 2273, 2225, 2246, 2341, 2325, 2246, 2298, 2374, 2310, 2226, 2222, 2217, 2243, 2360, 2428, 2388, 2391, 2433, 2382, 2291, 2257, 2258, 2300, 2366, 2325, 2198]
2502B198l3O2L6J4j3p3MJ49Q9o6m9K9K9N2M3m3l1L3q6j77LJ18l2j08j8J6N8J57P6q8l7M9m6
2497B315n6Q5R9L4O3J4j28j01Kp0j24J1R4K4mL0L9N5N2k0o8o3o8k3Q6Q3m6q3lO7Q0M0k6j5
2492B375K6m7j22k1J08P4k4o6m3M2J01L2n3l4j3l5LN7L2j1l5q3q4j0M7R5J46O8p9n4K6o6r8
2487B254Q0J16q8j35K8P6J8L1J8r1j16J1J18P6m2n4M3J4j30r4P1P4L2R7J9j94j34R9N8r9k3
2483B133R9O9L8L0jN6Q9p4j47N3J22q1j40J4M9l6l8J8R2J20j0j37l1R1On7Kj7m7O5R6n2j01
2478B273rJ8pj8o7p1J2J8k6N0Q6k9n2L0l8j05N6J49Ln1N1J9r7n9L9O1N1K0j5jMk4J6M1m9n9
2473B220O4L2j15n0R6L3o4j8PmN7M5n3j8M0p2j14M7R3k5J8J43N7q8m3L6Mj7M9O4n5j66o3J47
2468B287J41n8j24m3l5n1K4O1L2L1j8j26o0J50J65l4j59j20l1K1%j5O3P8m5n3Q1M7r8k3J24
$$ y = [2198, 2165, 2227, 2263, 2277, 2264, 2191, 2195, 2344, 2433, 2367, 2318, 2347, 2376, 2428, 2471, 2428, 2397, 2430, 2344, 2167, 2170, 2288, 2256, 2148, 2130, 2146, 2204, 2361, 2437, 2349, 2312, 2361, 2315, 2259, 2344, 2443, 2477, 2540, 2554, 2426, 2325, 2327, 2257, 2133, 2144, 2238, 2262, 2258, 2288, 2327, 2382, 2434, 2414, 2346, 2283, 2215, 2192, 2278, 2361, 2315, 2232, 2229, 2296, 2376, 2416, 2390, 2375, 2401, 2354, 2232, 2211, 2319, 2393, 2369, 2303, 2260, 2302, 2403, 2435, 2382, 2348, 2335, 2300, 2303, 2360, 2392, 2381, 2346, 2263, 2179, 2169, 2216, 2311, 2457, 2525, 2446, 2392, 2418, 2352, 2254, 2334, 2450, 2362, 2227, 2255, 2331, 2349, 2380, 2398, 2307, 2191, 2202, 2320, 2396, 2354, 2300, 2343, 2357, 2227, 2133, 2204, 2278, 2310, 2407, 2426, 2232, 2098, 2197, 2255, 2156, 2133, 2232, 2301, 2339, 2369, 2368, 2424, 2513, 2439, 2292, 2345, 2467, 2386, 2246, 2260, 2309, 2273, 2235, 2253, 2345, 2465, 2455, 2318, 2287, 2378, 2384, 2327, 2329, 2312, 2265, 2330, 2426, 2374, 2273, 2264, 2282, 2275, 2257, 2190, 2119, 2131, 2149, 2123, 2173, 2259, 2230, 2178, 2208, 2170, 2065, 2121, 2270, 2273, 2222, 2273, 2292, 2195, 2136, 2175, 2236, 2287, 2307, 2292, 2291, 2295, 2271, 2287, 2328, 2279, 2220, 2284, 2316, 2201, 2151, 2247, 2280, 2216, 2198, 2205, 2201, 2258, 2303, 2250, 2232, 2272, 2200, 2086, 2133, 2226, 2201, 2219, 2362, 2419, 2331, 2288, 2324, 2328, 2311, 2360, 2424, 2369, 2203, 2140, 2287, 2428, 2370, 2246, 2203, 2168, 2117, 2141, 2202, 2234, 2265, 2247, 2121, 2061, 2211, 2376, 2342, 2183, 2063, 2032, 2053, 2053, 2038, 2101, 2179, 2134, 2081, 2162, 2209, 2111, 2088, 2212]
2463B212L5q1J8J13K6n9k7M5Q6N1k8m6KL2K1l6r1j5J31J03l0qM2p5j16M0Q0n4o1L1nm4K4K2
2458B338p3n1O2P5k3q3j5R9P8o7j01ON2M2Q5N8o2o7N0P9K4k3r4j07N1J75O8o8k6N1L7jk0l5
2453B514k3j1k4l6n2p1m9jRPL7O2O5N2k2r5m2O4M4l4k7pm5m8L6J09M6j34j88J5J92R6k4L2
2448B447L0j03o8J01J01j6l2k0p6r3k4O0J06N7n1n5J2k9q9rN8Kj7K2Nj3K1K1mMk2k3P5N4j68
2443B264j90Q3K04N1m1k2l9k8L0jo8l6L2M4Qn1k4J19J16r2j29R5J68k5j64j16K5J50R5j15
2439B343j64jO3KJ3M8K2K0k7j31o6J34J58N0K5l2j15jJ33%j30pJ01M0j4l8l6O8Q9p9j04Q9
2434B453R5q9j06m5q9n9L0j6l3Q0K8j08J6J82Q6J3R2J7j47r0rq5o4P9O6m2k9L5O6R2O1j3j6
2429B451PoJ0Ln7K8J83N3j69l5J72K6j52n6Pp8o8k9p7JJ59P9j14r7K0L3L0N0Ol4k0PO2J10
$$ y = [2212, 2247, 2166, 2184, 2297, 2323, 2264, 2237, 2282, 2368, 2419, 2391, 2345, 2347, 2379, 2400, 2364, 2273, 2258, 2389, 2492, 2462, 2454, 2496, 2421, 2305, 2345, 2425, 2371, 2310, 2341, 2336, 2292, 2316, 2338, 2265, 2214, 2276, 2351, 2328, 2245, 2230, 2329, 2407, 2340, 2239, 2245, 2297, 2339, 2424, 2482, 2420, 2353, 2403, 2482, 2506, 2483, 2389, 2282, 2333, 2508, 2576, 2508, 2482, 2533, 2570, 2569, 2549, 2514, 2491, 2480, 2456, 2420, 2368, 2297, 2248, 2247, 2256, 2263, 2300, 2362, 2427, 2479, 2457, 2362, 2320, 2384, 2428, 2394, 2367, 2360, 2315, 2267, 2303, 2412, 2458, 2324, 2136, 2151, 2343, 2439, 2415, 2447, 2477, 2374, 2306, 2407, 2508, 2492, 2460, 2440, 2364, 2271, 2247, 2307, 2413, 2470, 2419, 2364, 2376, 2347, 2258, 2249, 2307, 2309, 2292, 2314, 2319, 2306, 2327, 2348, 2344, 2348, 2326, 2303, 2378, 2432, 2264, 2074, 2157, 2361, 2412, 2371, 2349, 2310, 2282, 2312, 2311, 2243, 2207, 2239, 2283, 2291, 2240, 2216, 2335, 2451, 2359, 2230, 2325, 2493, 2468, 2304, 2188, 2213, 2363, 2458, 2343, 2179, 2178, 2241, 2243, 2256, 2304, 2326, 2346, 2319, 2188, 2122, 2256, 2414, 2464, 2489, 2457, 2342, 2341, 2474, 2474, 2344, 2337, 2438, 2478, 2464, 2426, 2390, 2458, 2547, 2468, 2364, 2453, 2548, 2459, 2353, 2308, 2219, 2160, 2190, 2174, 2141, 2221, 2249, 2141, 2157, 2339, 2425, 2438, 2530, 2547, 2400, 2310, 2301, 2216, 2152, 2231, 2297, 2255, 2226, 2261, 2327, 2419, 2480, 2467, 2451, 2458, 2452, 2462, 2465, 2408, 2436, 2619, 2672, 2503, 2468, 2640, 2666, 2514, 2458, 2465, 2387, 2319, 2290, 2213, 2214, 2373, 2452, 2338, 2241, 2261, 2294, 2324, 2374, 2380, 2346, 2326, 2333, 2395, 2505]
2424B505K2j02n8K9k4n1O7J11Om7j4o%M2L3j3K4Q8J7q6%J77J75J1r0p5k8pp7j88j19N8M6n6
2419B370L9R1j29j83J01J59p1k8J85P0r5N7J30l7j1J60O9o6Q2K13J00j8l3n2m4k2o5m8O8N2
2415C044j12j78j22p8m1m1j29j18P6J86O2p6m5P4J40Q3jL4J09P8J7J1m5j17m9N2Oo0k8qk0
2410B704lj2o9q8q2o9JM6oMJ01N8q8p4L8M7K0M2M5L0Pq0j12j1j3j48q9J09Q2m3QL4q1m2J45
2405B411J20l6lJ20P5o6q0M4J14J0p4O1J73Pj56o2K7n3p1j0l6p2l5m5p0OM3m7o2L2L1n0k6
2400B220P5J20Q3op9p5l9pN4O7j5k0J05J26j6r9p9n5j3M2On9l0K0J8J2j0n7k5N2J3o9k0Q1
2395B321R2L6l1q5l5P1N8n3n0P8J46P3o2j33o6N2P1nk4L2K6n4n2M8N2m2kJ26L5j67j23L4L
2390B370m0Q2J18j9p1k3k3jM0l1o9L8N4n5l0L6o5q9O4P0n4K0J27Lr6j8Ln0l0k3m6M2J07L3
$$ y = [2505, 2527, 2425, 2367, 2396, 2372, 2321, 2388, 2499, 2505, 2458, 2444, 2438, 2438, 2480, 2513, 2500, 2524, 2612, 2629, 2543, 2543, 2720, 2895, 2906, 2816, 2741, 2713, 2706, 2629, 2441, 2322, 2380, 2426, 2370, 2409, 2500, 2371, 2188, 2289, 2448, 2377, 2349, 2534, 2604, 2509, 2566, 2696, 2659, 2648, 2808, 2877, 2811, 2893, 3106, 3206, 3188, 3155, 3103, 3059, 3037, 2972, 2924, 2992, 3044, 2932, 2754, 2632, 2554, 2513, 2472, 2343, 2225, 2301, 2487, 2549, 2473, 2428, 2502, 2642, 2725, 2724, 2758, 2867, 2945, 2962, 2973, 2928, 2811, 2762, 2814, 2820, 2760, 2732, 2724, 2704, 2701, 2689, 2620, 2532, 2450, 2381, 2382, 2428, 2422, 2426, 2527, 2585, 2497, 2423, 2461, 2508, 2528, 2570, 2615, 2645, 2652, 2572, 2460, 2449, 2436, 2288, 2199, 2308, 2390, 2347, 2355, 2389, 2308, 2266, 2411, 2531, 2495, 2492, 2612, 2687, 2621, 2541, 2585, 2699, 2709, 2635, 2696, 2869, 2876, 2720, 2658, 2685, 2632, 2561, 2551, 2515, 2443, 2408, 2363, 2293, 2299, 2342, 2295, 2233, 2265, 2296, 2246, 2220, 2295, 2415, 2498, 2492, 2413, 2338, 2299, 2292, 2346, 2413, 2398, 2378, 2483, 2609, 2593, 2494, 2415, 2360, 2347, 2389, 2395, 2336, 2306, 2326, 2344, 2356, 2346, 2289, 2264, 2316, 2329, 2260, 2240, 2321, 2413, 2449, 2418, 2333, 2298, 2369, 2427, 2374, 2324, 2402, 2548, 2621, 2559, 2426, 2360, 2412, 2483, 2478, 2454, 2486, 2512, 2458, 2406, 2454, 2506, 2464, 2462, 2588, 2623, 2456, 2333, 2367, 2370, 2330, 2412, 2530, 2511, 2440, 2417, 2394, 2393, 2433, 2402, 2333, 2371, 2425, 2370, 2340, 2376, 2311, 2222, 2286, 2356, 2302, 2322, 2449, 2452, 2356, 2338, 2341, 2291, 2261, 2238, 2192, 2234, 2341, 2374]
2386B374PM3n4j18J8R1K8O7R1p6j41NQj18n9N9K0NR3J00M9kj17j69l4L2m4L9K04Q4j32p9L7
2381B311k0m9M1M9m9q8j3Q1P1m0m9P1N2j01o0J03O1o9m4j0p1k5J24J41K7l2j5J1J7LPJ9l1
2376B423j02q1j4PKk2n6rR0N4o2m8M1K6j9K9J06R8Pn7%N5m1j00N9J55J1o9Kl8j01J8P1p3r4
2371B268J4k7m7J25J26j29j56Q4J46km6M6J38J17p8k44j22P9M1o0j0M2NpomP4Q7r3k08n0J46
2366B249J76J01j0q3j6O0l6j30l9P5O0J5j4m4rO1M3l2l5J0Pj7j4k1n8o2K2R4L0n0K0J03K5
2361B481p3l6kk6%K8l4p6n0m8rJ24J68N2m5m0k7mK8J8K7P8N1m1p0p3r0k6N9L8J2M2k1q9K7
2356B353J30K5l1R1R4q2j59q1J3N8Lq8rJ48R0p4m8O1M1j3j5l0l4llj6J1Pj3Ll2j04k7J21Q1
2351B468n4o5k6oN3N4m6l8Q0R0L2L4j2j13n9N1mr2j6J03J02lj33j54k4Q2Q4Q7L9q5p5R0J02
$$ y = [2374, 2381, 2424, 2370, 2252, 2270, 2361, 2389, 2456, 2547, 2471, 2330, 2335, 2343, 2225, 2166, 2225, 2245, 2250, 2343, 2443, 2492, 2490, 2373, 2204, 2170, 2202, 2158, 2197, 2401, 2485, 2353, 2274, 2311, 2291, 2242, 2283, 2332, 2283, 2195, 2182, 2263, 2334, 2294, 2245, 2316, 2368, 2267, 2207, 2310, 2371, 2302, 2258, 2248, 2177, 2152, 2276, 2417, 2444, 2412, 2397, 2408, 2425, 2428, 2435, 2454, 2423, 2321, 2240, 2226, 2233, 2235, 2213, 2157, 2148, 2238, 2292, 2230, 2182, 2223, 2249, 2230, 2259, 2365, 2463, 2470, 2413, 2413, 2468, 2427, 2327, 2386, 2541, 2552, 2483, 2485, 2447, 2346, 2364, 2435, 2362, 2268, 2282, 2255, 2208, 2333, 2459, 2330, 2174, 2258, 2404, 2402, 2356, 2402, 2540, 2657, 2579, 2335, 2213, 2292, 2333, 2273, 2263, 2305, 2310, 2303, 2297, 2293, 2367, 2454, 2361, 2153, 2103, 2249, 2425, 2526, 2516, 2433, 2417, 2477, 2441, 2311, 2272, 2347, 2407, 2422, 2408, 2364, 2355, 2416, 2459, 2427, 2392, 2402, 2409, 2392, 2378, 2357, 2299, 2237, 2259, 2353, 2383, 2333, 2353, 2456, 2481, 2408, 2372, 2370, 2344, 2344, 2372, 2338, 2262, 2212, 2164, 2155, 2279, 2447, 2499, 2454, 2414, 2387, 2383, 2411, 2429, 2456, 2534, 2585, 2544, 2474, 2401, 2311, 2285, 2344, 2382, 2394, 2436, 2415, 2326, 2353, 2483, 2508, 2477, 2568, 2662, 2580, 2421, 2340, 2353, 2411, 2414, 2326, 2317, 2465, 2555, 2481, 2433, 2494, 2535, 2522, 2507, 2477, 2443, 2440, 2437, 2421, 2432, 2439, 2426, 2429, 2397, 2293, 2266, 2387, 2468, 2414, 2349, 2323, 2317, 2370, 2424, 2378, 2340, 2420, 2510, 2542, 2576, 2564, 2451, 2392, 2443, 2439, 2347, 2331, 2434, 2536, 2533, 2400, 2246, 2222, 2304, 2388, 2475, 2514, 2429, 2354, 2444, 2546]
2346B546l8m7J7j2l9k3k5K2N9q7j91J8J83J5r4Q5J78L1r3r4k7P4N8p2o5M4Kn4P6J49K3k3M6
2341B642%j02q9l6k8k6l0J0J02O6r6r2Q0Q4o7q6J4N5M1J8qj5m8r6k4J25J24j1q2o2%P3N0m7
2336B439l8J3l8j8J44J58J1NN2l5n1M6k8j44j8J11K1l6K9Pn8n2n3j3J13R8n6m6N4J6jP5Oj08
2331B605pR9Rn0k4q0j13m4p2j35k1R4N1L8P5Mp8l8M1J23J34m5j51O7J98k8j26O3O9r3n0K8
2327B543p2p5M7N1L5J00N4l5nn6j66j6J90P9o2L1M4p5k6Q4O6N5N5j7J4J03np6J26K19P6J08
2322C394K37J50J26L10L06K12M22O25N20M65M45K7n17o45n29m51l49l12l76k82j10j39j64
2318C365k0k7j76j05M3k7r5j8K1L5P3J1l2J06J80J24K00K84J75J78L63L73L48N79P25O69Q56
2314H208J145J063Q97Q06J83q66j365j238j117j000p11n26m78l37k59l48l28j80j13q4l7p1
$$ y = [2546, 2508, 2461, 2478, 2466, 2427, 2404, 2379, 2401, 2460, 2373, 2182, 2200, 2383, 2398, 2304, 2389, 2567, 2598, 2505, 2411, 2384, 2458, 2516, 2444, 2379, 2423, 2425, 2371, 2447, 2596, 2619, 2596, 2642, 2642, 2540, 2451, 2415, 2387, 2361, 2331, 2341, 2443, 2509, 2413, 2321, 2401, 2485, 2418, 2332, 2346, 2401, 2442, 2460, 2452, 2437, 2389, 2293, 2269, 2394, 2518, 2507, 2425, 2363, 2363, 2436, 2486, 2439, 2401, 2414, 2376, 2358, 2502, 2660, 2671, 2676, 2728, 2693, 2642, 2688, 2660, 2516, 2498, 2609, 2630, 2594, 2623, 2630, 2572, 2520, 2467, 2454, 2567, 2665, 2609, 2563, 2617, 2633, 2632, 2707, 2713, 2605, 2598, 2697, 2706, 2656, 2632, 2552, 2439, 2395, 2323, 2188, 2167, 2261, 2312, 2350, 2425, 2429, 2351, 2313, 2354, 2477, 2611, 2566, 2415, 2482, 2680, 2652, 2526, 2589, 2658, 2565, 2515, 2543, 2471, 2396, 2443, 2494, 2529, 2629, 2683, 2648, 2643, 2587, 2421, 2405, 2595, 2674, 2612, 2643, 2687, 2612, 2586, 2670, 2736, 2791, 2846, 2829, 2843, 2946, 2941, 2865, 2991, 3210, 3286, 3394, 3631, 3781, 3907, 4217, 4523, 4735, 5157, 5782, 6302, 6767, 7212, 7239, 6722, 6077, 5548, 5097, 4748, 4436, 4060, 3778, 3668, 3529, 3365, 3345, 3318, 3142, 3037, 3080, 3053, 2958, 2940, 2961, 2996, 3069, 3080, 3048, 3154, 3334, 3458, 3658, 3942, 4117, 4295, 4658, 5031, 5379, 5958, 6683, 7352, 8208, 9353, 10416, 11313, 12119, 12302, 11436, 10071, 8833, 7716, 6716, 6005, 5479, 5001, 4664, 4405, 4057, 3729, 3549, 3436, 3352, 3315, 3244]
2311C244r5m3n3m6P0O4q6m8Q5N5O1J88J40N3K34L42J29P1L42N04M80N12N56N33L95m3n98p60
2307F286n85n09m77l55l39l44j58n0j60j65o0p2k1J35Rk57j79M5L5k2mm3k0P6l0j83m3J03
2303B613lk4Q1j9j31J8J06k0m3O2N1prk0J5P9J1o1K7N6o5p3J3J3N1J10m0j73jJ33jm3P7J8
2298B801j17m9O1J7o7p8j6N1J5k4R7J35q0j84l5j6r8M6J71K6k9Q5M7j3J14R9j16j48n5q5l1
2294B524J33Q0n7KL8n0k8J4p2l1J29R7L6J45J09j22j22N0L8l8k3l6l2M5J6m0O2Q6p1q1K9j8
2289B812l4R5L1j39n3N6l8jJ85J39k4m8r6j49j9O9oJ4K2j56j26J68J56q8j3J52L8n6J2l8j10
2284B755n7o6m3J81K46K2n2J7n6o0P8K9n4J11J26j20j07R5K9o7O0Q0j2Qm7j42M2J73o0j21
2280B988J18N6j53jJ25p0j24j0l7L5K00L2j62J2N8j47QK81P9j44j1oj00P5J17j11m2J76K3
$$ y = [3244, 3149, 3106, 3053, 3007, 3077, 3141, 3055, 3007, 3092, 3147, 3208, 3396, 3536, 3589, 3823, 4165, 4294, 4365, 4707, 5211, 5691, 6203, 6759, 7292, 7687, 7644, 7046, 6286, 5701, 5192, 4715, 4360, 4021, 3677, 3519, 3469, 3309, 3144, 3084, 3012, 2991, 3126, 3135, 2878, 2699, 2744, 2779, 2757, 2753, 2710, 2690, 2766, 2736, 2553, 2510, 2613, 2610, 2586, 2667, 2648, 2517, 2535, 2641, 2621, 2578, 2640, 2691, 2684, 2675, 2655, 2670, 2749, 2760, 2699, 2726, 2782, 2717, 2644, 2657, 2670, 2721, 2831, 2791, 2618, 2617, 2750, 2749, 2706, 2783, 2801, 2684, 2635, 2696, 2713, 2646, 2568, 2552, 2603, 2618, 2594, 2691, 2826, 2746, 2562, 2527, 2511, 2413, 2459, 2630, 2656, 2627, 2712, 2759, 2746, 2860, 2959, 2843, 2695, 2640, 2555, 2524, 2657, 2737, 2680, 2682, 2720, 2670, 2642, 2656, 2584, 2553, 2682, 2779, 2815, 2960, 3069, 2947, 2825, 2875, 2913, 2875, 2852, 2816, 2784, 2829, 2845, 2805, 2867, 2953, 2882, 2801, 2830, 2812, 2778, 2873, 2904, 2765, 2712, 2768, 2730, 2729, 2914, 3053, 3029, 2981, 2885, 2736, 2717, 2786, 2780, 2794, 2816, 2660, 2534, 2702, 2858, 2770, 2757, 2909, 2947, 2891, 2903, 2865, 2755, 2698, 2632, 2589, 2770, 3016, 3038, 2986, 3003, 2947, 2887, 2965, 2994, 2940, 3051, 3177, 3057, 2950, 3045, 3074, 3007, 3067, 3147, 3135, 3143, 3096, 2954, 2996, 3169, 3109, 2988, 3106, 3162, 3009, 3008, 3133, 3063, 2939, 2929, 2892, 2927, 3127, 3159, 2997, 3009, 3067, 2920, 2928, 3209, 3288, 3144, 3133, 3127, 3027, 3102, 3219, 3108, 3066, 3242, 3265]
2276C265j15M2L8m1J06L3k77j28K08N1j13J07J37n7K2J21rOO1q2lK35N3j58Q7J17k42j80J46
2271C430K8j24N9P7j3J21O5j82mK31j1j13J18pk28L0J74o7pJ85k3j20R6K6r9J31J33j50kK31
2267C985Qn2J54m9k37R0J53j54nK23m6n1K84P3k26P3J49j70K1K69j20k33J75O9k10J26K53
2263D552q6R2M10L4j94J18K7k24Q5K13q2Q4L50M4l7K47J8k01K02K24j98O0M24O4lL83J23j96
2259F533K24K66k10L9L97m7j37L74K33n2L35L27q2L21O73R4K0N87L16k7N16N29j7M16Q60K59
2255A2747K72R63N82K07J028J113K98O69J242N99O50J598J277Q47J899K285J667K418L442
2252C5803L261M421P161Q714J0514J4343J7162J8899K3098K7673L0105L4705M2391M9131N8337
2250C85718P2857Q3408Q7008R1374Q2191K9487n4484j13433j18423r5125p4603o0456m7483
$$ y = [3265, 3150, 3192, 3230, 3189, 3295, 3328, 3051, 2923, 3131, 3182, 3069, 3176, 3313, 3256, 3278, 3399, 3390, 3396, 3457, 3375, 3372, 3607, 3660, 3502, 3589, 3706, 3464, 3284, 3430, 3458, 3334, 3393, 3470, 3457, 3578, 3643, 3461, 3457, 3688, 3677, 3564, 3682, 3675, 3447, 3477, 3651, 3584, 3577, 3762, 3739, 3619, 3715, 3741, 3642, 3773, 3906, 3756, 3754, 3985, 3993, 3941, 4095, 4046, 3809, 3899, 4052, 3898, 3893, 4116, 4070, 4019, 4303, 4376, 4150, 4223, 4372, 4202, 4223, 4492, 4372, 4139, 4314, 4383, 4173, 4299, 4552, 4466, 4558, 4968, 5002, 4808, 4926, 4953, 4729, 4814, 5027, 4945, 5029, 5379, 5423, 5386, 5633, 5651, 5450, 5652, 5876, 5678, 5738, 6162, 6226, 6223, 6606, 6729, 6533, 6757, 7023, 6813, 6852, 7249, 7202, 7065, 7439, 7672, 7620, 7955, 8282, 8200, 8521, 9194, 9288, 9308, 9895, 10211, 10184, 10700, 11229, 11212, 11628, 12488, 12747, 13019, 13982, 14564, 14771, 15799, 16912, 17210, 17879, 19121, 19720, 20370, 21968, 23245, 24092, 25991, 28276, 29943, 32361, 35803, 39064, 43485, 50646, 59360, 69874, 84217, 101379, 120278, 143376, 171049, 201154, 235859, 278250, 327381, 385718, 458575, 541983, 628991, 720365, 802556, 832043, 777559, 664126, 545703, 450578, 375975, 315519, 268036]
2248B68036l7562l1952k7473k2624j8487j4785j0665p487o188m736k325j061n75J394L440
2246H6950M397P399J2562J6362K0460K7193L2598L6626M4821N4336O0396O9548Q4583R8961
2244F57192J18029J47804J70686J78351J87115J70650O1454j20337k47295k51063j96097j54405
2242G22084j25169r5871p6823o7178n6175m6240l9787l0934k1776j8321j6511j2612j0532
2240A04155j0135p510m620l772k102R85K994M940Q557J2096J4832J8561K3034K6675L0486
2238B19176L6050M2493M9712O0576P4386Q4516Q9575R2971Q0409K5572o0417j21521j25368
2236E48130r9558p8970o4492m9618l9907l5463k9853k4350k1211j6857j1989j0482r658o917
2234D8805n642o032m667l083l401l035j649j868k356j309r29j550r61k44q63r17j63m86q68
$$ y = [268036, 230474, 198522, 171049, 148425, 129938, 115153, 104488, 97001, 90813, 86077, 83752, 82691, 82116, 83510, 86950, 91347, 98746, 111308, 127670, 148130, 175323, 207921, 244547, 289368, 343704, 404100, 473648, 558231, 657192, 775221, 923025, 1093711, 1272062, 1459177, 1629827, 1691281, 1570944, 1323649, 1072586, 876489, 722084, 596915, 501044, 424221, 357043, 300868, 254628, 214841, 183907, 162131, 143810, 127299, 114687, 104155, 94020, 86510, 81890, 78118, 76016, 77001, 79995, 84935, 93492, 105588, 120420, 138981, 162015, 188690, 219176, 255226, 297719, 347431, 408007, 482393, 566909, 656484, 749455, 829864, 855436, 795019, 673498, 548130, 448572, 369602, 305110, 255492, 215585, 180122, 150269, 125919, 104708, 87851, 75862, 65380, 55722, 48805, 43163, 37131, 32464, 29381, 25980, 22945, 21296, 19428, 17072, 15763, 14834, 13284, 12323, 12079, 11216, 10299, 10136, 9650, 8782]
2231H782j46p0o70j94K33m96n65J41j51n43L5K9n83j89K72k41k26L73j5n08K1J86l19j88L2
2228E000l36j40M02k0m25J07K12k80o0K47j90k47K10K0k85J8K0k87j0J80k17j39K66l4k92
2224C720J21J31k49MK47j32j48J91m7k63P4M4k62M3K74j47k14J40L5r8J67N1k85k6J82j73
2220C380j71J91K6k19J7Q7r1J9J8k39k0L49J04j17J51J26j97j26j8j72n6J16j31j75J96J78
2216C226q9M7J45j01j26j4j16mK37j9k52R2K16j11o8J22j15j58J76J04j46N1J19j65o6J98
2213C183kj32Q9K3j62L6J32o6OJ15j29j53J05mj39J89K95m9j06Lj77j59J42P5r0J18J44j32
2208C155p6P0j24j10J77N9j75KN7j64l6J74n7j63Q8R2o6Rrj23P6J56j87k04J60J34o3P0L4
2204B956k24k0L00P0j38O5P8j04rQ3o0n6M4l7l5R2Lq2N8M7q5M1J44n5j50r2j40l7K03M3k05
$$ y = [8782, 8636, 8566, 7896, 7702, 7935, 7439, 6874, 7015, 6864, 6321, 6356, 6385, 5802, 5613, 5885, 5644, 5418, 5791, 5776, 5268, 5289, 5475, 5156, 4968, 5000, 4664, 4524, 4926, 4906, 4481, 4588, 4800, 4520, 4460, 4707, 4517, 4270, 4480, 4500, 4215, 4233, 4253, 3966, 3956, 4136, 3919, 3780, 4046, 4012, 3720, 3841, 3972, 3723, 3727, 3974, 3842, 3694, 3885, 3838, 3575, 3649, 3693, 3431, 3474, 3748, 3601, 3387, 3527, 3562, 3464, 3631, 3682, 3397, 3371, 3553, 3380, 3209, 3400, 3426, 3207, 3224, 3311, 3220, 3239, 3257, 3018, 2998, 3347, 3451, 3334, 3485, 3611, 3414, 3288, 3270, 3098, 3042, 3158, 3027, 2852, 3048, 3226, 3137, 3184, 3329, 3228, 3102, 3088, 2972, 2968, 3205, 3186, 2934, 3026, 3242, 3131, 3063, 3185, 3070, 2912, 3088, 3192, 3046, 3097, 3216, 3051, 2985, 3183, 3181, 3049, 3138, 3161, 2999, 3035, 3167, 3101, 3107, 3222, 3093, 2940, 3045, 3041, 2902, 3091, 3386, 3337, 3231, 3234, 3057, 2898, 3040, 3115, 3025, 3143, 3287, 3155, 3079, 3149, 3025, 2915, 3092, 3151, 2976, 2978, 3035, 2871, 2835, 3009, 2952, 2789, 2877, 2969, 2903, 2912, 2903, 2780, 2856, 3012, 2825, 2621, 2781, 2915, 2852, 2922, 2956, 2732, 2712, 3012, 3082, 2944, 3009, 3087, 2983, 2974, 3057, 2997, 2941, 2985, 2948, 2913, 3005, 3008, 2926, 2984, 3031, 2946, 2987, 3131, 3076, 2926, 2834, 2694, 2657, 2860, 2903, 2698]
2200B698K2J90o9j00J03n6j95J06K05o5n7J10j2q9N2L8m4K3l0j37NJ19jj0L6q8o7J09kj13
2195B681J31J65j20k6K22k1k30PN9j17K6J57p2j03Q8m0j78M3J09o7J6J39k8n1J33P1n8M1M7
2191C024p0OL1j52j06J17P8j8O3mj48l0N3j14j12P7P7L4J05L2j03k3M8j0J8kj37k2J83Qj49
2186B754R5J53j33j11J20M2m0R4L8j09J4N9j21n6J52P0l4L1j4m1J25M1k64j67J19M5l1J35
2182B966Q1j31m2J01L3J7J2j64j69M1M6j0J33R4j28j5J90Nj35O7J06o0j1R3J6PO1k1k7J12
2178C268R0mM2N6N0K38L56K23J95L08L05L68N54N01L76M43J84m84o81l94m36o01l21q5k52
2174D299l14j85k01j62Lm6j36L6J19l0l6N7K0N4J24m8j36J13K34J08J69K93K16K32L96L94
2170E573M25O84P87P31R04J100J022Q25K99p47j470j292r69r58p80m74m33l95k20k82m14k22
$$ y = [2698, 2720, 2910, 2841, 2741, 2844, 2788, 2593, 2699, 2904, 2839, 2782, 2892, 2880, 2791, 2843, 2881, 2837, 2860, 2830, 2693, 2698, 2817, 2816, 2806, 2842, 2754, 2687, 2796, 2794, 2681, 2812, 2977, 2857, 2831, 3053, 3032, 2802, 2809, 2868, 2751, 2777, 2934, 2862, 2759, 2847, 2807, 2629, 2672, 2781, 2714, 2730, 2869, 2841, 2790, 2923, 2994, 2936, 2977, 3024, 2954, 2960, 2991, 2839, 2733, 2850, 2928, 2910, 2973, 2969, 2821, 2791, 2844, 2730, 2618, 2695, 2772, 2806, 2911, 2943, 2840, 2817, 2865, 2855, 2873, 2871, 2734, 2712, 2895, 2903, 2754, 2849, 3002, 2869, 2758, 2878, 2920, 2880, 2974, 3012, 2903, 2917, 2976, 2855, 2799, 2951, 3021, 2987, 3018, 3004, 2963, 3088, 3129, 2865, 2698, 2817, 2862, 2831, 2966, 3047, 2916, 2874, 2975, 3008, 3025, 3037, 2873, 2704, 2745, 2791, 2781, 2914, 3008, 2880, 2865, 3055, 3060, 2925, 2992, 3098, 3038, 3027, 3120, 3136, 3143, 3204, 3183, 3156, 3268, 3358, 3354, 3396, 3452, 3502, 3740, 4096, 4319, 4514, 4822, 5127, 5495, 6049, 6550, 6926, 7369, 7553, 7069, 6388, 5994, 5558, 4957, 4636, 4551, 4299, 3985, 3800, 3599, 3437, 3440, 3394, 3258, 3294, 3413, 3383, 3347, 3404, 3424, 3478, 3602, 3554, 3418, 3531, 3765, 3873, 4042, 4335, 4551, 4783, 5179, 5573, 5998, 6682, 7469, 8200, 9104, 10204, 11226, 12051, 12350, 11603, 10133, 8841, 7872, 6914, 6134, 5660, 5227, 4832, 4612, 4330, 3916, 3694]
2167C694k3n5m2k2j51j21Q6L8j17m1K2m4O2J61k5j06J41K99K32J94J82J72K92M08L96M63N90
2163F685N20L18P5l37p00o74m99m73m31k89j82j28j83l52k67P1Q9j88j64K0m4m4J50R3r2l
2159B971N3j12o6J05l3j54O0J56pl6Kq3m1J00L3p8j4Ll2P2R7m6m5J6j23j57Q6J67J5m2p5j69
2155B623o5J37P6p6m4QJ0O3N7j0Kk5j20j9J20k5j27O2J14l1L7J18q6j31Q7M6j26K8J73j0j01
2150B765Kk7p2K1Mn8P4J46%n0j0r5q4Q7Q6l7OL9n3l7J4o8l2J33P8n0M7P6j04j03P6Q4Lj2q2
2145B767j13J8Q3J4J8k7j76j24M6k2r2Q9J14q4l2J44L8r0OM0pO0N7m0N2J49m5j61K8J04l6
2140B778m2M0Qj7Qk9j0Q3L5q0m7J4k3k3M2Q9J02%j75j41N7N1n7L2J15Jl9N1K4n0n4o2K7K33
2135B941J89q9j06P4L7p1l6m3m9Q4Q0r3k7J09j02k59j7J15o5o5J27R9n0n2QM6N5l4r5j1oj20
$$ y = [3694, 3671, 3616, 3574, 3552, 3401, 3280, 3366, 3404, 3287, 3246, 3268, 3224, 3286, 3447, 3422, 3316, 3457, 3756, 3988, 4182, 4364, 4536, 4828, 5236, 5632, 6095, 6685, 7205, 7523, 7598, 7261, 6561, 5887, 5388, 4915, 4484, 4195, 4013, 3885, 3702, 3350, 3083, 3154, 3243, 3055, 2891, 2911, 2867, 2823, 2973, 3066, 2974, 2971, 3024, 2912, 2846, 2951, 2918, 2764, 2824, 2980, 2973, 2937, 2939, 2856, 2815, 2915, 2948, 2870, 2856, 2859, 2827, 2899, 2996, 2950, 2905, 2921, 2798, 2641, 2727, 2894, 2909, 2867, 2792, 2623, 2558, 2695, 2771, 2695, 2651, 2659, 2669, 2732, 2789, 2779, 2781, 2756, 2636, 2617, 2737, 2712, 2585, 2647, 2761, 2730, 2767, 2885, 2799, 2668, 2755, 2801, 2675, 2703, 2876, 2866, 2765, 2767, 2740, 2668, 2689, 2693, 2635, 2709, 2855, 2855, 2805, 2795, 2700, 2616, 2703, 2789, 2752, 2758, 2797, 2744, 2707, 2721, 2653, 2621, 2754, 2832, 2782, 2829, 2905, 2801, 2698, 2774, 2858, 2861, 2849, 2767, 2654, 2672, 2755, 2769, 2787, 2760, 2584, 2460, 2506, 2484, 2392, 2481, 2595, 2511, 2479, 2623, 2661, 2571, 2577, 2617, 2610, 2670, 2727, 2687, 2739, 2888, 2843, 2682, 2710, 2814, 2778, 2736, 2776, 2784, 2767, 2775, 2746, 2736, 2819, 2854, 2774, 2727, 2741, 2718, 2695, 2737, 2826, 2928, 2928, 2753, 2612, 2669, 2720, 2663, 2695, 2810, 2811, 2772, 2823, 2847, 2797, 2743, 2681, 2708, 2941, 3130, 3041, 2935, 3009, 3046, 2975, 2939, 2896, 2847, 2931, 3011, 2918, 2891, 3000, 2898, 2639, 2622, 2737, 2672, 2607, 2734, 2833, 2783, 2731, 2739, 2785, 2840, 2806, 2711, 2700, 2694, 2574]
2131B574m7J16Q2J6M9k8r5O7J41l5m7J00Mj40LJ41M9oK3j5J0J17N9j02j04OP2O1l5j08k7M9
2126B950l4p7QO0P5Q5l8j78j11ml2JJ18J10O5Q2%q7rOj11j9J61L5j30j8L8o4%O6r0r7J26J32
2121C019PO2K7j84j45M9j6r9N5Q3o8oJ54P6n0l6m1o1L1J21J31J20M5q3j30r6n6QK1o0m2Q3
2116B919P4j6PJ9k9L2O2p8r1O9K3j30k7J06lp9l9p8n2J15J15j4M4R2n5r8K0J7j0Q6N7r1n1
2112B916O6M1J5J0p8m9J27J02q3j07o4p4L7J46J2p7L4L1o3M1J17l6r6QJ0j8J2q0j41M4J45
2107B948Mk3L6p8j00R7Q3q8PJ38nq2M4O8K2O1%j06j8N4k7J2R2m9j13O2O4q1RP8j04j03J13
2102C015M6j24K0J23p8j35O1J10Ml0l8l2K0Km3N3J20pq6%N9M5K0m5n0N9O7j3M8J07l4j16l4
2097C114q0j65j9J02j7o5N4N4o1r1m2N5J30K8j00j4O2k9nJ00k5j33M1J12n6n9N0l7q0M7K4
$$ y = [2574, 2527, 2643, 2725, 2741, 2790, 2762, 2667, 2734, 2875, 2840, 2793, 2893, 2897, 2757, 2760, 2901, 2950, 2944, 2967, 2952, 2962, 3079, 3138, 3036, 2932, 2938, 3010, 3071, 3036, 2928, 2901, 2950, 2916, 2839, 2847, 2907, 2982, 3067, 3029, 2851, 2740, 2736, 2704, 2705, 2823, 2933, 2998, 3080, 3080, 2993, 2984, 2990, 2879, 2860, 3021, 3056, 2926, 2908, 2946, 2882, 2882, 2948, 2858, 2761, 2887, 3019, 3026, 3088, 3115, 2931, 2786, 2835, 2819, 2720, 2775, 2858, 2790, 2784, 2938, 3014, 2964, 2928, 2887, 2826, 2857, 2978, 3109, 3229, 3274, 3191, 3061, 2965, 2909, 2917, 2938, 2878, 2836, 2919, 2993, 2977, 2984, 3003, 2974, 3006, 3068, 2990, 2899, 2968, 2991, 2861, 2834, 2940, 2937, 2858, 2819, 2741, 2689, 2804, 2919, 2905, 2949, 3041, 2986, 2888, 2908, 2925, 2915, 3001, 3058, 2967, 2916, 2982, 3023, 3038, 3048, 2970, 2921, 3048, 3150, 3067, 2960, 2896, 2822, 2859, 3005, 3017, 2940, 2974, 3005, 2942, 2983, 3100, 3064, 2968, 2976, 2986, 2968, 2980, 2900, 2759, 2803, 2948, 2952, 2929, 2965, 2887, 2787, 2884, 2967, 2879, 2886, 3024, 3019, 2937, 2981, 3049, 3071, 3132, 3132, 3026, 3008, 3062, 3035, 3047, 3139, 3090, 2977, 3039, 3103, 3022, 3031, 3109, 3005, 2902, 3015, 3061, 2937, 2957, 3080, 3002, 2867, 2928, 3038, 3042, 3012, 2974, 2942, 2962, 2964, 2921, 2974, 3094, 3087, 3001, 3001, 3060, 3105, 3125, 3080, 3030, 3089, 3156, 3143, 3191, 3298, 3264, 3148, 3114, 3034, 2869, 2850, 2952, 2935, 2870, 2924, 2978, 2917, 2826, 2784, 2839, 2969, 2997, 2897, 2883, 2945, 2916, 2911, 3011, 2986, 2853, 2894, 3006, 2950, 2891, 2941, 2904, 2824, 2871, 2895]
2093B895o7N4J17j9k0M6j04j40J07J50p3r7K8J2J6R1J0q6nL1n5l7K2kJ0K2q4j22kK2j1J14
2088B823J87K2r8m5L2J00J08o2j68j1Q0n6r4J9K2j2N9N2o6j04p9n4M2J26O1j0J9K8%j1m9o8
2083B793k9p8j57k9J31N9k1O8P9J8Q9R8p9j42m9n0j7J13P2m0R1J59r7k08K3J19k1n1Nk4n2
2079B773m4j7Q5R8p2r8R8Q3j35j08O6O4J8L8j6j9J00N5j09l8Q0o2j54J7R8m7j24l9Q2J41M6
2074B860j11j15k2%N0J03j3r6M2R3l0L5J68J9j58p3lk8N5R0k9mR2n4j62J7O8j14r1Q4M0n4
2070B659J0N9N6R7M1q8o0J9k4k4N0K4MP0Oj25n2L7l9j7J11K2j27k2J13N9Plo0m9K7OpP4K4
2064B878j13m9M7n8j00M1N8n8l3O0N0K9Nq1r3NK2l8j7K0K8P1R0K0j1K0k6p1RQ2K2p0r9o2J9
2059B597O0L2J2J0j9j8j2q0p2R7J21q3j40K7O1l7l2Jl3J4R3K8m5K8P5j6r6n6N3J14N1l3j2
$$ y = [2895, 2828, 2882, 2999, 2980, 2960, 3006, 2902, 2762, 2869, 3019, 2946, 2849, 2877, 2889, 2905, 2996, 3006, 2920, 2915, 2946, 2891, 2854, 2876, 2874, 2884, 2906, 2822, 2700, 2698, 2720, 2709, 2823, 3010, 3032, 2934, 2889, 2921, 3021, 3129, 3067, 2899, 2888, 2968, 2912, 2818, 2837, 2859, 2847, 2906, 2958, 2892, 2788, 2709, 2655, 2697, 2823, 2884, 2874, 2893, 2921, 2921, 2910, 2861, 2793, 2764, 2686, 2529, 2500, 2631, 2690, 2669, 2737, 2816, 2834, 2923, 3021, 2942, 2800, 2751, 2701, 2684, 2797, 2869, 2829, 2920, 3079, 2982, 2774, 2797, 2916, 2895, 2844, 2849, 2825, 2773, 2729, 2712, 2797, 2895, 2823, 2725, 2823, 2906, 2771, 2663, 2729, 2793, 2811, 2849, 2833, 2814, 2914, 2969, 2860, 2822, 2902, 2840, 2686, 2703, 2801, 2754, 2630, 2591, 2673, 2814, 2860, 2749, 2634, 2612, 2612, 2662, 2765, 2752, 2656, 2698, 2791, 2761, 2796, 2964, 2983, 2825, 2752, 2749, 2721, 2776, 2866, 2837, 2833, 2925, 2871, 2709, 2726, 2794, 2680, 2589, 2673, 2713, 2659, 2669, 2728, 2784, 2881, 2922, 2834, 2774, 2793, 2769, 2745, 2795, 2819, 2823, 2893, 2899, 2774, 2722, 2759, 2720, 2703, 2814, 2836, 2709, 2687, 2800, 2859, 2866, 2863, 2803, 2754, 2781, 2787, 2780, 2854, 2878, 2765, 2716, 2763, 2705, 2605, 2646, 2704, 2646, 2613, 2673, 2723, 2752, 2757, 2676, 2583, 2588, 2610, 2572, 2555, 2575, 2603, 2674, 2764, 2784, 2773, 2793, 2767, 2696, 2705, 2787, 2809, 2739, 2640, 2578, 2597, 2657, 2689, 2701, 2711, 2692, 2674, 2662, 2582, 2510, 2607, 2728, 2645, 2505, 2532, 2593, 2556, 2524, 2525, 2492, 2506, 2599, 2627, 2582, 2610, 2685, 2669, 2573, 2517, 2570, 2684, 2735, 2702, 2690]
2055B690J8mL6R2K4j2Q8O5j10j34l0MM2O3j02j98J0J45k0r8K1L8j7L2M2l5n3n0k5J07J24q2
2050B671j19R0J00o2j6P8J1RM2j24j96K7J25oQO8q7j51M1J21Pl7j7RN7nj40p4K5j00j06J79
2045B428K24m0o6R3L9l9L6qq1P1J40l4m5R4Mj19j2Pj22l2J19j3j29L2J18j9p3j0oK9J25O6
2040B777j16j31L2J00Ko8LP8L1m0m7k8J1R3R8l6j28o9L0O5kj30j16Q6J49k3r0L0L6m1J1N2
2036B619n5o9O3R5J2l4o1q2m5rl4j0N9O0L5L7J5qM5J03P1j8j18j57n0P9L0q9o6O2J20O2m0
2031B622o9mL1K1N1M8m5l5P6J4j26n6L7o1o4J17J52M0j7j24k40p4J66J06JJ09J18l8m3K1p5
2026B659j17j2Kj2J04R6r7j22N4R9k0j03r1RQ5jq5K0Q2m7q0M2N6oK8J5r6q6K6M3K3N2O3M7
2021B630J3p6j22j0P1J0l2j9k4L9J42Q5o1q1k4M3J21N1j58j25J15J24j9MJ7r7k9J13m3k02
$$ y = [2690, 2708, 2704, 2740, 2832, 2856, 2844, 2932, 2997, 2887, 2753, 2723, 2727, 2769, 2832, 2730, 2532, 2542, 2687, 2667, 2569, 2590, 2628, 2611, 2643, 2685, 2650, 2597, 2547, 2522, 2629, 2753, 2671, 2552, 2642, 2742, 2680, 2664, 2742, 2753, 2762, 2804, 2680, 2484, 2511, 2636, 2630, 2638, 2706, 2619, 2468, 2509, 2630, 2637, 2600, 2583, 2592, 2649, 2644, 2504, 2430, 2455, 2355, 2249, 2428, 2652, 2612, 2546, 2639, 2678, 2639, 2675, 2667, 2586, 2657, 2797, 2763, 2718, 2812, 2816, 2697, 2685, 2692, 2570, 2538, 2657, 2644, 2515, 2547, 2665, 2646, 2573, 2563, 2557, 2586, 2711, 2777, 2661, 2530, 2562, 2662, 2664, 2596, 2599, 2677, 2708, 2668, 2621, 2593, 2604, 2697, 2795, 2759, 2631, 2562, 2592, 2657, 2655, 2525, 2409, 2495, 2644, 2621, 2531, 2561, 2597, 2556, 2567, 2619, 2564, 2495, 2558, 2653, 2665, 2631, 2570, 2488, 2443, 2434, 2400, 2390, 2449, 2509, 2544, 2581, 2596, 2588, 2633, 2736, 2807, 2789, 2671, 2514, 2464, 2543, 2573, 2484, 2418, 2480, 2600, 2662, 2622, 2553, 2549, 2580, 2601, 2652, 2700, 2655, 2620, 2696, 2710, 2584, 2528, 2565, 2504, 2440, 2557, 2709, 2749, 2732, 2608, 2368, 2294, 2460, 2566, 2567, 2676, 2794, 2756, 2713, 2734, 2659, 2542, 2530, 2532, 2520, 2624, 2720, 2623, 2501, 2555, 2654, 2634, 2531, 2440, 2449, 2534, 2533, 2448, 2468, 2550, 2503, 2423, 2465, 2521, 2515, 2543, 2558, 2462, 2376, 2402, 2445, 2468, 2520, 2583, 2630, 2643, 2567, 2445, 2435, 2506, 2516, 2484, 2465, 2441, 2480, 2622, 2707, 2646, 2565, 2541, 2584, 2705, 2756, 2598, 2473, 2588, 2712, 2693, 2697, 2714, 2617, 2588, 2701, 2658, 2456]
2017B456pJ42jo5L4L9J4K6q2j67lJ14j1m2J02J00j6kM1mk7k0o5p2mK0kK4O1L6k2m4nL5j2o4
2012B507PQ9L6k7%Jn1n2j1J9M5Jq9n4P5P1k5k1L4K4J5Kn6q3o1p1m2R1J58O9l1o8q4k9O0N3
2006B502LJ6J1m7m7j6k5K5J28R0o2r5J5R1N7k8o8j2N3M5lm4n9j5L5LJQ4P1m1nJ01J0j09m3
2001B622Nn7nP2l1j13j9J1o2J4J48J10on6o7n2k9o5m2J03J15n4r6K0J9o3l7K4M1Q9R2po4m0
1996B520n1m5M2O3l6q7l7J0K5K1J1K0Jo5o1M9J15P2%m7k3N8K6j01n7Q2Mj50q1K9k1j0J02Q4
1991B462j1k2k7jJ11R6r8j21N8J08J3k9n5m9N1N0j01j04M8N5k2K6N7ol5n2m5J19K26K2j77
1987B547r5l6j28p1J04J18N1K6j8m8j7l8k2J04Q5r2m3J33L9j21n0j4q5K4J37j0q3O2L9j04
1982B394jJ32J4o7J6kn6L3M8j09j46j0N8L4M3N7L0j4l1K3O4m0j39l8Q6M6j5j0l9n0K6M8K7
$$ y = [2456, 2449, 2591, 2590, 2525, 2559, 2598, 2612, 2638, 2556, 2389, 2386, 2500, 2489, 2447, 2549, 2649, 2633, 2631, 2672, 2668, 2641, 2621, 2556, 2484, 2480, 2500, 2498, 2522, 2583, 2619, 2597, 2553, 2548, 2583, 2571, 2507, 2514, 2603, 2639, 2612, 2612, 2613, 2562, 2510, 2499, 2518, 2563, 2564, 2475, 2421, 2496, 2567, 2542, 2521, 2555, 2579, 2594, 2596, 2540, 2457, 2396, 2325, 2283, 2374, 2532, 2601, 2570, 2502, 2418, 2389, 2449, 2502, 2505, 2521, 2532, 2485, 2438, 2422, 2397, 2422, 2550, 2640, 2578, 2483, 2498, 2589, 2646, 2618, 2550, 2538, 2591, 2636, 2633, 2589, 2530, 2515, 2550, 2553, 2554, 2638, 2709, 2668, 2663, 2764, 2774, 2665, 2622, 2627, 2570, 2565, 2637, 2606, 2493, 2474, 2485, 2423, 2437, 2585, 2695, 2689, 2633, 2566, 2514, 2485, 2420, 2378, 2481, 2596, 2542, 2446, 2466, 2485, 2422, 2385, 2409, 2450, 2539, 2631, 2624, 2560, 2520, 2469, 2424, 2466, 2529, 2493, 2406, 2369, 2379, 2404, 2425, 2436, 2456, 2457, 2392, 2331, 2380, 2495, 2567, 2567, 2520, 2497, 2555, 2581, 2480, 2423, 2505, 2509, 2359, 2278, 2307, 2286, 2276, 2378, 2462, 2451, 2429, 2402, 2401, 2512, 2608, 2510, 2389, 2447, 2555, 2568, 2539, 2484, 2435, 2486, 2536, 2435, 2331, 2379, 2434, 2412, 2438, 2495, 2489, 2454, 2402, 2357, 2476, 2702, 2724, 2547, 2452, 2416, 2288, 2217, 2321, 2439, 2490, 2516, 2498, 2450, 2433, 2395, 2373, 2477, 2562, 2470, 2427, 2560, 2599, 2478, 2428, 2414, 2329, 2353, 2490, 2480, 2397, 2459, 2498, 2394, 2393, 2525, 2539, 2472, 2488, 2486, 2430, 2463, 2511, 2402, 2256, 2246, 2304, 2338, 2381, 2438, 2468, 2454, 2423, 2446, 2510, 2470, 2331, 2293, 2379, 2425, 2410, 2400, 2361, 2311, 2337, 2385, 2412]
1977B412Q5R8l2q6NOp7l3J02J35L3r1q6M8O9p0r4L0L5o4m8L7P8Q2Lj18p0O1K8l5L8K0j05m9
1972B347P4No7qj8m3O4O1j24j25P1J18M4L6%l0O0N7j13j30L2N4m0l3J2L6J03J20M0Olo6m3
1968B497O6O3oom2q8J9J07k1j09k5Mm1k6m3n7P8J30m8p9J01P5j02n2N8MPR4K8n1J4J2q6o0
1963B415j3q0p4K0J0j1N4K9n7J2J09L6p9r1j5J06J13n9j29J7N9l4O4J92K9j45m0O8J5j1nm3
1958B462j8Rq2j04M2P6m5p4LM1O2O6J9j3o1j54j08J10J49l1r0JJ7nK1K2M3Q7Qj02j0J06K7
1953B474n6l3p1q7N9J48M7l0j6k0LJ9o6q4P2J39L6lJ0o0j03m0K1O2N6p1j24L8J02o9j10L4
1948B277L4n5%M9j1RQ0L2l0OM9P1M0j05j57K6J35%l9R0P6m9m1L6N2K7o2j30j4J18L8n5j9l6
1943B442q6JM5n3o3Qk7KJ39O9j35r9J3p4q5J07J65L3j7nl2jO1K4l8k5J1N4N4l1m7K9m5j92
$$ y = [2412, 2497, 2595, 2563, 2477, 2482, 2488, 2411, 2378, 2480, 2615, 2648, 2557, 2471, 2519, 2588, 2518, 2424, 2454, 2489, 2425, 2377, 2414, 2492, 2574, 2577, 2459, 2389, 2450, 2478, 2443, 2481, 2501, 2396, 2347, 2421, 2426, 2359, 2351, 2333, 2290, 2354, 2415, 2291, 2166, 2237, 2355, 2399, 2435, 2435, 2405, 2465, 2522, 2409, 2279, 2311, 2365, 2325, 2292, 2304, 2340, 2443, 2563, 2603, 2609, 2606, 2540, 2497, 2563, 2626, 2620, 2614, 2572, 2484, 2503, 2610, 2589, 2480, 2455, 2459, 2418, 2392, 2349, 2292, 2370, 2500, 2452, 2373, 2474, 2549, 2447, 2395, 2453, 2457, 2464, 2558, 2586, 2535, 2549, 2561, 2475, 2415, 2402, 2322, 2248, 2268, 2278, 2267, 2321, 2350, 2293, 2305, 2414, 2450, 2371, 2280, 2265, 2371, 2484, 2425, 2296, 2313, 2372, 2338, 2402, 2594, 2623, 2478, 2438, 2506, 2521, 2510, 2505, 2462, 2444, 2453, 2371, 2267, 2309, 2385, 2340, 2266, 2269, 2310, 2372, 2438, 2457, 2444, 2383, 2229, 2121, 2231, 2380, 2349, 2259, 2260, 2277, 2272, 2293, 2315, 2358, 2445, 2453, 2351, 2341, 2447, 2474, 2418, 2385, 2314, 2227, 2286, 2434, 2481, 2451, 2435, 2415, 2418, 2437, 2371, 2287, 2359, 2498, 2534, 2531, 2541, 2481, 2378, 2338, 2359, 2421, 2477, 2406, 2282, 2320, 2422, 2353, 2243, 2277, 2311, 2256, 2256, 2305, 2294, 2303, 2383, 2415, 2385, 2391, 2440, 2511, 2551, 2446, 2289, 2315, 2450, 2450, 2411, 2501, 2577, 2528, 2487, 2523, 2575, 2602, 2540, 2410, 2396, 2514, 2552, 2497, 2478, 2442, 2356, 2357, 2402, 2349, 2286, 2294, 2267, 2269, 2408, 2477, 2342, 2243, 2256, 2182, 2097, 2204, 2369, 2402, 2385, 2380, 2348, 2347, 2408, 2432, 2394, 2369, 2380, 2434, 2488, 2457, 2410, 2439, 2394, 2202]
1938B202o1J65P9r3k7P3L4J0Nn5l9K9j3n3J6J7o7m0N5J12J60J22m8j17l2m9j03K7J40L1p9
1934B401l5L3R3R9o6k12r5N4Ol2L9L6j2M0R0L7l1p2p7J4J08O4m1r0r3m5K4M0L0L0k4o1M0R6
1929B388jj2O7l4j33L0J25l7o9O5J2r5oM3j2Q0J56j6j23k8m5j08L1J01l8l2J14O5n2oJq5l6
1924B310M3rj8N8J9m3J0Lr4o0M9M0MO5R9K8n8q1k2M4J2m4k0J2K8R6Q0r4j47K1J07K2j3Kk2
1919B427pL4RJ3L4p7j53J1J27Mn9J1m1j09L2J58O4m7n5m7k1J7J4K1M3k4r3k9L7JLO4P9O5J
1914B507j04l7J56Q7j66j43L8Qo8PJ9j1J12J41q2j76LJ10O2M1L8L0P0M7n3l9J6n5j02k7k5
1909B404q5n0k9p1KJ20R0L1K8k9m8N0J5j18J5K47J44r6j08k5kM5L4p3p4QjJ6J21P6o1m4J4
1904B546l6l6Mp0j09J5P7J0J0L6opL3%j3L7j0j06p9k6j4N4P5o8j17O3J61L5p6n4J7N5Lo6r
$$ y = [2202, 2141, 2306, 2385, 2292, 2265, 2338, 2372, 2382, 2387, 2332, 2293, 2322, 2309, 2256, 2272, 2289, 2222, 2182, 2237, 2349, 2509, 2631, 2583, 2466, 2434, 2385, 2282, 2309, 2449, 2480, 2401, 2366, 2399, 2492, 2591, 2525, 2313, 2218, 2272, 2278, 2246, 2285, 2321, 2309, 2349, 2439, 2476, 2445, 2373, 2296, 2310, 2418, 2482, 2441, 2351, 2258, 2213, 2237, 2277, 2307, 2337, 2313, 2252, 2292, 2388, 2387, 2375, 2442, 2408, 2275, 2305, 2430, 2393, 2324, 2389, 2401, 2306, 2300, 2343, 2331, 2411, 2567, 2551, 2428, 2400, 2355, 2247, 2278, 2379, 2341, 2309, 2423, 2488, 2436, 2430, 2431, 2346, 2310, 2353, 2344, 2326, 2384, 2403, 2360, 2370, 2373, 2279, 2219, 2268, 2308, 2312, 2377, 2476, 2504, 2446, 2365, 2343, 2387, 2399, 2355, 2335, 2347, 2375, 2471, 2551, 2457, 2310, 2331, 2438, 2460, 2447, 2449, 2427, 2420, 2454, 2463, 2476, 2510, 2433, 2280, 2291, 2418, 2422, 2363, 2374, 2333, 2224, 2256, 2414, 2478, 2431, 2376, 2329, 2308, 2325, 2339, 2360, 2403, 2379, 2286, 2257, 2294, 2295, 2298, 2362, 2441, 2506, 2507, 2403, 2366, 2522, 2609, 2443, 2300, 2338, 2346, 2278, 2285, 2304, 2293, 2405, 2546, 2464, 2288, 2291, 2401, 2463, 2504, 2542, 2572, 2642, 2689, 2636, 2597, 2613, 2558, 2456, 2429, 2404, 2319, 2269, 2240, 2169, 2171, 2291, 2381, 2412, 2440, 2411, 2363, 2413, 2428, 2310, 2325, 2572, 2716, 2620, 2512, 2487, 2485, 2530, 2564, 2491, 2417, 2425, 2424, 2440, 2561, 2637, 2576, 2532, 2546, 2510, 2474, 2478, 2408, 2299, 2314, 2391, 2401, 2411, 2447, 2441, 2434, 2467, 2467, 2454, 2491, 2481, 2375, 2296, 2270, 2256, 2310, 2385, 2317, 2200, 2263, 2424, 2459, 2383, 2329, 2346, 2401, 2404, 2338, 2329]
1899B329M6n3p9P5R4p0p9M5O1O9J15L3n8M7J26Kq0rN9P9N0o7j35q0p2r0L1J05m1j18JL1m1
1894B326J8R7K7n0n0l4J8L7o7r5Q3J70L4m1RJ2J6O1%q2NJ05L9m3l4j1J0pj01j05M2Q6l6k3
1889B416J30J10q1j62n5R4J34L9n0j1L8pn5o7q2l6Q8J36K6j10j37n2K6PNR4P0j08j18M7J5
1885B344j44n6J18N9k9L9M9m7l3P4J28J08Qq1NJ25L3q9l9k1j25j02L0N5M8R5O4j3k5l7p5m4
1880B422j8n1j6L0n6r0K3K3q6k7J31J30N2J4n7q9l6m8q4mM7j1L1J27L4p9k2lo1kL6p5o1J01
1875B225P2o7j5P1Qj8M1K6j1J5L7N3M8o3j40k9K9j03j07Q7J42J8m9m7j2M9J3q5m1N4L2N0J32
1870B415M8n5M5M0j77j34J35R0j39o3J24P6l8n8o0lQ3L8m1j8l8q1L9J61Q3OL6k2j01NJ17P4
1866B587J8kn2l7M9K5o3o7k7k5l8m8MJ09O4j10p2J25J17K1J11J30n7p7P1%j47k1J42N8n7l2
$$ y = [2329, 2375, 2322, 2243, 2318, 2412, 2342, 2263, 2308, 2369, 2438, 2553, 2586, 2528, 2575, 2701, 2703, 2623, 2614, 2673, 2752, 2802, 2735, 2600, 2520, 2448, 2358, 2389, 2494, 2453, 2335, 2336, 2367, 2326, 2344, 2441, 2468, 2418, 2368, 2334, 2352, 2389, 2322, 2227, 2310, 2480, 2514, 2473, 2482, 2494, 2510, 2571, 2571, 2489, 2494, 2599, 2638, 2595, 2561, 2550, 2560, 2553, 2452, 2347, 2389, 2475, 2439, 2416, 2546, 2656, 2575, 2413, 2358, 2452, 2586, 2625, 2575, 2564, 2602, 2595, 2540, 2473, 2391, 2355, 2443, 2579, 2605, 2495, 2358, 2306, 2332, 2339, 2344, 2438, 2508, 2400, 2282, 2329, 2344, 2200, 2144, 2262, 2321, 2292, 2331, 2380, 2333, 2300, 2374, 2502, 2610, 2618, 2537, 2542, 2667, 2700, 2611, 2572, 2551, 2426, 2324, 2354, 2409, 2457, 2552, 2616, 2603, 2578, 2541, 2466, 2422, 2404, 2353, 2337, 2367, 2311, 2221, 2244, 2267, 2181, 2154, 2285, 2415, 2467, 2481, 2424, 2335, 2299, 2251, 2167, 2163, 2210, 2199, 2230, 2357, 2391, 2312, 2290, 2287, 2226, 2224, 2260, 2185, 2124, 2225, 2297, 2230, 2215, 2286, 2294, 2276, 2317, 2343, 2332, 2347, 2384, 2437, 2485, 2422, 2282, 2253, 2282, 2179, 2072, 2159, 2301, 2319, 2270, 2223, 2211, 2260, 2273, 2188, 2147, 2201, 2233, 2283, 2415, 2463, 2408, 2453, 2493, 2316, 2182, 2317, 2407, 2268, 2205, 2329, 2405, 2367, 2309, 2249, 2246, 2329, 2367, 2326, 2308, 2270, 2189, 2228, 2389, 2472, 2478, 2514, 2492, 2391, 2396, 2513, 2587, 2605, 2603, 2551, 2514, 2563, 2588, 2525, 2458, 2431, 2406, 2368, 2320, 2324, 2433, 2497, 2387, 2315, 2440, 2557, 2578, 2689, 2819, 2762, 2685, 2756, 2756, 2609, 2588, 2730, 2788, 2731, 2699]
1861B699PJ8L6J6k1k8n7j16j51j53q3N6J09L3njn1l7P4M8n6J0J28R9O7P6k1j17o5k3p3p7l0
1856B311M0J35Q5r1m2J42Lk23p2J04o2j53OM0lJ15J16o7n4O9j1o9M5M2l8M1R3RL0O3p4r3N6
1851B493j1j73m9J01Lk2Q3J0q8K8P6m7l4P3K5n5j0L6O0J02N9l0rL8j5o2n6m6pJ3o5r5J2M6
1846B384j8J5R5N2l5q0q5OJ03K4o2J1J0r0K5J87N1q8L7M9j32p4J68J67Jr5j59j33K6N8r8j43
1842B177l8M0P3N1n2m5P9O3l7J3L6q8p3Q7P4m1n2p7j00J9R1rl0O7Q4R6J14n4j91j7R9p5r1
1837B193J12Q5m1P3J22p7r7P6K6j51j08L0N9M6J0n6m4KrK0R0N2l6l1mk1m7p4k3J50J93k8j90
1832B302j14j1N2J29N9j07p9M3J4lP9Rj27m9O3J0kM8k3o7L1J8r6k5R6L4qR4R2l4n7L4R6M7
1827B548q6j21K3P4o7r4M1L3o5k4J5m9j1Q0K2k5M4K9n4oM3j8qP1K7m6%M9K5J2kk3j1l9p8K1
$$ y = [2699, 2706, 2724, 2760, 2776, 2755, 2727, 2670, 2554, 2403, 2250, 2167, 2223, 2332, 2365, 2360, 2359, 2308, 2271, 2345, 2393, 2337, 2347, 2475, 2574, 2641, 2717, 2696, 2579, 2514, 2491, 2418, 2341, 2311, 2351, 2486, 2571, 2480, 2438, 2580, 2583, 2360, 2288, 2392, 2330, 2177, 2183, 2223, 2220, 2335, 2451, 2384, 2330, 2399, 2388, 2319, 2364, 2406, 2368, 2409, 2502, 2511, 2541, 2604, 2530, 2437, 2493, 2482, 2309, 2260, 2361, 2364, 2342, 2425, 2435, 2347, 2375, 2451, 2404, 2370, 2443, 2468, 2413, 2403, 2439, 2499, 2601, 2660, 2630, 2621, 2659, 2644, 2582, 2526, 2480, 2473, 2486, 2421, 2326, 2338, 2384, 2366, 2381, 2476, 2528, 2493, 2413, 2328, 2334, 2437, 2461, 2399, 2410, 2420, 2330, 2355, 2542, 2593, 2505, 2542, 2591, 2459, 2385, 2553, 2720, 2721, 2626, 2467, 2334, 2360, 2418, 2320, 2177, 2139, 2179, 2252, 2303, 2251, 2206, 2285, 2348, 2311, 2324, 2360, 2272, 2199, 2286, 2360, 2319, 2267, 2190, 2090, 2109, 2200, 2191, 2161, 2228, 2312, 2408, 2522, 2468, 2277, 2260, 2359, 2284, 2193, 2305, 2390, 2349, 2422, 2544, 2467, 2370, 2446, 2472, 2321, 2213, 2243, 2302, 2348, 2358, 2302, 2258, 2260, 2251, 2271, 2361, 2413, 2377, 2346, 2342, 2321, 2274, 2200, 2177, 2327, 2520, 2492, 2302, 2188, 2177, 2229, 2358, 2417, 2310, 2231, 2274, 2288, 2285, 2364, 2373, 2246, 2197, 2260, 2270, 2268, 2316, 2293, 2226, 2257, 2275, 2179, 2154, 2250, 2284, 2276, 2370, 2462, 2428, 2371, 2405, 2501, 2548, 2462, 2341, 2364, 2438, 2371, 2277, 2318, 2351, 2286, 2262, 2277, 2228, 2217, 2297, 2319, 2294, 2338, 2367, 2313, 2307, 2350, 2332, 2324, 2395, 2422, 2376, 2376, 2425, 2450, 2462, 2460, 2437, 2426, 2387, 2309, 2330]
1822B330J44O3o7l5J5j0j8j9k2K7J2j10o2J26Q1j01l5J34J12K3l5j28j18J6L3m0rj0n1Q2J74
1817B502k2j42K3O5o4k0L8r6j14K8Ol7J21J64Kj0N8m5q7L8J2j20o2L7nj1N6O4P0P5k0p0Lj1
1812B426p9MP3k4l2O5J6p5j2M9K0J6k3p5N3J46p6k37k9J59P4j2k6l6N9J35l6j98r4Rk8NP7
1807B294N7N5O8jlM3r4k06mJ51J3l1Q5j9j75l1J39O7k6l7n9lP2k0r3K6P4l1l3J5m7m6O9P6
1802B345K3M3qj12k1J28O7l6mJ5nN2Q9lj16j58j17J4J20J01M6J1m2k0P9M9p6p3l2j06j01K9
1798B181N6RN3O0k6j4M4l0p4K9O3l5p2PJ02J17j0j48p6Q4R2J9J1%k6k5o2p4O6J41pj02m4o8
1793B241q4P1J07n9o2O9Op9J8N8nL8N3o7o5M0oo0L3P2L3M6k4j30K0J79j9j74M5J59j7o9M3
1788B411M1K2M4m3j02j4mn4M9P5j20j39R6J49Rl5n5j07m4K0k8lR5M4k0M8L5p2l6L6j5k3K6
$$ y = [2330, 2474, 2537, 2470, 2435, 2450, 2440, 2422, 2403, 2381, 2408, 2420, 2310, 2248, 2374, 2455, 2354, 2319, 2453, 2565, 2588, 2553, 2425, 2307, 2323, 2356, 2316, 2307, 2297, 2246, 2328, 2502, 2480, 2338, 2361, 2426, 2362, 2342, 2380, 2284, 2170, 2198, 2204, 2167, 2288, 2452, 2454, 2444, 2502, 2457, 2370, 2408, 2420, 2300, 2238, 2275, 2270, 2259, 2315, 2379, 2449, 2524, 2504, 2434, 2437, 2426, 2347, 2351, 2424, 2400, 2368, 2433, 2449, 2374, 2362, 2411, 2431, 2447, 2424, 2349, 2402, 2548, 2472, 2235, 2206, 2365, 2439, 2427, 2401, 2365, 2424, 2559, 2523, 2325, 2231, 2240, 2212, 2217, 2294, 2351, 2406, 2474, 2473, 2470, 2513, 2419, 2213, 2209, 2360, 2373, 2342, 2427, 2408, 2233, 2202, 2341, 2408, 2382, 2345, 2286, 2283, 2355, 2335, 2242, 2268, 2342, 2311, 2278, 2293, 2246, 2200, 2269, 2345, 2368, 2411, 2403, 2291, 2270, 2398, 2465, 2429, 2425, 2440, 2435, 2487, 2576, 2573, 2457, 2299, 2182, 2196, 2316, 2417, 2463, 2474, 2432, 2412, 2491, 2540, 2464, 2391, 2359, 2253, 2152, 2181, 2237, 2246, 2299, 2359, 2333, 2319, 2363, 2333, 2259, 2288, 2351, 2316, 2244, 2251, 2353, 2470, 2460, 2312, 2236, 2320, 2412, 2431, 2442, 2442, 2416, 2391, 2329, 2255, 2321, 2462, 2455, 2353, 2309, 2241, 2157, 2228, 2335, 2276, 2214, 2283, 2289, 2210, 2228, 2286, 2281, 2319, 2372, 2305, 2240, 2280, 2274, 2214, 2247, 2319, 2352, 2398, 2374, 2244, 2264, 2443, 2424, 2250, 2295, 2454, 2437, 2368, 2411, 2452, 2474, 2518, 2475, 2373, 2359, 2355, 2301, 2350, 2425, 2305, 2166, 2262, 2411, 2420, 2385, 2330, 2223, 2179, 2199, 2171, 2168, 2263, 2307, 2287, 2335, 2370, 2298, 2262, 2298, 2283, 2260, 2286]
1783B286K1R7J97J0k04k3J82J7r7O3Q3o5l9M9l6j30j10p1rN7M7L8M5n3j40j8J13N5k6m0n1
1778B248%O7Qk0J01R1q8p4N9j1q3N3J15j2n0J9K8K8K9m4q8m5l2j0P7N0o5qQ5m3j33O5K33R1
1773B641j30j50k1L6m0m1R8Q7j01o9J53J24o4o8k8q0k4M7o2n9J38J13q2m2M9n5m7J02J9j17
1769B327OJ05J6K1Q0m6j49n9J9M1R0M4q5o8K6L2M5M8n5r5k7n3p1Q6J19q4j12P0R3kJ3K8KN0
1764B455K3j06n8R4M0q3q1p5m5Q0N8j06l7J53P7r7p1jK4R3R6J3L4M5q0p3Q7O3n6kK2q5l7P5
1759B439Rk5O5Qr6pK4j15p9R1O2n2o2p7m6Q2O4o1L0J54Pj17j6K8k9l1n9r0L4J12J1pN4k2j7
1754B266J34N1j44rJ72J8j13pJ8k7j0o2p8R9J07r7k0J81M1p2J15R4j10kP8j66j24K03Q7j92
1749B431KJ91k2j27l2n9J4K16J07r5K9R4j08p5J46J32O7Q4o4j29J02J07j83j33P9p5k12k7
$$ y = [2286, 2307, 2404, 2601, 2611, 2407, 2384, 2566, 2583, 2486, 2549, 2632, 2567, 2528, 2577, 2541, 2411, 2301, 2230, 2221, 2278, 2325, 2363, 2408, 2355, 2215, 2197, 2310, 2365, 2339, 2299, 2248, 2248, 2315, 2323, 2303, 2404, 2495, 2407, 2333, 2392, 2381, 2298, 2351, 2466, 2454, 2404, 2423, 2451, 2479, 2508, 2464, 2376, 2331, 2299, 2289, 2366, 2416, 2351, 2343, 2428, 2385, 2252, 2317, 2550, 2641, 2511, 2361, 2340, 2376, 2336, 2295, 2393, 2480, 2379, 2310, 2463, 2587, 2523, 2455, 2427, 2347, 2323, 2370, 2308, 2249, 2387, 2500, 2418, 2376, 2425, 2370, 2323, 2425, 2444, 2327, 2333, 2438, 2454, 2475, 2555, 2509, 2360, 2301, 2320, 2361, 2451, 2495, 2410, 2342, 2368, 2400, 2445, 2493, 2438, 2343, 2316, 2263, 2192, 2278, 2397, 2313, 2201, 2271, 2364, 2362, 2375, 2403, 2405, 2455, 2478, 2372, 2314, 2408, 2448, 2365, 2284, 2209, 2164, 2244, 2302, 2196, 2159, 2312, 2389, 2292, 2221, 2220, 2244, 2337, 2433, 2446, 2480, 2525, 2445, 2372, 2459, 2522, 2466, 2464, 2486, 2401, 2364, 2439, 2448, 2423, 2488, 2496, 2400, 2393, 2417, 2302, 2223, 2314, 2376, 2324, 2262, 2185, 2139, 2221, 2285, 2224, 2254, 2408, 2415, 2298, 2282, 2310, 2281, 2250, 2191, 2101, 2135, 2247, 2258, 2251, 2305, 2283, 2266, 2400, 2451, 2307, 2298, 2470, 2488, 2375, 2368, 2386, 2359, 2349, 2287, 2209, 2308, 2415, 2318, 2298, 2479, 2520, 2448, 2563, 2657, 2547, 2545, 2623, 2457, 2333, 2536, 2623, 2431, 2433, 2624, 2602, 2475, 2443, 2384, 2398, 2614, 2721, 2626, 2655, 2749, 2641, 2566, 2712, 2844, 2911, 2995, 2931, 2802, 2904, 3011, 2828, 2695, 2774, 2699, 2487, 2460]
1745B460J2r3P8J98l1j36K5O5L1O6j4j11k7k0j14K2J52n3j78RJ08M9L6m8j25L8R4j39j17J67
1741B404R9j07N6J77l1p2P8j9j67p2RPR7J40Q2J09Q3n8j7P2j28k28L2R9j03l3J34k1j31J7
1737B508J3r1RN7n8RJ20k3j06M5J05N7N0m5j05N9P0j72r2K10J03j22N5K00lr1K2L0M7J13k7
1732B947j73n3J4j05j01l2r1o2M9j9n3J27J57k0l0M6k7m9K7lj2Q3L8o7k0k0r4M8J97L4r1K9
1727B674L5n3POp0Q7J93n3j31J19J04j47j07Lr2o0R3J2j04m8n7o1J03P9j49q3J32N9k6P0N
1723B540j02O8J54rMJ66J35J11J77Q3L7K42K68R2K01M13L70L89N06L33K03M53M85P8k09l97
1719F791p18p09l56l42n09k91n8j37j36q1k37k25N2R6%R4M7j62n3J29j2l9J71J07jK49L60
1715D030J55K61N60N17M65O65P32P21Q63P67M93O57Q79L90m40j015j389j397r23o10o66n30
$$ y = [2460, 2472, 2379, 2457, 2655, 2624, 2488, 2513, 2578, 2609, 2675, 2661, 2550, 2523, 2503, 2389, 2411, 2563, 2510, 2332, 2341, 2449, 2498, 2534, 2486, 2361, 2399, 2493, 2354, 2237, 2404, 2503, 2396, 2452, 2629, 2598, 2526, 2604, 2585, 2418, 2346, 2355, 2362, 2459, 2599, 2681, 2790, 2873, 2815, 2798, 2870, 2742, 2514, 2546, 2645, 2542, 2509, 2643, 2622, 2491, 2508, 2521, 2430, 2439, 2496, 2438, 2447, 2567, 2544, 2438, 2483, 2588, 2645, 2695, 2650, 2545, 2604, 2674, 2502, 2410, 2620, 2723, 2601, 2656, 2856, 2853, 2762, 2784, 2814, 2861, 2974, 2947, 2774, 2721, 2735, 2630, 2529, 2497, 2406, 2344, 2393, 2374, 2321, 2448, 2605, 2585, 2555, 2601, 2574, 2525, 2552, 2549, 2537, 2620, 2658, 2591, 2571, 2551, 2457, 2505, 2702, 2736, 2645, 2674, 2709, 2656, 2663, 2669, 2599, 2686, 2879, 2826, 2695, 2814, 2918, 2771, 2664, 2667, 2575, 2515, 2608, 2620, 2516, 2468, 2411, 2350, 2453, 2532, 2383, 2300, 2432, 2491, 2465, 2535, 2540, 2438, 2506, 2660, 2651, 2655, 2821, 2956, 3067, 3244, 3327, 3364, 3606, 3874, 3966, 4167, 4580, 4950, 5339, 5845, 6178, 6381, 6834, 7319, 7397, 7188, 6791, 6073, 5364, 5008, 4666, 4157, 3866, 3808, 3671, 3535, 3454, 3217, 2992, 3044, 3140, 3140, 3234, 3281, 3119, 3066, 3195, 3183, 3144, 3315, 3422, 3421, 3670, 4030, 4185, 4446, 5006, 5523, 5988, 6653, 7385, 8106, 8969, 9736, 10229, 10886, 11765, 12155, 11715, 10700, 9311, 7914, 6991, 6381, 5715, 5185]
1712E185k92m06n08k81j31j30m8p4j84k4J38l6j27L5N6kO0Kp8J27K13k3K0L43L21J76L34L95
1708E061K40L04M05K61K67M29K16k18m56o33p03m71l30m15k45jj82l18n3M5j14o0j0j43n3
1704B823Q7j37k11O9M4j67M1J72j17j36R8m3j26J92J70j77k4K43j2j82K7Mj29Q2J82k3l5P1
1700B786l5o1L2n2l9J68N0k08n0J29k1jJ57j9j68oj7j21J10K16q1j40O5J5m2P3p1k37K9J89
1695B650j8L2K05k8j56J01Q1j40qO6j47l4J99l7j75J13J10j26K2J26j03l0J85q3k42J04J74
1692B841q2K0J41r6j02J16j5j30P5N3j30M7J55q1n6J49rj24O7Lj52R9K07r9r1J36n2j98O6
1687B758J21l9Q4J05j75j24J37Nj09J02N7j72l0J31j9k2J16M7K5J05l4n8K23J54k00q1J39
1683C246j27k61RO3k0J11M9j18J43K91j33k84N0O0j05R1J62l4K9P8j99j78J13kj44J14J05
$$ y = [5185, 4893, 4487, 3979, 3698, 3567, 3437, 3389, 3315, 3131, 3107, 3245, 3209, 3082, 3117, 3173, 3171, 3231, 3233, 3155, 3282, 3495, 3472, 3492, 3835, 4156, 4332, 4666, 5061, 5301, 5605, 6010, 6271, 6538, 6967, 7183, 6965, 6509, 5876, 5173, 4702, 4372, 3957, 3712, 3711, 3529, 3211, 3158, 3203, 3089, 3029, 3019, 2876, 2823, 2910, 2773, 2562, 2631, 2675, 2508, 2549, 2721, 2604, 2468, 2566, 2523, 2397, 2589, 2759, 2582, 2558, 2801, 2789, 2607, 2634, 2638, 2509, 2591, 2773, 2750, 2715, 2786, 2751, 2690, 2722, 2670, 2631, 2799, 2849, 2641, 2591, 2720, 2699, 2698, 2855, 2836, 2668, 2662, 2645, 2524, 2634, 2850, 2769, 2629, 2694, 2709, 2667, 2740, 2669, 2432, 2461, 2650, 2632, 2664, 2869, 2841, 2685, 2786, 2867, 2727, 2719, 2785, 2638, 2604, 2803, 2766, 2591, 2704, 2814, 2688, 2710, 2836, 2733, 2703, 2888, 2805, 2563, 2667, 2841, 2759, 2779, 2920, 2824, 2722, 2838, 2823, 2693, 2768, 2821, 2691, 2738, 2893, 2812, 2756, 2905, 2896, 2772, 2839, 2842, 2690, 2789, 2996, 2897, 2806, 2942, 2890, 2692, 2758, 2879, 2840, 2924, 3029, 2854, 2730, 2867, 2872, 2763, 2865, 2922, 2750, 2720, 2851, 2832, 2810, 2926, 2973, 2998, 3103, 3069, 3011, 3234, 3388, 3188, 3107, 3246, 3119, 2858, 2867, 2930, 2910, 3021, 3070, 2952, 3095, 3386, 3253, 2969, 3019, 3079, 2974, 3065, 3227, 3193, 3222, 3300, 3101, 2923, 3036, 3034, 2890, 3004, 3109]
1679C109j72J5K59K7m8J61K7j30Q2P6j31M4J54j31j28R2q6j63J14Ok39R7K70j61j77K20R0
1675C277j29R5O4j63P5J88j63j05J98m1j68J92R6k35R2L15j13j31K42M1j87Q3L3j95J51L03
1672C815j54j40K22mj52K21J16k66QJ89j81n0L39Nj95K70K30j95L8K36r6M4L86nk20K00N1
1668D712l98n3J95j99p2L10o0k11K87J17l65N6L41j79j46L02k2k54K10J45k61N1K30j51L0
1664D615L20j53j44N54L20k28K53M50j53R7O88J90n6N87L59l73o1J27m55k15L73j40m04K85
1660F836K09k59K86M89k49j00N09M4j71M84K82k14M05N95j29J66P70J22q1O92L89j65O54Q87
1657A2451KL49J077L80L03J358R82J75J022J324M18R74J888J073J090K503K192J523L035L855
1654C7974L406N512Q716R908J2313J6764J8891K0552K5565K9706L1596L7174M5366N2496O4580
$$ y = [3109, 2937, 2952, 3211, 3238, 3190, 3351, 3378, 3248, 3330, 3406, 3275, 3319, 3473, 3342, 3214, 3306, 3220, 3057, 3171, 3177, 2938, 3035, 3305, 3144, 2967, 3187, 3277, 3148, 3243, 3307, 3144, 3219, 3407, 3244, 3139, 3337, 3296, 3128, 3320, 3416, 3181, 3273, 3588, 3475, 3344, 3586, 3627, 3440, 3523, 3556, 3361, 3512, 3815, 3661, 3521, 3743, 3739, 3587, 3808, 3924, 3658, 3666, 3855, 3674, 3624, 3963, 3968, 3773, 4043, 4273, 4078, 4116, 4352, 4256, 4300, 4686, 4681, 4461, 4661, 4712, 4314, 4261, 4456, 4257, 4185, 4495, 4435, 4224, 4511, 4628, 4263, 4319, 4660, 4481, 4335, 4637, 4615, 4361, 4571, 4716, 4455, 4506, 4736, 4585, 4615, 4935, 4782, 4638, 5192, 5512, 5284, 5537, 5987, 5834, 5931, 6619, 6809, 6753, 7340, 7699, 7326, 7265, 7392, 6937, 6722, 7095, 6955, 6551, 6836, 7045, 6786, 7072, 7561, 7312, 7212, 7721, 7765, 7594, 8078, 8360, 8146, 8551, 9146, 9017, 9183, 9953, 10075, 9994, 10686, 11075, 10910, 11564, 12451, 12453, 12802, 13879, 14259, 14562, 15920, 16902, 17077, 18099, 19423, 19841, 20815, 22703, 23776, 24866, 27369, 29561, 31084, 34119, 37974, 41380, 46892, 55608, 65516, 77829, 94593, 113484, 134036, 159601, 189307, 220903, 258077, 303443, 355939, 420519]
1652D20519Q1395R0906R5003J00446Q1520R638q3246j32592j24087r5853p5362o0421m6664
1650B61202l7199l1792k6494k0799j6406j2617q685o636o570n117k388j491q35J917L804M669
1648I4563Q927J4639J7814K2484K9968L4451L8391M7588N5829O0493P1239Q6937J01369J25805
1645H10497J60206J79472J86893K00969J67927J7473j82193k79663k47692j85613j48907j18211
1644E61158q8736p3662o3969n0687m1211l4594k4637j7857j7957j6968j3523j2491j1188p174
1642H6504m833m329j709J482L006N470R546J2708J5325J9038K2813K5883K9745L5241M1626
1639B97516M9708O1900P5957Q5281R0204R2537P2662O545q1472j30172j20585r1819p3327
1638C34935n8939m4533l6765l2361k5721k0705j7964j3301r610r882r371o810o268o390m480
$$ y = [420519, 501914, 592820, 687823, 788269, 869789, 879427, 796181, 663589, 539502, 443649, 368287, 307866, 261202, 224003, 192211, 165717, 144918, 128512, 115895, 107210, 100574, 94004, 88887, 86499, 85008, 84173, 86090, 89894, 94563, 103490, 118129, 135943, 158427, 188395, 222846, 261237, 308825, 364654, 425147, 496386, 583323, 684692, 810497, 970703, 1150175, 1337068, 1538037, 1705964, 1723437, 1541244, 1261581, 1013889, 828276, 679369, 561158, 472422, 398760, 334791, 284104, 242893, 208299, 183662, 165805, 147848, 130880, 117357, 104866, 93678, 86504, 81671, 77342, 75633, 77115, 80121, 85591, 95137, 107845, 123170, 142208, 165021, 190904, 220649, 255890, 297516, 347224, 409124, 485081, 570362, 660566, 753103, 825765, 832310, 750838, 620666, 500081, 408262, 334935, 275996, 231463, 194698, 162337, 136616, 115911, 97947, 84646, 75036, 65154, 55783, 48973, 42705, 36315, 31835]
1635C1835l379l732k633j583k471k381r33j102j651n99k86j133o39R1o29p26J29k40p45P9
1632G272K23o15l45J89l31l25K77k01o26J04J75m79q3L48l11l71K79k1l80J81J22n26j78K09
1629D587l34k49M41J11l46J53J95l54p6K67k44k92K51M2k78J16J00l37m4K42j82j56K94J6
1625C923k81J01J15k12P6K39k41k18J99l5k34J40J03j99P5J42k75l0M14p7m51M1J35k36%K26
1622C440j51j30K34j9k41J16R2k54kK38q4p8K43N1j61P5L2k06j0Q8j62m0J59j49j81K46J27
1618C273k29N1K31j37j50J04r9j74J59P1j86J01K04k04j62J82n0k56J02K11n0j8L9j33k8J40
1614B992o5n6K46L9l33q4J76n0r6J06O1M7J70k5k14J6P4j50m4R4j16n1K53L3k33R2K04j69
1610B917j32J45o2j94J00O8k18n7J61J0PJ53J3p9P4j2j84oJ20l4mJ18j3l9J10l2k18j7J22
$$ y = [31835, 28456, 24724, 22091, 20508, 18037, 15656, 14723, 13621, 11970, 11371, 11085, 9952, 9313, 9404, 8775, 8049, 8178, 7938, 7193, 7272, 7495, 6880, 6535, 6724, 6393, 6068, 6345, 6144, 5518, 5622, 5797, 5318, 5235, 5583, 5272, 4901, 5180, 5159, 4779, 4960, 5082, 4556, 4378, 4587, 4253, 4004, 4445, 4556, 4210, 4363, 4558, 4204, 4128, 4395, 4151, 3859, 4110, 4152, 3874, 3990, 4090, 3753, 3709, 3951, 3769, 3613, 3907, 3923, 3642, 3743, 3858, 3646, 3722, 3961, 3720, 3502, 3701, 3666, 3432, 3572, 3675, 3476, 3551, 3693, 3418, 3388, 3802, 3725, 3274, 3315, 3450, 3214, 3214, 3440, 3289, 3159, 3393, 3374, 3133, 3249, 3341, 3087, 3085, 3323, 3239, 3161, 3404, 3455, 3294, 3369, 3401, 3195, 3185, 3273, 3111, 3071, 3230, 3081, 2900, 3146, 3273, 3044, 3095, 3326, 3189, 3039, 3143, 3044, 2870, 3029, 3100, 2914, 3015, 3219, 3015, 2853, 3035, 2985, 2729, 2831, 3042, 2992, 2974, 3013, 2880, 2852, 2992, 2927, 2871, 3117, 3156, 2823, 2739, 2915, 2865, 2769, 2875, 2936, 2983, 3153, 3128, 2914, 2930, 3004, 2854, 2810, 2904, 2788, 2737, 2990, 3023, 2790, 2882, 3086, 2917, 2785, 2930, 2868, 2674, 2774, 2842, 2624, 2567, 2728, 2738, 2745, 2898, 2911, 2832, 2906, 2894, 2710, 2704, 2824, 2790, 2786, 2904, 2891, 2852, 2962, 2930, 2712, 2695, 2817]
1605B817l2k8M8q6o8J61R4j45j33n1j1J37J45p2o5R6Op2P1N2n3O5N8j33K1K44m6k90l6R3m2
1601B745O6J46j34k22J4M5j8J12R1o5K6Q8j12j15O5l4j39N5R8q0k7R0jjQ6m6j26M2L8j11J7
1596B593J64M0lP8l6j03O5O5j21q1M3j6k6Q9Q3J3k8j01o0P8Nj13O5J46j13j65O5N4m1R9Q3
1592B821j37q7K0j29q6J75M6k01RJ91k7q8J00N8m1N5L1r2NJ05J5J6O9l1n0N1m8j60mQ0nO9
1587B730J24o9j03P6Pj18N6J26q2j12oo5k6J29J0j13R8J40j28r3J37M0m4J42R3j43n3P6n7
1583B772MK44J07j26P1K87J69J08K16K08K33M55N64M64M37M88L77L0m10o52n51l88m22m61
1579D224l26j95j78j66j06oO1l6j90j41J2M5L9N7rm3P4J33P8J31K04J40J39K67K68K14L00
1575D990L38L28N72Q92Q86P95R54J059P07p1r38j402j241q84p29o04m21l82m03l11k49k02
$$ y = [2817, 2785, 2757, 2805, 2719, 2651, 2812, 2906, 2761, 2628, 2577, 2566, 2703, 2848, 2776, 2711, 2807, 2813, 2741, 2812, 2864, 2811, 2876, 2934, 2801, 2822, 3066, 3020, 2730, 2694, 2787, 2745, 2811, 2957, 2823, 2601, 2615, 2660, 2642, 2754, 2845, 2780, 2806, 2894, 2782, 2667, 2732, 2698, 2559, 2614, 2712, 2632, 2605, 2695, 2694, 2693, 2779, 2733, 2607, 2649, 2687, 2576, 2593, 2757, 2797, 2794, 2872, 2836, 2733, 2798, 2863, 2742, 2661, 2704, 2688, 2662, 2751, 2834, 2847, 2819, 2718, 2658, 2736, 2741, 2628, 2693, 2839, 2726, 2561, 2626, 2680, 2639, 2738, 2821, 2684, 2597, 2617, 2488, 2402, 2577, 2623, 2422, 2431, 2622, 2595, 2507, 2607, 2665, 2624, 2679, 2710, 2618, 2623, 2728, 2743, 2759, 2828, 2797, 2747, 2798, 2750, 2590, 2586, 2666, 2661, 2730, 2854, 2785, 2682, 2758, 2765, 2647, 2703, 2829, 2747, 2635, 2629, 2564, 2538, 2667, 2677, 2564, 2662, 2802, 2674, 2581, 2718, 2758, 2714, 2856, 2949, 2806, 2753, 2829, 2772, 2776, 3020, 3127, 3001, 3072, 3359, 3528, 3636, 3852, 4060, 4293, 4748, 5312, 5776, 6213, 6701, 7078, 7108, 6698, 6046, 5495, 5107, 4685, 4224, 3898, 3703, 3525, 3359, 3253, 3247, 3308, 3272, 3082, 2941, 2953, 2998, 3037, 3094, 3085, 3042, 3116, 3249, 3327, 3458, 3662, 3802, 3941, 4208, 4476, 4690, 4990, 5328, 5656, 6228, 7120, 8006, 8801, 9755, 10814, 11521, 11450, 10512, 9110, 7869, 6985, 6256, 5652, 5231, 4849, 4446, 4135, 3886, 3684]
1572C684m3j8k17k31l3j7r4j6pr6jJ07%j5J50J48L7P5R5P0K26L32J95K18M62M53K86L80M83
1568F613K81k5l31o22o02l73l96m96k83r9j78j37J6j05k41o1O9o6j05K5M7l4p7q5l2K8j5o7
1564B649n2p2o6N3P9k9NR3%k6J24N3j82j42J8qJ1J04m5j83K7J75L6J1J04k9j25N1R2j05j01
1559B520P9L9j25r8N5J30O6m2k9O6L5p0n4J6L3L6l7j51l8J80Q7j29m4Q7n0j31LN0J0Q6J36
1555B716M4l9q6r9L2J40j3j88j20nL3P6L6o9oJ12J6q0%J4p6m5Kn3NJ23K3j21l6O9L3J2K0j6
1550B454QN6K1K7J13Q0l9o0p5j02J2J03l1j23oN0PL2Nj22j06Kj0PJ13M4j18n8Q2N0l2o0n6
1545B268L7R6n9j63K3J74Q8J1ro0J6J47N0p4M5R3p5q1M1j7p4J9k4j40k9Q2J6M9J30m1j65J7
1540B391R6n3j9J19J4j02KM1o3n7K7K7J6K5j6l4nj2k2J3L8O2P9k1j06jO7n0n3Q5K6r3L8J36
$$ y = [3684, 3641, 3623, 3406, 3175, 3142, 3125, 3031, 3015, 3008, 2912, 2911, 3018, 3018, 3003, 3153, 3301, 3338, 3413, 3508, 3578, 3804, 4136, 4331, 4549, 5011, 5464, 5750, 6130, 6613, 6894, 6869, 6538, 5916, 5314, 4941, 4545, 4049, 3766, 3667, 3489, 3352, 3368, 3263, 3022, 2961, 3030, 2964, 2859, 2884, 2931, 2897, 2820, 2735, 2703, 2731, 2716, 2649, 2597, 2525, 2459, 2512, 2591, 2562, 2567, 2660, 2660, 2634, 2758, 2811, 2629, 2487, 2505, 2497, 2508, 2612, 2567, 2384, 2411, 2586, 2622, 2633, 2737, 2708, 2583, 2634, 2726, 2621, 2520, 2599, 2638, 2513, 2415, 2470, 2600, 2666, 2624, 2595, 2661, 2696, 2626, 2572, 2588, 2621, 2657, 2620, 2469, 2431, 2611, 2698, 2569, 2525, 2612, 2562, 2431, 2434, 2484, 2494, 2580, 2716, 2760, 2721, 2635, 2536, 2568, 2708, 2695, 2507, 2387, 2382, 2415, 2491, 2527, 2458, 2452, 2564, 2580, 2500, 2500, 2514, 2438, 2393, 2395, 2342, 2347, 2470, 2493, 2372, 2336, 2405, 2438, 2450, 2470, 2454, 2462, 2518, 2539, 2566, 2679, 2759, 2720, 2660, 2585, 2483, 2495, 2598, 2567, 2444, 2438, 2488, 2495, 2527, 2532, 2410, 2304, 2306, 2296, 2303, 2416, 2460, 2342, 2284, 2366, 2416, 2384, 2324, 2268, 2305, 2401, 2342, 2179, 2202, 2376, 2464, 2475, 2466, 2406, 2422, 2569, 2619, 2545, 2590, 2683, 2608, 2527, 2568, 2551, 2477, 2496, 2472, 2332, 2303, 2385, 2401, 2450, 2580, 2539, 2374, 2391, 2487, 2434, 2415, 2534, 2548, 2446, 2448, 2489, 2426, 2369, 2396, 2423, 2439, 2464, 2448, 2414, 2409, 2397, 2375, 2388, 2426, 2488, 2567, 2546, 2440, 2439, 2506, 2456, 2403, 2488, 2514, 2421, 2459, 2595]
1535B595m4j56l4K3J3J06J60N5o1j04q0nl4j26J2K30Q4j71m1J79O1q7NP7K0j9r0j72q2O2O2
1531B438N1R7J5j02l4L7q3j40L2J74R4l7l8O3R1k5j50j35k1O7O2j0l5K4J8n9PJ53N2j81j40
1526B285J09J88N9q0j38o7Q4J16l2j45n2J59K18Rj91r8M2m3r4M5M7r6k5J14J0o8O8P7m8M9
1522B502J70kj58l7L9n2m8N9O5k3r0r4j3O1N0M4M6m5q4M2N6j24j32O7J15L1M3K2q8o9N3M7
1517B453k4k8k2NP5M4n9j1J02M9n6k7K7J1k5n9p6l5J0L1Q6R3k2q7k3om7mK9j9J8R9K6n4L0
1512B504O5m8o4K9%q7o4QP1J37Q8o8q3N0P4k9o6m3n8m9K5Q3O9K5PPlpK0Pp6r9nN5L5M7N6k5
1506B588q7n1k0j8N2J14L1q3m6Q8J33K6r4p5Lj7q8p3k6pN4J13L9o4m1no2n5O6J16K3p0q8o5
$$ y = [2595, 2551, 2395, 2361, 2384, 2397, 2503, 2663, 2718, 2657, 2553, 2473, 2468, 2434, 2308, 2320, 2550, 2634, 2463, 2422, 2601, 2662, 2575, 2580, 2657, 2677, 2658, 2568, 2396, 2314, 2376, 2438, 2489, 2586, 2601, 2499, 2465, 2502, 2419, 2279, 2311, 2485, 2579, 2542, 2504, 2567, 2658, 2633, 2483, 2348, 2327, 2394, 2456, 2446, 2411, 2435, 2453, 2394, 2401, 2554, 2606, 2425, 2285, 2394, 2582, 2641, 2561, 2423, 2356, 2440, 2556, 2524, 2379, 2327, 2486, 2704, 2713, 2522, 2424, 2466, 2423, 2329, 2374, 2421, 2325, 2300, 2414, 2424, 2356, 2424, 2501, 2453, 2502, 2672, 2670, 2512, 2475, 2514, 2462, 2414, 2473, 2538, 2515, 2425, 2331, 2318, 2379, 2429, 2473, 2519, 2474, 2390, 2432, 2488, 2364, 2232, 2299, 2414, 2445, 2488, 2510, 2422, 2353, 2406, 2453, 2429, 2401, 2379, 2384, 2459, 2503, 2444, 2433, 2535, 2584, 2528, 2501, 2528, 2539, 2514, 2455, 2379, 2344, 2354, 2385, 2471, 2564, 2542, 2455, 2432, 2426, 2379, 2375, 2404, 2385, 2403, 2502, 2528, 2474, 2504, 2569, 2521, 2457, 2486, 2486, 2399, 2335, 2343, 2414, 2551, 2639, 2571, 2488, 2538, 2612, 2583, 2517, 2474, 2416, 2367, 2392, 2475, 2544, 2569, 2576, 2583, 2580, 2573, 2593, 2600, 2524, 2425, 2420, 2475, 2510, 2557, 2613, 2588, 2501, 2450, 2430, 2412, 2464, 2578, 2609, 2526, 2480, 2568, 2701, 2727, 2633, 2558, 2561, 2544, 2456, 2383, 2357, 2350, 2404, 2517, 2556, 2492, 2451, 2446, 2384, 2329, 2395, 2511, 2534, 2464, 2376, 2311]
$$ [...]
##END=	
##TITLE=	RM1002-H
##JCAMP-DX=	6.0	$$ MestReNova 14.1.2-25024
##BLOCK_ID=	3
##DATA TYPE=	NMR PEAK TABLE
##DATA CLASS=	PEAK TABLE
##CROSS REFERENCE=	NMR SPECTRUM: BLOCK_ID=2                                     
##.OBSERVE FREQUENCY=	599.77881209999998191
##.OBSERVE NUCLEUS=	^1H
##NPOINTS=	7
##FIRSTX=	2.7316366355103749441
##LASTX=	4.7664818397219113066
##XFACTOR=	1
##YFACTOR=	1
##FIRSTY=	543402022.14501440525
##XUNITS=	PPM
##YUNITS=	ARBITRARY UNITS
##PEAK TABLE=	(XYW..XYW)
2.7316366355103749441,543402022.14501440525,0.0023565202970311986512
2.7421741149403966453,1132525753.5916516781,0.0024084823382264498697
2.7526578123162606104,567030116.60630714893,0.0023310812832776496399
3.7291492918132460588,567376813.40066957474,0.0025012885143253170937
3.7396612109194196094,1126737240.860118866,0.0024529190321033234913
3.7501625703594552164,541702871.09197020531,0.0024439749375905267179
4.7664818397219113066,2139206039.8375675678,0.0021358687848475749194
##$MNOVA/PEAK_DATA_TABLE=	(T,F,A,ST,SP,APT,APC)
$$ Complementary to PEAK TABLE
$$ T: Type
$$ F: Flags
$$ A: Annotation
$$ ST: Shape Type
$$ SP: Shape Parameter
$$ APT: Attached Peaks Type
$$ APC: Attached Peaks Count
Compound,None,,1,-0.18433896060538818018,0,0
Compound,None,,1,-0.11910325597975895962,0,0
Compound,None,,1,-0.12001399770162979319,0,0
Compound,None,,1,-0.040334943357545935405,0,0
Compound,None,,1,-0.27840889183812000951,0,0
Compound,None,,1,-0.059338318447537730105,0,0
Compound,None,,1,-0.025088018246150763091,0,0
##END=	
##END=	
