##TITLE=	RM1002-H
##JCAMPDX= 6.0         $$ Bruker NMR compound JCAMP-DX V2.0
##DATA TYPE= LINK
##BLOCKS=   1
##TITLE=	RM1002-H
##JCAMPDX= 6.0         $$ Bruker NMR JCAMP-DX V2.0
##DATA TYPE= NMR SPECTRUM
##DATA CLASS= XYDATA
##ORIGIN= Varian
##OWNER= HGL
##LONG DATE= 2010/05/10 09:49:11+0000
$$ TopSpin 4.4.1
$$ 2026-04-26 13:18:44.931 +0800  HGL@NMR20240229
$$ Compression mode = diff/dup
##.OBSERVE FREQUENCY= 599.7788121
##.OBSERVE NUCLEUS= ^1H
##.ACQUISITION MODE= SIMULTANEOUS
##.ACQUISITION SCHEME= undefined
##.AVERAGES= 16
##.DIGITISER RES= 32
##SPECTROMETER/DATA SYSTEM= 
##.PULSE SEQUENCE= presat
##.SOLVENT NAME= d2o
##.SHIFT REFERENCE= INTERNAL, d2o, 1, 12.78199
##AUDIT TRAIL= $$ (NUMBER, WHEN, WHO, WHERE, PROCESS, VERSION, WHAT)
$$ ##TITLE= Audit trail, TopSpin 4.4.1
$$ ##JCAMPDX= 5.01
$$ ##ORIGIN= Bruker BioSpin GmbH & Co. KG
$$ ##OWNER= HGL
$$ $$ C:\Bruker\TopSpin4.4.1/1002-H/1/pdata/1/auditp.txt
$$ ##AUDIT TRAIL=  $$ (NUMBER, WHEN, WHO, WHERE, PROCESS, VERSION, WHAT)
(   1,<2026-04-26T12:54:32.973+0800>,<HGL>,<NMR20240229>,<jcamp>,<TopSpin 4.4.1>,
      <fromjdx created from
       H:\NMR\AI-Test-data\JDX\1002-H.jdx
       data hash MD5: 64K
       49 5E B4 3D 77 C8 63 F4 4F B3 B0 9B E6 81 CB 90>)
(   2,<2026-04-26T12:54:59.069+0800>,<HGL>,<NMR20240229>,<dataserver>,<TopSpin 4.4.1>,
      <Start of interactive peak picking
       data hash MD5: 64K
       49 5E B4 3D 77 C8 63 F4 4F B3 B0 9B E6 81 CB 90>)
(   3,<2026-04-26T12:55:03.505+0800>,<HGL>,<NMR20240229>,<peak>,<TopSpin 4.4.1>,
      <1D Peak picking
       data hash MD5: 64K
       49 5E B4 3D 77 C8 63 F4 4F B3 B0 9B E6 81 CB 90>)
(   4,<2026-04-26T12:57:47.719+0800>,<HGL>,<NMR20240229>,<dataserver>,<TopSpin 4.4.1>,
      <End of interactive peak picking
       data hash MD5: 64K
       49 5E B4 3D 77 C8 63 F4 4F B3 B0 9B E6 81 CB 90>)
$$ ##END=
$$ 
$$ $$ hash MD5
$$ $$ DA C0 70 03 0E CA DA B5 D4 C5 B2 92 12 62 6B 39
##$RELAX= 
##$RELAX= 
##$RELAX= 
$$ Bruker specific parameters
$$ --------------------------
##$DATPATH= <C:\Bruker\TopSpin4.4.1>
##$EXPNO= 1
##$NAME= <1002-H>
##$PROCNO= 1
##$ACQT0= 0
##$AMP= (0..31)
100 100 100 100 100 100 100 100 100 100 100 100 100 100 100 100 100 100
100 100 100 100 100 100 100 100 100 100 100 100 100 100
##$AMPCOIL= (0..32)
0 0 0 0 0 0 0 0 0 0 0 0 0 0 0 0 0 0 0 0 0 0 0 0 0 0 0 0 0 0 0 0 0
##$AQSEQ= 0
##$AQ_mod= 1
##$AUNM= <au_zg>
##$AUTOPOS= <>
##$BF1= 599.7788121
##$BF2= 600.13
##$BF3= 600.13
##$BF4= 600.13
##$BF5= 600.13
##$BF6= 600.13
##$BF7= 600.13
##$BF8= 600.13
##$BWFAC= (0..63)
0 0 0 0 0 0 0 0 0 0 0 0 0 0 0 0 0 0 0 0 0 0 0 0 0 0 0 0 0 0 0 0 0 0 0 0
0 0 0 0 0 0 0 0 0 0 0 0 0 0 0 0 0 0 0 0 0 0 0 0 0 0 0 0
##$BYTORDA= 0
##$CHANFCU= (0..24)
0 1 0 0 0 0 0 0 0 0 0 0 0 0 0 0 0 0 0 0 0 0 0 0 0
##$CHANREC= (0..24)
0 1 0 0 0 0 0 0 0 0 0 0 0 0 0 0 0 0 0 0 0 0 0 0 0
##$CHEMSTR= <none>
##$CNST= (0..63)
1 1 1 1 1 1 1 1 1 1 1 1 1 1 1 1 1 1 1 1 1 1 1 1 1 1 1 1 1 1 1 1 1 1 1 1
1 1 1 1 1 1 1 1 1 1 1 1 1 1 1 1 1 1 1 1 1 1 1 1 1 1 1 1
##$CPDPRG= (0..8)
$$ [...]
##$TE4= 300
##$TEG= 300
##$TE_MAGNET= 300
##$TE_PIDX= 0
##$TE_RAW= 300
##$TE_STAB= (0..9)
0 0 0 0 0 0 0 0 0 0
##$TOTROT= (0..63)
0 0 0 0 0 0 0 0 0 0 0 0 0 0 0 0 0 0 0 0 0 0 0 0 0 0 0 0 0 0 0 0 0 0 0 0
0 0 0 0 0 0 0 0 0 0 0 0 0 0 0 0 0 0 0 0 0 0 0 0 0 0 0 0
##$TUBE_TYPE= <>
##$USERA1= <>
##$USERA10= <>
##$USERA2= <>
##$USERA3= <>
##$USERA4= <>
##$USERA5= <>
##$USERA6= <>
##$USERA7= <>
##$USERA8= <>
##$USERA9= <>
##$UUID= <>
##$VALIDCODE= 0
##$VALIST= <>
##$VCLIST= <>
##$VDLIST= <>
##$VPLIST= <>
##$VTLIST= <>
##$WAVEMAKER= (0..7)
<> <> <> <> <> <> <> <>
##$WBST= 1024
##$WBSW= (0..7)
4 10 10 10 10 10 10 10
##$XL= 0
##$YL= 0
##$YMAX_a= 2139960192
##$YMIN_a= 0
##$ZGOPTNS= <>
##$scaledByNS= no
##$scaledByRG= no
##$shimCoilTempK= 300
##$ABSF1= 10
##$ABSF2= 0
##$ABSG= 5
##$ABSL= 3
##$ALPHA= 0
##$AQORDER= 0
##$ASSFAC= 0
##$ASSFACI= 0
##$ASSFACX= 0
##$ASSWID= 0
##$AUNMP= <proc_1d>
##$AXLEFT= 0
##$AXNAME= <>
##$AXNUC= <off>
##$AXRIGHT= 0
##$AXTYPE= 0
##$AXUNIT= <>
##$AZFE= 0.1
##$AZFW= 0.1
##$BCFW= 1
##$BC_mod= 2
##$BYTORDP= 0
##$COROFFS= 0
##$CY= 15
##$DATMOD= 1
##$DC= 2
##$DFILT= <>
##$DTYPP= 0
##$ERETIC= no
##$F1P= 0
##$F2P= 0
##$FCOR= 0.5
##$FTSIZE= 0
##$FT_mod= 4
##$GAMMA= 1
##$GB= 0
##$INTBC= 1
##$INTSCL= 1
##$ISEN= 128
##$LB= 0.3
##$LEV0= 0
##$LPBIN= 0
##$MAXI= 10000
##$MC2= 0
##$MEAN= 0
##$ME_mod= 0
##$MI= 0
##$MddCEXP= no
##$MddCT_SP= no
##$MddF180= no
##$MddLAMBDA= 0
##$MddMEMORY= 0
##$MddMERGE= 0
##$MddNCOMP= 0
##$MddNITER= 0
##$MddNOISE= 0
##$MddPHASE= 0
##$MddSEED= 0
##$MddSRSIZE= 0
##$Mdd_CsALG= 0
##$Mdd_CsLAMBDA= 1
##$Mdd_CsNITER= 0
##$Mdd_CsNORM= 0
##$Mdd_CsVE= yes
##$Mdd_CsZF= 0
##$Mdd_LrLAMBDA= 0
##$Mdd_LrNITER= 0
##$Mdd_LrRANK= 0
##$Mdd_LrZF= 0
##$Mdd_mod= 0
##$NCOEF= 0
##$NC_proc= -23
##$NLEV= 6
##$NOISF1= 0
##$NOISF2= 0
##$NSP= 1
##$NTH_PI= 0
##$NZP= 0
##$OFFSET= 12.7819915707858
##$PC= 1
##$PHC0= 0
##$PHC1= 0
##$PH_mod= 1
##$PKNL= yes
##$PPARMOD= 0
##$PPDIAG= 0
##$PPIPTYP= 0
##$PPMPNUM= 16384
##$PPRESOL= 1
##$PSCAL= 0
##$PSIGN= 0
##$PYNMP= <proc.py>
##$RDF1= 0
##$RDF2= 0
##$RDFWHM= 0
##$RDINT= 0
##$RDPOS= 0
##$REVERSE= no
##$SF= 599.7788121
##$SI= 65536
##$SIGF1= 0
##$SIGF2= 0
##$SINO= 0
##$SIOLD= 32768
##$SPECTYP= <>
##$SREF_mod= 1
##$SREGLST= <1H.CDCl3>
##$SSB= 0
##$STSI= 0
##$STSR= 0
##$SW_p= 9615.38461539
##$SYMM= 0
##$S_DEV= 0
##$TDeff= 0
##$TDoff= 0
##$TI= <>
##$TILT= no
##$TM1= 0
##$TM2= 0
##$TOPLEV= 0
##$USERP1= <>
##$USERP10= <>
##$USERP2= <>
##$USERP3= <>
##$USERP4= <>
##$USERP5= <>
##$USERP6= <>
##$USERP7= <>
##$USERP8= <>
##$USERP9= <>
##$WDW= 1
##$XDIM= 65536
##$YMAX_p= 2139959968
##$YMIN_p= 1228469
##$CURPLOT= <>
##$CURPRIN= <$>
##$DFORMAT= <normdp>
##$LAYOUT= <+/1D_H.xwp>
##$LFORMAT= <normlp>
##$PFORMAT= <normpl>
$$ End of Bruker specific parameters
$$ ---------------------------------
##XUNITS= HZ
##YUNITS= ARBITRARY UNITS
##XFACTOR= 0.146719125601044
##YFACTOR= 1
##DELTAX= -0.146719125601044
##NPOINTS= 65536
##FIRSTX= 9615.2378962644
##FIRSTY= 1337477
##LASTX= 0
##MAXY= 2139959968
##MINY= 1228469
##XYDATA= (X++(Y..Y))
$$ [...]
37814A533954J3055J1097j1750k7415k1541k8721n0914j3055Q6816R5953k3499
$$ 1533954 1547009 1558106 1546356 1518941 1497400 1468679 1417765 1404710 1491526 1587479 1563980
37803A563980q0940p180K3498j3707K7415O9191l0026j13578l7859J8929k6762
$$ 1563980 1483040 1475860 1499358 1485651 1513066 1582257 1552231 1438653 1400794 1419723 1392961
37792A392961r791O0705L1332k0235K8068O3316J1750k8721l8512n8095m6345
$$ 1392961 1383170 1443875 1475207 1454972 1483040 1546356 1558106 1529385 1490873 1432778 1386433
37781A386433k611P833K2194O2011L3290m5693l4595L7859M5692N222j7624k4804
$$ 1386433 1383822 1391655 1413849 1475860 1509150 1463457 1428862 1466721 1512413 1517635 1500011 1475207
37769A475207j3708K611k2193m1776P833M1776J2402J7624N2220J0444l5901j306
$$ 1475207 1461499 1464110 1441917 1400141 1407974 1449750 1462152 1479776 1531996 1542440 1506539 1505233
37757A505233l264p9635p1802K2194L6553k4804l1984K4804Q5510J11619N7442
$$ 1505233 1501969 1422334 1350532 1372726 1409279 1384475 1352491 1377295 1462805 1574424 1631866
37746A631866m6345q0288l3290P180K4805K4151j4360m6998k2846Q486K0235M5692
$$ 1631866 1585521 1505233 1471943 1479123 1503928 1528079 1513719 1466721 1443875 1452361 1472596 1518288
37734A518288L1332m4387n8747J1749K2847l0027m569M9609J6318j9582K8721
$$ 1518288 1549620 1505233 1446486 1458235 1481082 1451055 1446486 1496095 1512413 1492831 1521552
37723A521552N6789r791q0941p4413k611O0705K9374n3525m1776L2637O528o7886
$$ 1521552 1578341 1568550 1487609 1413196 1410585 1471290 1500664 1447139 1405363 1438000 1444528 1376642
37711A376642k9373M8956K3498o527M0470M0471m1776n0914K2846L6553n222j5665
$$ 1376642 1347269 1396225 1419723 1413196 1453666 1494137 1452361 1401447 1424293 1460846 1455624 1439959
37699A439959l0027p1149n1567K8721O5927N4831M8303J9582k7415j7624K0888
$$ 1439959 1409932 1338783 1287216 1315937 1381864 1436695 1484998 1504580 1477165 1459541 1480429
37688A480429J958k9374l916J5013o527P833M4386K5458m570M570J958r791K4151
$$ 1480429 1482387 1453013 1449097 1464110 1457583 1465416 1509802 1535260 1530690 1535260 1537218 1527427 1551578
37675A551578K9374l0027k4804N4178K7415r8564j14884p180O7886O3316K8721
$$ 1551578 1580952 1550925 1526121 1580299 1607714 1509150 1394266 1387086 1454972 1518288 1547009
37664A547009j2402k8721q486R791J6319J5666j9582m8956L916O2011K7415k3498
$$ 1547009 1534607 1505886 1497400 1507191 1523510 1539176 1519594 1470638 1474554 1536565 1563980 1540482
37652A540482k7416m2428m0471K3499J8277q7468p7677O8539J01828J306k4152
$$ 1540482 1513066 1470638 1430167 1453666 1471943 1384475 1306798 1375337 1477165 1478471 1454319
37641A454319L0679M0470K7416J5666l0027o6580m4387j3707J0444M3734K0235
$$ 1454319 1484998 1525468 1552884 1568550 1538523 1471943 1427556 1413849 1424293 1468027 1488262
37630A488262o2664p7024j9582J305N222N7442Q3551K0888n8747q0288k9373N0261
$$ 1488262 1425598 1348574 1328992 1330297 1335519 1392961 1476512 1497400 1438653 1358365 1328992 1379253
37618A379253N7442L264J3054O3317J7624o2664m6997j1097j9582K0235P8982
$$ 1379253 1436695 1439959 1453013 1516330 1533954 1471290 1424293 1413196 1393614 1413849 1492831
37607A492831L7859l1984l4596l3943l1331L4595N4831l1332o1358J8929M6998
$$ 1492831 1530690 1498706 1464110 1430167 1398836 1433431 1488262 1456930 1395572 1414501 1461499
37596A461499M569n222j1096m0471k1540J0444k5457l7860K6110M9609P180o53
$$ 1461499 1466068 1460846 1449750 1409279 1387739 1398183 1372726 1334866 1360976 1410585 1417765 1417112
37584A417112K2847K9373M7651N0914k0235o3969L263N9400J6972l1985l1985
$$ 1417112 1439959 1469332 1516983 1567897 1547662 1483693 1486956 1546356 1563328 1531343 1499358
37573A499358k8068k0887L916m569n0262n6789n222L0027R791j8277N875M5692
$$ 1499358 1471290 1450403 1454319 1449750 1399488 1342699 1337477 1367504 1377295 1359018 1364893 1410585
37561A410585K6110k7416k4804J8277K0235j3055k4804p833J4360J8277L264R791
$$ 1410585 1436695 1409279 1384475 1402752 1422987 1409932 1385128 1377295 1391655 1409932 1413196 1422987
37549A422987M2429L3942j5013q485L3942K611o9191o3316J1749O3969O7233M0471
$$ 1422987 1465416 1499358 1484345 1475860 1509802 1512413 1443222 1379906 1391655 1455624 1522857 1563328
37537A563328J2402J305j3707l3943j5666P180l0026m6998K2846N4831p180k6763
$$ 1563328 1575730 1577035 1563328 1529385 1513719 1520899 1490873 1443875 1466721 1521552 1514372 1487609
37525A487609J4360o527m8303j6972N875j8277k611J8930k4152k8721M6345N3526
$$ 1487609 1501969 1495442 1447139 1430167 1436042 1417765 1415154 1434084 1409932 1381211 1427556 1481082
37513A481082r792J959O2663M7651j6972p1149j01828n2873N6136P7677p833m4387
$$ 1481082 1471290 1473249 1535912 1583563 1566591 1495442 1393614 1340741 1396877 1474554 1466721 1422334
37501A422334P833N2873L7206j5666m0470K3499Q7468K1541q5510p6371j4361
$$ 1422334 1430167 1483040 1520246 1504580 1464110 1487609 1575077 1596618 1511108 1434737 1420376
37490A420376o527r139J306j6972o527O5927P4413j7624o6580r791O3969P3108
$$ 1420376 1413849 1404710 1406016 1389044 1382517 1448444 1522857 1505233 1438653 1428862 1492831 1565939
37478A565939M569p3760m7651M3081L7207n0262p1149k3499L917O527j4360m5040
$$ 1565939 1570508 1496748 1449097 1492178 1529385 1479123 1407974 1384475 1388392 1394919 1380559 1335519
37466A335519r791P3760O7886K611j958l264n3525j6972Q6816M8956q4205q6162
$$ 1335519 1325728 1399488 1467374 1469985 1468027 1464763 1411238 1394266 1481082 1530038 1445833 1359671
37454A359671l917N875Q486P0496P0497r791l0027J6319L3290K8721M0470L1332
$$ 1359671 1355754 1361629 1370115 1440611 1511108 1501317 1471290 1487609 1520899 1549620 1590090 1621422
37442A621422j1749l1985p833J6319J305k4151o528K1541j0444m8303j959N8095
$$ 1621422 1609673 1577688 1569855 1586174 1587479 1563328 1556800 1578341 1567897 1519594 1517635 1575730
37430A575730J7624n3525m5040j3055k2193j5013K6762K1541l1332l1984K4151
$$ 1575730 1593354 1539829 1494789 1481734 1459541 1444528 1471290 1492831 1461499 1429515 1453666
37419A453666M7651Q485l0026j6971K0235K3499p181j3707K4151M6345J2403k1541
$$ 1453666 1501317 1509802 1479776 1462805 1483040 1506539 1499358 1485651 1509802 1556147 1568550 1547009
37407A547009k1541l2637o3969m1776L5248N3526m570k6109J7624L1332J958J5666
$$ 1547009 1525468 1492831 1428862 1387086 1422334 1475860 1471290 1445181 1462805 1494137 1496095 1511761
37395A511761N2872J5666o4622n6789K4805L6553l1984m6345J8929M8956K6110
$$ 1511761 1564633 1580299 1515677 1458888 1483693 1520246 1488262 1441917 1460846 1509802 1535912
37384A535912K0235O53o9844p5718J3707K3499p3760p0497N0262Q1593P833k0888
$$ 1535912 1556147 1556800 1486956 1411238 1424945 1448444 1374684 1304187 1354449 1436042 1443875 1422987
37372A422987n875n874N874P181k0236J0444P0497J3708p8330l9817L263o3969
$$ 1422987 1417112 1411238 1417112 1424293 1404057 1414501 1484998 1498706 1420376 1380559 1383822 1319853
37360A319853o2011N6136P8330K4804O7886Q0288n4831j09661O527M5040l4596
$$ 1319853 1257842 1313978 1392308 1417112 1484998 1565286 1510455 1400794 1407321 1452361 1417765
37349A417765j1749P4413L3943m5040K611Q8774O8538j4360l6554N875P180n4831
$$ 1417765 1406016 1480429 1514372 1469332 1471943 1560717 1629255 1614895 1578341 1584216 1591396 1536565
37337A536565o5275J1750L6554k3499l0679K3499K2193j6319k6110m6997o0053
$$ 1536565 1471290 1483040 1519594 1496095 1465416 1488915 1511108 1494789 1468679 1421682 1361629
37326A361629J6971R7260M5692m9609n6136j8277l264j958j305J6318N2873K6762
$$ 1361629 1378600 1475860 1521552 1471943 1415807 1397530 1394266 1392308 1391003 1407321 1460194 1486956
37314A486956n4178n4830K4151L5901L264K4152R791q2899p9635M8956Q6163k611
$$ 1486956 1432778 1377948 1402099 1438000 1441264 1465416 1475207 1392308 1312673 1361629 1447792 1445181
37302A445181l0680K8721L7207j7624n0915n0261k3499L6554Q1593M7651k1541
$$ 1445181 1414501 1443222 1480429 1462805 1411890 1361629 1338130 1374684 1456277 1503928 1482387
37291A482387k8068K2193N4178L7860O52l7859m3734J3055P6371N0262l3290o2664
$$ 1482387 1454319 1476512 1530690 1568550 1569202 1531343 1487609 1500664 1577035 1627297 1594007 1531343
37279A531343k7415J3707M1776L7207q486k7415%j0444n4831l9165J7624L5249
$$ 1531343 1503928 1517635 1559411 1596618 1588132 1560717 1560717 1550273 1495442 1456277 1473901 1509150
37267A509150M1775M5040%m5692l5249l1331k4805M5040O0705n6136r2037L3943
$$ 1509150 1550925 1595965 1595965 1550273 1515024 1483693 1458888 1503928 1564633 1508497 1416460 1450403
37255A450403O5274m5039m5693M5040J6971m0470J6319M8956j7624m1776j6972
$$ 1450403 1515677 1470638 1424945 1469985 1486956 1446486 1462805 1511761 1494137 1452361 1435389
37244A435389l4595l5249Q486n875n2219j4361N2220N2872L3943K2194k5457o7233
$$ 1435389 1400794 1365545 1374031 1368156 1315937 1301576 1353796 1406668 1440611 1462805 1437348 1370115
37232A370115m2429J7624O0706O4622J1096m9608l2638K7416L5248k611j6319
$$ 1370115 1327686 1345310 1406016 1470638 1481734 1432126 1399488 1426904 1462152 1459541 1443222
37221A443222P181M3081M6998M569l1332j3708J6972J8929K0235K0236l264k7415
$$ 1443222 1450403 1493484 1540482 1545051 1513719 1500011 1516983 1535912 1556147 1576383 1573119 1545704
37209A545704l1985l3943k6763N222L4596K8721j306k4151k1541j3708k2193j3708
$$ 1545704 1513719 1479776 1453013 1458235 1492831 1521552 1520246 1496095 1474554 1460846 1438653 1424945
37197A424945L2638M6345l264k0235M569l916O52N7442K3499r0079n8095P1803
$$ 1424945 1457583 1503928 1500664 1480429 1484998 1481082 1481734 1539176 1562675 1472596 1414501 1486304
37185A486304M2428o3969k6763K8721j6318J305Q2246L3943o2011k0888K4804
$$ 1486304 1528732 1464763 1438000 1466721 1450403 1451708 1533954 1567897 1505886 1484998 1509802
37174A509802l3290l7859M3081M5693k6110m8304j1096L3290L3290l4596p3107
$$ 1509802 1476512 1438653 1481734 1527427 1501317 1453013 1441917 1475207 1508497 1473901 1400794
37163A400794l264L9818j6972j3055O3969M1123k8720M569L7206j9582j6319O4622
$$ 1400794 1397530 1437348 1420376 1407321 1471290 1512413 1483693 1488262 1525468 1505886 1489567 1554189
37151A554189L6554p8982r3343j3055K8721J305l1984n875N8094O3317O527k0888
$$ 1554189 1590743 1511761 1418418 1405363 1434084 1435389 1403405 1397530 1455624 1518941 1525468 1504580
37139A504580l5248p4413m3081M8303K1541p1150l2637N8094L0027j6319L264
$$ 1504580 1469332 1394919 1351838 1400141 1421682 1350532 1317895 1375989 1406016 1389697 1392961
37128A392961j3055m5040R139N6789L1984K9374M1123O53n875K3499l3290r0732
$$ 1392961 1379906 1334866 1344005 1400794 1432778 1462152 1503275 1503928 1498053 1521552 1488262 1397530
37116A397530j7624K6110m5040k2193R0732N6136m8956p833O0705J3055k9373
$$ 1397530 1379906 1406016 1360976 1338783 1429515 1485651 1436695 1428862 1489567 1502622 1473249
37105A473249j6319k0235J5013R0079M6345n8747l3290M2428P181k9374Q486j4361
$$ 1473249 1456930 1436695 1451708 1541787 1588132 1529385 1496095 1538523 1545704 1516330 1524816 1510455
37093A510455r8565p6371L3943P5066L1332j4361k0235J3055M1776K8068J9582
$$ 1510455 1411890 1335519 1369462 1444528 1475860 1461499 1441264 1454319 1496095 1524163 1543745
37082A543745L1985k611p2455p0497n874J8929j305k3499m1776k4151N4830J05745
$$ 1543745 1575730 1573119 1500664 1430167 1424293 1443222 1441917 1418418 1376642 1352491 1407321 1513066
37070A513066O5275R138j305j4361l2637k4152l0026o5927l9165N2220O0052l1332
$$ 1513066 1578341 1587479 1586174 1571813 1539176 1515024 1484998 1419071 1379906 1432126 1492178 1460846
37058A460846o0705N875M1776K1540J0444O53k4805j1749K9374J6318k4151j306
$$ 1460846 1400141 1406016 1447792 1469332 1479776 1480429 1455624 1443875 1473249 1489567 1465416 1464110
37046A464110N2220M4387k8068q6163n3525M2428P3108J305m3081j0444k611k4151
$$ 1464110 1516330 1560717 1532649 1446486 1392961 1435389 1508497 1509802 1466721 1456277 1453666 1429515
37034A429515M569L0026J3708M1123P8982L917o5275P833N3525m3734p9635J1097
$$ 1429515 1434084 1464110 1477818 1518941 1597923 1601840 1536565 1544398 1597923 1554189 1474554 1485651
37022A485651M2428J306m569k7416p1149k6763M0471J5665J4361Q7468P3108k2194
$$ 1485651 1528079 1529385 1524816 1497400 1426251 1399488 1439959 1455624 1469985 1557453 1630561 1608367
37010A608367l3943J306j5013k9374k0888k9373n222L9164l916n2220J1750N1567
$$ 1608367 1574424 1575730 1560717 1531343 1510455 1481082 1475860 1515024 1511108 1458888 1470638 1522205
36998A522205j7625l5248K6763L1984J1750K6110q486o1358j0444N3525J8277
$$ 1522205 1504580 1469332 1496095 1528079 1539829 1565939 1557453 1496095 1485651 1539176 1557453
36987A557453k6763m6997p8330j7624J10314Q1593m6345k9373L7859r791k7416
$$ 1557453 1530690 1483693 1405363 1387739 1498053 1579646 1533301 1503928 1541787 1531996 1504580
36976A504580L1985j1749p6372J3055P5066j6319m4386L7206L7207o528K3499
$$ 1504580 1536565 1524816 1448444 1461499 1536565 1520246 1475860 1513066 1550273 1543745 1567244
36965A567244J4361o5928o2011R791L0027K6110K2846k1541m6998r138M569K611
$$ 1567244 1581605 1515677 1453666 1463457 1493484 1519594 1542440 1520899 1473901 1464763 1469332 1471943
36953A471943M8956N6789l916r792J0444n4178p7024K2846M8304o0706q4204K2193
$$ 1471943 1520899 1577688 1573772 1563980 1574424 1520246 1443222 1466068 1514372 1453666 1369462 1391655
36941A391655P8330M1123o53k5457l7206m6998m6998J3055R9870P3108k6763k1540
$$ 1391655 1469985 1511108 1510455 1484998 1447792 1400794 1353796 1366851 1466721 1539829 1513066 1491526
36929A491526L4595j3708o5274L916O7886J8930n8095q2246m1776M0471N1567
$$ 1491526 1526121 1512413 1447139 1451055 1518941 1537871 1479776 1397530 1355754 1396225 1447792
36918A447792k9374l8512M9609N9400p181j5666r791l9165k0235J0444k6110p833
$$ 1447792 1418418 1379906 1429515 1488915 1481734 1466068 1456277 1417112 1396877 1407321 1381211 1373378
36906A373378Q2246L1985j17494q2246P5065Q4858J6318L9165N9400n875n4178
$$ 1373378 1455624 1487609 1370115 1287869 1362934 1447792 1464110 1503275 1562675 1556800 1502622
36895A502622m4387j4360K8068L1332l0026l9165M3081O3969p833l4595l264M569
$$ 1502622 1458235 1443875 1471943 1503275 1473249 1434084 1477165 1541134 1533301 1498706 1495442 1500011
36883A500011Q486K1541l264k9374J1097M8956K3499O527L2638K4151l0026m9609
$$ 1500011 1508497 1530038 1526774 1497400 1508497 1557453 1580952 1587479 1620117 1644268 1614242 1564633
36871A564633k1540r139k8721m0470k7415j1097J1749M1123M5040J1097k3499
$$ 1564633 1543093 1533954 1505233 1464763 1437348 1426251 1438000 1479123 1524163 1535260 1511761
36860A511761m5693o3969m5039K6110P5065N8095J8930j3708m1123j8277L7206
$$ 1511761 1466068 1402099 1357060 1383170 1458235 1516330 1535260 1521552 1480429 1462152 1499358
36849A499358K8721l0026l9165%K9374L2637j5013r2037o6580M5692M4387n1567
$$ 1499358 1528079 1498053 1458888 1458888 1488262 1520899 1505886 1413849 1347269 1392961 1437348 1385781
36837A385781k2194Q2246M1123o2663l0027P3108Q6162J9583m4387l9817K7415
$$ 1385781 1363587 1445833 1486956 1424293 1394266 1467374 1553536 1573119 1528732 1488915 1516330
36826A516330L3943m6345m4387O3316P3761k0235l1985K4804K2847J958n875n2220
$$ 1516330 1550273 1503928 1459541 1522857 1596618 1576383 1544398 1569202 1592049 1594007 1588132 1535912
36814A535912n5483M3081P1150l5902p1149J5013L1985l8512l9818K0235M3082
$$ 1535912 1480429 1523510 1594660 1558758 1487609 1502622 1534607 1496095 1456277 1476512 1519594
36803A519594L1331J3708j2402j7624l917n222j5666j1096k2194m5039k1541L0027
$$ 1519594 1550925 1564633 1552231 1534607 1530690 1525468 1509802 1498706 1476512 1431473 1409932 1439959
36791A439959L2637j3708l0679J7624O2011L0027k2847m569M4387L7207J7624
$$ 1439959 1472596 1458888 1428209 1445833 1507844 1537871 1515024 1510455 1554842 1592049 1609673
36780A609673L6553K0888n2872p7024l0679N222J8277L3290K8068J3055J958n2220
$$ 1609673 1646226 1667114 1614242 1537218 1506539 1511761 1530038 1563328 1591396 1604451 1606409 1554189
36768A554189j23369q5510K9374O5275L0026K9373L3291r139k3499K0888L4596
$$ 1554189 1430820 1345310 1374684 1439959 1469985 1499358 1532649 1523510 1500011 1520899 1555495
36757A555495p833k9374l916N874j9582l1332j8277j5666j5666J4361K6762j3054
$$ 1555495 1547662 1518288 1514372 1520246 1500664 1469332 1451055 1435389 1419723 1434084 1460846 1447792
36745A447792J958R6606P7024q4204j26633Q486O7233p833k9374O528N222L6553
$$ 1447792 1449750 1546356 1623380 1539176 1412543 1421029 1488262 1480429 1451055 1457583 1462805 1499358
36733A499358J04440L8512j07050r5301M0470P8329J8277j5666j2402N222K8068
$$ 1499358 1603798 1642310 1535260 1439959 1480429 1558758 1577035 1561369 1548967 1554189 1582257
36722A582257J0444l2637k0888J1749j5665m5040O528N4830J5666l7859k3499
$$ 1582257 1592701 1560064 1539176 1550925 1535260 1490220 1496748 1551578 1567244 1529385 1505886
36711A505886Q486Q485R139K1540p832p0497p0497J8930P5066K6762l5901j6971
$$ 1505886 1514372 1522857 1531996 1553536 1545704 1475207 1404710 1423640 1498706 1525468 1489567 1472596
36699A472596L2637K9374j3055j6972L9818P3108J6318o0052o3317k6110j4360
$$ 1472596 1505233 1534607 1521552 1504580 1544398 1617506 1633824 1573772 1510455 1484345 1469985
36688A469985j3055O53Q485K4805L7859n875n1567j958O0706K6762p833L3943
$$ 1469985 1456930 1457583 1466068 1490873 1528732 1522857 1471290 1469332 1530038 1556800 1548967 1582910
36676A582910M2429k6110m3082J0444J5014o3970j31202r0079M6998J20105N1567
$$ 1582910 1625339 1599229 1556147 1566591 1581605 1517635 1386433 1296354 1343352 1463457 1515024
36665A515024j1096K3499J3707m8303P180Q2899j3708j03134J6319J05745j3055
$$ 1515024 1503928 1527427 1541134 1492831 1500011 1582910 1569202 1466068 1482387 1588132 1575077
36654A575077j03787m0470R139K0235O8538M9609m3081k7416O7233M8303l1984
$$ 1575077 1471290 1430820 1439959 1460194 1528732 1578341 1535260 1507844 1575077 1623380 1591396
36643A591396k2194J1097l264J1750L8512r139n8747k3499J3708j306J0444L7207
$$ 1591396 1569202 1580299 1577035 1588785 1627297 1618158 1559411 1535912 1549620 1548314 1558758 1595965
36631A595965j3055p9635l9165K1541l3290j01829k2193R7259P8330M569K6110
$$ 1595965 1582910 1503275 1464110 1485651 1452361 1350532 1328339 1425598 1503928 1508497 1534607
36620A534607P8982M4387l0679o2664m4387J306K4152n875n222N6136M8956n6136
$$ 1534607 1613589 1657976 1627297 1564633 1520246 1521552 1545704 1539829 1534607 1590743 1639699 1583563
36608A583563r3343l0026J305J958L3943L0027j5014J6319Q0941L1332o3970o0052
$$ 1583563 1490220 1460194 1461499 1463457 1497400 1527427 1512413 1528732 1609673 1641005 1577035 1516983
36596A516983l917J5666P180q485j5666n875k3499n4178o53Q3552M3081n0261
$$ 1516983 1513066 1528732 1535912 1527427 1511761 1505886 1482387 1428209 1427556 1511108 1554189 1503928
36584A503928l9818M569j6318j7624J9582J2402J3708O7233M8303m4387l9165
$$ 1503928 1464110 1468679 1452361 1434737 1454319 1466721 1480429 1547662 1595965 1551578 1512413
36573A512413M5693L9164k8068k2193K5457K0235k2846o3316p5719l5248L7206
$$ 1512413 1558106 1597270 1569202 1547009 1572466 1592701 1569855 1506539 1430820 1395572 1432778
36562A432778P5719M5039k7415n4831l263M1775K3499K6110O4622K1541p3108
$$ 1432778 1508497 1553536 1526121 1471290 1468027 1509802 1533301 1559411 1624033 1645574 1572466
36551A572466p2455r138J305R139O2663P0497J9582j0443k2847m4386m6998l4596
$$ 1572466 1500011 1490873 1492178 1501317 1563980 1634477 1654059 1643616 1620769 1576383 1529385 1494789
36539A494789k6762K611J8277j9583k1540L8512K1540n6136j0444J06398Q2899
$$ 1494789 1468027 1470638 1488915 1469332 1447792 1486304 1507844 1451708 1441264 1547662 1630561
36528A630561k9374m6998M569R139j8277j1097L0027M1775%j1749L0026r138j13578
$$ 1630561 1601187 1554189 1558758 1567897 1549620 1538523 1568550 1610325 1610325 1598576 1628602 1619464 1505886
36515A505886o1358R6606O6580q0940n6136L7859k6110q3551K2846J05745N1567
$$ 1505886 1444528 1541134 1607714 1526774 1470638 1508497 1482387 1398836 1421682 1527427 1578994
36504A578994j7625l6553r792M1776N875j01176o4622Q3552P2455m4387l1332
$$ 1578994 1561369 1524816 1515024 1556800 1562675 1461499 1396877 1480429 1552884 1508497 1477165
36493A477165K7415n222l916N1567K4804k8720l917p180o2011n2873j5665j5666
$$ 1477165 1504580 1499358 1495442 1547009 1571813 1543093 1539176 1531996 1469985 1417112 1401447 1385781
36481A385781K9373Q6163L8512q486K6763q486j14231q0288L9818O3316M8304
$$ 1385781 1415154 1501317 1539829 1531343 1558106 1549620 1435389 1355101 1394919 1458235 1506539
36470A506539O0052Q486n6789k3499m569n1567J958J09009L9818j22717j08356
$$ 1506539 1566591 1575077 1518288 1494789 1490220 1438653 1440611 1549620 1589438 1466721 1358365
36459A358365N0914J35119R2037n222p8982o8538M569N3525M7651J3707j5013
$$ 1358365 1409279 1544398 1636435 1631213 1552231 1483693 1488262 1541787 1589438 1603145 1588132
36448A588132k4152l5901n9400m2428M569R139Q485O0053N4831l7207m5039L4595
$$ 1588132 1563980 1528079 1468679 1426251 1430820 1439959 1448444 1508497 1563328 1526121 1481082 1515677
36436A515677J2402n3525L264O2011m569m3082L264r138m6998N875M5692n222
$$ 1515677 1528079 1474554 1477818 1539829 1535260 1492178 1495442 1486304 1439306 1445181 1490873 1485651
36424A485651j0444N2872M7651j0444k3499j6971j7625J5666N6789M0471k4152
$$ 1485651 1475207 1528079 1575730 1565286 1541787 1524816 1507191 1522857 1579646 1620117 1595965
36413A595965p8330n9400L3291Q6815L2637k7415l0027l9164n0262l916L7859
$$ 1595965 1517635 1458235 1491526 1578341 1610978 1583563 1553536 1514372 1464110 1460194 1498053
36402A498053K2193N222j3055m0470J0444R3996L4595q3551m7651L5248j5666
$$ 1498053 1520246 1525468 1512413 1471943 1482387 1576383 1610978 1527427 1479776 1515024 1499358
36391A499358n0261L5901M5040o6581p4413M8304R9870L8512k4805m9608l7860
$$ 1499358 1449097 1484998 1530038 1463457 1389044 1437348 1537218 1575730 1550925 1501317 1463457
36380A463457r138o527k2194m569J5666L264Q485M3082L4595j8930m6997l8512
$$ 1463457 1454319 1447792 1425598 1421029 1436695 1439959 1448444 1491526 1526121 1507191 1460194 1421682
36368A421682m1776o1358m9609K1541R5301Q6162L0679J9583K5457k4152o2664
$$ 1421682 1379906 1318548 1268939 1290480 1385781 1471943 1502622 1522205 1547662 1523510 1460846
36357A460846j1749O1358P1802L7207k2194p4413m5039L5248M2429j8930k4152
$$ 1460846 1449097 1510455 1582257 1619464 1597270 1522857 1477818 1513066 1555495 1536565 1512413
36346A512413J6319M569l7859l5901r791%%r791k1541l264K0888j958k2194J8930
$$ 1512413 1528732 1533301 1495442 1459541 1449750 1449750 1449750 1439959 1418418 1415154 1436042 1434084 1411890 1430820
36332A430820M5692j305k2846K8721M1775O53P180J3055o7233j07703r791N0914
$$ 1430820 1476512 1475207 1452361 1481082 1522857 1523510 1530690 1543745 1476512 1368809 1359018 1409932
36320A409932r791n875J09009J35771L5249m7651o8538n6789j7624j4361m6998
$$ 1409932 1400141 1394266 1503275 1639046 1674295 1626644 1558106 1501317 1483693 1469332 1422334
36309A422334l263Q2246M7650l1332J1750O2011j3055q2899n6789j6319L5249
$$ 1422334 1419071 1501317 1548967 1517635 1529385 1591396 1578341 1495442 1438653 1422334 1457583
36298A457583R1384M3734m6997l2638r138o9844l4596J01829P9635n0262k6762
$$ 1457583 1548967 1592701 1545704 1513066 1503928 1434084 1399488 1501317 1580952 1530690 1503928
36287A503928N1567j959m9608j4361m5039r4648j0444P8982L1985j1097L0679
$$ 1503928 1555495 1553536 1503928 1489567 1444528 1349880 1339436 1418418 1450403 1439306 1469985
36276A469985L9165l264j3055J958J959j1097l5901l0027M0471P5066J0444n1567
$$ 1469985 1509150 1505886 1492831 1494789 1496748 1485651 1449750 1419723 1460194 1535260 1545704 1494137
36264A494137m5693j6971J7624M2429R138k3499K0888N9400K8721J1749J2402
$$ 1494137 1448444 1431473 1449097 1491526 1500664 1477165 1498053 1557453 1586174 1597923 1610325
36253A610325m7650j00523o4622l264K5457L7207Q486l8512k7416k611m569N1567
$$ 1610325 1562675 1462152 1397530 1394266 1419723 1456930 1465416 1426904 1399488 1396877 1392308 1443875
36241A443875J08356O527j05092k1540O3969k5457p9635L263K8068j4360L916
$$ 1443875 1552231 1558758 1453666 1432126 1496095 1470638 1391003 1394266 1422334 1407974 1411890
36230A411890l263n4178J6971J21411M4387o0706J3708Q8774J2402m7651n222
$$ 1411890 1408627 1354449 1371420 1492831 1537218 1476512 1490220 1578994 1591396 1543745 1538523
36219A538523J4361p180r139j9582l1332N222L1984j3707l8512K2846O2011r139
$$ 1538523 1552884 1545704 1536565 1516983 1485651 1490873 1522857 1509150 1470638 1493484 1555495 1546356
36207A546356q6162m2429N0914M8304k2194k9373N874j958k2846k4152k8068R139
$$ 1546356 1460194 1417765 1468679 1516983 1494789 1465416 1471290 1469332 1446486 1422334 1394266 1403405
36195A403405Q5510N2872o4622m4387O9191K4805q8774l5901O7233L7207p181
$$ 1403405 1488915 1541787 1477165 1432778 1501969 1526774 1438000 1402099 1469332 1506539 1499358
36184A499358K4152K6763n875K611N222k7415l2638j3055k611J4361J5666j6972
$$ 1499358 1523510 1550273 1544398 1547009 1552231 1524816 1492178 1479123 1476512 1490873 1506539 1489567
36172A489567p833J5014l3291m7650M7650O4622o3969r7259J4360N8095J6318
$$ 1489567 1481734 1496748 1463457 1415807 1463457 1528079 1464110 1366851 1381211 1439306 1455624
36161A455624J5666K2194l264P833K0235l0026o7886m5692k8721N222P0497P2455
$$ 1455624 1471290 1493484 1490220 1498053 1518288 1488262 1420376 1374684 1345963 1351185 1421682 1494137
36149A494137O52k6762j306K1541M0470L7207Q485K0236K2846o8539j08356O528
$$ 1494137 1494789 1468027 1466721 1488262 1528732 1565939 1574424 1594660 1617506 1548967 1440611 1447139
36137A447139M9609n7442l0679J31855J05744p7024j08356k5457k1540m6345k6110
$$ 1447139 1496748 1439306 1408627 1540482 1646226 1569202 1460846 1435389 1413849 1367504 1341394
36126A341394k6110l9818q485L1984O0053R1385Q0940K2193l263o53j8277k4152
$$ 1341394 1315284 1275466 1266981 1298965 1359018 1450403 1531343 1553536 1550273 1549620 1531343 1507191
36114A507191k0235l5901j1096N5483M8303%L3943N3525l7859p7024N222K5457
$$ 1507191 1486956 1451055 1439959 1495442 1543745 1543745 1577688 1631213 1593354 1516330 1521552 1547009
36102A547009l2637m570M6998r791o3316j5014K4805L264n875M569J2402M6345
$$ 1547009 1514372 1509802 1556800 1547009 1483693 1468679 1493484 1496748 1490873 1495442 1507844 1554189
36090A554189O3969P833n0261k8068J4360L917l3290m3082J959O5274M8303m7650
$$ 1554189 1618158 1625991 1575730 1547662 1562022 1565939 1532649 1489567 1491526 1556800 1605103 1557453
36078A557453p4413J3708O3969%n4178k0235J5665m569k4151p833J4360K0235
$$ 1557453 1483040 1496748 1560717 1560717 1506539 1486304 1501969 1497400 1473249 1465416 1479776 1500011
36066A500011M569l8512n3525L917M8303J305l9164o528O53k6763K8068R3996
$$ 1500011 1504580 1466068 1412543 1416460 1464763 1466068 1426904 1420376 1421029 1394266 1422334 1516330
36054A516330J0444q9426k4152Q0941P3760L9165J1749p0497j10314l8512o52
$$ 1516330 1526774 1437348 1413196 1494137 1567897 1607062 1618811 1548314 1438000 1399488 1398836
36043A398836k1541M6345J24022M3081p1802n5484j6318m5692l9165K0888L2637
$$ 1398836 1377295 1423640 1547662 1590743 1518941 1463457 1447139 1401447 1362282 1383170 1415807
36032A415807N875J1096L7207L3290j8277m4387K8721Q8774j306r0079P180J13578
$$ 1415807 1421682 1432778 1469985 1503275 1484998 1440611 1469332 1558106 1556800 1466721 1473901 1587479
36020A587479M2429m9609l0679j0444j0444J4361j5666p3761k2193M3081q486
$$ 1587479 1629908 1580299 1549620 1539176 1528732 1543093 1527427 1453666 1431473 1474554 1466068
36009A466068k6109M5039J1097p1150M570P3107m4387j05092K1541P8329P833
$$ 1466068 1439959 1484998 1496095 1424945 1429515 1502622 1458235 1353143 1374684 1453013 1460846
35998A460846J6972P8329N4178K9374L7207l0680j11619p7677j1749o528P180
$$ 1460846 1477818 1556147 1610325 1639699 1676906 1646226 1534607 1456930 1445181 1438653 1445833
35987A445833L0027r139n0261j3055M3734M5692J3708o528J7624N5484K9373m7650
$$ 1445833 1475860 1466721 1416460 1403405 1447139 1492831 1506539 1500011 1517635 1573119 1602492 1554842
35975A554842o7886k6762j1750j6971K6110P5718N0915l7860r5953o3970J4361
$$ 1554842 1486956 1460194 1448444 1431473 1457583 1533301 1584216 1546356 1450403 1386433 1400794
35964A400794N6789M7650K6763J2402j958k6763m8956k0888N2220O1358j9582
$$ 1400794 1457583 1505233 1531996 1544398 1542440 1515677 1466721 1445833 1498053 1559411 1539829
35953A539829m6345J5666J7624m8303l7207K1541J3707j4360k2846m9609l1332
$$ 1539829 1493484 1509150 1526774 1478471 1441264 1462805 1476512 1462152 1439306 1389697 1358365
35942A358365O5928Q4857p833l0679J5666j1097l1332M7651O9191k7416o2663
$$ 1358365 1424293 1509150 1501317 1470638 1486304 1475207 1443875 1491526 1560717 1533301 1470638
35931A470638j0444m570k9373j6972J5014O7885J11620K6110j17495j10966O527
$$ 1470638 1460194 1455624 1426251 1409279 1424293 1492178 1603798 1629908 1512413 1401447 1407974
35920A407974L4596j5014k4804j1097r791J958K0235K0236j959l1984n222O6580
$$ 1407974 1442570 1427556 1402752 1391655 1381864 1383822 1404057 1424293 1422334 1390350 1385128 1451708
35908A451708K3499j14884q9426P9635Q8121k0235K9374J05744j4360j13578j1097
$$ 1451708 1475207 1360323 1270897 1350532 1438653 1418418 1447792 1553536 1539176 1425598 1414501
35897A414501O2664j7624o0053o527K3499J0444k0888n9400k0235R3995J10967
$$ 1414501 1477165 1459541 1399488 1392961 1416460 1426904 1406016 1346616 1326381 1420376 1531343
35886A531343J958n9400k6109p833l3943m2429j3707K4151M1776L5901K5457N222
$$ 1531343 1533301 1473901 1447792 1439959 1406016 1363587 1349880 1374031 1415807 1451708 1477165 1482387
35874A482387j4360J6318N8095J2402p5066o7233J2402O2664P5719L7206n1567
$$ 1482387 1468027 1484345 1542440 1554842 1479776 1412543 1424945 1487609 1563328 1600534 1548967
35863A548967o7885Q485J306r0079q0941P180K1541O527L3943M1123K7416L1332
$$ 1548967 1481082 1489567 1490873 1400794 1319853 1327033 1348574 1355101 1389044 1430167 1457583 1488915
35851A488915O527k0888K2194M1123k1541j6319N5484K6762l6553N874K2846n4830
$$ 1488915 1495442 1474554 1496748 1537871 1516330 1500011 1555495 1582257 1545704 1551578 1574424 1519594
35839A519594n8095R139%j4361J5013l5248r8565j3055Q4857M5040K0235O9191
$$ 1519594 1461499 1470638 1470638 1456277 1471290 1436042 1337477 1324422 1409279 1454319 1474554 1543745
35827A543745M2429l8512m8956l3290k6763J0444J7624k4804j5666J1097l1985
$$ 1543745 1586174 1547662 1498706 1465416 1438653 1449097 1466721 1441917 1426251 1437348 1405363
35816A405363j8930Q6816P5065n1566o8539J958j958j6319L0680N2872L1332M569
$$ 1405363 1386433 1473249 1548314 1496748 1428209 1430167 1428209 1411890 1442570 1495442 1526774 1531343
35804A531343l5901m1123Q486m570o5927j5013P9635M9609j9583k4804l5901k2846
$$ 1531343 1495442 1454319 1462805 1458235 1392308 1377295 1456930 1506539 1486956 1462152 1426251 1403405
35792A403405O3316P1802j1749N875L7859q0288j19453N3526J10967l9818p6371
$$ 1403405 1466721 1538523 1526774 1532649 1570508 1490220 1370767 1424293 1535260 1495442 1419071
35781A419071K2846J7624k4152K4805L5901j1750K1541P3760K8068l9817n3525
$$ 1419071 1441917 1459541 1435389 1460194 1496095 1484345 1505886 1579646 1607714 1567897 1514372
35770A514372l8512%K2846j1097p180N0261K0235n9399k4805L3943p833k5457
$$ 1514372 1475860 1475860 1498706 1487609 1480429 1530690 1550925 1491526 1466721 1500664 1492831 1467374
35758A467374J9582j6318p9635k6763K2193k1540k2846L7206K8721j3708n222
$$ 1467374 1486956 1470638 1391003 1364240 1386433 1364893 1342047 1379253 1407974 1394266 1389044
35747A389044o52j8277l917J5666L0026P2455P1802r791n6136k2846m569m570
$$ 1389044 1388392 1370115 1366198 1381864 1411890 1484345 1556147 1546356 1490220 1467374 1462805 1458235
35735A458235K8721L7860o53k3499k5457j3708M7651Q6815J8930o1359o0705k8068
$$ 1458235 1486956 1524816 1524163 1500664 1475207 1461499 1509150 1595965 1614895 1553536 1492831 1464763
35723A464763J5013O3317L0679l9818m569M6998k6110q0941j5666%m5692Q486
$$ 1464763 1479776 1543093 1573772 1533954 1529385 1576383 1550273 1469332 1453666 1453666 1407974 1416460
35711A416460P3760n222o6580J6319P5718J6319m3081m1776j1097J6972P180j7624
$$ 1416460 1490220 1484998 1418418 1434737 1510455 1526774 1483693 1441917 1430820 1447792 1454972 1437348
35699A437348N222P180n0914l4596N4831K8721o5275k0235O0052J1750k8721L3943
$$ 1437348 1442570 1449750 1398836 1364240 1419071 1447792 1382517 1362282 1422334 1434084 1405363 1439306
35687A439306M7650j958J1750L3942j1096l3943q486J958L3943P7024K2846o5274
$$ 1439306 1486956 1484998 1496748 1530690 1519594 1485651 1477165 1479123 1513066 1590090 1612936 1547662
35675A547662m8956p833l9818l4595M4386O7886J9582L917K3499L0026K0888j2402
$$ 1547662 1498706 1490873 1451055 1416460 1460846 1528732 1548314 1552231 1575730 1605756 1626644 1614242
35663A614242m7651l0679J0444R139J958J8930r792n8747k2193M3734J1749m7650
$$ 1614242 1566591 1535912 1546356 1555495 1557453 1576383 1566591 1507844 1485651 1529385 1541134 1493484
35651A493484j306N6789r791r3343l5901O5275N0261j5013m569K4152j2403o1358
$$ 1493484 1492178 1548967 1539176 1445833 1409932 1475207 1525468 1510455 1505886 1530038 1517635 1456277
35639A456277o6580n4831j6971M8303O3969K0888o52o528l1985j6971L2637J3708
$$ 1456277 1389697 1334866 1317895 1366198 1430167 1451055 1450403 1443875 1411890 1394919 1427556 1441264
35627A441264l4596l916L9818K0235P180P833j6972J4361R1384M1123p8982n2872
$$ 1441264 1406668 1402752 1442570 1462805 1469985 1477818 1460846 1475207 1566591 1607714 1528732 1475860
35615A475860K9373k0888o8538P833M2428o527J958K4805k6763k5457O2011O3316
$$ 1475860 1505233 1484345 1415807 1423640 1466068 1459541 1461499 1486304 1459541 1434084 1496095 1559411
35603A559411k9373p2455n6789k2846L9164N5484j4361k8720M6345L8512o5928
$$ 1559411 1530038 1457583 1400794 1377948 1417112 1472596 1458235 1429515 1475860 1514372 1448444
35592A448444p5066L5249R1384M6998j958j8277m6345o5928k1540M7650L9165
$$ 1448444 1373378 1408627 1500011 1547009 1545051 1526774 1480429 1414501 1392961 1440611 1479776
35581A479776j5013K611M8303J3055l1984l917J8930M569K0888J3707m8956j9582
$$ 1479776 1464763 1467374 1515677 1528732 1496748 1492831 1511761 1516330 1537218 1550925 1501969 1482387
35569A482387Q4857M4387r4648j06398m1123k9374Q486P7024M2429o528M6998
$$ 1482387 1567244 1611631 1516983 1410585 1369462 1340088 1348574 1425598 1468027 1461499 1508497
35558A508497O0705k9373n4831o53k611k3499n874j0444j1750L5249J5666o6581
$$ 1508497 1569202 1539829 1484998 1484345 1481734 1458235 1452361 1441917 1430167 1465416 1481082 1414501
35546A414501m3734L1985J1749r791M8956M8956j7624j0444J6319k4152k7415
$$ 1414501 1370767 1402752 1414501 1404710 1453666 1502622 1484998 1474554 1490873 1466721 1439306
35535A439306L0026K4805j5014p833k5457o9844k4151N9400O0052K3499K611m5692
$$ 1439306 1469332 1494137 1479123 1471290 1445833 1375989 1351838 1411238 1471290 1494789 1497400 1451708
35523A451708p5066j6971M0470L5901L9165N2872R139l2638J8277R2038O0705
$$ 1451708 1376642 1359671 1400141 1436042 1475207 1528079 1537218 1504580 1522857 1614895 1675600
35512A675600n0914r2037r139N2220p180o7233l6554r139j9582J5013M8956J958
$$ 1675600 1624686 1532649 1523510 1575730 1568550 1501317 1464763 1455624 1436042 1451055 1500011 1501969
35500A501969l0026n875k0235k5457O8539R4648o3969j74284q7468O528J1749
$$ 1501969 1471943 1466068 1445833 1420376 1488915 1583563 1519594 1345310 1257842 1264370 1276119
35489A276119L5901P4413N0262J4360K2194K2193J958N222K1541K0888j0444n9400
$$ 1276119 1312020 1386433 1436695 1451055 1473249 1495442 1497400 1502622 1524163 1545051 1534607 1475207
35477A475207p3760l0680L917L916J2403L2637M1776M5692K0235m0470o3317l5901
$$ 1475207 1401447 1370767 1374684 1378600 1391003 1423640 1465416 1511108 1531343 1490873 1427556 1391655
35465A391655k0888J1750P1802L6554o2011j5666R9217L2638j01829m2428R0079
$$ 1391655 1370767 1382517 1454319 1490873 1428862 1413196 1512413 1545051 1443222 1400794 1490873
35454A490873O4622m1776p4413l1985L0679M7651J1097J8276N8095P833n8747
$$ 1490873 1555495 1513719 1439306 1407321 1438000 1485651 1496748 1515024 1573119 1580952 1522205
35443A522205j4361j3707j20759q2898J03134J14883l0679n3525R791L264o528
$$ 1522205 1507844 1494137 1373378 1290480 1393614 1508497 1477818 1424293 1434084 1437348 1430820
35432A430820J306k6110N874Q8121L9818n4831J0444P2455l3290q3552K2846N7442
$$ 1430820 1432126 1406016 1411890 1500011 1539829 1484998 1495442 1567897 1534607 1451055 1473901 1531343
35420A531343l916N874J9583m6345n4831O527r791o9844m2428L0026O3317M2428
$$ 1531343 1527427 1533301 1552884 1506539 1451708 1458235 1448444 1378600 1336172 1366198 1429515 1471943
35408A471943k9373p7677j6972O5275L3290l7207k2846L3943M0470L917j4360
$$ 1471943 1442570 1364893 1347921 1413196 1446486 1409279 1386433 1420376 1460846 1464763 1450403
35397A450403J958R791k2193l7207O53J7624j306K5458O5927L3943m569J5013
$$ 1450403 1452361 1462152 1439959 1402752 1403405 1421029 1419723 1445181 1511108 1545051 1540482 1555495
35385A555495J1749l4595k9374J8930L3290J2402k2846l4596R139K6110n8748
$$ 1555495 1567244 1532649 1503275 1522205 1555495 1567897 1545051 1510455 1519594 1545704 1486956
35374A486956r7259J958O2011N875j4360J3707%Q486N4831K7415r138K3498j5013
$$ 1486956 1389697 1391655 1453666 1459541 1445181 1458888 1458888 1467374 1522205 1549620 1540482 1563980 1548967
35361A548967j06397j5666J38382N2220j25328r4648K8068M9609K7415L264k4804
$$ 1548967 1442570 1426904 1565286 1617506 1492178 1397530 1425598 1475207 1502622 1505886 1481082
35350A481082J305K8068k4151l5901L4595K6110l5248k611K3499k9374j4361M1776
$$ 1481082 1482387 1510455 1486304 1450403 1484998 1511108 1475860 1473249 1496748 1467374 1453013 1494789
35338A494789n222k3499O3970M8956n4178k8721K2193l8512j6971R9217O4622
$$ 1494789 1489567 1466068 1530038 1578994 1524816 1496095 1518288 1479776 1462805 1562022 1626644
35327A626644m3081j3055J2402o6580p5719k4151k7416N222N9400j8929q1594
$$ 1626644 1583563 1570508 1582910 1516330 1440611 1416460 1389044 1394266 1453666 1434737 1353143
35316A353143K8721O9844l9165j9582R1384L5249m9609J8930M3734m9609o6580
$$ 1353143 1381864 1451708 1412543 1392961 1484345 1519594 1469985 1488915 1532649 1483040 1416460
35305A416460p181J6319M4387N8747k611k4804R138n4178j10314J306Q0940j7624
$$ 1416460 1409279 1425598 1469985 1528732 1526121 1501317 1510455 1456277 1345963 1347269 1428209 1410585
35293A410585p1149j959J8277N222L7207K4151k611N0915M5692n0262k1540Q7468
$$ 1410585 1339436 1337477 1355754 1360976 1398183 1422334 1419723 1470638 1516330 1466068 1444528 1531996
35281A531996L8512m0470K4151M2429m9609l5248L9817k9373j15537n0261L0679
$$ 1531996 1570508 1530038 1554189 1596618 1547009 1511761 1551578 1522205 1406668 1356407 1387086
35270A387086L5901M4387L9817r791j8929J2402O527j6318k9374m6345j9582M7650
$$ 1387086 1422987 1467374 1507191 1497400 1478471 1490873 1497400 1481082 1451708 1405363 1385781 1433431
35258A433431L8512k2193r139K8068O53p180L1985R791n0262l5901O528Q485Q486
$$ 1433431 1471943 1449750 1440611 1468679 1469332 1462152 1494137 1503928 1453666 1417765 1424293 1432778 1441264
35245A441264K3499J5013o527k2846l0027l264M6345M1123j8929n6136m1776j958
$$ 1441264 1464763 1479776 1473249 1450403 1420376 1417112 1463457 1504580 1485651 1429515 1387739 1385781
35233A385781P180l9818m8303N4831J20758L5901m8303j8277L263k5457j4360
$$ 1385781 1392961 1353143 1304840 1359671 1480429 1516330 1468027 1449750 1453013 1427556 1413196
35222A413196P833p180K1540O5928J8277m5040j6971R791r139J1750L3290j7624
$$ 1413196 1421029 1413849 1435389 1501317 1519594 1474554 1457583 1467374 1458235 1469985 1503275 1485651
35210A485651k4805M3734L4596m5039l5902K8721K7416r792k0887k6110k6763
$$ 1485651 1460846 1504580 1539176 1494137 1458235 1486956 1514372 1504580 1483693 1457583 1430820
35199A430820j4360k3499l9818j6971L0679O4622O0053l264p3761n7441P180J3055
$$ 1430820 1416460 1392961 1353143 1336172 1366851 1431473 1491526 1488262 1414501 1357060 1364240 1377295
35187A377295j1097J1097L8512J6971o527J9582N6789L7207l1332m7651J1097
$$ 1377295 1366198 1377295 1415807 1432778 1426251 1445833 1502622 1539829 1508497 1460846 1471943
35176A471943L4596j5666m3081l0027l3943j5666M1776M1776J0444M3734M8956
$$ 1471943 1506539 1490873 1447792 1417765 1383822 1368156 1409932 1451708 1462152 1505886 1554842
35165A554842l9165o2011J6972M0470L7859R2690N8095q2899q4204L1984L0027
$$ 1554842 1515677 1453666 1470638 1511108 1548967 1641657 1699752 1616853 1532649 1564633 1594660
35154A594660k4152k611k6763q2246O528Q8773k4804q6163N0262R0732m5040o0705
$$ 1594660 1570508 1567897 1541134 1458888 1465416 1554189 1529385 1443222 1493484 1584216 1539176 1478471
35142A478471O2011P1149j6319k2193J4360j9582o9191m3082K2847J1096o7233
$$ 1478471 1540482 1611631 1595312 1573119 1587479 1567897 1498706 1455624 1478471 1489567 1422334
35131A422334o4622J8930K0235m1123p833L9818j2402j5014Q2247Q7468K611R791
$$ 1422334 1357712 1376642 1396877 1355754 1347921 1387739 1375337 1360323 1442570 1530038 1532649 1542440
35119A542440M4387r139m3081l3290p5719p0497M8956Q1594k8068o2664N875M1123
$$ 1542440 1586827 1577688 1534607 1501317 1425598 1355101 1404057 1485651 1457583 1394919 1400794 1441917
35107A441917N6136M7651n0915j15536k2846P5066O2664L9164K5457j4360q486
$$ 1441917 1498053 1545704 1494789 1379253 1356407 1431473 1494137 1533301 1558758 1544398 1535912
35096A535912R792o5275j08356l264O5275P180j7624o53l9165l3290M3082J3707
$$ 1535912 1545704 1480429 1372073 1368809 1434084 1441264 1423640 1422987 1383822 1350532 1393614 1407321
35084A407321p1802o527J04439O0053l2638j9582K8068J9583l7207r1385p3760
$$ 1407321 1335519 1328992 1433431 1493484 1460846 1441264 1469332 1488915 1451708 1360323 1286563
35073A286563M569J7624l4595N222J14231J14883J0444m1123o528K0888k1540
$$ 1286563 1291132 1308756 1274161 1279383 1393614 1508497 1518941 1477818 1471290 1492178 1470638
35062A470638p8983l9817P7677J27285P4413J6319k5457p1802o1358j306K8721
$$ 1470638 1391655 1351838 1429515 1556800 1631213 1647532 1622075 1550273 1488915 1487609 1516330
35051A516330M1123M6998r791o4622j1750K8068m4387p7676j0444J3707r138J6971
$$ 1516330 1557453 1604451 1594660 1530038 1518288 1546356 1501969 1424293 1413849 1427556 1418418 1435389
35039A435389K8068j958J0444J7624l5248k8068L7859J1750k6110M6998O4621
$$ 1435389 1463457 1461499 1471943 1489567 1454319 1426251 1464110 1475860 1449750 1496748 1561369
35028A561369n4178r0079j3707L263o52N7441N4178k0887j7625K9374J7624R791
$$ 1561369 1507191 1417112 1403405 1406668 1406016 1463457 1517635 1496748 1479123 1508497 1526121 1535912
35016A535912J5666l1984o6581m2428l5901j4361Q0941J10967J4360l0026J8277
$$ 1535912 1551578 1519594 1453013 1410585 1374684 1360323 1441264 1552231 1566591 1536565 1554842
35005A554842L1332J5013N222m6998o6580L917J6318n1567j3055O2664k5457j24022
$$ 1554842 1586174 1601187 1606409 1559411 1492831 1496748 1513066 1461499 1448444 1511108 1485651 1361629
34993A361629l6554O7233M5692M570o528j958N4178O6580m7651q2246N8748R5953
$$ 1361629 1325075 1392308 1438000 1442570 1436042 1434084 1488262 1554842 1507191 1424945 1483693 1579646
34981A579646m4386r1385k5457l6554m1123O5275Q7468l9818q8773R791Q0288
$$ 1579646 1535260 1443875 1418418 1381864 1340741 1406016 1493484 1453666 1364893 1374684 1454972
34970A454972N7441K5458J3707O53l0026o2664n1567O53L9165N1566M8956J2403
$$ 1454972 1512413 1537871 1551578 1552231 1522205 1459541 1407974 1408627 1447792 1499358 1548314 1560717
34958A560717k6763j1097J1097j9582m2429n222M6998O9191L1985n3526o8538
$$ 1560717 1533954 1522857 1533954 1514372 1471943 1466721 1513719 1582910 1614895 1561369 1492831
34947A492831K5457O5275n875l3290N222j3708m7650j5013j1097m8303o528N2873
$$ 1492831 1518288 1583563 1577688 1544398 1549620 1535912 1488262 1473249 1462152 1413849 1407321 1460194
34935A460194J3707k2846K0235K2847l5902l6553m570r791o53L0680M569l4596
$$ 1460194 1473901 1451055 1471290 1494137 1458235 1421682 1417112 1407321 1406668 1437348 1441917 1407321
34923A407321j305L9817J2402j8929J6318O5928M5692l6554o3969Q486N8094O528
$$ 1407321 1406016 1445833 1458235 1439306 1455624 1521552 1567244 1530690 1466721 1475207 1533301 1539829
34911A539829m7651k8721N222J4361L264k2194j5666K3499J306o7886m0470O1358
$$ 1539829 1492178 1463457 1468679 1483040 1486304 1464110 1448444 1471943 1473249 1405363 1364893 1426251
34899A426251Q1593K4152k8721p1149n7442L5248O6580k611j6971J1097m2429
$$ 1426251 1507844 1531996 1503275 1432126 1374684 1409932 1476512 1473901 1456930 1468027 1425598
34888A425598n9400N2873Q6815k9374o7885L916K0888P180M3734N0915J8929J6972
$$ 1425598 1366198 1419071 1505886 1476512 1408627 1412543 1433431 1440611 1484345 1535260 1554189 1571161
34876A571161r139p5718p1803p833J5014J3707J8930J958N875K8068j8930n0914
$$ 1571161 1562022 1486304 1414501 1406668 1421682 1435389 1454319 1456277 1462152 1490220 1471290 1420376
34864A420376M5692R0732l1332r0731K611L1331j5666K2194P0497L3290J3055
$$ 1420376 1466068 1556800 1525468 1434737 1437348 1468679 1453013 1475207 1545704 1578994 1592049
34853A592049J3054n4830q7468p833L7859%j5013j958N874L2638L5901k2846m3082
$$ 1592049 1605103 1550273 1462805 1454972 1492831 1492831 1477818 1475860 1481734 1514372 1550273 1527427 1484345
34840A484345j305M569k0235k3499m3734m5040J8930L2637l0026j6971L7859o53
$$ 1484345 1483040 1487609 1467374 1443875 1400141 1355101 1374031 1406668 1376642 1359671 1397530 1396877
34828A396877r138Q9426Q4204l8512m5692K3499K611r791K8068j5666n1567N2872
$$ 1396877 1387739 1477165 1561369 1522857 1477165 1500664 1503275 1493484 1521552 1505886 1454319 1507191
34816A507191R7260j9583q2246l9817k6110J8929R2038L916j29244l1331J28591
$$ 1507191 1604451 1584868 1502622 1462805 1436695 1455624 1547662 1551578 1422334 1391003 1519594
34805A519594O9844n4178l6554L263j5665p833K3498K9374L4596K8721j2403m6997
$$ 1519594 1589438 1535260 1498706 1501969 1486304 1478471 1501969 1531343 1565939 1594660 1582257 1535260
34793A535260m8956k7416K7416O7232K8069k7416j5666J6972K2193Q486l7860
$$ 1535260 1486304 1458888 1486304 1553536 1581605 1554189 1538523 1555495 1577688 1586174 1548314
34782A548314q0940n5484j9582n222P2455J48173N2873r9218r4648k5457j4360
$$ 1548314 1467374 1411890 1392308 1387086 1459541 1607714 1660587 1561369 1466721 1441264 1426904
34771A426904K1540O7886J4360n2872l5248j7625l916N6136M5040n7442n6136
$$ 1426904 1448444 1516330 1530690 1477818 1442570 1424945 1421029 1477165 1522205 1464763 1408627
34760A408627M1776M5039j3055k0888l7206m5040K5457O6580L9165O1358M5693
$$ 1408627 1450403 1495442 1482387 1461499 1424293 1379253 1404710 1471290 1510455 1571813 1617506
34749A617506r9871j35771K9374O5927o7886m0470R7259N6137m6998N222O0705
$$ 1617506 1517635 1381864 1411238 1477165 1409279 1368809 1466068 1522205 1475207 1480429 1541134
34738A541134j7624q6162l9165N3525Q0288o528r7259l2637Q9426P3108j8277
$$ 1541134 1523510 1437348 1398183 1451708 1531996 1525468 1428209 1395572 1484998 1558106 1539829
34727A539829m8303n9400o3317q486L5249J0444p833m569j1750K6763P5718K4805
$$ 1539829 1491526 1432126 1368809 1360323 1395572 1406016 1398183 1393614 1381864 1408627 1484345 1509150
34715A509150m6345k5457l917k7415%L3290P180J9582N5484j1097o2663J6318
$$ 1509150 1462805 1437348 1433431 1406016 1406016 1439306 1446486 1466068 1521552 1510455 1447792 1464110
34703A464110L3290o6580o9191J5666K2846J9582L8512l5901q2898M7650J30549
$$ 1464110 1497400 1430820 1361629 1377295 1400141 1419723 1458235 1422334 1339436 1387086 1517635
34692A517635J7625o1359j1096R138K611K4804J959j6972L4596K4152m7651J306
$$ 1517635 1535260 1473901 1462805 1471943 1474554 1499358 1501317 1484345 1518941 1543093 1495442 1496748
34680A496748P9635J305o3316R138J5666o4622k4804O2011L3290k8068m5693n6136
$$ 1496748 1576383 1577688 1514372 1523510 1539176 1474554 1449750 1511761 1545051 1516983 1471290 1415154
34668A415154j4360M5692L264l2638M1776M5040o1358m2429N7442K4804l2637
$$ 1415154 1400794 1446486 1449750 1417112 1458888 1503928 1442570 1400141 1457583 1482387 1449750
34657A449750J4360J4361l6554R138N6789J3055O528L0026j6971k1541M4387j0444
$$ 1449750 1464110 1478471 1441917 1451055 1507844 1520899 1527427 1557453 1540482 1518941 1563328 1552884
34645A552884r9218q485J01828M7651p181L917m2429o5274J0444J8929m0470j958
$$ 1552884 1453666 1445181 1547009 1594660 1587479 1591396 1548967 1483693 1494137 1513066 1472596 1470638
34633A470638M5692j5666l3290L3943K2846k7415j959J2402k4151j0444L2637
$$ 1470638 1516330 1500664 1467374 1501317 1524163 1496748 1494789 1507191 1483040 1472596 1505233
34622A505233L5249M4386M1776j1749j8930K5457j0444p1802l5248J1096P833
$$ 1505233 1540482 1584868 1626644 1614895 1595965 1621422 1610978 1539176 1503928 1515024 1522857
34611A522857K2847J305q2246o5275M1123M3082o528J2402j1096o7886p833M6345
$$ 1522857 1545704 1547009 1464763 1399488 1440611 1483693 1477165 1489567 1478471 1410585 1402752 1449097
34599A449097k9374k5457Q6816N0914n1567o53J7624j00523o7233R7260O8538
$$ 1449097 1419723 1394266 1481082 1531996 1480429 1479776 1497400 1396877 1329644 1426904 1495442
34588A495442o5927l9165M1123L5901K4152J3054j1749L9818O9191n6789j27939
$$ 1495442 1429515 1390350 1431473 1467374 1491526 1504580 1492831 1532649 1601840 1545051 1417112
34577A417112r791N4831j1749r139K8068k7415m3081J7624p181m8956K8069O5274
$$ 1417112 1407321 1462152 1450403 1441264 1469332 1441917 1398836 1416460 1409279 1360323 1388392 1453666
34565A453666l2637o2664K6763N6136P180j8277j4360J1097L6553K611m0470L264
$$ 1453666 1421029 1358365 1385128 1441264 1448444 1430167 1415807 1426904 1463457 1466068 1425598 1428862
34553A428862M1123k6763q6162l8512L9817O9844M8303l916k2193j306k3499n0914
$$ 1428862 1469985 1443222 1357060 1318548 1358365 1428209 1476512 1472596 1450403 1449097 1425598 1374684
34541A374684J5013O9191k611o3316L264P2454N4831P180l3942n2220k8721j2402
$$ 1374684 1389697 1458888 1456277 1392961 1396225 1468679 1523510 1530690 1496748 1444528 1415807 1403405
34529A403405j8930J3055M4387L264j6319M5039O3317J0444l264J3708j6972n6789
$$ 1403405 1384475 1397530 1441917 1445181 1428862 1473901 1537218 1547662 1544398 1558106 1541134 1484345
34517A484345n5483k2846L5248O3316N875l0679K1541L4595j5013N875M5692j5013
$$ 1484345 1428862 1406016 1441264 1504580 1510455 1479776 1501317 1535912 1520899 1526774 1572466 1557453
34505A557453o0053j5013j3708l7859L7859Q8121j3055r7259n4178l264J2403
$$ 1557453 1497400 1482387 1468679 1430820 1468679 1556800 1543745 1446486 1392308 1389044 1401447
34494A401447L9817L9165J5666L0679L3290k2193m7651j1097N875o527j5014j7624
$$ 1401447 1441264 1480429 1496095 1526774 1560064 1537871 1490220 1479123 1484998 1478471 1463457 1445833
34482A445833P833M5692J4361l7207j1096L0679J5666J305r791m1776j1096O2663
$$ 1445833 1453666 1499358 1513719 1476512 1465416 1496095 1511761 1513066 1503275 1461499 1450403 1513066
34470A513066L2638l9165k7416m4386j07051k2193J20105P7677n875M6345L8512
$$ 1513066 1545704 1506539 1479123 1434737 1327686 1305493 1425598 1503275 1497400 1543745 1582257
34459A582257q2899p7024J8277J959l0680Q486k0235p6371j0444O7233O3969P2455
$$ 1582257 1499358 1422334 1440611 1442570 1411890 1420376 1400141 1323770 1313326 1380559 1444528 1516983
34447A516983N3525n3525p1802L1331L7860k9374%K8721k0235j1750K1541l0679
$$ 1516983 1570508 1516983 1445181 1476512 1514372 1484998 1484998 1513719 1493484 1481734 1503275 1472596
34435A472596l1332M6345K611q7468O53J13578M6997l5248k2193l5901o3970k2846
$$ 1472596 1441264 1487609 1490220 1402752 1403405 1516983 1563980 1528732 1506539 1470638 1406668 1383822
34423A383822J1750J3707M2429L1332l9165l5901K9374K2193j3708j8277n1567
$$ 1383822 1395572 1409279 1451708 1483040 1443875 1407974 1437348 1459541 1445833 1427556 1375989
34412A375989o8538J5013Q2246M6998R138j6971p4413o6580K4804O0053M7650
$$ 1375989 1307451 1322464 1404710 1451708 1460846 1443875 1369462 1302882 1327686 1387739 1435389
34401A435389O2011J2402r7259p5066M7651P5718L9818N8094N0915k8068o5928
$$ 1435389 1497400 1509802 1412543 1337477 1385128 1460846 1500664 1558758 1609673 1581605 1515677
34390A515677k0235K2193R792l5901m5693O528K2193m1123o6580j6971J8929M3081
$$ 1515677 1495442 1517635 1527427 1491526 1445833 1452361 1474554 1433431 1366851 1349880 1368809 1411890
34378A411890O2664L264n0914K8720Q2247j6972n6789L3943K3499o6580j8930
$$ 1411890 1474554 1477818 1426904 1455624 1537871 1520899 1464110 1498053 1521552 1454972 1436042
34367A436042O0053J958n0914k4805l5248l2637N1567O7233j7625l3290J0444
$$ 1436042 1496095 1498053 1447139 1422334 1387086 1354449 1406016 1473249 1455624 1422334 1432778
34356A432778O528O527K1541k3499m2428M1123Q6815J9582n2872q5510p5719J5014
$$ 1432778 1439306 1445833 1467374 1443875 1401447 1442570 1529385 1548967 1496095 1410585 1334866 1349880
34344A349880R2037L6554l8512j2403L5901K8721n874m6345m4387P180%n6136
$$ 1349880 1441917 1478471 1439959 1427556 1463457 1492178 1486304 1439959 1395572 1402752 1402752 1346616
34332A346616o53R1385M0470k6110J4360J306o5927M569R5953J5014o0053K611
$$ 1346616 1345963 1437348 1477818 1451708 1466068 1467374 1401447 1406016 1501969 1516983 1456930 1459541
34320A459541K5457j7624J1749J9583o2011p5719q485O52p833R791j8276k6110
$$ 1459541 1484998 1467374 1479123 1498706 1436695 1360976 1352491 1353143 1345310 1355101 1336825 1310715
34308A310715M9608N1567l3290j5013O3317M6345K2193M4387j1097p7677l1332
$$ 1310715 1360323 1411890 1378600 1363587 1426904 1473249 1495442 1539829 1528732 1451055 1419723
34297A419723O528j6319K8068N6789k9373k2194J14231R0732o5928o4622K6110
$$ 1419723 1426251 1409932 1438000 1494789 1465416 1443222 1557453 1648185 1582257 1517635 1543745
34286A543745O53l7859J6318M1776m569m8303o3317l3290J4361N222m570L6554
$$ 1543745 1544398 1506539 1522857 1564633 1560064 1511761 1448444 1415154 1429515 1434737 1430167 1466721
34274A466721J5666m6345K4804R5954k7415r7259N1567J01828m2428p1150J1097
$$ 1466721 1482387 1436042 1460846 1556800 1529385 1432126 1483693 1585521 1543093 1471943 1483040
34263A483040j5013l7860M2429K4804q4204p9635k611M6345J02481P8982p0496
$$ 1483040 1468027 1430167 1472596 1497400 1413196 1333561 1330950 1377295 1479776 1558758 1488262
34252A488262r7912M5039O9844l0026j8277M6998L0026K0888K8721k0235r139
$$ 1488262 1390350 1435389 1505233 1475207 1456930 1503928 1533954 1554842 1583563 1563328 1554189
34241A554189P5066K2846j01176n2872O0053K4151m1775j5666n222k9374n222
$$ 1554189 1629255 1652101 1550925 1498053 1558106 1582257 1540482 1524816 1519594 1490220 1484998
34230A484998J4360j8929l5248p833J5665J6319O528l264n875n875K6763P5719
$$ 1484998 1499358 1480429 1445181 1437348 1453013 1469332 1475860 1472596 1466721 1460846 1487609 1563328
34218A563328J6971j09009n8094J03787N2219j20758p9635M5040R138q486O0053
$$ 1563328 1580299 1471290 1413196 1516983 1569202 1448444 1368809 1413849 1422987 1414501 1474554
34207A474554l916j05093j8929N3525l3290k6110Q0288L3943n0915J1097L9818
$$ 1474554 1470638 1365545 1346616 1400141 1366851 1340741 1421029 1454972 1404057 1415154 1454972
34196A454972k4805o52M1775j8277j1749P8982K6110r7259p6371n875%K4804M5040
$$ 1454972 1430167 1429515 1471290 1453013 1441264 1520246 1546356 1449097 1372726 1366851 1366851 1391655 1436695
34183A436695%k611M3081P833m1123p833M569k2193J6319M6997j4360n3525k4152
$$ 1436695 1436695 1434084 1477165 1484998 1443875 1436042 1440611 1418418 1434737 1481734 1467374 1413849 1389697
34170A389697L264M1123N7442l3291r6606O53P7024J6971l916N1567M9608J7625
$$ 1389697 1392961 1434084 1491526 1458235 1361629 1362282 1439306 1456277 1452361 1503928 1553536 1571161
34158A571161M569l9818o0052o528k611l5901M1776J15536M7651n222J1096m3081
$$ 1571161 1575730 1535912 1475860 1469332 1466721 1430820 1472596 1588132 1635783 1630561 1641657 1598576
34146A598576q4204j959R792p7024k1541R9870M5040n0262j6971J4360k611K3499
$$ 1598576 1514372 1512413 1522205 1445181 1423640 1523510 1568550 1518288 1501317 1515677 1513066 1536565
34134A536565K8068j3055k611n874q6816p1149N6136Q5510L1984J6319k8068p1149
$$ 1536565 1564633 1551578 1548967 1543093 1456277 1385128 1441264 1526774 1558758 1575077 1547009 1475860
34122A475860P833N8747k4152k9373N1567N222p8330l8512k6763n2872L9817Q8121
$$ 1475860 1483693 1542440 1518288 1488915 1540482 1545704 1467374 1428862 1402099 1349227 1389044 1477165
34110A477165l4595n6137M5693p833p5066O5927J08356q3551j25981K4152L7859
$$ 1477165 1442570 1386433 1432126 1424293 1349227 1415154 1523510 1439959 1313978 1338130 1375989
34099A375989j2402M8956M4387n2873k0235N6137M569l0679J1749j9582o7886
$$ 1375989 1363587 1412543 1456930 1404057 1383822 1439959 1444528 1413849 1425598 1406016 1338130
34088A338130J306P1149L1332n1567j03134n8747P3107J10967K0235%L3290l8512
$$ 1338130 1339436 1410585 1441917 1390350 1287216 1228469 1301576 1412543 1432778 1432778 1466068 1427556
34076A427556p7676J6318L0027m7651J1097J03134L0026l7859J1096N875m0470
$$ 1427556 1349880 1366198 1396225 1348574 1359671 1462805 1492831 1454972 1466068 1471943 1431473
34065A431473n875P180m6997k8721L8512M8303M1123M569p1802l0026R2037L8512
$$ 1431473 1425598 1432778 1385781 1357060 1395572 1443875 1484998 1489567 1417765 1387739 1479776 1518288
34053A518288p7024o53P8983j2403m3081J9583l3943q1594K2847O0705l916L6553
$$ 1518288 1441264 1440611 1519594 1507191 1464110 1483693 1449750 1368156 1391003 1451708 1447792 1484345
34041A484345P7677j1749l5901J8929m8303q6815M1776P0496n9400o5927L264
$$ 1484345 1562022 1550273 1514372 1533301 1484998 1398183 1439959 1510455 1451055 1385128 1388392
34030A388392j8277J1749R2037R792o6581M4387P1802n7441k9374O9191m3734
$$ 1388392 1370115 1381864 1473901 1483693 1417112 1461499 1533301 1475860 1446486 1515677 1471943
34019A471943j39688j305Q6162J5666K6763Q8121J5013o3317j2402M6998K4804
$$ 1471943 1332255 1330950 1417112 1432778 1459541 1547662 1562675 1499358 1486956 1533954 1558758
34008A558758l7206p2455j4360Q2898P4414r792l0679l916J2402P833n2873r2690
$$ 1558758 1521552 1449097 1434737 1517635 1592049 1582257 1551578 1547662 1560064 1567897 1515024 1422334
33996A422334J6319J10314%r0732n874L1984P181R7259J14230o8538j12925K9373
$$ 1422334 1438653 1548967 1548967 1458235 1452361 1484345 1491526 1588785 1703015 1634477 1521552 1550925
33984A550925O528q1593J9582N0262r6607o2664J07704O5274l1332J8277l0679
$$ 1550925 1557453 1475860 1495442 1545704 1449097 1386433 1494137 1559411 1528079 1546356 1515677
33973A515677j52090n1567J09662P8982L9818N0261m8303r0079N6136R3343l6554
$$ 1515677 1363587 1312020 1421682 1500664 1540482 1590743 1542440 1452361 1508497 1601840 1565286
33962A565286n0914L916m0470l3290M8303J7624l3943P833j7624p7024J5666Q6163
$$ 1565286 1514372 1518288 1477818 1444528 1492831 1510455 1476512 1484345 1466721 1389697 1405363 1491526
33950A491526j0444l5249N4831J6971o9843l5249j6971n0262J7624Q2247K6109
$$ 1491526 1481082 1445833 1500664 1517635 1447792 1412543 1395572 1345310 1362934 1445181 1471290
33939A471290J8930P5719M569j07703q5510k4804o53L1984J4361l7860J2403P3107
$$ 1471290 1490220 1565939 1570508 1462805 1377295 1352491 1351838 1383822 1398183 1360323 1372726 1445833
33927A445833J8930K611N0914j6319r3342p833M3081l4596k2846N1567Q486j5013
$$ 1445833 1464763 1467374 1518288 1501969 1408627 1400794 1443875 1409279 1386433 1438000 1446486 1431473
33915A431473N0914N222r0732k8068N0914J1750J4360N2220j3708n2872L3943
$$ 1431473 1482387 1487609 1396877 1368809 1419723 1431473 1445833 1498053 1484345 1431473 1465416
33904A465416O2011j1097o3317q2246l3290R0079P1802r5953p5719R4648O0706
$$ 1465416 1527427 1516330 1453013 1370767 1337477 1427556 1499358 1403405 1327686 1422334 1483040
33893A483040o0053J0444P1802l916J5666R8564K4152n6789N222K2193n5483p5719
$$ 1483040 1422987 1433431 1505233 1501317 1516983 1615547 1639699 1582910 1588132 1610325 1554842 1479123
33881A479123n3525j1749Q0940P3761n6789n0915O3970K0235o5928Q486O3969
$$ 1479123 1425598 1413849 1494789 1568550 1511761 1460846 1524816 1545051 1479123 1487609 1551578
33870A551578j958j6971k2847r5953o5928N4178N2873L3943J13577Q2247n5484
$$ 1551578 1549620 1532649 1509802 1413849 1347921 1402099 1454972 1488915 1602492 1684739 1629255
33859A629255n4831p833o7233n1566N6788M3082q486K7415j5013r4648j306R5301
$$ 1629255 1574424 1566591 1499358 1447792 1504580 1547662 1539176 1566591 1551578 1456930 1455624 1550925
33847A550925K1541o527L9164m3734r6606L0026O6580l0679m569M1776m2429l1331
$$ 1550925 1572466 1565939 1605103 1561369 1464763 1494789 1561369 1530690 1526121 1567897 1525468 1494137
33835A494137P6371J3055p3108K5457N4178p1802o7233K3499L264K2846J05745
$$ 1494137 1570508 1583563 1510455 1535912 1590090 1518288 1451055 1474554 1477818 1500664 1606409
33824A606409J6971r9870o527P0496k2193o0053p833J958M0471Q1593k6110j18800
$$ 1606409 1623380 1523510 1516983 1587479 1565286 1505233 1497400 1499358 1539829 1621422 1595312 1476512
33812A476512l1331K6109k5457j8277l916m7651K0888J25328L5248o2664K4805
$$ 1476512 1445181 1471290 1445833 1427556 1423640 1375989 1396877 1522205 1557453 1494789 1519594
33801A519594P9635J4360k611l1332r2037L3290J90602M7651j31855j5013Q6162
$$ 1519594 1599229 1613589 1610978 1579646 1487609 1520899 1711501 1759152 1627297 1612284 1698446
33790A698446m5039r8565R138L1985k2193k2847j5013j5013j8277n8094m1123
$$ 1698446 1653407 1554842 1563980 1595965 1573772 1550925 1535912 1520899 1502622 1444528 1403405
33779A403405O2663M7651n9400Q486J20105K3499o6580K2846L7859n8747l5901
$$ 1403405 1466068 1513719 1454319 1462805 1582910 1606409 1539829 1562675 1600534 1541787 1505886
33768A505886K2193k5457k2193N5483L9818j3055j7624l8512j4361P0497M569
$$ 1505886 1528079 1502622 1480429 1535912 1575730 1562675 1545051 1506539 1492178 1562675 1567244
33757A567244j21411r791J31202J958j12272j306M6998k2193P833M1776r139L1985
$$ 1567244 1445833 1436042 1567244 1569202 1456930 1455624 1502622 1480429 1488262 1530038 1520899 1552884
33745A552884Q0288n5484j48173o1359m5039q0941N0915J61881O5927j7624O53
$$ 1552884 1633172 1577688 1429515 1368156 1323117 1242176 1293091 1454972 1520899 1503275 1503928
33734A503928j2402J1749P8982K2194n2873J1097J1749r9870m7650R3995N4831
$$ 1503928 1491526 1503275 1582257 1604451 1551578 1562675 1574424 1474554 1426904 1520899 1575730
33723A575730l9165l5901o9191q4204K8068O3969k3499J1749R0732R139m6345
$$ 1575730 1536565 1500664 1431473 1347269 1375337 1439306 1415807 1427556 1518288 1527427 1481082
33712A481082J4360l1332j05745k611Q6163L4595L1332L9165o7233p9635N4178
$$ 1481082 1495442 1464110 1358365 1355754 1441917 1476512 1507844 1547009 1479776 1400141 1454319
33701A454319O2664k3499O527L9818L264K6109K3499p3107l7860P7677j0444j20758
$$ 1454319 1516983 1493484 1500011 1539829 1543093 1569202 1592701 1519594 1481734 1559411 1548967 1428209
33689A428209m569O5927l0679n875R3343K8068l4595J5666k6763q8773K5457R7912
$$ 1428209 1423640 1489567 1458888 1453013 1546356 1574424 1539829 1555495 1528732 1439959 1465416 1563328
33677A563328j7624p3761k3499j1749K3499P5718n874p3761J3055L0679n8747
$$ 1563328 1545704 1471943 1448444 1436695 1460194 1535912 1530038 1456277 1469332 1500011 1441264
33666A441264o527R9217M4387k2846k2846p7025o6580P5066P4413o2011j5666
$$ 1441264 1434737 1533954 1578341 1555495 1532649 1455624 1389044 1464110 1538523 1476512 1460846
33655A460846J07051L3290q0288o1358o528P5719J46868K0888j42299m6345P8983
$$ 1460846 1567897 1601187 1520899 1459541 1453013 1528732 1675600 1696488 1554189 1507844 1586827
33644A586827j2403o5927J9582L264m3081L5248M8303l3942J1749N4831p8983
$$ 1586827 1574424 1508497 1528079 1531343 1488262 1523510 1571813 1537871 1549620 1604451 1525468
33633A525468j33160l916L7859r139K7416M4387j959K3499L7207m5040l9817N6789
$$ 1525468 1392308 1388392 1426251 1417112 1444528 1488915 1486956 1510455 1547662 1502622 1462805 1519594
33621A519594M6345L263K6763j5013o7233K6763P1149m7651n4178Q3552P7024
$$ 1519594 1565939 1569202 1595965 1580952 1513719 1540482 1611631 1563980 1509802 1593354 1670378
33610A670378l7859m6998j3708o527K9374K4151l5901k2846J0444j4361J8277
$$ 1670378 1632519 1585521 1571813 1565286 1594660 1618811 1582910 1560064 1570508 1556147 1574424
33599A574424O5275l0679r9870k611K6762n0261j5013L6553k5457J5014J20758
$$ 1574424 1639699 1609020 1509150 1506539 1533301 1483040 1468027 1504580 1479123 1494137 1614895
33588A614895J2402j16189O53P6371m5692p7024j6972m5039M569J35771O3317
$$ 1614895 1627297 1511108 1511761 1588132 1542440 1465416 1448444 1403405 1407974 1543745 1607062
33577A607062q4205k1540N0914j6319r791J9583q2247q8120N9400N4830m1123
$$ 1607062 1522857 1501317 1552231 1535912 1526121 1545704 1463457 1375337 1434737 1489567 1448444
33566A448444K1541N5483o2011p7676k611k6763j3708Q8774N9400l4596J1750
$$ 1448444 1469985 1525468 1463457 1385781 1383170 1356407 1342699 1431473 1490873 1456277 1468027
33555A468027N8747J1097R138l264p8982l8512N0914j8277m9609O7886L4596j12925
$$ 1468027 1526774 1537871 1547009 1543745 1464763 1426251 1477165 1458888 1409279 1477165 1511761 1398836
33543A398836m0471Q9427K5457j1097M8303p833l7206P3760L0679j13578j0444
$$ 1398836 1358365 1447792 1473249 1462152 1510455 1502622 1465416 1539176 1569855 1456277 1445833
33532A445833J24675n222q8774L3290N5484j1097J5666j9582j08356k0235Q6162
$$ 1445833 1570508 1565286 1476512 1509802 1565286 1554189 1569855 1550273 1441917 1421682 1507844
33521A507844R139k0235N8094K8721k0888J6971k4151n8747N4830L7860j41646
$$ 1507844 1516983 1496748 1554842 1583563 1562675 1579646 1555495 1496748 1551578 1589438 1447792
33510A447792p5066J13578Q485j23369%M5692k8068P4413J12926r7260j09661
$$ 1447792 1372726 1486304 1494789 1371420 1371420 1417112 1389044 1463457 1576383 1479123 1369462
33499A369462J28591J09661r9217r9218p832Q485N6789M0470q7468p5718L5248
$$ 1369462 1498053 1607714 1508497 1409279 1401447 1409932 1466721 1507191 1419723 1344005 1379253
33488A379253K2194M1123J23369K611j28591K2846R8564o9191n2872J12272M3734
$$ 1379253 1401447 1442570 1565939 1568550 1439959 1462805 1561369 1492178 1439306 1551578 1595312
33477A595312l3290O9191p180j80158m3081J15536j6972p3760M4387M569n2872
$$ 1595312 1562022 1631213 1624033 1443875 1400794 1516330 1499358 1425598 1469985 1474554 1421682
33466A421682O5927O3969o1358r791N0914l5901l264P3108l8512l5248J51437
$$ 1421682 1487609 1551578 1490220 1480429 1531343 1495442 1492178 1565286 1526774 1491526 1642963
33455A642963P0496j16841M7650J92561l264o7886P7677j1749j50132k3499L1332
$$ 1642963 1713459 1596618 1644268 1836829 1833565 1765679 1843356 1831607 1681475 1657976 1689308
33444A689308p0497J3055J18147n875n4830L0679l7207q4857M8303L5902j01829
$$ 1689308 1618811 1631866 1750013 1744138 1689308 1719987 1682780 1597923 1646226 1682128 1580299
33433A580299l2637L2637j03787r5301Q0288P7024R791O0053J8277o1358K4804
$$ 1580299 1547662 1580299 1476512 1381211 1461499 1538523 1548314 1608367 1626644 1565286 1590090
33422A590090K6110j11620j3054J67755L7860j01176N222K7415m8956L0679L9165
$$ 1590090 1616200 1504580 1491526 1659281 1697141 1595965 1601187 1628602 1579646 1610325 1649490
33411A649490j08356o5274O0052l4595o2011P7024P180j04439O1358J10967r7912
$$ 1649490 1541134 1475860 1535912 1501317 1439306 1516330 1523510 1419071 1480429 1591396 1493484
33400A493484o1358J22716P833j02481J8277k0888j11620R9870J71673j16842
$$ 1493484 1432126 1554842 1562675 1460194 1478471 1457583 1345963 1445833 1617506 1500664
33390A500664j31202J47521R2690j03787j306O2664p6371m2429P5066n875m3734
$$ 1500664 1369462 1516983 1609673 1505886 1504580 1567244 1490873 1448444 1523510 1517635 1473901
33379A473901N5484L4595j2402N2220j958j18800m0470M1775j6318K2846R0079
$$ 1473901 1529385 1563980 1551578 1603798 1601840 1483040 1442570 1484345 1468027 1490873 1580952
33368A580952k4805n9399P7676M4387q2246%O1358m1123j0444R6607J4360o9844
$$ 1580952 1556147 1496748 1574424 1618811 1536565 1536565 1597923 1556800 1546356 1642963 1657323 1587479
33356A587479k4804n6136p1802N2872N0914o7885J3055J03786j7624k8068J04439
$$ 1587479 1562675 1506539 1434737 1487609 1538523 1470638 1483693 1587479 1569855 1541787 1646226
33345A646226K3499r8564J8277O3316o6580n8095J959m2429L3290J22717m1124
$$ 1646226 1669725 1571161 1589438 1652754 1586174 1528079 1530038 1487609 1520899 1643616 1602492
33334A602492j09008R3995P0497j47521n6136R0079m2429l7859J51437O3317q3552
$$ 1602492 1493484 1587479 1657976 1510455 1454319 1544398 1501969 1464110 1615547 1678864 1595312
33323A595312M8304N6788j31854o6581O2011n4830k2846J87338O8538j57312l7206
$$ 1595312 1643616 1700404 1568550 1501969 1563980 1509150 1486304 1673642 1742180 1584868 1547662
33312A547662Q0288j8277O52K8069j40994j14883J28591R4648p0496j306K8068
$$ 1547662 1627950 1609673 1610325 1638394 1497400 1382517 1511108 1605756 1535260 1533954 1562022
33301A562022p7024O53O9844p7024l5901J78852O0706j65145n6789N8094m3734
$$ 1562022 1484998 1485651 1555495 1478471 1442570 1621422 1682128 1516983 1460194 1518288 1474554
33290A474554l9817L9817k611K8068Q6816m9609q8121J24022J26633q9427q4204
$$ 1474554 1434737 1474554 1471943 1500011 1586827 1537218 1449097 1573119 1699752 1610325 1526121
33279A526121J1750k9374P833M1776j25980j11620J63839J52090o0705J1097P7024
$$ 1526121 1537871 1508497 1516330 1558106 1432126 1320506 1484345 1636435 1575730 1586827 1663851
33268A663851j04440q2899J06398J5666p3760R2690Q0940j11619m8956N2219m9608
$$ 1663851 1559411 1476512 1582910 1598576 1524816 1617506 1698446 1586827 1537871 1590090 1540482
33257A540482k4805Q1593l4595p6371Q7468M0470r0732L1332N3525j17494r139
$$ 1540482 1515677 1597270 1562675 1486304 1573772 1614242 1523510 1554842 1608367 1490873 1481734
33246A481734J47521o7233j51437J06398Q4857j27286L264R7259j10314p7024
$$ 1481734 1629255 1562022 1410585 1516983 1601840 1474554 1477818 1575077 1464763 1387739
33236A387739J21411k5457j28592J05745J19453p4413L1985J29243o6580o7233
$$ 1387739 1509150 1483693 1355101 1460846 1580299 1505886 1537871 1667114 1600534 1533301
33226A533301R9218k4152j22063N9400N8094o9191Q4857J50784r4648j12272N6136
$$ 1533301 1632519 1608367 1486304 1545704 1603798 1534607 1619464 1770248 1675600 1563328 1619464
33215A619464l7859p8983J29897R0079r9870J8929R7912r1384o2664J01176l1332
$$ 1619464 1581605 1502622 1632519 1722598 1622728 1641657 1739569 1648185 1585521 1686697 1655365
33204A655365j13578M9609j1750j46215P8330K17364o52o0053M6998m3734o0053
$$ 1655365 1541787 1591396 1579646 1433431 1511761 1729125 1728473 1668420 1715418 1671684 1611631
33193A611631Q2246l6554j66450M8956J14230q7468J959J50131p5065j57312O2010
$$ 1611631 1693877 1657323 1490873 1539829 1654059 1566591 1568550 1718681 1643616 1486304 1548314
33182A548314p180j35118J35118K13448j09661j00523J33160n222j10314Q8121
$$ 1548314 1541134 1406016 1541134 1754582 1644921 1544398 1677558 1672336 1562022 1650143
33172A650143L3290j52090K7415J12926j42299j14884J27286K6763p7677R5301
$$ 1650143 1683433 1531343 1558758 1671684 1529385 1414501 1541787 1568550 1490873 1586174
33162A586174P3760p1149O7233J22716r1384q0941O3969m4387p3107J01828M3081
$$ 1586174 1659934 1588785 1656018 1778734 1687350 1606409 1670378 1625991 1552884 1654712 1697793
33151A697793q2246N1567O2011r7912L917R2037r7259n6136J62534p833j57965
$$ 1697793 1615547 1667114 1729125 1631213 1635130 1727167 1629908 1573772 1736306 1728473 1570508
33140A570508J10967J39035j48174l2637J87991l0679j07703J42299M3734j93213
$$ 1570508 1681475 1820510 1672336 1639699 1827690 1797011 1689308 1831607 1875341 1682128
33130A682128j1097R7259j17494p4413J07050k4152p1802J13578M1123j02481
$$ 1682128 1671031 1768290 1650796 1576383 1683433 1659281 1587479 1701057 1742180 1639699
33120A639699L9165M4387j31202m570J27286q3552j09661J07050J8930j14883
$$ 1639699 1678864 1723251 1592049 1587479 1714765 1631213 1521552 1628602 1647532 1532649
33110A532649N5483O0053j09662L9165J56007p3761q6162J10967k5458j27938
$$ 1532649 1588132 1648185 1538523 1577688 1733695 1659934 1573772 1684739 1659281 1531343
33100A531343J27938J48827o7886K4152P3760j67756q4204J90602J4360j36424
$$ 1531343 1659281 1808108 1740222 1764374 1838134 1670378 1586174 1776776 1791136 1654712
33090A654712J09009M6998k63057p1802K00393J3055m9609J22064j3708j20758
$$ 1654712 1763721 1810719 1547662 1475860 1676253 1689308 1639699 1761763 1748055 1627297
33080A627297J14230P8983j80811k8068J55354l7860n8094J19452L264p7677P9635
$$ 1627297 1741527 1820510 1639699 1611631 1766985 1729125 1671031 1790483 1793747 1716070 1795705
33069A795705k7415j68409R9218J54701j69061p8983J81464o5275j72978J86033
$$ 1795705 1768290 1599881 1699099 1853800 1684739 1605756 1787220 1721945 1548967 1735000
33059A735000J42299j87991j6319J52743j07051q2246J45563p2455j93213J40340
$$ 1735000 1877299 1689308 1672989 1825732 1718681 1636435 1781998 1709543 1516330 1656670
33049A656670J55354j06398J7625Q6815j67756o2011K14754J6318j16841J11619
$$ 1656670 1812024 1705626 1723251 1810066 1642310 1580299 1795053 1811371 1694530 1806149
33039A806149K6763j61881Q8121J42298j67755l3291K10838r8565j89297J98435
$$ 1806149 1832912 1671031 1759152 1901450 1733695 1700404 1911242 1812677 1623380 1821815
33029A821815J02482k17365O1358K25850j40993j35771J52743k3499j27286J48174
$$ 1821815 1924297 1706932 1768290 1994140 1853147 1717376 1870119 1846620 1719334 1867508
33019A867508N0914j96477K3499P0497k17365l264K94389n2872j91908K09532
$$ 1867508 1918422 1721945 1745444 1815941 1598576 1595312 1889701 1836829 1644921 1854453
33009A854453J42298k01698J0444J69061q7468k2193J40340j16842q1593K77417
$$ 1854453 1996751 1795053 1805497 1974558 1887090 1864897 2005237 1888395 1806802 2084219
32999B084219K1541l24415L5248J97783j63840p4413J80811j03134j55354K11490
$$ 2084219 2105760 1781345 1816593 2014376 1850536 1776123 1956934 1853800 1698446 1909936
32989A909936O1358k06268R2690J16189k51307j0444L15277n5484j69714K06921
$$ 1909936 1971294 1765026 1857716 1973905 1722598 1712154 2027431 1971947 1802233 2009154
32979B009154M5692k19976J31202J65798k36294J305L19846q8773k04310J91907
$$ 2009154 2054846 1834870 1966072 2131870 1895576 1896881 2216727 2127954 1923644 2115551
32969B115551P181k66321J22716J56659k71542r139L19846j20758j89949K81986
$$ 2115551 2122732 1856411 1979127 2135786 1864244 1855105 2174951 2054193 1864244 2146230
32959B146230J4361l94912N2873K33683k18017o3317L16582N222r9217K28461
$$ 2146230 2160591 1765679 1818552 2052235 1834218 1770901 2087483 2092705 1993488 2221949
32949B221949k5457k85250J65797J94519k89820m6998L11361p1802j14231K80028
$$ 2221949 2196492 1911242 2077039 2271558 1981738 1934740 2246101 2174299 2060068 2340096
32939B340096n3525l77940J40993K44127k11490L3943L19846j71020k14101K57835
$$ 2340096 2286571 1908631 2049624 2293751 2082261 2116204 2436050 2265030 2050929 2308764
32929B308764j0444k75459K35642K05615l40734k4804L30942j55353j36424L78593
$$ 2308764 2298320 2022861 2258503 2464118 2123384 2098580 2429522 2274169 2137745 2516338
32919B516338Q485l30289K29766J92561m18411m1123L91648j74936k43475L26374
$$ 2516338 2524823 2194534 2424300 2616861 2198450 2157327 2548975 2374039 2130564 2456938
32909B456938K5457l30290K18670K29767l36164K0235L94259j80811k07574L51831
$$ 2456938 2482395 2152105 2370775 2600542 2264378 2284613 2678872 2498061 2290487 2642318
32899B642318n875l54441K44127K68932k76765R0732L94911k38252k38905L20498
$$ 2642318 2636443 2282002 2526129 2795061 2518296 2609028 3003939 2765687 2526782 2847280
32889B847280l1332k64362L52483J85380m24285J07050M54965k50655j86033M06661
$$ 2847280 2815948 2551586 2904069 3089449 2665164 2772214 3227179 2976524 2790491 3197152
32879C197152j12925m15147L23763K26503l51178K25198M36687m28854j93213
$$ 3197152 3084227 2669080 2992843 3219346 2868168 3093366 3530053 3101199 2907986
32870B907986O17498o53m06008M09272K23239n43085J46868N97916k78723j76241
$$ 2907986 3525484 3524831 3118823 3528095 3751334 3208249 3355117 3953033 3674310 3498069
32860C498069N88777j5666l77287M63450K60446m35382L20498N97916m15147j24674
$$ 3498069 4086846 4071180 3693893 4157343 4417789 3982407 4302905 4900821 4485674 4361000
32850D361000P30423p1802m07967O33165K75459o35123L00264P06272m55618j30549
$$ 4361000 5091423 5019621 4611654 5244819 5520278 4885155 5185419 5891691 5436073 5305524
32840E305524Q82514J305l67496Q10058L65538o78856M03397Q53140m66714k8721
$$ 5305524 6188038 6189343 5821847 6631905 6997443 6318587 6721984 7575124 7108410 7079689
32830G079689J139043O5928l55094J051574N39822o80815N80292J092698m37341
$$ 7079689 8218732 8284660 7929566 8981140 9520962 8840147 9420439 10513137 10075796
32821A0075796J05093J466069J95824k74807J377948P78727n60709R92175J486956
$$ 10075796 10180889 11646958 11842782 11567975 12945923 13724650 13163941 14156116 15643072
32812A5643072m22979K70889J913201M02744k8720K029389J253926k47391J836829
$$ 15643072 15220093 15490982 17404183 17806927 17778207 19807596 21061522 20814131 22650960
32803B2650960K421037J34466J212803L093367R12539P14758L815957K736966
$$ 22650960 25071997 25206463 26419266 29512633 30425172 31139930 34955887 37692853
32795C7692853P71547L926924N022885K402760M833589Q295104O139082P840140
$$ 37692853 38464400 42391324 47414209 49816969 54650558 62945662 69084744 76924884
32787G6924884J5165262J6823239J8615681K9799189L7728755L9089732M8408342
$$ 76924884 92090146 108913385 127529066 157328255 195057010 234146742 282555084
32780B82555084N8493931N8456724O7324940Q8514400R9654828J16173233J61546957
$$ 282555084 341049015 399505739 466830679 555345079 654999907 771173140 932720097
32773I32720097K05906312K44414447L12294874L22892215J21732023k07177862
$$ 932720097 1138626409 1383040856 1695335730 2018227945 2139959968 1932782106
32767A932782106l82304560l27391598k25550069j83627417j49316444j05740384
$$ 1932782106 1550477546 1223085948 997535879 813908462 664592018 558851634
32761E58851634q8020271q1110949o2814460n2083959n0409011l8647170k6723446
$$ 558851634 470831363 389720414 326905954 274821995 224412984 185765814 159042368
32754A59042368k6176446k2333073j3567338j3157414j4203114q396280o178246
$$ 159042368 132865922 110532849 96965511 83808097 69604983 61208703 55030457
32747E5030457q470693n498085k673650n643648n438032j575078k460202l787888
$$ 55030457 46559764 41061679 38388029 32744381 27306349 25731271 23271069 19483181
32739A9483181p03008l17235k845323j312673N06531j597271j657976N95957n63320
$$ 19483181 18780173 18462938 15617615 14304942 14811473 13214202 11556226 12152183 11588863
32730A1588863j858370J46868K85251j555495m60187O71676j005229r92828O21415
$$ 11588863 9730493 9877361 10162612 8607117 8146930 8818606 7813377 6820549 7441964
32721G441964l46609j155361M61492L30942j153403p5066Q21808o80162o82120
$$ 7441964 7095355 5939994 6401486 6732428 5579025 5503959 6325767 5645605 4963485
32712D963485O30553k28461q89041M59533L28985q70764K3499O41650o21415m31466
$$ 4963485 5594038 5365577 4476536 4936069 5265054 4394290 4417789 5059439 4438024 4006558
32702D006558P26507j59923q02878L89690L04832o85384J22064N92694o09013
$$ 4006558 4733065 4573142 3770264 4159954 4464786 3779402 3901466 4494160 3885147
32693C885147m73894N77681j25980o37733L93606K82639o02485Q5510N01962m84338
$$ 3885147 3411253 3988934 3862954 3225221 3618827 3901466 3298981 3384491 3886453 3402115
32683C402115l42039N01309j49479n47654L38122J84075n39821J07703L96217
$$ 3402115 3060076 3561385 3411906 2864252 3202374 3386449 2846628 2954331 3350548
32674C350548m74547k02351N96610n7442m52353K92430O7233n62014J30549M09272
$$ 3350548 2876001 2673650 3270260 3212818 2760465 3052895 3120128 2558114 2688663 3097935
32664C097935m29507k23892M41256j67103m02092L91648J42299n13712J18800
$$ 3097935 2668428 2444536 2885792 2718689 2316597 2708245 2850544 2336832 2455632
32655B455632L77288m22327k08226M84990o6580l74024L21152J71672l98175J01175
$$ 2455632 2832920 2410593 2202367 2687357 2620777 2246753 2567905 2739577 2341402 2442577
32645B442577L05486l57053j47520M12536r8565l27026K87208J09662l71413J04439
$$ 2442577 2748063 2391010 2243490 2656026 2557461 2230435 2517643 2627305 2255892 2360331
32635B360331K36295l75330j35771L78593r2037k65668K74153N6789l51177J31202
$$ 2360331 2596626 2221296 2085525 2464118 2372081 2106413 2380566 2437355 2086178 2217380
32625B217380K10184l47261m2429L97523j68408l13319L21804J45563l18541R9218
$$ 2217380 2427564 2080303 2037874 2435397 2266989 1953670 2275474 2421037 2102496 2201714
32615B201714K34336k45433k0235K98958k42169l30943K69585R5954k95042J32508
$$ 2201714 2436050 2190617 2170382 2469340 2227171 1896228 2165813 2261767 1966725 2099233
32605B099233K08879k98958o3970L16583j22064j95824L13318P7677l23762R1384
$$ 2099233 2308112 2009154 1945184 2261767 2139703 1943879 2257197 2334874 2011112 2102496
32595B102496J99741k83945j24675K25851q0288r2690K89167j306k95041J71019
$$ 2102496 2302237 2018292 1893617 2119468 2039180 1946490 2235657 2234351 1939310 2110329
32585B110329K39558k46738j03134J63840j72326j31854K93083K2846k78723J07703
$$ 2110329 2349887 2103149 2000015 2163855 1991529 1859675 2152758 2175604 1896881 2004584
32575B004584J13578k88514J306L25068q4205j76894J85380j4360k53266R3995
$$ 2004584 2118162 1829648 1830954 2156022 2071817 1894923 2080303 2065943 1812677 1906672
32565A906672J02482k29767L1984K76112o7233p3107K06268o5275j92560K34988
$$ 1906672 2009154 1779387 1811371 2087483 2020250 1947143 2153411 2088136 1895576 2130564
32555B130564J39036l01569m8304J83422j63839q2246K72195o5275k88514J70367
$$ 2130564 2269600 1968031 1919727 2103149 1939310 1857064 2129259 2063984 1775470 1945837
32545A945837J70367k52613m3734J79505j53395q4857K70237l2637k77418R7912
$$ 1945837 2116204 1863591 1819857 1999362 1845967 1761110 2031347 1998710 1721292 1819204
32535A819204R2038k17365Q6815K94389j21411j17494K36294m3734k92430J04439
$$ 1819204 1911242 1693877 1780692 2075081 1953670 1836176 2072470 2028736 1736306 1840745
32525A840745J76242j51438j0444J22064j68409p1802K31725n7441k32378J52090
$$ 1840745 2016987 1865549 1855105 1977169 1808760 1736958 1968683 1911242 1678864 1830954
32515A830954J12925k42169j306K32378q6815j23369J09009r7912j67756K16059
$$ 1830954 1943879 1701710 1700404 1932782 1845967 1722598 1831607 1733695 1565939 1781998
32505A781998J56659j73631M8304J95171j50785j18147J69062p4413k23893J43605
$$ 1781998 1938657 1765026 1813330 2008501 1857716 1739569 1908631 1834218 1610325 1753930
32495A753930J59923j16189N5483J40341j84075q8121K49350L1331j74936P3108
$$ 1753930 1913853 1797664 1853147 1993488 1809413 1721292 1970642 2001973 1827037 1900145
32485A900145L0026k19975j2403J32508j24675q1593J35119n3526j09008J71672
$$ 1900145 1930171 1710196 1697793 1830301 1705626 1624033 1759152 1705626 1596618 1768290
32475A768290O2664j76242P0497J59270j52743o7233J82117n8095j54048J72325
$$ 1768290 1830954 1654712 1725209 1884479 1731736 1664503 1846620 1788525 1634477 1806802
32465A806802J16842j43604L9164J12926j54701m5040J78853q9427j76894J63187
$$ 1806802 1923644 1780040 1819204 1932130 1777429 1732389 1911242 1821815 1644921 1808108
32455A808108Q1593k16059K611J61228j12272p7677J79505L3290p6371J25980
$$ 1808108 1889701 1673642 1676253 1837481 1725209 1647532 1827037 1860327 1783956 1909936
32445A909936M4387j42299O7233J30549j45562p6371J48826l6554j40341O0053
$$ 1909936 1954323 1812024 1879257 2009806 1864244 1787873 1936699 1900145 1759804 1819857
32435A819857K611r4648J61881J44257k33031j54701J54701J5014j11620P2455
$$ 1819857 1822468 1727820 1889701 2033958 1800927 1646226 1800927 1815941 1704321 1776776
32425A776776K0235j16842Q3552J12925j62534r3343J47521M9609R138J47521
$$ 1776776 1797011 1680169 1763721 1876646 1714112 1620769 1768290 1817899 1827037 1974558
32415A974558l8512k30420K6110J48827p7025n6789Q2247p7677j21411P3107J3055
$$ 1974558 1936046 1705626 1731736 1880563 1803538 1746749 1828996 1751319 1629908 1703015 1716070
32404A716070r4648P7024O7886j51437l2638J52743j1097o9844Q7468j1096j29244
$$ 1716070 1621422 1698446 1766332 1614895 1582257 1735000 1723903 1654059 1741527 1730431 1601187
32393A601187O1358J09009o1358j0444O5927o0705l264J39688l9818j44257P0497
$$ 1601187 1662545 1771554 1710196 1699752 1765679 1704974 1701710 1841398 1801580 1657323 1727820
32382A727820O6580j01176L1985J02481j01828l7860J40994q0288j86033J44257
$$ 1727820 1794400 1693224 1725209 1827690 1725862 1688002 1828996 1748708 1562675 1706932
32372A706932J91907q9426m5039Q2898n9399l0680J15537p0497j69714R8565J00523
$$ 1706932 1898839 1809413 1764374 1847272 1787873 1757193 1872730 1802233 1632519 1731084 1831607
32361A831607j55354o0053J01176k7415M569J64492j1097j42299O3317O0705j33160
$$ 1831607 1676253 1616200 1717376 1689961 1694530 1859022 1847925 1705626 1768943 1829648 1696488
32350A696488n875J06398j01176j04439J03786K3499o5927J04439O8539j24675
$$ 1696488 1690613 1797011 1695835 1591396 1695182 1718681 1652754 1757193 1825732 1701057
32340A701057%J22717l4596k6110R2690r2690j88644P1802J18148j04440r0732
$$ 1701057 1701057 1823774 1789178 1763068 1855758 1763068 1574424 1646226 1764374 1659934 1569202
32329A569202J0444n2219J305R0732k6110j2402J65145L3943j63840K611R4648
$$ 1569202 1579646 1527427 1528732 1619464 1593354 1580952 1746097 1780040 1616200 1618811 1713459
32318A713459q8773m2429J07704l7207q2246J15536L1332j50785K8721J37077
$$ 1713459 1624686 1582257 1689961 1652754 1570508 1686044 1717376 1566591 1595312 1732389
32308A732389n4831j5013J46868j3708j06397P8982L1332j32508K5458R9870j12273
$$ 1732389 1677558 1662545 1809413 1795705 1689308 1768290 1799622 1667114 1692572 1792442 1680169
32297A680169n4178J66451K2846j09662J03134J34466j01176j07703L917k9374
$$ 1680169 1625991 1792442 1815288 1705626 1808760 1943226 1842050 1734347 1738264 1708890
32287A708890J3055R4648p833o2663N222p0497r8565J01829J11619r5953n0915
$$ 1708890 1721945 1816593 1808760 1746097 1751319 1680822 1582257 1684086 1795705 1699752 1648837
32276A648837P2455m7650m6998J48826R2690o5274J0444Q485j29243k0888J30549
$$ 1648837 1721292 1673642 1626644 1775470 1868160 1802886 1813330 1821815 1692572 1671684 1802233
32265A802233L0679J1097Q6162q4857j82116M6998Q2898j11619r791J40340n1567
$$ 1802233 1832912 1844009 1930171 1845314 1663198 1710196 1793094 1681475 1671684 1812024 1760457
32254A760457j35118M8303K7415p8982L1332K8721r9218M3081J40994r7260j22716
$$ 1760457 1625339 1673642 1701057 1622075 1653407 1682128 1582910 1625991 1766985 1669725 1547009
32243A547009J39035P8330j29244p833N8094j20105n4178J50132M1775p6371N6789
$$ 1547009 1686044 1764374 1635130 1627297 1685391 1565286 1511108 1661240 1703015 1626644 1683433
32232A683433Q2246l6554k6762j8930p5719j1096L3290m1776L5248J48174j1097
$$ 1683433 1765679 1729125 1702363 1683433 1607714 1596618 1629908 1588132 1623380 1771554 1760457
32221A760457j22716M6998R2037l8512p833K5457q3552l7206O8538m5039o5928
$$ 1760457 1637741 1684739 1776776 1738264 1730431 1755888 1672336 1635130 1703668 1658629 1592701
32210A592701J20106Q2898o6580L3943N2220j50132r8565P3108n6789j00523J27286
$$ 1592701 1712807 1795705 1729125 1763068 1815288 1665156 1566591 1639699 1582910 1482387 1609673
32199A609673P3107j46868K0235J82770l4596r2690R6606K5458r7260M8956P2455
$$ 1609673 1682780 1535912 1556147 1738917 1704321 1611631 1708237 1733695 1636435 1685391 1757846
32188A757846o8538M569N2220j03787p833K14101L3943j65145R791L7207j72325
$$ 1757846 1689308 1693877 1746097 1642310 1634477 1848578 1882521 1717376 1727167 1764374 1592049
32177A592049p1150J35119K6762j3707J37076K8069j61882l7859N3525p5718n1567
$$ 1592049 1520899 1656018 1682780 1669073 1806149 1834218 1672336 1634477 1688002 1612284 1560717
32166A560717O7233r792n8747K8721K4804M0471J48826L9165j76242q9426Q0940
$$ 1560717 1627950 1618158 1559411 1588132 1612936 1653407 1802233 1841398 1665156 1575730 1656670
32155A656670L5902N874L0027o5928m6345J37077P3108j35119o6580M8303l5248
$$ 1656670 1692572 1698446 1728473 1662545 1616200 1753277 1826385 1691266 1624686 1672989 1637741
32144A637741j5666P8329l6553r4649O9192N7441r0079J306R2037n4178p3108
$$ 1637741 1622075 1700404 1663851 1569202 1638394 1695835 1605756 1607062 1699099 1644921 1571813
32133A571813O7233J7624n6136O2664P9635m8303l5249J0444n5483k0235P5066
$$ 1571813 1639046 1656670 1600534 1663198 1742833 1694530 1659281 1669725 1614242 1594007 1669073
32122A669073J8277k2847L4596p833l8512O4622J4360j35118j8277J14883m8956
$$ 1669073 1687350 1664503 1699099 1691266 1652754 1717376 1731736 1596618 1578341 1693224 1644268
32111A644268r9217J12925R7259r0732l0026O1358m2428m5693N6789P181k3499
$$ 1644268 1545051 1657976 1755235 1664503 1634477 1695835 1653407 1607714 1664503 1671684 1648185
32100A648185M0470n1567j38382L1984J19453l6554o7885R791o5928r6606J1096
$$ 1648185 1688655 1637088 1498706 1530690 1650143 1613589 1545704 1555495 1489567 1392961 1404057
32089A404057j6318n8095J06398J66450K611l0026L9165k6110k2193R1384K6763
$$ 1404057 1387739 1329644 1436042 1602492 1605103 1575077 1614242 1588132 1565939 1657323 1684086
32078A684086p2455L7206Q2247k1541K2193Q1594o0706r9870L8512K2193l5248
$$ 1684086 1611631 1648837 1731084 1709543 1731736 1813330 1752624 1652754 1691266 1713459 1678211
32067A678211P8330M8303j50132q4204J10314L5901n6789N4831O7886n3526o3316
$$ 1678211 1756541 1804844 1654712 1570508 1680822 1716723 1659934 1714765 1782651 1729125 1665809
32056A665809l2637k0236Q4205R0732q6816r1384Q2246N0261n5483L9165P1802
$$ 1665809 1633172 1612936 1697141 1787873 1701057 1609673 1691919 1742180 1686697 1725862 1797664
32045A797664q4205j04439J6319M7650N6136O0053m5040p1802N4178M4387o2664
$$ 1797664 1713459 1609020 1625339 1672989 1729125 1789178 1744138 1672336 1726514 1770901 1708237
32034A708237m569K8068j01828q4857O7233M7650j3055K8068l5248r9217O3316
$$ 1708237 1703668 1731736 1629908 1545051 1612284 1659934 1646879 1674947 1639699 1540482 1603798
32023A603798J21411p8330r3343P6372J5013r0732L3290P5719m7651k5457K6110
$$ 1603798 1725209 1646879 1553536 1629908 1644921 1554189 1587479 1663198 1615547 1590090 1616200
32012A616200o4622k7415J05092J3055o8538R7912J27938o8538p3761N5484l917
$$ 1616200 1551578 1524163 1629255 1642310 1573772 1671684 1799622 1731084 1657323 1712807 1708890
32001A708890p8329j5666R138L3290J16189L5901j33813q4857J7624n1567o0052
$$ 1708890 1630561 1614895 1624033 1657323 1773512 1809413 1675600 1590743 1608367 1556800 1496748
31990A496748N4177M1776k1540J8277Q485m6345J9583N0914m3081l6554M6998
$$ 1496748 1550925 1592701 1571161 1589438 1597923 1551578 1571161 1622075 1578994 1542440 1589438
31979A589438m570n4178P181J3054R139R4648N5484r2038m0470Q0941J8277j0444
$$ 1589438 1584868 1530690 1537871 1550925 1560064 1654712 1710196 1618158 1577688 1658629 1676906 1666462
31967A666462O4622k6763j16189N6789J33813n0914o5275R7912M0470j01828m7651
$$ 1666462 1731084 1704321 1588132 1644921 1778734 1727820 1662545 1760457 1800927 1699099 1651448
31956A651448K7416K6110O2011K0235j07703q6816j2402o0053j0444J48827Q7468
$$ 1651448 1678864 1704974 1766985 1787220 1679517 1592701 1580299 1520246 1509802 1658629 1746097
31945A746097o9191m570N0262p1802p8330L5248K3499O528O5274n874j01829j0444
$$ 1746097 1676906 1672336 1722598 1650796 1572466 1607714 1631213 1637741 1703015 1697141 1595312 1584868
31933A584868O0706Q485M6345P5719o5275j07050K6763K9373k9373N8747O7885
$$ 1584868 1645574 1654059 1700404 1776123 1710848 1603798 1630561 1659934 1630561 1689308 1757193
31922A757193o9843n2873L5901l4595l5249J08356O5275j04440q4857J959R791
$$ 1757193 1687350 1634477 1670378 1635783 1600534 1708890 1774165 1669725 1584868 1586827 1596618
31911A596618N5483M6998r3343q5510P3761M9609m5040L8512P5066l0026j8277
$$ 1596618 1652101 1699099 1605756 1520246 1594007 1643616 1598576 1637088 1712154 1682128 1663851
31900A663851K4804o3969l1985J26633N8095j11620n6789J7624l9817R791J09661
$$ 1663851 1688655 1624686 1592701 1719334 1777429 1665809 1609020 1626644 1586827 1596618 1706279
31889A706279M3081k2193J4360l1984p8330J5013L3291m6345r792L917j12273
$$ 1706279 1749360 1727167 1741527 1709543 1631213 1646226 1679517 1633172 1623380 1627297 1515024
31878A515024n5483J29244N4831j12273l4595N4830l264K4152P2455k4804l2638
$$ 1515024 1459541 1588785 1643616 1531343 1496748 1551578 1548314 1572466 1644921 1620117 1587479
31867A587479P7677J0444j07050k0888M1123k7416J6319P3108l9818n8094Q2899
$$ 1587479 1665156 1675600 1568550 1547662 1588785 1561369 1577688 1650796 1610978 1552884 1635783
31856A635783N2872p5066k8721J8277m3734J306O7233k9374n6136O7233L7859
$$ 1635783 1688655 1613589 1584868 1603145 1559411 1560717 1627950 1598576 1542440 1609673 1647532
31845A647532q8774l0026P1802M0471R791j8930r9217l8512J21410Q4857m1775
$$ 1647532 1558758 1528732 1600534 1641005 1650796 1631866 1532649 1494137 1615547 1700404 1658629
31834A658629j306N1567j5666l3290j1097o3316n6789K3499J8930J2402Q6815
$$ 1658629 1657323 1708890 1693224 1659934 1648837 1585521 1528732 1552231 1571161 1583563 1670378
31823A670378N6136l8512K6110R1385m8956j53396p1149p180j3708Q486L916j8277
$$ 1670378 1726514 1688002 1714112 1805497 1756541 1603145 1531996 1524816 1511108 1519594 1523510 1505233
31811A505233K7416L2637k9374J3055R7912M8303j3707p833p3761j19452%P7024
$$ 1505233 1532649 1565286 1535912 1548967 1646879 1695182 1681475 1673642 1599881 1480429 1480429 1557453
31799A557453J9582M6998R2690l6554j22063l917N0262l8512m8304J8277N2220
$$ 1557453 1577035 1624033 1716723 1680169 1558106 1554189 1604451 1565939 1517635 1535912 1588132
31788A588132Q5510M5039q0287o5928M4387k0888j14231L917R9217K9374K3499
$$ 1588132 1673642 1718681 1638394 1572466 1616853 1595965 1481734 1485651 1584868 1614242 1637741
31777A637741M6998n6137p0496O0052L1332r0732j1096R4648J5013l8512K1541
$$ 1637741 1684739 1628602 1558106 1618158 1649490 1558758 1547662 1642310 1657323 1618811 1640352
31766A640352M4387M6997K5457r7912j29896L3290Q5510k5457j1097L8512n8747
$$ 1640352 1684739 1731736 1757193 1659281 1529385 1562675 1648185 1622728 1611631 1650143 1591396
31755A591396o3317N7442j305r0732N2220R5301j03787j07703Q8773O8539l8513
$$ 1591396 1528079 1585521 1584216 1493484 1545704 1641005 1537218 1429515 1518288 1586827 1548314
31744A548314N2220J07051j306l7206j1097m6345r791P1802J5013l5248N2872
$$ 1548314 1600534 1707585 1706279 1669073 1657976 1611631 1601840 1673642 1688655 1653407 1706279
31733A706279N5484o2011q4857n6789p1150L264J08356M5692n0261j1750K4152
$$ 1706279 1761763 1699752 1614895 1558106 1486956 1490220 1598576 1644268 1594007 1582257 1606409
31722A606409j958k611l1985p1802J6319J01828K2846k6762L9817J4361o0706
$$ 1606409 1604451 1601840 1569855 1498053 1514372 1616200 1639046 1612284 1652101 1666462 1605756
31711A605756O528O7233p181m8956k7415n6789n0914J6971J0444%P5066N0262
$$ 1605756 1612284 1679517 1672336 1623380 1595965 1539176 1488262 1505233 1515677 1515677 1590743 1641005
31699A641005p3761l6554Q2246M1123j6318M3081K5457p8329p0497j1097j1749
$$ 1641005 1567244 1530690 1612936 1654059 1637741 1680822 1706279 1627950 1557453 1546356 1534607
31688A534607J5013M2429j8277l3290N3525M5692n8094n3526L1332M2429O527
$$ 1534607 1549620 1592049 1573772 1540482 1594007 1639699 1581605 1528079 1559411 1601840 1608367
31677A608367k2846l5901j306M5040K6763j1750n875J1750L5248K6763o5928r9217
$$ 1608367 1585521 1549620 1548314 1593354 1620117 1608367 1602492 1614242 1649490 1676253 1610325 1511108
31665A511108M9609J37076n221j02482k0235P180m7650j8277K8068O528J1749
$$ 1511108 1560717 1697793 1692572 1590090 1569855 1577035 1529385 1511108 1539176 1545704 1557453
31654A557453K4804J959M5692R0079k0888r7912Q486M3734n2873j2402R7912M1776
$$ 1557453 1582257 1584216 1629908 1719987 1699099 1601187 1609673 1653407 1600534 1588132 1686044 1727820
31642A727820l1332l264m9608j01176M569O2664k5457j6972N6789k0888p3107
$$ 1727820 1696488 1693224 1643616 1542440 1547009 1609673 1584216 1567244 1624033 1603145 1530038
31631A530038N2872R8565j958k0888L263m8303m0470M3734L7206k4151m5692o9192
$$ 1530038 1582910 1681475 1679517 1658629 1661892 1613589 1573119 1616853 1654059 1629908 1584216 1515024
31619A515024n1567L1985K3499m0470M6997J34466M569j03134m569O7886R791
$$ 1515024 1463457 1495442 1518941 1478471 1525468 1659934 1664503 1561369 1556800 1624686 1634477
31608A634477l0026l7207k8721L7207M3734n7442m7650P1149N8095j7625J1750
$$ 1634477 1604451 1567244 1538523 1575730 1619464 1562022 1514372 1585521 1643616 1625991 1637741
31597A637741K611p6372k2193Q4204M8304j959K5457l263m7651%K2194j959K8068
$$ 1637741 1640352 1563980 1541787 1625991 1674295 1672336 1697793 1694530 1646879 1646879 1669073 1667114 1695182
31584A695182J959j16189r0079M3734L9165N222Q3551O7886n1567l5248R791p4413
$$ 1695182 1697141 1580952 1490873 1534607 1573772 1578994 1662545 1730431 1678864 1643616 1653407 1578994
31572A578994o8539O4622P1149J1097M1776L916q6162k1541M8304l2638k9373
$$ 1578994 1510455 1575077 1646226 1657323 1699099 1703015 1616853 1595312 1643616 1610978 1581605
31561A581605O6580r139r5953K0887O3317m8956j6972O2664l3290m4387J11620
$$ 1581605 1648185 1639046 1543093 1563980 1627297 1578341 1561369 1624033 1590743 1546356 1657976
31550A657976P0497j05093o5927J9582o0705n6136N5483J2402o3316K4152P6371
$$ 1657976 1728473 1623380 1557453 1577035 1516330 1460194 1515677 1528079 1464763 1488915 1565286
31539A565286K2846L3943K8721r0079j22064k8721k611n222N3525N2220n222R791
$$ 1565286 1588132 1622075 1650796 1560717 1438653 1409932 1407321 1402099 1455624 1507844 1502622 1512413
31527A512413K0888k3499P181O0052%m5039m569k3499l7860Q2899J41646N875
$$ 1512413 1533301 1509802 1516983 1577035 1577035 1531996 1527427 1503928 1466068 1548967 1690613 1696488
31515A696488q4204l0679j2403m8303l9817p181L0679O3317r791j34466j08356
$$ 1696488 1612284 1581605 1569202 1520899 1481082 1473901 1504580 1567897 1558106 1423640 1315284
31504A315284K8068Q4204N5484K0235m569J8929O5928L3290l9165m5692j8277
$$ 1315284 1343352 1427556 1483040 1503275 1498706 1517635 1583563 1616853 1577688 1531996 1513719
31493A513719K2846R9218R0079m2429p7024K8068N3525j0444k6762l1332l0679
$$ 1513719 1536565 1635783 1725862 1683433 1606409 1634477 1688002 1677558 1650796 1619464 1588785
31482A588785M2428O0053m6998p1802J306j6319l6554M8303L7207o3316L263J19453
$$ 1588785 1631213 1691266 1644268 1572466 1573772 1557453 1520899 1569202 1606409 1543093 1546356 1665809
31470A665809M0470n1567j1096p181l2637N875k9374j02481Q486J03786l4595
$$ 1665809 1706279 1654712 1643616 1636435 1603798 1609673 1580299 1477818 1486304 1590090 1555495
31459A555495q8774P5719Q8773m6345m569P5719q486k5457O3969J6319o0706J959
$$ 1555495 1466721 1542440 1631213 1584868 1580299 1656018 1647532 1622075 1686044 1702363 1641657 1643616
31447A643616P180o9844O527J09009K3499m6345J8277J1096m9608l917K6763m5692
$$ 1643616 1650796 1580952 1587479 1696488 1719987 1673642 1691919 1703015 1653407 1649490 1676253 1630561
31435A630561n4178J8929K2846k4804l0026P833O3316O0705k4804m9609L264k5457
$$ 1630561 1576383 1595312 1618158 1593354 1563328 1571161 1634477 1695182 1670378 1620769 1624033 1598576
31423A598576o5275L0027P1149n0261o7886L9165J5013l9165M1123K6763j12925
$$ 1598576 1533301 1563328 1634477 1584216 1516330 1555495 1570508 1531343 1572466 1599229 1486304
31412A486304o0706J03787P1802j9582L263j1096l8512M6345N6136n2220k2193
$$ 1486304 1425598 1529385 1601187 1581605 1584868 1573772 1535260 1581605 1637741 1585521 1563328
31401A563328O5274l2637r5954M1123Q2246l1984l0679K2193m5039n6789M0470
$$ 1563328 1628602 1595965 1500011 1541134 1623380 1591396 1560717 1582910 1537871 1481082 1521552
31390A521552L9817j6318N222j5013r3996m6998O5928O5927J5666q486m6997m8956
$$ 1521552 1561369 1545051 1550273 1535260 1441264 1394266 1460194 1526121 1541787 1533301 1486304 1437348
31378A437348N222P180j1750M3082Q0287N4178N1567L1332n0914n9400J8930J9582
$$ 1437348 1442570 1449750 1438000 1481082 1561369 1615547 1667114 1698446 1647532 1588132 1607062 1626644
31366A626644k8721k6762m1776o1358J305L3943j3708K6763J02481K6110n2220
$$ 1626644 1597923 1571161 1529385 1468027 1469332 1503275 1489567 1516330 1618811 1644921 1592701
31355A592701%j6971r0732R791J24675K6762n0261L0026K9374m7651j5665J958
$$ 1592701 1592701 1575730 1484998 1494789 1619464 1646226 1595965 1625991 1655365 1607714 1592049 1594007
31343A594007p8983n2219N3525L1984j6318L7206N4178J1097J8930q486r1385
$$ 1594007 1515024 1462805 1516330 1548314 1531996 1569202 1623380 1634477 1653407 1644921 1553536
31332A553536n8747K8068k4804q7468N222J02481P3108L916l9817l4596K0235
$$ 1553536 1494789 1522857 1498053 1410585 1415807 1518288 1591396 1595312 1555495 1520899 1541134
31321A541134L1332j2402J3708N9400J305l9817K6109L8512j6971Q486L9165k0236
$$ 1541134 1572466 1560064 1573772 1633172 1634477 1594660 1620769 1659281 1642310 1650796 1689961 1669725
31309A669725k9373J7624j3055m2429J5666Q486p6371o7886j1749j5666J2402
$$ 1669725 1640352 1657976 1644921 1602492 1618158 1626644 1550273 1482387 1470638 1454972 1467374
31298A467374O2011K3499o528M0471J8929n0261k2194m569o9191l3943Q4857P8330
$$ 1467374 1529385 1552884 1546356 1586827 1605756 1555495 1533301 1528732 1459541 1425598 1510455 1588785
31286A588785K0888L8512J1749n8747k2193J5666m8304m1123M2429K6762j305
$$ 1588785 1609673 1648185 1659934 1601187 1578994 1594660 1546356 1505233 1547662 1574424 1573119
31275A573119O9191N4831o3969n7442K4151l263l0027K7416L1332p181K6110M7651
$$ 1573119 1642310 1697141 1633172 1575730 1599881 1596618 1566591 1594007 1625339 1618158 1644268 1691919
31263A691919%j8277j5666l7207%O3970K1540m3081p833L4596J6318%k1540n2873
$$ 1691919 1691919 1673642 1657976 1620769 1620769 1684739 1706279 1663198 1655365 1689961 1706279 1706279 1684739 1631866
31249A631866k1541K1541j305m570K2194j8930m5692L0679N4831j6319k0888N875
$$ 1631866 1610325 1631866 1630561 1625991 1648185 1629255 1583563 1614242 1669073 1652754 1631866 1637741
31237A637741l9165j7624Q4857M5039q0287n2873J6319l1332l6554N5484O5927
$$ 1637741 1598576 1580952 1665809 1710848 1630561 1577688 1594007 1562675 1526121 1581605 1647532
31226A647532n222k6763k6109k3499K4151O1358L8513Q485l2637p5066j7624O3969
$$ 1647532 1642310 1615547 1589438 1565939 1590090 1651448 1689961 1698446 1665809 1590743 1573119 1637088
31214A637088P833n3525J6971L3290p7024r0732N875K4152J958L3290K6763j8277
$$ 1637088 1644921 1591396 1608367 1641657 1564633 1473901 1479776 1503928 1505886 1539176 1565939 1547662
31202A547662j306J4361j6319J958L2638k6763o5275P833N6136J5666j6971o527
$$ 1547662 1546356 1560717 1544398 1546356 1578994 1552231 1486956 1494789 1550925 1566591 1549620 1543093
31190A543093J9582M5692K4152j6972K611K0236l4596m6345Q486j1750n8094J1096
$$ 1543093 1562675 1608367 1632519 1615547 1618158 1638394 1603798 1557453 1565939 1554189 1496095 1507191
31178A507191R0732O3969K1541j5666p5066l8512O6580M1123m6997k2194J306
$$ 1507191 1597923 1661892 1683433 1667767 1592701 1554189 1620769 1661892 1614895 1592701 1594007
31167A594007l8512K0888R7259l917r8564j0444M0470l4596m2428K1541M2428
$$ 1594007 1555495 1576383 1673642 1669725 1571161 1560717 1601187 1566591 1524163 1545704 1588132
31156A588132N6789K8721p4413o3317O5928L0679r6607l3943N5484k6763l9164
$$ 1588132 1644921 1673642 1599229 1535912 1601840 1632519 1535912 1501969 1557453 1530690 1491526
31145A491526P7676L9165q0288q485Q6815J4360l1984K0888Q485l2637J306K0887
$$ 1491526 1569202 1608367 1528079 1519594 1606409 1620769 1588785 1609673 1618158 1585521 1586827 1607714
31133A607714j305R791K611m3734k6110J4361j8277n0262j7624J8930M8303O0053
$$ 1607714 1606409 1616200 1618811 1575077 1548967 1563328 1545051 1494789 1477165 1496095 1544398 1604451
31121A604451J305m2428J8277M6997k4151l5249J8930N222j7624J2402k0235p9635
$$ 1604451 1605756 1563328 1581605 1628602 1604451 1569202 1588132 1593354 1575730 1588132 1567897 1488262
31109A488262j6972O5275J3055o2011l2637M4386P5066J4361q2899n0914O6580
$$ 1488262 1471290 1536565 1549620 1487609 1454972 1499358 1574424 1588785 1505886 1454972 1521552
31098A521552N1567l3943K611K2193o7885k8721J16842O5927n9400J1749P8330
$$ 1521552 1573119 1539176 1541787 1563980 1496095 1467374 1584216 1650143 1590743 1602492 1680822
31087A680822r138j8930M4387l3290j08356k4152P180n8094k0235M7650K0888
$$ 1680822 1671684 1652754 1697141 1663851 1555495 1531343 1538523 1480429 1460194 1507844 1528732
31076A528732K8068O5928q486n8747K4804L5248m8303l3943l916o3317l2637P9635
$$ 1528732 1556800 1622728 1614242 1555495 1580299 1615547 1567244 1533301 1529385 1466068 1433431 1513066
31064A513066L9165n2220N875O5275J5013j958O52n6789m5692M0470J4361o3969
$$ 1513066 1552231 1500011 1505886 1571161 1586174 1584216 1584868 1528079 1482387 1522857 1537218 1473249
31052A473249j2403O7886M1123j1749k8068k0888L5901O9844l264p3108n6789
$$ 1473249 1460846 1528732 1569855 1558106 1530038 1509150 1545051 1614895 1611631 1538523 1481734
31041A481734m4386k9374N8094Q9427p181n0261J3055M3081K4805N222m6998o5275
$$ 1481734 1437348 1407974 1466068 1555495 1548314 1498053 1511108 1554189 1578994 1584216 1537218 1471943
31029A471943J5013N3526j0444k0888K7415p833o2664j8276L1331K4805L3943
$$ 1471943 1486956 1540482 1530038 1509150 1536565 1528732 1466068 1447792 1479123 1503928 1537871
31018A537871M8303J0444n2220r1385n9399M6345Q8120M570j3708R3995R3996
$$ 1537871 1586174 1596618 1544398 1453013 1393614 1439959 1528079 1532649 1518941 1612936 1706932
31007A706932l9818r5301o5927m9609R791P7677K4805l7207J8930L5248m3081
$$ 1706932 1667114 1571813 1505886 1456277 1466068 1543745 1568550 1531343 1550273 1585521 1542440
30996A542440m8956J4360K0235J8930L5248l916j8930M6345L3290o7885n7442
$$ 1542440 1493484 1507844 1528079 1547009 1582257 1578341 1559411 1605756 1639046 1571161 1513719
30985A513719M1123O0053K1540r138m5040l0026L7207K1540n6789n5483l264K6110
$$ 1513719 1554842 1614895 1636435 1627297 1582257 1552231 1589438 1610978 1554189 1498706 1495442 1521552
30973A521552O0705L6554p1802p5066L8512L5901m4387j9582l916o2664j306J01176
$$ 1521552 1582257 1618811 1547009 1471943 1510455 1546356 1501969 1482387 1478471 1415807 1414501 1515677
30961A515677P180r2037J5666P5719k6763l7207L9165J958m1775J5013K4804k0888
$$ 1515677 1522857 1430820 1446486 1522205 1495442 1458235 1497400 1499358 1457583 1472596 1497400 1476512
30949A476512%j958n0914K611Q2899K3499m6345r139m569m8956o528O7233P7024
$$ 1476512 1476512 1474554 1423640 1426251 1509150 1532649 1486304 1477165 1472596 1423640 1417112 1484345 1561369
30936A561369O0706J8930m2429k5457J7624m3081q9427L264O2011j5013o7233
$$ 1561369 1622075 1641005 1598576 1573119 1590743 1547662 1458235 1461499 1523510 1508497 1441264
30925A441264l2637M569M3734N4831j3055m5040K8721N2220k2846m1776O527K8068
$$ 1441264 1408627 1413196 1456930 1511761 1498706 1453666 1482387 1534607 1511761 1469985 1476512 1504580
30913A504580L3291K5457j306K4805O9191J958p1802j1097K7415m6345l8512P1150
$$ 1504580 1537871 1563328 1562022 1586827 1656018 1657976 1586174 1575077 1602492 1556147 1517635 1588785
30901A588785P5718q485m9609p7677p0497L1985Q6815J2403j5014M6345L0027
$$ 1588785 1664503 1656018 1606409 1528732 1458235 1490220 1577035 1589438 1574424 1620769 1650796
30890A650796m5693o4621n9400m3082K6763O2011J0444l1332n6789r7259m5693
$$ 1650796 1605103 1540482 1481082 1438000 1464763 1526774 1537218 1505886 1449097 1351838 1306145
30879A306145P5066P5719O53J5666M2428J958O528K6762n4830j05092j1750O7233
$$ 1306145 1381211 1456930 1457583 1473249 1515677 1517635 1524163 1550925 1496095 1391003 1379253 1446486
30867A446486M6998K3499m570l9817k611M3081r138l3290M6345Q8120N0262Q486
$$ 1446486 1493484 1516983 1512413 1472596 1469985 1513066 1503928 1470638 1516983 1605103 1655365 1663851
30855A663851m3734o5275Q486L5901n9400o9191M7650M9609l5248o53O2011N222
$$ 1663851 1620117 1554842 1563328 1599229 1539829 1470638 1518288 1567897 1532649 1531996 1594007 1599229
30843A599229o2011o0706k5457N8747J09662L264q6816O53N0914n1567p7677R139
$$ 1599229 1537218 1476512 1451055 1509802 1619464 1622728 1535912 1536565 1587479 1535912 1458235 1467374
30831A467374K8068J5013L1985k4152p7024K7415J11620J6971n5483n222J5666
$$ 1467374 1495442 1510455 1542440 1518288 1441264 1468679 1580299 1597270 1541787 1536565 1552231
30820A552231k611J9582J959n0262r138O5927M6998j5013n4178o6580j7625L7860
$$ 1552231 1549620 1569202 1571161 1520899 1511761 1577688 1624686 1609673 1555495 1488915 1471290 1509150
30808A509150O52k3498N2219O3969l1984m8956N875%K0235J01828O5928n8095
$$ 1509150 1509802 1486304 1538523 1602492 1570508 1521552 1527427 1527427 1547662 1649490 1715418 1657323
30796A657323o1358p180l1332l7859J4360R791j8277J4361J6318l5248l3943m569
$$ 1657323 1595965 1588785 1557453 1519594 1533954 1543745 1525468 1539829 1556147 1520899 1486956 1482387
30784A482387k2846j4360N7441P8983J3055l9165r791O7885Q6163L916n6789r138
$$ 1482387 1459541 1445181 1502622 1581605 1594660 1555495 1545704 1613589 1699752 1703668 1646879 1637741
30772A637741M4387N5483R3343R7912j306m2428O3969J26633M6345m3734q0288
$$ 1637741 1682128 1737611 1830954 1928866 1927560 1885132 1949101 2075734 2122079 2078345 1998057
30761A998057q2246m1776k2846n8747m1123J1096m4386j06398j1097O8539l264
$$ 1998057 1915811 1874035 1851189 1792442 1751319 1762415 1718029 1611631 1600534 1669073 1665809
30750A665809m8303j1097l1985n4178J7625M4386r138L264L3290j0444n875O7886
$$ 1665809 1617506 1606409 1574424 1520246 1537871 1582257 1573119 1576383 1609673 1599229 1593354 1661240
30738A661240N0261k6762l5249l7206n9400J1749J10967J04440P1149Q1593O9844
$$ 1661240 1711501 1684739 1649490 1612284 1552884 1564633 1675600 1780040 1851189 1932782 2002626
30727B002626M8956O4622O7886P1149J24675J29896M9609J4360o52j10967j84728
$$ 2002626 2051582 2116204 2184090 2255239 2379914 2509810 2559419 2573779 2573127 2462160 2277432
30716B277432j10966p1803j37076j28591m3734k2194l5901j7624k1541l1984r792
$$ 2277432 2166466 2094663 1957587 1828996 1785262 1763068 1727167 1709543 1688002 1656018 1646226
30705A646226r791j6318K8720L5249m1776o0705O52J306l5249o527L2637J3708
$$ 1646226 1636435 1620117 1648837 1684086 1642310 1581605 1582257 1583563 1548314 1541787 1574424 1588132
30693A588132k0235l9165j8277M6345M3734m1776k4151R9870J03787P833L4595
$$ 1588132 1567897 1528732 1510455 1556800 1600534 1558758 1534607 1634477 1738264 1746097 1780692
30682A780692J27939J05745K5457P180J6319j959m8303r0079o1358r791o0053
$$ 1780692 1908631 2014376 2039833 2047013 2063332 2061373 2013070 1922991 1861633 1851842 1791789
30671A791789j22064l3942O2663K611n8094j1750J306l0679J958K4152p181K0236
$$ 1791789 1669725 1635783 1698446 1701057 1642963 1631213 1632519 1601840 1603798 1627950 1620769 1641005
30659A641005O0705j958n2220%J9582j5013j0444l3943r7259l9817Q0940L4596
$$ 1641005 1701710 1699752 1647532 1647532 1667114 1652101 1641657 1607714 1510455 1470638 1551578 1586174
30647A586174r7259p7025L8513N8094j6971p9636p2454j1097K8721K8721N4178
$$ 1586174 1488915 1411890 1450403 1508497 1491526 1411890 1339436 1328339 1357060 1385781 1439959
30636A439959O8538Q486l6554%K2193n222k0235l1984l5902K2194N9400%j8930
$$ 1439959 1508497 1516983 1480429 1480429 1502622 1497400 1477165 1445181 1409279 1431473 1490873 1490873 1471943
30623A471943L2637P181l3290M7650R3343J305m0470j0444o3316q4857L0679N7441
$$ 1471943 1504580 1511761 1478471 1526121 1619464 1620769 1580299 1569855 1506539 1421682 1452361 1509802
30611A509802m3734k4151O6580K0235l1332M7651R2037M0470%o0705j25327n2873
$$ 1509802 1466068 1441917 1508497 1528732 1497400 1545051 1637088 1677558 1677558 1616853 1491526 1438653
30599A438653N8747J8277m3734L917Q485n5483J305J24675J01176k2194o9191
$$ 1438653 1497400 1515677 1471943 1475860 1484345 1428862 1430167 1554842 1656018 1633824 1564633
30588A564633j4360M5692K9374l3290k4805K3499k7415r7912l7207L5901%J306
$$ 1564633 1550273 1595965 1625339 1592049 1567244 1590743 1563328 1465416 1428209 1464110 1464110 1465416
30576A465416Q0940P9635O528j4361k4151n5484l3943J3708J9583J6971q486p5066
$$ 1465416 1546356 1625991 1632519 1618158 1594007 1538523 1504580 1518288 1537871 1554842 1546356 1471290
30564A471290o0052M1775N2873j4360l917K3499o53K7416O8538m569n8095J7624
$$ 1471290 1411238 1453013 1505886 1491526 1487609 1511108 1510455 1537871 1606409 1601840 1543745 1561369
30552A561369L3291m7651k5457N4178L1332P833O2011M6997n1567q6815n0914
$$ 1561369 1594660 1547009 1521552 1575730 1607062 1614895 1676906 1723903 1672336 1585521 1534607
30541A534607j306L9165%p6371l0679Q4204Q6815L7207K6110k4152p1802L264
$$ 1534607 1533301 1572466 1572466 1496095 1465416 1549620 1636435 1673642 1699752 1675600 1603798 1607062
30529A607062N4830k9373n5484J6319m569o9191k3499J8277k2194j3055M1123
$$ 1607062 1661892 1632519 1577035 1593354 1588785 1519594 1496095 1514372 1492178 1479123 1520246
30518A520246L9818L6554K8721o9192j18799K611J00523L7859l6554m2429j9582
$$ 1520246 1560064 1596618 1625339 1556147 1437348 1439959 1540482 1578341 1541787 1499358 1479776
30507A479776M7651P1802k6763n0261P7024N8747j25980j08356Q4857Q6163m8956
$$ 1479776 1527427 1599229 1572466 1522205 1599229 1657976 1531996 1423640 1508497 1594660 1545704
30496A545704l9165L1332J0443k610L1331P181l7207k1541J306j6319l9817l1332
$$ 1545704 1506539 1537871 1548314 1545704 1577035 1584216 1547009 1525468 1526774 1510455 1470638 1439306
30484A439306K8068Q8121N0261l7206l9165O53j3055l917O4622N9400j8930l0679
$$ 1439306 1467374 1555495 1605756 1568550 1529385 1530038 1516983 1513066 1577688 1637088 1618158 1587479
30472A587479M570k4805p0496n0915j0444N875L0026O3970N2872o527l4596J958
$$ 1587479 1592049 1567244 1496748 1445833 1435389 1441264 1471290 1535260 1588132 1581605 1547009 1548967
30460A548967N222p0496p3108N9400J24675K7415m3734j0444n222k9374P833M4387
$$ 1548967 1554189 1483693 1410585 1469985 1594660 1622075 1578341 1567897 1562675 1533301 1541134 1585521
30448A585521K6110J5666N875l5902l2637J0444j6971o5275j4360L9164n222l6553
$$ 1585521 1611631 1627297 1633172 1597270 1564633 1575077 1558106 1492831 1478471 1517635 1512413 1475860
30436A475860N874K8721N222o527j306N875P180k0888m5039j3708L0026L8512
$$ 1475860 1481734 1510455 1515677 1509150 1507844 1513719 1520899 1500011 1454972 1441264 1471290 1509802
30424A509802L4596%n9400l3943N9400N0914l3942k8069J9583o53k611M6998L1332
$$ 1509802 1544398 1544398 1484998 1451055 1510455 1561369 1527427 1499358 1518941 1518288 1515677 1562675 1594007
30411A594007l1332l0679%R138L8512O4622L3290j3707n7442r5301l7859Q3551
$$ 1594007 1562675 1531996 1531996 1541134 1579646 1644268 1677558 1663851 1606409 1511108 1473249 1556800
30399A556800O9844n3525o7233n222k8721m7650K8720O3970J2402j0444j1750
$$ 1556800 1626644 1573119 1505886 1500664 1471943 1424293 1453013 1516983 1529385 1518941 1507191
30388A507191m2428j7624O7885P3108k611k7415R138Q486m3081o0053n875L9818
$$ 1507191 1464763 1447139 1515024 1588132 1585521 1558106 1567244 1575730 1532649 1472596 1466721 1506539
30376A506539l264o5927l0680M8956N4178O528p833K0888M1123L264o2664n0262
$$ 1506539 1503275 1437348 1406668 1455624 1509802 1516330 1508497 1529385 1570508 1573772 1511108 1460846
30364A460846K5458K0887l1984J3708O3316j0444n2220L3943N0262m2429n5483
$$ 1460846 1486304 1507191 1475207 1488915 1552231 1541787 1489567 1523510 1573772 1531343 1475860
30353A475860k611l264J6971P7677M5040k6110J958K7415l3290o0705k2193O52
$$ 1475860 1473249 1469985 1486956 1564633 1609673 1583563 1585521 1612936 1579646 1518941 1496748 1497400
30341A497400K7416M3734k6763q4204k2194M1123K4152R138q485m8304K611R8565
$$ 1497400 1524816 1568550 1541787 1457583 1435389 1476512 1500664 1509802 1501317 1453013 1455624 1554189
30329A554189N8747m3734l1984J8929J9583L3943K8721k8721k0235K1540n6789
$$ 1554189 1612936 1569202 1537218 1556147 1575730 1609673 1638394 1609673 1589438 1610978 1554189
30318A554189j17494J958P8330k0888p1802j1750J0444L8512J03787N0261n8094
$$ 1554189 1436695 1438653 1516983 1496095 1424293 1412543 1422987 1461499 1565286 1615547 1557453
30307A557453k4152L1985l0026l7207N6136O5928K2193M1776R138q4857o6580
$$ 1557453 1533301 1565286 1535260 1498053 1554189 1620117 1642310 1684086 1693224 1608367 1541787
30296A541787J306m6345q2247P181O2011J6318k611J9583K6110L6553L3943j3055
$$ 1541787 1543093 1496748 1414501 1421682 1483693 1500011 1497400 1516983 1543093 1579646 1613589 1600534
30284A600534m5039m1776m5040j5013N6789N4831l0026n5484j958M4387N3525
$$ 1600534 1555495 1513719 1468679 1453666 1510455 1565286 1535260 1479776 1477818 1522205 1575730
30273A575730K6110j6972r791J6972l1332q0941j3708P1803M8956j6319m3734
$$ 1575730 1601840 1584868 1575077 1592049 1560717 1479776 1466068 1537871 1586827 1570508 1526774
30262A526774k8068K7415O7233K0888l4596k2846q486k3498J958L7859K1541p180
$$ 1526774 1498706 1526121 1593354 1614242 1579646 1556800 1548314 1524816 1526774 1564633 1586174 1578994
30250A578994k3499n4831n6136o528L1332O3317R6606M5040n2220l5901J6971
$$ 1578994 1555495 1500664 1444528 1438000 1469332 1532649 1629255 1674295 1622075 1586174 1603145
30239A603145m3734o4622N2873P7024n8747q9427J8930N0262J1749K0888J1749
$$ 1603145 1559411 1494789 1547662 1624686 1565939 1476512 1495442 1545704 1557453 1578341 1590090
30228A590090o0705p6372P181P8329N0262k8068l5901K8720R139q6163o2011M6998
$$ 1590090 1529385 1453013 1460194 1538523 1588785 1560717 1524816 1553536 1562675 1476512 1414501 1461499
30216A461499M8956K0888O4622J2402j28591q8773O5927L8512o5927j5014O5275
$$ 1461499 1510455 1531343 1595965 1608367 1479776 1391003 1456930 1495442 1429515 1414501 1479776
30205A479776M5692K5457J9583o53L7207N9400m8956r7912L5248Q0941n3526r2690
$$ 1479776 1525468 1550925 1570508 1569855 1607062 1666462 1617506 1519594 1554842 1635783 1582257 1489567
30193A489567R139L1984k3499k5457J2403O0705P9635o527r0732k0888O0705L917
$$ 1489567 1498706 1530690 1507191 1481734 1494137 1554842 1634477 1627950 1537218 1516330 1577035 1580952
30181A580952l7859J305j1097l1332M3082O3316l3943o7233n874J1749m569j1749
$$ 1580952 1543093 1544398 1533301 1501969 1545051 1608367 1574424 1507191 1501317 1513066 1508497 1496748
30169A496748m4387m6998P833J1749j6971L2637N7442j9582l4596K0235k5457
$$ 1496748 1452361 1405363 1413196 1424945 1407974 1440611 1498053 1478471 1443875 1464110 1438653
30158A438653o9191L7206R8565J958l3942L3942J2403o3970l9164K5457M0470
$$ 1438653 1369462 1406668 1505233 1507191 1473249 1507191 1519594 1455624 1416460 1441917 1482387
30147A482387L3943J3055r791o53K611j5666J0444K7415l2637l9165M2429K1540
$$ 1482387 1516330 1529385 1519594 1518941 1521552 1505886 1516330 1543745 1511108 1471943 1514372 1535912
30135A535912p6371l3290O3969K1541m2429j1749M569k611L7859K9374l4596j2402
$$ 1535912 1459541 1426251 1490220 1511761 1469332 1457583 1462152 1459541 1497400 1526774 1492178 1479776
30123A479776K6763m7651p5718L1331O1359j6319J1749R4649L7859n8094k8721
$$ 1479776 1506539 1458888 1383170 1414501 1475860 1459541 1471290 1565939 1603798 1545704 1516983
30112A516983K4151K611j1096L1984M2429l6554j09662m1775R7259R3343l8512
$$ 1516983 1541134 1543745 1532649 1564633 1607062 1570508 1460846 1419071 1516330 1609673 1571161
30101A571161q1594k8721k3498l3291J5666M0471K0888K0887j1749q3552l9817
$$ 1571161 1489567 1460846 1437348 1404057 1419723 1460194 1481082 1501969 1490220 1406668 1366851
30090A366851R9217J09662k2846j05092p9636k0887J3707%r791M1776N1567k9374
$$ 1366851 1466068 1575730 1552884 1447792 1368156 1347269 1360976 1360976 1351185 1392961 1444528 1415154
30078A415154l5248N3525L1332o5275j5013Q2246K3499n4178J2402P4413J7625
$$ 1415154 1379906 1433431 1464763 1399488 1384475 1466721 1490220 1436042 1448444 1522857 1540482
30067A540482l9165j8277L0026N6789L3943j8277l0679J305K1541J3708k4152
$$ 1540482 1501317 1483040 1513066 1569855 1603798 1585521 1554842 1556147 1577688 1591396 1567244
30056A567244o0053r791Q6816O7885j9582n222K7415m9609p7024K6763N2872l5901
$$ 1567244 1507191 1497400 1584216 1652101 1632519 1627297 1654712 1605103 1528079 1554842 1607714 1571813
30044A571813l9817K0235l264k9373J6318J4361m8304l3942M1123M9608j5013
$$ 1571813 1531996 1552231 1548967 1519594 1535912 1550273 1501969 1468027 1509150 1558758 1543745
30033A543745n5483r791O5927N1567m4387o7233L917L4595K8068N6137L8512m1123
$$ 1543745 1488262 1478471 1544398 1595965 1551578 1484345 1488262 1522857 1550925 1607062 1645574 1604451
30021A604451m4387L3290N2220J6318j5666o2010p1150L3943J16189M5039m5039
$$ 1604451 1560064 1593354 1645574 1661892 1646226 1584216 1513066 1547009 1663198 1708237 1663198
30010A663198j7624L3943K4804o53j3707k2847j5666p180j5666k4151l4596m6998
$$ 1663198 1645574 1679517 1704321 1703668 1689961 1667114 1651448 1644268 1628602 1604451 1569855 1522857
29998A522857l1984o53N875M569K4152M1123M3081L4596j4361o3316k7416M2429
$$ 1522857 1490873 1490220 1496095 1500664 1524816 1565939 1609020 1643616 1629255 1565939 1538523 1580952
29986A580952K8721k2194j8277m569k9373l1985K3499P2455L0679q8774j24674
$$ 1580952 1609673 1587479 1569202 1564633 1535260 1503275 1526774 1599229 1629908 1541134 1416460
29975A416460R791J27285O3970j6319K1541J9582o7886m5692O7233O7233j1097
$$ 1416460 1426251 1553536 1617506 1601187 1622728 1642310 1574424 1528732 1595965 1663198 1652101
29964A652101k0888j3055n0914o1358j5666L9165P0496L7860l3943l6554Q486
$$ 1652101 1631213 1618158 1567244 1505886 1490220 1529385 1599881 1637741 1603798 1567244 1575730
29953A575730j9583n8747n874L7859J305j1096J5013L264r139J4361J3707k611
$$ 1575730 1556147 1497400 1491526 1529385 1530690 1519594 1534607 1537871 1528732 1543093 1556800 1554189
29941A554189K611j4360j5666N0261L5249j10967j25980N4830J35119L3943k7416
$$ 1554189 1556800 1542440 1526774 1577035 1612284 1501317 1375337 1430167 1565286 1599229 1571813
29930A571813j4360k5457j8930K0235o52m5693k3499K0888K9374N222l3943j5666
$$ 1571813 1557453 1531996 1513066 1533301 1532649 1486956 1463457 1484345 1513719 1518941 1484998 1469332
29918A469332P8982P7025o1359q5509O3316J10967j6319j09008p6372J6319R9217
$$ 1469332 1548314 1625339 1563980 1478471 1541787 1652754 1636435 1527427 1451055 1467374 1566591
29907A566591O3317p6372j09008o53M1776J305R139L1332J5013J3055j7624q6816
$$ 1566591 1629908 1553536 1444528 1443875 1485651 1486956 1496095 1527427 1542440 1555495 1537871 1451055
29895A451055m3734Q8774J04439L3290J6319k0888p6371o53Q8121%q6163m569
$$ 1451055 1407321 1496095 1600534 1633824 1650143 1629255 1552884 1552231 1640352 1640352 1554189 1549620
29883A549620O6580K6763r139k5457k3499M5040N8747n2220o9191N9400O2664
$$ 1549620 1616200 1642963 1633824 1608367 1584868 1629908 1688655 1636435 1567244 1626644 1689308
29872A689308n8747p0497l0026n8748l9164K0235j1097k1541N2873J8930p1803
$$ 1689308 1630561 1560064 1530038 1471290 1432126 1452361 1441264 1419723 1472596 1491526 1419723
29861A419723J0444J20758N6789Q486O1358J1097r7259o0053n875n6136m2428
$$ 1419723 1430167 1550925 1607714 1616200 1677558 1688655 1591396 1531343 1525468 1469332 1426904
29850A426904N2219M3734k7415j9582K3498M3735O0705M0470q485j0444M569l917
$$ 1426904 1479123 1522857 1495442 1475860 1499358 1543093 1603798 1644268 1635783 1625339 1629908 1625991
29838A625991O528J958l7859J8277J21411L5248j11620k3499J14231J6971j00523
$$ 1625991 1632519 1634477 1596618 1614895 1736306 1771554 1659934 1636435 1750666 1767637 1667114
29827A667114l7206M569n1567m5039j9583n0914O53J05092N2872p5718o4622J3707
$$ 1667114 1629908 1634477 1582910 1537871 1518288 1467374 1468027 1573119 1625991 1550273 1485651 1499358
29815A499358K1541K0235L2638M569k2846j3055M569M1123P3108J4360o7886l8512
$$ 1499358 1520899 1541134 1573772 1578341 1555495 1542440 1547009 1588132 1661240 1675600 1607714 1569202
29803A569202J9583j6319l3290M4387P3107M570l1332r139l916o53K8068K2194
$$ 1569202 1588785 1572466 1539176 1583563 1656670 1661240 1629908 1620769 1616853 1616200 1644268 1666462
29791A666462r139J6319N8094J1097n6789%J17494J16189P181o0053m9609j8277
$$ 1666462 1657323 1673642 1731736 1742833 1686044 1686044 1803538 1919727 1926908 1866855 1817246 1798969
29779A798969m569n1567j24022p8982L8512L0026l7206K6109O0053q5510j20758
$$ 1798969 1794400 1742833 1618811 1539829 1578341 1608367 1571161 1597270 1657323 1571813 1451055
29768A451055O6580J05745m6997j8930J22716M6345o2663L7206Q6816k4805p180
$$ 1451055 1517635 1623380 1576383 1557453 1680169 1726514 1663851 1701057 1787873 1763068 1755888
29757A755888J05745M5692m3734N4831J40993O5928j1750k1541l4595k9374j4360
$$ 1755888 1861633 1907325 1863591 1918422 2059415 2125343 2113593 2092052 2057457 2028083 2013723
29746B013723m3081l1985M5039L4596p4413j18147q0288n2220k6762k7416q5510
$$ 2013723 1970642 1938657 1983696 2018292 1943879 1825732 1745444 1693224 1666462 1639046 1553536
29735A553536p8329N0261J23369M1124n0262l0026M9608R2690N4831o53K2194
$$ 1553536 1475207 1525468 1648837 1689961 1639699 1609673 1659281 1751971 1806802 1806149 1828343
29724A828343P2455N1567J1749P180l0026p7677l1984L3942L917l9165j8930n222
$$ 1828343 1900798 1952365 1964114 1971294 1941268 1863591 1831607 1865549 1869466 1830301 1811371 1806149
29712A806149j3055j958q485m5693n8094n4178m5692O52L0027l917K611O7233
$$ 1806149 1793094 1791136 1782651 1736958 1678864 1624686 1578994 1579646 1609673 1605756 1608367 1675600
29700A675600L8512n8747m8956K5457L1332J3055K8068K9374K0235M569n2873
$$ 1675600 1714112 1655365 1606409 1631866 1663198 1676253 1704321 1733695 1753930 1758499 1705626
29689A705626p4413p180r138r7912n8748P1803N4830k8721N222K2847n4178k7416
$$ 1705626 1631213 1624033 1614895 1516983 1458235 1530038 1584868 1556147 1561369 1584216 1530038 1502622
29677A502622R5954P9635k4152j958P9635M9609m3734n2872K9373P5719O527m8956
$$ 1502622 1598576 1678211 1654059 1652101 1731736 1781345 1737611 1684739 1714112 1789831 1796358 1747402
29665A747402M0471J14230M569j03134m1123J7625l4596m7651o527k3499m7650
$$ 1747402 1787873 1902103 1906672 1803538 1762415 1780040 1745444 1697793 1691266 1667767 1620117
29654A620117k3499l0027m6345L917K8721l1332m1123K1540K0236l3290j6972
$$ 1620117 1596618 1566591 1520246 1524163 1552884 1521552 1480429 1501969 1522205 1488915 1471943
29643A471943M9609P9635N4831l917n2220m9608k6110m569L5901M4386r791j3055
$$ 1471943 1521552 1601187 1656018 1652101 1599881 1550273 1524163 1519594 1555495 1599881 1590090 1577035
29631A577035O9191Q3552j0444o5927n2220l6554q486K8069L916l9165k0235J3708
$$ 1577035 1646226 1729778 1719334 1653407 1601187 1564633 1556147 1584216 1588132 1548967 1528732 1542440
29619A542440J1749P833o527l7860j6318L4595Q486m5692j3708N4178O0705K4152
$$ 1542440 1554189 1562022 1555495 1517635 1501317 1535912 1544398 1498706 1484998 1539176 1599881 1624033
29607A624033k0888n6136k3499M6998L8512l4596l3290N1567R6607M8303m1123
$$ 1624033 1603145 1547009 1523510 1570508 1609020 1574424 1541134 1592701 1689308 1737611 1696488
29596A696488q8121m3734L4596M6997l263j5666K0888J7624l5901l4596L1985
$$ 1696488 1608367 1564633 1599229 1646226 1642963 1627297 1648185 1665809 1629908 1595312 1627297
29585A627297L4595k8068j305Q3551K2847j10315q1593K2193J959k6110N4178
$$ 1627297 1661892 1633824 1632519 1716070 1738917 1628602 1547009 1569202 1571161 1545051 1599229
29574A599229P8329j2402m6998j5666j5013o52K6109k0235m5692K4804L5901l6553
$$ 1599229 1677558 1665156 1618158 1602492 1587479 1586827 1612936 1592701 1547009 1571813 1607714 1571161
29562A571161j9583K4152m3081n9400M2428M6345l5901J3708Q4204J958o3969
$$ 1571161 1551578 1575730 1532649 1473249 1515677 1562022 1526121 1539829 1624033 1625991 1562022
29551A562022j1749J958l3290j9583j5665l0027K7416P1149K1541N222K8068l5901
$$ 1562022 1550273 1552231 1518941 1499358 1483693 1453666 1481082 1552231 1573772 1578994 1607062 1571161
29539A571161p7677J1749O0053J8930M4386O0053n0261r3343L263N222p8329l9165
$$ 1571161 1493484 1505233 1565286 1584216 1628602 1688655 1638394 1545051 1548314 1553536 1475207 1436042
29527A436042L9165J3055L916O1358O6581L1984j305p7677j11620k2846K1541
$$ 1436042 1475207 1488262 1492178 1553536 1620117 1652101 1650796 1573119 1461499 1438653 1460194
29516A460194k9374K6110J35119N5483q7468n2220K4805j3708l2637K7415L2637
$$ 1460194 1430820 1456930 1592049 1647532 1560064 1507844 1532649 1518941 1486304 1513719 1546356
29505A546356l2637n8095r138N4178M6998k6763l2637M7650L3943o6580l9818
$$ 1546356 1513719 1455624 1446486 1500664 1547662 1520899 1488262 1535912 1569855 1503275 1463457
29494A463457O7886M0470m5692k8721o527m7651j6318Q2246R3342J8277k1540
$$ 1463457 1531343 1571813 1526121 1497400 1490873 1443222 1426904 1509150 1602492 1620769 1599229
29483A599229r791P180J1096J959M569J3055k0888o7233n4178r138M569J305j4360
$$ 1599229 1589438 1596618 1607714 1609673 1614242 1627297 1606409 1539176 1484998 1475860 1480429 1481734 1467374
29470A467374l7207n874N9400L5901m1123l1332K6762J7625j3055J9582O9844
$$ 1467374 1430167 1424293 1483693 1519594 1478471 1447139 1473901 1491526 1478471 1498053 1567897
29459A567897O5275M569l7860%L6554k7415o5927L9164J02482P180m5693J306
$$ 1567897 1633172 1637741 1599881 1599881 1636435 1609020 1543093 1582257 1684739 1691919 1646226 1647532
29447A647532k4804o7233J1749M6998m8303o2011R138j7624l1332Q2899Q3552
$$ 1647532 1622728 1555495 1567244 1614242 1565939 1503928 1513066 1495442 1464110 1547009 1630561
29436A630561q5510j03787N6136R6607j306l0679L0679R1385P7677n1567j61882
$$ 1630561 1545051 1441264 1497400 1594007 1592701 1562022 1592701 1684086 1761763 1710196 1548314
29425A548314q0940N2220K7415l9818o527K7415L264m569l917k611M8956N8095
$$ 1548314 1467374 1519594 1547009 1507191 1500664 1528079 1531343 1526774 1522857 1520246 1569202 1627297
29413A627297o2011j37730l3290R7260J16188O7233o527n5484j0444L9818k3499
$$ 1627297 1565286 1427556 1394266 1491526 1607714 1674947 1668420 1612936 1602492 1642310 1618811
29402A618811q6162k6110M9608L9818R791r138k9374n875M0471K8721k1541k2846
$$ 1618811 1532649 1506539 1556147 1595965 1605756 1596618 1567244 1561369 1601840 1630561 1609020 1586174
29390A586174O527M569j1096r139j4360l8512m1123J5013O2011K0235l3290J3055
$$ 1586174 1592701 1597270 1586174 1577035 1562675 1524163 1483040 1498053 1560064 1580299 1547009 1560064
29378A560064O8538J6319m8303k4152j305j6972%J8277k2193n0262l3290l1984
$$ 1560064 1628602 1644921 1596618 1572466 1571161 1554189 1554189 1572466 1550273 1500011 1466721 1434737
29366A434737n875Q2246J11620L3942k9373k6763j7624k611J8277J1749J8277
$$ 1434737 1428862 1511108 1622728 1656670 1627297 1600534 1582910 1580299 1598576 1610325 1628602
29355A628602N1567L3943k7415m6345m8303n9400j7625L9165K5457P833K7416
$$ 1628602 1680169 1714112 1686697 1640352 1592049 1532649 1515024 1554189 1579646 1587479 1614895
29344A614895j3708n8747J7624Q6162J6972k0888O0705O2011n4178j05745n3525
$$ 1614895 1601187 1542440 1560064 1646226 1663198 1642310 1703015 1765026 1710848 1605103 1551578
29333A551578Q486L8512J958n8094n875R7912N9400m8956l1985M0471K7415q486
$$ 1551578 1560064 1598576 1600534 1542440 1536565 1634477 1693877 1644921 1612936 1653407 1680822 1672336
29321A672336r791k0235k2193j959k611j0444P181N222r139J958k0887o9192j7624
$$ 1672336 1662545 1642310 1620117 1618158 1615547 1605103 1612284 1617506 1608367 1610325 1589438 1520246 1502622
29308A502622Q0288N3525l5901m3081j6971l917L4596L5901l0027k5457N2873
$$ 1502622 1582910 1636435 1600534 1557453 1540482 1536565 1571161 1607062 1577035 1551578 1604451
29297A604451O0052K0888K2846q485p4413l9165L3943k611o1359j0443O7885O7886
$$ 1604451 1664503 1685391 1708237 1699752 1625339 1586174 1620117 1617506 1556147 1545704 1613589 1681475
29285A681475j958q8121j01829j6318N4178N6136N7442K6109n6789m9608O0052
$$ 1681475 1679517 1591396 1489567 1473249 1527427 1583563 1641005 1667114 1610325 1560717 1620769
29274A620769O7233k4804l1332J1097p833k6110j5013j6319J4361L9164n8094
$$ 1620769 1688002 1663198 1631866 1642963 1635130 1609020 1594007 1577688 1592049 1631213 1573119
29263A573119j25980J1749J21411R791o2663N6789J17494K0888o1358o2664j7624
$$ 1573119 1447139 1458888 1580299 1590090 1527427 1584216 1701710 1722598 1661240 1598576 1580952
29252A580952M8956L8512m7651m3081K8721J305l5901N0915R8564J5014j5014
$$ 1580952 1629908 1668420 1620769 1577688 1606409 1607714 1571813 1622728 1721292 1736306 1721292
29241A721292L0679%o7885n8747k4152j8277j7624j9582O527O7886M3734o3970
$$ 1721292 1751971 1751971 1684086 1625339 1601187 1582910 1565286 1545704 1552231 1620117 1663851 1599881
29229A599881o0705N2873N5483m4387n6789R139L6554K7415J1749n222j0444l1331
$$ 1599881 1539176 1592049 1647532 1603145 1546356 1555495 1592049 1619464 1631213 1625991 1615547 1584216
29217A584216o3970j5666Q2899Q2246p180n4831m1123%M8304L3290l0679k5457
$$ 1584216 1520246 1504580 1587479 1669725 1662545 1607714 1566591 1566591 1614895 1648185 1617506 1592049
29205A592049Q485k4804j2402R5953J04440P180L264L4595k3498l3291L0027j8277
$$ 1592049 1600534 1575730 1563328 1659281 1763721 1770901 1774165 1808760 1785262 1751971 1781998 1763721
29193A763721r5301j2402P3760J3708k3499J8930M569l7860l4595l5248q486P5066
$$ 1763721 1668420 1656018 1729778 1743486 1719987 1738917 1743486 1705626 1671031 1635783 1627297 1702363
29181A702363O4622l7207l0679L5901J1097o53M9609L916p1802m569O5927N875
$$ 1702363 1766985 1729778 1699099 1735000 1746097 1745444 1795053 1798969 1727167 1722598 1788525 1794400
29169A794400l3290j5666n3525p4413k9374m7650q9427j4360O2663L3943K4805
$$ 1794400 1761110 1745444 1691919 1617506 1588132 1540482 1451055 1436695 1499358 1533301 1558106
29158A558106M9608K611n1567k4804K6763Q1593Q8774l0027r9870M4387J31202
$$ 1558106 1607714 1610325 1558758 1533954 1560717 1642310 1731084 1701057 1601187 1645574 1776776
29147A776776j8277q3552M1776M5692o2011l2637J8277m7650m9609L1332L3290
$$ 1776776 1758499 1674947 1716723 1762415 1700404 1667767 1686044 1638394 1588785 1620117 1653407
29136A653407K3499O5927L5901k2846l264l7206j10315j0443J25980N2219m1123
$$ 1653407 1676906 1742833 1778734 1755888 1752624 1715418 1605103 1594660 1720640 1772859 1731736
29125A731736K0888K8721m9609j6971N5483M3734L6554L6554j1097R139O7885
$$ 1731736 1752624 1781345 1731736 1714765 1770248 1813982 1850536 1887090 1875993 1885132 1953017
29114A953017l263n0262Q3552J45562N0262P1149J57312R9218Q3551K05615K03004
$$ 1953017 1949754 1899492 1983044 2128606 2178868 2250017 2407329 2506547 2590098 2795713 2998717
29103B998717J40341K80028M14494L44651L08096K95042J7624l42692m27549l50525
$$ 2998717 3139058 3419086 3833580 4178231 4486327 4781369 4798993 4456301 4028752 3678227
29093C678227k98958k31725k06268k49349j87339p2455r2037j09009j3054j8277
$$ 3678227 3379269 3147544 2941276 2691927 2504588 2432133 2340096 2231087 2218033 2199756
29083B199756j16842o9191K8068j7624o2664j2402J4360K2846M8304P180k0888
$$ 2199756 2082914 2013723 2041791 2024167 1961503 1949101 1963461 1986307 2034611 2041791 2020903
29072B020903P0497J18800Q2246J32507J88644J16189J17494K40864K47391K30419
$$ 2020903 2091400 2210200 2292446 2424953 2613597 2729786 2847280 3088144 3335535 3565954
29062C565954L83815M81075M43215N67236P59145P04966N94652N33947J21411
$$ 3565954 3949769 4430844 4874059 5441295 6200440 6905406 7500058 8034005 8155416
29053H155416n73764r05360q20503p40214o63191m71283l48567l17234k23240
$$ 8155416 7581652 6676292 5855789 5115575 4452384 3981101 3632534 3315300 3092060
29044C092060j71672k30420k17364j19453p5066n5483k4805m6997o2664k8721
$$ 3092060 2920388 2689968 2472604 2353151 2278085 2222602 2197797 2150800 2088136 2059415
29034B059415l5248l0679M6345M2428n6789l1984N6789L6553L9818J24675R3342
$$ 2059415 2024167 1993488 2039833 2082261 2025472 1993488 2050277 2086830 2126648 2251323 2344665
29023B344665L4596J55354K26503Q5510M7650K26503L34206L17888L39428L68802
$$ 2344665 2379261 2534615 2761118 2846628 2894278 3120781 3454987 3772875 4112303 4481105
29013D481105L53136K61751k8068l96870n03920l87732l37470l15929k35641k24545
$$ 4481105 4834241 5095992 5067924 4671054 4167134 3779402 3441932 3126003 2890362 2665817
29003B665817k27809j05092l2637j06398j09662l9164m8304j3707Q9426N875j70367
$$ 2665817 2438008 2332916 2300279 2193881 2084219 2045055 1996751 1983044 2072470 2078345 1907978
28992A907978j18147K9373K3499j5013k611k8068j3708N0915k0236j21410k8069
$$ 1907978 1789831 1819204 1842703 1827690 1825079 1797011 1783303 1834218 1813982 1692572 1664503
28981A664503O7886j958j5666N3525j2402q6815J1749P0497j3708k8068M1123
$$ 1664503 1732389 1730431 1714765 1768290 1755888 1669073 1680822 1751319 1737611 1709543 1750666
28970A750666L3290m569n875j3055R791N2220P833m0470J7624L7206m3081m8303
$$ 1750666 1783956 1779387 1773512 1760457 1770248 1822468 1830301 1789831 1807455 1844661 1801580 1753277
28958A753277Q486Q485L3943P3108k6763j14883o53Q8121o53k8068N0914J1750
$$ 1753277 1761763 1770248 1804191 1877299 1850536 1735653 1735000 1823121 1822468 1794400 1845314 1857064
28946A857064p7677l1985M0471J1096m4387n1567j1096L3943R791j5666O3969
$$ 1857064 1779387 1747402 1787873 1798969 1754582 1703015 1691919 1725862 1735653 1719987 1783956
28935A783956R0079n3525j22064k2846j0444o5275L0680J12925J7624j9583N6789
$$ 1783956 1874035 1820510 1698446 1675600 1665156 1599881 1630561 1743486 1761110 1741527 1798316
28924A798316L0680q486P5718O5928p7024r7912l6554n6789k0235Q8121N2872
$$ 1798316 1828996 1820510 1896228 1962156 1885132 1787220 1750666 1693877 1673642 1761763 1814635
28913A814635l7859J305K5457l3290j8277R139m7651k0887Q5509O4622K3499R6607
$$ 1814635 1776776 1778081 1803538 1770248 1751971 1761110 1713459 1692572 1778081 1842703 1866202 1962809
28901A962809P1802q0941q0288L2638K5457k5457j5014k4151k0888L0026J0444
$$ 1962809 2034611 1953670 1873382 1906020 1931477 1906020 1891006 1866855 1845967 1875993 1886437
28890A886437k6762M1123N7441m7650n3525J9582j2402k2194O2664K0888r2037
$$ 1886437 1859675 1900798 1958239 1910589 1857064 1876646 1864244 1842050 1904714 1925602 1833565
28879A833565l5249L7207k5457o53J22717R2037j5666l1985o3969r8565j2402
$$ 1833565 1798316 1835523 1810066 1809413 1932130 2024167 2008501 1976516 1912547 1813982 1801580
28868A801580M5692l916R138J4361j03134q3552J11620J03134n8094r139J01176
$$ 1801580 1847272 1843356 1852494 1866855 1763721 1680169 1791789 1894923 1836829 1827690 1928866
28857A928866K4804l6554P833k5457p3107l7207m3734k8721J20106J62533J5014
$$ 1928866 1953670 1917116 1924949 1899492 1826385 1789178 1745444 1716723 1836829 1999362 2014376
28846B014376l4596J1097l7207l9817N2219J8930l5901P3760Q3552p9635p1150
$$ 2014376 1979780 1990877 1953670 1913853 1966072 1985002 1949101 2022861 2106413 2026778 1955628
28835A955628O3317J8929m4386L9817N3525q485N222l0679r3996K7415J14884
$$ 1955628 2018945 2037874 1993488 2033305 2086830 2078345 2083567 2052888 1958892 1986307 2101191
28824B101191l9818q0287P8329L7207j01829o53Q2899m6345q2246o527k4152K2846
$$ 2101191 2061373 1981086 2059415 2096622 1994793 1994140 2077039 2030694 1948448 1941921 1917769 1940615
28812A940615J32508K1540j07703P833L8512r7259N222J86686N2219r5301p833
$$ 1940615 2073123 2094663 1986960 1994793 2033305 1936046 1941268 2127954 2180173 2084872 2077039
28801B077039l916o5928M9609P7677p3760k8069J16842J5013p5718K7415K5457
$$ 2077039 2073123 2007195 2056804 2134481 2060721 2032652 2149494 2164507 2088789 2116204 2141661
28790B141661k7415P0496K1541j83422q4857J37730L3943p5066P1149R0732l7859
$$ 2141661 2114246 2184742 2206283 2022861 1938004 2075734 2109677 2034611 2105760 2196492 2158633
28779B158633J5013P9635n875L917M0470n4178j958J56006L5248j05092N7442
$$ 2158633 2173646 2253281 2247406 2251323 2291793 2237615 2235657 2391663 2426911 2321819 2379261
28768B379261P7677j60576j18800R6607J8277q2246L9164N1567r138Q0288M3081
$$ 2379261 2456938 2296362 2177562 2274169 2292446 2210200 2249364 2300931 2291793 2372081 2415162
28757B415162j20758k611J53395p180p5066P8330m569j51438K0236J14883m4387
$$ 2415162 2294404 2291793 2445188 2438008 2362942 2441272 2436703 2285265 2305501 2420384 2375997
28746B375997m569J22716j5013p9635O3317J7624o5928Q6816Q8120r9217j306
$$ 2375997 2371428 2494144 2479131 2399496 2462813 2480437 2414509 2501325 2589445 2490228 2488922
28735B488922J53396N222l4596J01829l1985j57312N9400J01829j02482l263J48173
$$ 2488922 2642318 2647540 2612944 2714773 2682788 2525476 2584876 2686705 2584223 2580960 2729133
28724B729133l0679l3943J88644M8303j50131M8303R9217j12925J3708J78852
$$ 2729133 2698454 2664511 2853155 2901458 2751327 2799630 2898847 2785922 2799630 2978482
28714B978482p9635j54701J16189M5692j39035Q2899J67756n6789O1358K71543
$$ 2978482 2898847 2744146 2860335 2906027 2766992 2849891 3017647 2960858 3022216 3293759
28704C293759K2193j28591P8330J8277j48826N6789J40993n4178N5483K31725
$$ 3293759 3315952 3187361 3265691 3283968 3135142 3191931 3332924 3278746 3334229 3565954
28694C565954K9374k4804J63839J2402j33813J34466J48173j31202L9818K81334
$$ 3565954 3595328 3570524 3734363 3746765 3612952 3747418 3895591 3764389 3804207 4085541
28684D085541M2428k611K53919Q1593j29897J48827J76241j39035K5457K63057
$$ 4085541 4127969 4125358 4379277 4460870 4330973 4479800 4656041 4517006 4542463 4805520
28674D805520l0679r0732K47391J54701l4595K21933K17365n4831K12796M46478
$$ 4805520 4774841 4684109 4931500 5086201 5051606 5273539 5490904 5436073 5648869 6095347
28664F095347O2011J3708L89037K09532j8277L42039L50525j1097K76112N69848
$$ 6095347 6157358 6171066 6560103 6769635 6751358 7093397 7443922 7432825 7708937 8278785
28654H278785J71672J80158O38387L85773J37729O81468P37604J97782M43215
$$ 8278785 8450457 8630615 9269002 9654775 9792504 10473972 11211576 11409358 11852573
28645A1852573Q23113L97523M30813J059407Q46613N61362J258495J515025J105100
$$ 11852573 12675686 13073209 13504022 14563429 15410042 15971404 17229899 18744924 19850024
28636A9850024J603146K281350K161896K930833M747426N776155O970028R508560
$$ 19850024 21453170 23734520 25896416 28827249 33574675 39350830 46320858 55829418
28628E5829418J1376721J2528819J5311478J8345444J9957075K3006055K8102048
$$ 55829418 67206139 79734958 95046436 113391880 133348955 156355010 184457058
28621A84457058L2569445L8672627M8298028N5292861N7679303O0572929N4486066
$$ 184457058 217026503 255699130 303997158 359290019 416969322 477542251 532028317
28614E32028317J9547151l6118429p5196412p8504531o3059893m9455348m0077338
$$ 532028317 551575468 515457039 440260627 361756096 298696203 249240855 209163517
28607B09163517l1477400k4900979k1180975j8212283j4998160j2255318r800990
$$ 209163517 177686117 152785138 131604163 113391880 98393720 86138402 76337412
28600G6337412p069899m963485m102513l139058j541788p03008l81204R24289
$$ 76337412 69267513 64304028 60201515 57062457 55520669 54817661 54436457 55360746
28592E5360746K280044K915167M904738Q327741J0846691J3562769J8026904K1609830
$$ 55360746 57640790 60555957 65460695 73788436 84635127 98197896 116224800 137834630
28584A37834630K4280216K9712374L6020517M0037520M6104146N6071588O5602994
$$ 137834630 162114846 191827220 227847737 267885257 313989403 370060991 435663985
28577D35663985P8243433R7981838J13150364J18231996J24042094J13126212
$$ 435663985 513907418 611889256 725039620 843271616 967313710 1080439922
28571A080439922M0739223p9773471j63936010j66434070j29995796j02357852
$$ 1080439922 1121179145 1041405674 877469664 711035594 581039798 478681946
28565D78681946q2976498o3554675n0927292m4532986l7239847l0652982k6375533
$$ 478681946 395705448 332150773 281223481 236690495 199450648 168797666 142422133
28558A42422133k0506688j4435492j2145656j0945255q361032o981778o718721
$$ 142422133 121915445 107479953 95334297 84389042 76028010 69046232 62327511
28551F2327511m978498l062688k500019j393614O52746J985003L274830N672368
$$ 62327511 57349013 54286325 51786306 50392692 51045438 53030441 56305271 61977639
28543F1977639Q018992R832323J2304273J5269702J7682906K0209689K3898359
$$ 61977639 69996631 79828954 92133227 107402929 125085835 145295524 169193883
28536A69193883K8169281L2955219M0156972M9311744N6026548N9381014O1632336
$$ 169193883 197363164 230318383 270475355 319787099 375813647 435194661 496826997
28529D96826997N3303942J6952483m0051880q0558072q3108354o5998558n2350932
$$ 496826997 550130939 567083422 527031542 446473470 363365116 297366558 245015626
28522B45015626m2752946l2892555k6455168k3508670j9789972j6142424j4060815
$$ 245015626 202262680 169370125 142914957 119406287 99616315 83473891 69413076
28515F9413076j1175023p947842o948488o402139m585545l740238l998726l094019
$$ 69413076 58238053 50290211 43341723 36939584 32354039 28613801 24615075 21521056
28507B1521056k043750k254587k011765j093350j238261j561370q68153o15540
$$ 21521056 19477306 17222719 15210954 14117604 12879343 11317973 10449820 9834280
28499I834280j028076o36428j61881n72459o07707j08356l21804n75722r6607
$$ 9834280 8806204 8169776 8007895 7435436 6827729 6719373 6397569 5821847 5725240
28490E725240m6345m43868j28591J54049l28985l74024R3343j00523l59663K3499
$$ 5725240 5678895 5235027 5106436 5260485 4931500 4557476 4650819 4550296 4190633 4214132
28480D214132J8929l86426j25327J80158j59923j49479K47391j0444l36164J3707
$$ 4214132 4233061 3846635 3721308 3901466 3741543 3592064 3839455 3829011 3492847 3506554
28470C506554J23369k11489j24675K0888k22587r2690K66321j3055k81987P1150
$$ 3506554 3629923 3418434 3293759 3314647 3092060 2999370 3265691 3252636 2970649 3041799
28460C041799J40340j85380l9817J63839j25980j63839J39035J3707j89296J1749
$$ 3041799 3182139 2996759 2956942 3120781 2994801 2830962 2969997 2983704 2794408 2806157
28450B806157J3708j90602o528J19453j43604r2690J76894k2846j93866Q0288
$$ 2806157 2819865 2629263 2622735 2742188 2598584 2505894 2682788 2659942 2466076 2546364
28440B546364Q6815j64492K611J63187q7468r7912J26633l1332j74284M8956K9374
$$ 2546364 2633179 2468687 2471298 2634485 2547017 2449105 2575738 2544406 2370122 2419078 2448452
28429B448452j73631K8721J81464r7259j42299R2690K3499o5275J10967L3943
$$ 2448452 2274821 2303542 2485006 2387747 2245448 2338138 2361637 2296362 2407329 2441272
28419B441272j89297j6971J20758j14883j13578J26633J7624j45563J1750N7441
$$ 2441272 2251975 2235004 2355762 2240879 2127301 2253934 2271558 2125995 2137745 2195186
28409B195186o0052J2402J1749j57964j3708K31725O8538p7676J00523Q3551j30549
$$ 2195186 2135134 2147536 2159285 2001321 1987613 2219338 2287876 2210200 2310723 2394274 2263725
28398B263725q3552j2402j13578l7206P7024q6816j16189J29897J18147n9400
$$ 2263725 2180173 2167771 2054193 2016987 2094011 2007195 1891006 2020903 2139050 2079650
28388B079650L1332R5954o6580q3552r138p7024k611J56659j2402j67104O1359
$$ 2079650 2110982 2206936 2140356 2056804 2047666 1970642 1968031 2124690 2112288 1945184 2006543
28377B006543J42951p3760m5040Q0941p6372j04439J16842O8538r6606L3942P8983
$$ 2006543 2149494 2075734 2030694 2111635 2035263 1930824 2047666 2116204 2019598 2053540 2132523
28366B132523j09662m3734J31202j305q7468N8747J5666j07703K4151Q7468m3734
$$ 2132523 2022861 1979127 2110329 2109024 2021556 2080303 2095969 1988266 2012417 2099885 2056151
28355B056151L917P6371q5510j01828O9844k611r2037J25327J95171l2637o9844
$$ 2056151 2060068 2136439 2050929 1949101 2018945 2016334 1924297 2049624 2244795 2212158 2142314
28344B142314J958j17494j05092R3995M9609n9400P7677R5953q7468n0914M6998
$$ 2142314 2144272 2026778 1921686 2015681 2065290 2005890 2083567 2179520 2092052 2041138 2088136
28333B088136q2246p3108J17495L9164j16188J305L7859j09008k3499J14883l7206
$$ 2088136 2005890 1932782 2050277 2089441 1973253 1974558 2012417 1903409 1879910 1994793 1957587
28322A957587j08356N8094O1358m3734N875n875q1593N0261J03134j23369j35771
$$ 1957587 1849231 1907325 1968683 1924949 1930824 1924949 1843356 1893617 1996751 1873382 1737611
28311A737611J06398Q8773m1776M6345K2847j48827j3055J98435M6998r2037M3081
$$ 1737611 1844009 1932782 1891006 1937351 1960198 1811371 1798316 1996751 2043749 1951712 1994793
28300A994793N2220o9191n875N4831l9818l7206K9373k4804k2846O0705J958n4178
$$ 1994793 2047013 1977822 1971947 2026778 1986960 1949754 1979127 1954323 1931477 1992182 1994140 1939962
28288A939962L8513L1331n6789K7416R5301l6554r9218o0705r3343k4151J34465
$$ 1939962 1978475 2009806 1953017 1980433 2075734 2039180 1939962 1879257 1785914 1761763 1896228
28277A896228K8721j35771J4360J25981m5693o6580O8539l7207j29244P0497J35771
$$ 1896228 1924949 1789178 1803538 1929519 1883826 1817246 1885785 1848578 1719334 1789831 1925602
28266A925602m3081l7860P3108q486n8747L4596K4804k8721J5013j9582r1384
$$ 1925602 1882521 1844661 1917769 1909283 1850536 1885132 1909936 1881215 1896228 1876646 1785262
28255A785262L916P8330o53o528K4152n8747m4387P2455j306p5065Q6815J09661
$$ 1785262 1789178 1867508 1866855 1860327 1884479 1825732 1781345 1853800 1852494 1777429 1864244 1973905
28243A973905p9635j6971J46868j3708j52743M570L9164p7676J7624J03786m7650
$$ 1973905 1894270 1877299 2024167 2010459 1857716 1862286 1901450 1823774 1841398 1945184 1897534
28232A897534o7886N8095k6763j18147K8721P2455m4387J0444R2037j8277l3943
$$ 1897534 1829648 1887743 1860980 1742833 1771554 1844009 1799622 1810066 1902103 1883826 1849883
28221A849883Q8121M6998l8512K7415L1332m6345L917K0235j00523p0497P7677
$$ 1849883 1938004 1985002 1946490 1973905 2005237 1958892 1962809 1983044 1882521 1812024 1889701
28210A889701N1567j1749M1775k611r8564j9583L5249p5719p4413N1567N0914
$$ 1889701 1941268 1929519 1971294 1968683 1870119 1850536 1885785 1810066 1735653 1787220 1838134
28199A838134K2193O9844K0888o7885j5666L1984o527J1749j305r0732j4361J21411
$$ 1838134 1860327 1930171 1951059 1883174 1867508 1899492 1892965 1904714 1903409 1812677 1798316 1919727
28187A919727N222r9217O3316J01176q8121p3760P9635K8068k6763O2664K4804
$$ 1919727 1924949 1825732 1889048 1990224 1902103 1828343 1907978 1936046 1909283 1971947 1996751
28176A996751p1802R139L9165q0288l7207J00523M6998k2846K0888r792k6762
$$ 1996751 1924949 1934088 1973253 1892965 1855758 1956281 2003279 1980433 2001321 1991529 1964767
28165A964767Q2899K6762j74936j10314P8330L0026k0235Q9426N3525q6815k8068
$$ 1964767 2047666 2074428 1899492 1789178 1867508 1897534 1877299 1966725 2020250 1933435 1905367
28154A905367O7233K1540J1750P833j09009j11620K6763L0679o527Q8121O2010
$$ 1905367 1972600 1994140 2005890 2013723 1904714 1793094 1819857 1850536 1844009 1932130 1994140
28143A994140q4857r791J25980L264q9426M4386P0497l9817p181O1359J0444M569
$$ 1994140 1909283 1899492 2025472 2028736 1939310 1983696 2054193 2014376 2007195 2068554 2078998 2083567
28131B083567M0470j3708j7624P3761O0052k611K7416L7206L3290J57965K35641
$$ 2083567 2124037 2110329 2092705 2166466 2226518 2223907 2251323 2288529 2321819 2479784 2715425
28120B715425J48174J29244K04309K01699K44127L67497L32248K48696K93736
$$ 2715425 2863599 2992843 3197152 3398851 3642978 4010475 4342723 4591419 4885155
28111D885155J22064l20499m51700k61099k89167l98175k12796n6789j67103k07573
$$ 4885155 5007219 4686720 4235020 3973921 3684754 3286579 3073783 3016994 2849891 2642318
28101B642318j22717j33160j07703J958l0679r0079K4152P8982k0235k3499L7859
$$ 2642318 2519601 2386441 2278738 2280696 2250017 2159938 2184090 2263072 2242837 2219338 2257197
28090B257197J3055L5901Q2246l1984r0079P5066J54701P1802J11619J94519J42951
$$ 2257197 2270252 2306153 2388399 2356415 2266336 2341402 2496103 2567905 2679524 2874043 3016994
28079C016994J54049K62404K61098K81987M53659N21544M84338N99222P29118
$$ 3016994 3171043 3433447 3694545 3976532 4430191 4951735 5436073 6035295 6764413
28070F764413O77551N47001J98435m95434r74551q56404o42302o35123n16975
$$ 6764413 7441964 7988965 8187400 7691966 6717415 5861011 5218709 4583586 4066611
28061D066611l13971k87209k61751j46215j86686k74153j47521j5013l6554k8068
$$ 4066611 3752640 3465431 3203680 3057465 2870779 2596626 2449105 2434092 2397538 2369470
28051B369470j4361j00523p9635N6789K5457p7677k7415J4361k8721M1123J06397
$$ 2369470 2355109 2254586 2174951 2231740 2257197 2179520 2152105 2166466 2137745 2178868 2285265
28040B285265j6318p0497R3343J98435J54048J28591J20758J13578J93866K70237
$$ 2285265 2268947 2198450 2291793 2490228 2644276 2772867 2893625 3007203 3201069 3471306
28030C471306K62404L06791L91648L44650K10837M9609k23239m64103m47131l30943
$$ 3471306 3733710 4040501 4432149 4776799 4987636 5037245 4814006 4349903 3902772 3571829
28020C571829l13318k85903j91255j20758q4857j21411k33031j76894M6998N8747
$$ 3571829 3258511 2972608 2781353 2660595 2575738 2454327 2221296 2044402 2091400 2150147
28010B150147j24675j08356J3055k9373k8721R9217O1358o0705j958L5248p4413
$$ 2150147 2025472 1917116 1930171 1900798 1872077 1971294 2032652 1971947 1969989 2005237 1930824
27999A930824m3734O9191k1541j01828L9818J03134m570k4151J305n4831k7415
$$ 1930824 1887090 1956281 1934740 1832912 1872730 1975864 1971294 1947143 1948448 1893617 1866202
27988A866202O6580K1541n1567r139J959k0888M7650O3969l0679k9373J0444q1594
$$ 1866202 1932782 1954323 1902756 1893617 1895576 1874688 1922338 1986307 1955628 1926255 1936699 1855105
27976A855105j03786N6789J10967R791k8068m9609j12272m3082R0732N0914n0261
$$ 1855105 1751319 1808108 1919075 1928866 1900798 1851189 1738917 1695835 1786567 1837481 1787220
27965A787220k9374N222O528M1775L7860o528J306j6972p8982j3055P9635j6319
$$ 1787220 1757846 1763068 1769596 1811371 1849231 1842703 1844009 1827037 1748055 1735000 1814635 1798316
27953A798316q4204M1123P5719k0888K4804P7677n6789q6815N7442L0679q3552
$$ 1798316 1714112 1755235 1830954 1810066 1834870 1912547 1855758 1768943 1826385 1857064 1773512
27942A773512J8930J14230o527o6580J305j8277m7650J3708K611l7860M8956R6607
$$ 1773512 1792442 1906672 1900145 1833565 1834870 1816593 1768943 1782651 1785262 1747402 1796358 1892965
27930A892965%l3290o528o2664n6136N8095N6789k4805L917K6110l5249k4151
$$ 1892965 1892965 1859675 1853147 1790483 1734347 1792442 1849231 1824426 1828343 1854453 1819204 1795053
27918A795053R138m5039k1541Q8121N2220l3291L1332N0262o9191o7886N0261
$$ 1795053 1804191 1759152 1737611 1825732 1877952 1844661 1875993 1926255 1857064 1789178 1839439
27907A839439N5484J958p833n4178p5066J1750N4831R791J1749j7624j16842q2246
$$ 1839439 1894923 1896881 1889048 1834870 1759804 1771554 1826385 1836176 1847925 1830301 1713459 1631213
27895A631213L0679j5013o0705N8747P5719n5484k1540R5301K5457n9400L916
$$ 1631213 1661892 1646879 1586174 1644921 1720640 1665156 1643616 1738917 1764374 1704974 1708890
27884A708890K6110m569L9817L7860k6763L4596R8564k9373j07051J8930O8538
$$ 1708890 1735000 1730431 1770248 1808108 1781345 1815941 1914505 1885132 1778081 1797011 1865549
$$ [...]
##END=
$$
$$ end of block 1
$$
##END=
