##TITLE=	Document 14
##JCAMP-DX=	6.0	$$ MestReNova 15.0.0-34764
##DATA TYPE=	LINK
##BLOCKS=	3    
##ORIGIN=	Mestrelab Research S.L.
##OWNER=	PC
##$MNOVA/METADATA=	(DOCUMENT,BASE64)
ewogICAgIm5hbWUiOiAiRG9jdW1lbnQgMTQiLAogICAgInBhZ2VzIjogWwogICAgICAgIHsKICAgICA
gICAgICAgIml0ZW1zIjogWwogICAgICAgICAgICAgICAgIjIiLCAgICAgICAgICAgICAgICAgICAgIC
AgICAgICAgICAgICAgICAKICAgICAgICAgICAgICAgICIxIiAgICAgICAgICAgICAgICAgICAgICAgI
CAgICAgICAgICAgICAKICAgICAgICAgICAgXQogICAgICAgIH0KICAgIF0KfQo=
##TITLE=	H NMR calculated spectrum
##JCAMP-CS=	3.7	$$ MestReNova 15.0.0-34764
##BLOCK_ID=	1
##ORIGIN=	Mestrelab Research S.L.
##OWNER=	PC
##$MNOVA/METADATA=	(ITEM,BASE64)
ewogICAgImFuZ2xlIjogMCwKICAgICJwb2ludHMiOiBbCiAgICAgICAgewogICAgICAgICAgICAieCI
6IDU1NTcsCiAgICAgICAgICAgICJ5IjogNjA3MQogICAgICAgIH0sCiAgICAgICAgewogICAgICAgIC
AgICAieCI6IDYwMTguNDk2MjE3MjQ2MjkyLAogICAgICAgICAgICAieSI6IDYwNzEKICAgICAgICB9L
AogICAgICAgIHsKICAgICAgICAgICAgIngiOiA2MDE4LjQ5NjIxNzI0NjI5MiwKICAgICAgICAgICAg
InkiOiA2NDAwLjczOTIwMzcyNjIwNQogICAgICAgIH0sCiAgICAgICAgewogICAgICAgICAgICAieCI
6IDU1NTcsCiAgICAgICAgICAgICJ5IjogNjQwMC43MzkyMDM3MjYyMDUKICAgICAgICB9LAogICAgIC
AgIHsKICAgICAgICAgICAgIngiOiA1NTU3LAogICAgICAgICAgICAieSI6IDYwNzEKICAgICAgICB9C
iAgICBdLAogICAgInoiOiAxCn0K
##NAMES=	H NMR calculated spectrum
##ATOMLIST=	
$$ AN	AS	NH
	1	C	3
	2	C	2
	3	O	 
	4	P	 
	5	C	3
	6	F	 
	7	O	 
##BONDLIST=	
$$ AN1	AN2	BT
	1	2	S
	2	3	S
	3	4	S
	4	5	S
	4	6	S
	4	7	D
##MAXRASTER=	32768
##XY_RASTER=	
$$ AN	X	Y	Z
	1	5661	4108	0
	2	13427	4108	0
	3	17235	10822	0
	4	25001	10822	0
	5	25001	3056	0
	6	25001	18588	0
	7	32768	10822	0
##END=		$$ JCAMP-CS
##TITLE=	
##JCAMP-DX=	6.0	$$ MestReNova 15.0.0-34764
##DATA TYPE=	NMR SPECTRUM
##DATA CLASS=	XYDATA
##BLOCK_ID=	2
##ORIGIN=	Mnova: Peaks
##OWNER=	PC
##NUMDIM=	1
##$MNOVA/METADATA=	(ITEM,BASE64)
ewogICAgImFuZ2xlIjogMCwKICAgICJheGVzIjogewogICAgICAgICJ4IjogewogICAgICAgICAgICA
ibWF4IjogNS4wNjU5MDUwNjgyMzQ0MDQsCiAgICAgICAgICAgICJtaW4iOiAwLjk5MjA4MDgxNDY5Mz
g2NTgKICAgICAgICB9LAogICAgICAgICJ5IjogewogICAgICAgICAgICAibWF4IjogMC4xMjIxMzYyN
Tk0NTE1MDg1MiwKICAgICAgICAgICAgIm1pbiI6IC0wLjAxMTEwMzI5NjY1MjQzNjI1NgogICAgICAg
IH0KICAgIH0sCiAgICAicG9pbnRzIjogWwogICAgICAgIHsKICAgICAgICAgICAgIngiOiA1MzIxLAo
gICAgICAgICAgICAieSI6IDU4MzUKICAgICAgICB9LAogICAgICAgIHsKICAgICAgICAgICAgIngiOi
A4NzIyLAogICAgICAgICAgICAieSI6IDU4MzUKICAgICAgICB9LAogICAgICAgIHsKICAgICAgICAgI
CAgIngiOiA4NzIyLAogICAgICAgICAgICAieSI6IDgyMDgKICAgICAgICB9LAogICAgICAgIHsKICAg
ICAgICAgICAgIngiOiA1MzIxLAogICAgICAgICAgICAieSI6IDgyMDgKICAgICAgICB9LAogICAgICA
gIHsKICAgICAgICAgICAgIngiOiA1MzIxLAogICAgICAgICAgICAieSI6IDU4MzUKICAgICAgICB9Ci
AgICBdLAogICAgInoiOiAwCn0K
##.OBSERVE FREQUENCY=	500.12699922000001607
##.OBSERVE NUCLEUS=	^Unknown
##.SOLVENT NAME=	
##.PULSE SEQUENCE=	
##LONGDATE=	2025/08/25 00:38:27.000
##.ACQUISITIONMODE=	SIMULTANEOUS
##$ORIGINAL FORMAT=	MNova
##$MNOVA/SCALES_VERSION=	9
##$PARAMETER FILE=	(datafile, ASCII, c:/Users/PC/Desktop/PdfDB2025/H/01-3-0001.jdx, 0)
$$ 
##$PARAMETER FILE=	(originalData.xml, ASCII, , 0)
$$ <?xml version="1.0" encoding="UTF-8"?>
$$ <MnovaSpectrumParams>
$$     <itemId>{b7e48ed3-0fbe-4016-b6b3-79f241eef0db}</itemId>
$$     <spectrumIndex>0</spectrumIndex>
$$     <DataFileName/>
$$     <Title>
$$         <dim0>Simulated Unknown NMR Spectrum</dim0>
$$     </Title>
$$     <Comment/>
$$     <Origin>
$$         <dim0>Mnova: Spin Simulation</dim0>
$$     </Origin>
$$     <Owner/>
$$     <Site/>
$$     <Instrument/>
$$     <Author/>
$$     <Solvent/>
$$     <Temperature/>
$$     <PulseSequence/>
$$     <Experiment>
$$         <dim0>1D</dim0>
$$     </Experiment>
$$     <Probe/>
$$     <NumberofScans/>
$$     <ReceiverGain/>
$$     <RelaxationDelay/>
$$     <PulseWidth/>
$$     <PresaturationFrequency/>
$$     <AcquisitionTime/>
$$     <AcquisitionDate/>
$$     <ModificationDate/>
$$     <Class/>
$$     <Purity>
$$         <dim0>100</dim0>
$$     </Purity>
$$     <SpectrumQuality>
$$         <dim0>0</dim0>
$$     </SpectrumQuality>
$$     <Version/>
$$     <Algorithm/>
$$     <UseDB/>
$$     <GMMXCycles/>
$$     <LineWidth>
$$         <dim0>0</dim0>
$$     </LineWidth>
$$     <SpectrometerFrequency>
$$         <dim0>500.13</dim0>
$$     </SpectrometerFrequency>
$$     <SpectralWidth>
$$         <dim0>8002.08</dim0>
$$     </SpectralWidth>
$$     <LowestFrequency>
$$         <dim0>-1000.26</dim0>
$$     </LowestFrequency>
$$     <Nucleus>
$$         <dim0>Unknown</dim0>
$$     </Nucleus>
$$     <AcquiredSize/>
$$     <SpectralSize>
$$         <dim0>65536</dim0>
$$     </SpectralSize>
$$     <DigitalResolution>
$$         <dim0>0.12210205078125</dim0>
$$     </DigitalResolution>
$$     <AbsoluteReference/>
$$ </MnovaSpectrumParams>
##$PARAMETER FILE=	(parameters, ASCII, , 0)
$$ <MnovaSpectrumParams>
$$ <SpecCount>1</SpecCount>
$$ <Dimensions>1</Dimensions>
$$ <Origin>Mnova: Peaks</Origin>
$$ <Window Dim="f1">
$$ <Nucleus>Unknown</Nucleus>
$$ <Points>65536</Points>
$$ <Width>8002.07999999999993</Width>
$$ <MHz>500.126999220000016</MHz>
$$ <Hz>-1000.25999999999999</Hz>
$$ </Window>
$$ <Window Dim="f0">
$$ <Points>1</Points>
$$ </Window>
$$ </MnovaSpectrumParams>
##$PARAMETER FILE=	(title, ASCII, , 0)
$$ 
##XUNITS=	HZ
##YUNITS=	ARBITRARY UNITS
##FIRSTX=	7001.819999999999709
##LASTX=	-1000.1378979492187682
##DELTAX=	-0.12210205078124998501
##XFACTOR=	1
##YFACTOR=	5.1703752414684751078E-11
##FIRSTY=	1.137482552593382934E-09
##MINY=	0
##MAXY=	0.11103296279907226563
##NPOINTS=	65536
##XYDATA=	(X++(Y..Y))
$$ [...]
1797B177jjjjjjjjjjjjjjjjjkjjjjjjjjjjjjjjjjjjjjjjjjjjjjjjjjjjjjjjjjjjjjjjjjjj
$$ 2177 2176 2175 2174 2173 2172 2171 2170 2169 2168 2167 2166 2165 2164 2163 2162 2161 2160 2158 2157 2156 2155 2154 2153 2152 2151 2150 2149 2148 2147 2146 2145 2144 2143 2142 2141 2140 2139 2138 2137 2136 2135 2134 2133 2132 2131 2130 2129 2128 2127 2126 2125 2124 2123 2122 2121 2120 2119 2118 2117 2116 2115 2114 2113 2112 2111 2110 2109 2108
1789B108jjjjjjjjjjj%jjjjjjjjjjjjjjjjjjj%jjjjjjjjjjjjj%jjjjjjjjjjj%jjjjjjjjj%
$$ 2108 2107 2106 2105 2104 2103 2102 2101 2100 2099 2098 2097 2097 2096 2095 2094 2093 2092 2091 2090 2089 2088 2087 2086 2085 2084 2083 2082 2081 2080 2079 2078 2078 2077 2076 2075 2074 2073 2072 2071 2070 2069 2068 2067 2066 2065 2065 2064 2063 2062 2061 2060 2059 2058 2057 2056 2055 2054 2054 2053 2052 2051 2050 2049 2048 2047 2046 2045 2045
1781B045jjjjjjjj%jjjjjjjj%jjjjjjj%jjjjjj%jjjjjj%jjjjjj%jjjjj%jjjjj%jjjjj%jjj
$$ 2045 2044 2043 2042 2041 2040 2039 2038 2037 2037 2036 2035 2034 2033 2032 2031 2030 2029 2029 2028 2027 2026 2025 2024 2023 2022 2022 2021 2020 2019 2018 2017 2016 2016 2015 2014 2013 2012 2011 2010 2010 2009 2008 2007 2006 2005 2004 2004 2003 2002 2001 2000 1999 1999 1998 1997 1996 1995 1994 1994 1993 1992 1991 1990 1989 1989 1988 1987 1986
1772A986jj%jjjj%jjjjj%jjjj%jjjj%jjjj%jjjj%jjj%jjjj%jjj%jjjj%jjj%jjjj%jjj%jjj
$$ 1986 1985 1984 1984 1983 1982 1981 1980 1980 1979 1978 1977 1976 1975 1975 1974 1973 1972 1971 1971 1970 1969 1968 1967 1967 1966 1965 1964 1963 1963 1962 1961 1960 1959 1959 1958 1957 1956 1956 1955 1954 1953 1952 1952 1951 1950 1949 1949 1948 1947 1946 1945 1945 1944 1943 1942 1942 1941 1940 1939 1938 1938 1937 1936 1935 1935 1934 1933 1932
1764A932%jjj%jjj%jjj%jjj%jjj%jj%jjj%jjj%jjj%jj%jjj%jj%jjj%jj%jjj%jj%jj%jjj%j
$$ 1932 1932 1931 1930 1929 1929 1928 1927 1926 1926 1925 1924 1923 1923 1922 1921 1920 1920 1919 1918 1917 1917 1916 1915 1915 1914 1913 1912 1912 1911 1910 1909 1909 1908 1907 1906 1906 1905 1904 1904 1903 1902 1901 1901 1900 1899 1899 1898 1897 1896 1896 1895 1894 1894 1893 1892 1891 1891 1890 1889 1889 1888 1887 1887 1886 1885 1884 1884 1883
1756A883j%jj%jjj%jj%jj%jj%jj%jj%jj%jj%jj%jj%jj%jj%jj%jj%jj%jj%jj%jj%j%jj%jj%
$$ 1883 1882 1882 1881 1880 1880 1879 1878 1877 1877 1876 1875 1875 1874 1873 1873 1872 1871 1871 1870 1869 1869 1868 1867 1867 1866 1865 1865 1864 1863 1863 1862 1861 1861 1860 1859 1859 1858 1857 1857 1856 1855 1855 1854 1853 1853 1852 1851 1851 1850 1849 1849 1848 1847 1847 1846 1845 1845 1844 1843 1843 1842 1842 1841 1840 1840 1839 1838 1838
1748A838jj%jj%j%jj%jj%j%jj%jj%j%jj%jj%j%jj%j%jj%j%jj%j%jj%j%jj%j%jj%j%jj%j%j
$$ 1838 1837 1836 1836 1835 1834 1834 1833 1833 1832 1831 1831 1830 1829 1829 1828 1828 1827 1826 1826 1825 1824 1824 1823 1823 1822 1821 1821 1820 1819 1819 1818 1818 1817 1816 1816 1815 1815 1814 1813 1813 1812 1812 1811 1810 1810 1809 1809 1808 1807 1807 1806 1806 1805 1804 1804 1803 1803 1802 1801 1801 1800 1800 1799 1798 1798 1797 1797 1796
1739A796j%j%j%jj%j%jj%j%j%jj%j%j%jj%j%j%jj%j%j%j%jj%j%j%j%jj%j%j%j%j%jj%j%j%
$$ 1796 1795 1795 1794 1794 1793 1793 1792 1791 1791 1790 1790 1789 1788 1788 1787 1787 1786 1786 1785 1784 1784 1783 1783 1782 1782 1781 1780 1780 1779 1779 1778 1778 1777 1776 1776 1775 1775 1774 1774 1773 1773 1772 1771 1771 1770 1770 1769 1769 1768 1768 1767 1766 1766 1765 1765 1764 1764 1763 1763 1762 1762 1761 1760 1760 1759 1759 1758 1758
1731A758j%j%j%j%jj%j%j%j%j%j%j%j%j%jj%j%j%j%j%j%j%j%j%j%j%j%j%j%j%j%j%j%j%j%
$$ 1758 1757 1757 1756 1756 1755 1755 1754 1754 1753 1752 1752 1751 1751 1750 1750 1749 1749 1748 1748 1747 1747 1746 1746 1745 1745 1744 1744 1743 1742 1742 1741 1741 1740 1740 1739 1739 1738 1738 1737 1737 1736 1736 1735 1735 1734 1734 1733 1733 1732 1732 1731 1731 1730 1730 1729 1729 1728 1728 1727 1727 1726 1726 1725 1725 1724 1724 1723 1723
1723A723j%j%j%j%j%j%j%j%j%%j%j%j%j%j%j%j%j%j%j%%j%j%j%j%j%j%%j%j%j%j%j%j%%j%
$$ 1723 1722 1722 1721 1721 1720 1720 1719 1719 1718 1718 1717 1717 1716 1716 1715 1715 1714 1714 1714 1713 1713 1712 1712 1711 1711 1710 1710 1709 1709 1708 1708 1707 1707 1706 1706 1705 1705 1704 1704 1704 1703 1703 1702 1702 1701 1701 1700 1700 1699 1699 1698 1698 1698 1697 1697 1696 1696 1695 1695 1694 1694 1693 1693 1692 1692 1692 1691 1691
1714A691j%j%j%%j%j%j%j%%j%j%j%j%%j%j%j%%j%j%j%%j%j%j%%j%j%j%%j%j%%j%j%j%%j%j
$$ 1691 1690 1690 1689 1689 1688 1688 1688 1687 1687 1686 1686 1685 1685 1684 1684 1684 1683 1683 1682 1682 1681 1681 1680 1680 1680 1679 1679 1678 1678 1677 1677 1677 1676 1676 1675 1675 1674 1674 1674 1673 1673 1672 1672 1671 1671 1671 1670 1670 1669 1669 1668 1668 1668 1667 1667 1666 1666 1666 1665 1665 1664 1664 1663 1663 1663 1662 1662 1661
1706A661%%j%j%%j%j%%j%j%j%%j%j%%j%j%%j%%j%j%%j%j%%j%j%%j%%j%j%%j%j%%j%%j%j%%
$$ 1661 1661 1661 1660 1660 1659 1659 1659 1658 1658 1657 1657 1657 1656 1656 1655 1655 1654 1654 1654 1653 1653 1652 1652 1652 1651 1651 1650 1650 1650 1649 1649 1649 1648 1648 1647 1647 1647 1646 1646 1645 1645 1645 1644 1644 1643 1643 1643 1642 1642 1642 1641 1641 1640 1640 1640 1639 1639 1638 1638 1638 1637 1637 1637 1636 1636 1635 1635 1635
1698A635j%%j%j%%j%%j%%j%j%%j%%j%%j%j%%j%%j%%j%%j%j%%j%%j%%j%%j%%j%%j%%j%j%%j
$$ 1635 1634 1634 1634 1633 1633 1632 1632 1632 1631 1631 1631 1630 1630 1630 1629 1629 1628 1628 1628 1627 1627 1627 1626 1626 1626 1625 1625 1624 1624 1624 1623 1623 1623 1622 1622 1622 1621 1621 1621 1620 1620 1619 1619 1619 1618 1618 1618 1617 1617 1617 1616 1616 1616 1615 1615 1615 1614 1614 1614 1613 1613 1613 1612 1612 1611 1611 1611 1610
1689A610%%j%%j%%j%%j%%j%%j%%j%%j%%j%%j%%%j%%j%%j%%j%%j%%j%%j%%%j%%j%%j%%j%%%
$$ 1610 1610 1610 1609 1609 1609 1608 1608 1608 1607 1607 1607 1606 1606 1606 1605 1605 1605 1604 1604 1604 1603 1603 1603 1602 1602 1602 1601 1601 1601 1600 1600 1600 1600 1599 1599 1599 1598 1598 1598 1597 1597 1597 1596 1596 1596 1595 1595 1595 1594 1594 1594 1593 1593 1593 1593 1592 1592 1592 1591 1591 1591 1590 1590 1590 1589 1589 1589 1589
1681A589j%%j%%j%%j%%%j%%j%%j%%%j%%j%%%j%%j%%j%%%j%%j%%%j%%j%%%j%%%j%%j%%%j%%
$$ 1589 1588 1588 1588 1587 1587 1587 1586 1586 1586 1585 1585 1585 1585 1584 1584 1584 1583 1583 1583 1582 1582 1582 1582 1581 1581 1581 1580 1580 1580 1580 1579 1579 1579 1578 1578 1578 1577 1577 1577 1577 1576 1576 1576 1575 1575 1575 1575 1574 1574 1574 1573 1573 1573 1573 1572 1572 1572 1572 1571 1571 1571 1570 1570 1570 1570 1569 1569 1569
1673A569j%%%j%%%j%%j%%%j%%%j%%%j%%j%%%j%%%j%%%j%%%j%%%j%%%j%%%j%%%j%%%j%%%j%
$$ 1569 1568 1568 1568 1568 1567 1567 1567 1567 1566 1566 1566 1565 1565 1565 1565 1564 1564 1564 1564 1563 1563 1563 1563 1562 1562 1562 1561 1561 1561 1561 1560 1560 1560 1560 1559 1559 1559 1559 1558 1558 1558 1558 1557 1557 1557 1557 1556 1556 1556 1556 1555 1555 1555 1555 1554 1554 1554 1554 1553 1553 1553 1553 1552 1552 1552 1552 1551 1551
1664A551%%j%%%j%%%j%%%j%%%j%%%j%%%%j%%%j%%%j%%%%j%%%j%%%j%%%%j%%%j%%%%j%%%j%
$$ 1551 1551 1551 1550 1550 1550 1550 1549 1549 1549 1549 1548 1548 1548 1548 1547 1547 1547 1547 1546 1546 1546 1546 1545 1545 1545 1545 1545 1544 1544 1544 1544 1543 1543 1543 1543 1542 1542 1542 1542 1542 1541 1541 1541 1541 1540 1540 1540 1540 1539 1539 1539 1539 1539 1538 1538 1538 1538 1537 1537 1537 1537 1537 1536 1536 1536 1536 1535 1535
1656A535%%%j%%%%j%%%j%%%%j%%%%j%%%%j%%%j%%%%j%%%%j%%%%j%%%%j%%%%j%%%%%j%%%%j
$$ 1535 1535 1535 1535 1534 1534 1534 1534 1534 1533 1533 1533 1533 1532 1532 1532 1532 1532 1531 1531 1531 1531 1531 1530 1530 1530 1530 1530 1529 1529 1529 1529 1528 1528 1528 1528 1528 1527 1527 1527 1527 1527 1526 1526 1526 1526 1526 1525 1525 1525 1525 1525 1524 1524 1524 1524 1524 1523 1523 1523 1523 1523 1523 1522 1522 1522 1522 1522 1521
1648A521%%%%j%%%%j%%%%%j%%%%j%%%%%j%%%%j%%%%%j%%%%j%%%%%j%%%%%j%%%%%j%%%%%j%
$$ 1521 1521 1521 1521 1521 1520 1520 1520 1520 1520 1519 1519 1519 1519 1519 1519 1518 1518 1518 1518 1518 1517 1517 1517 1517 1517 1517 1516 1516 1516 1516 1516 1515 1515 1515 1515 1515 1515 1514 1514 1514 1514 1514 1513 1513 1513 1513 1513 1513 1512 1512 1512 1512 1512 1512 1511 1511 1511 1511 1511 1511 1510 1510 1510 1510 1510 1510 1509 1509
1640A509%%%%j%%%%%j%%%%%j%%%%%%j%%%%%j%%%%%%j%%%%%j%%%%%%j%%%%%%j%%%%%%j%%%%
$$ 1509 1509 1509 1509 1509 1508 1508 1508 1508 1508 1508 1507 1507 1507 1507 1507 1507 1506 1506 1506 1506 1506 1506 1506 1505 1505 1505 1505 1505 1505 1504 1504 1504 1504 1504 1504 1504 1503 1503 1503 1503 1503 1503 1502 1502 1502 1502 1502 1502 1502 1501 1501 1501 1501 1501 1501 1501 1500 1500 1500 1500 1500 1500 1500 1499 1499 1499 1499 1499
1631A499%%j%%%%%%j%%%%%%j%%%%%%%j%%%%%%%j%%%%%%j%%%%%%%j%%%%%%%j%%%%%%%%j%%%
$$ 1499 1499 1499 1498 1498 1498 1498 1498 1498 1498 1497 1497 1497 1497 1497 1497 1497 1496 1496 1496 1496 1496 1496 1496 1496 1495 1495 1495 1495 1495 1495 1495 1495 1494 1494 1494 1494 1494 1494 1494 1493 1493 1493 1493 1493 1493 1493 1493 1492 1492 1492 1492 1492 1492 1492 1492 1491 1491 1491 1491 1491 1491 1491 1491 1491 1490 1490 1490 1490
1623A490%%%%j%%%%%%%%j%%%%%%%%j%%%%%%%%j%%%%%%%%%j%%%%%%%%%j%%%%%%%%%j%%%%%%
$$ 1490 1490 1490 1490 1490 1489 1489 1489 1489 1489 1489 1489 1489 1489 1488 1488 1488 1488 1488 1488 1488 1488 1488 1487 1487 1487 1487 1487 1487 1487 1487 1487 1486 1486 1486 1486 1486 1486 1486 1486 1486 1486 1485 1485 1485 1485 1485 1485 1485 1485 1485 1485 1484 1484 1484 1484 1484 1484 1484 1484 1484 1484 1483 1483 1483 1483 1483 1483 1483
1615A483%%%j%%%%%%%%%%j%%%%%%%%%%%j%%%%%%%%%%%j%%%%%%%%%%%j%%%%%%%%%%%%j%%%%
$$ 1483 1483 1483 1483 1482 1482 1482 1482 1482 1482 1482 1482 1482 1482 1482 1481 1481 1481 1481 1481 1481 1481 1481 1481 1481 1481 1481 1480 1480 1480 1480 1480 1480 1480 1480 1480 1480 1480 1480 1479 1479 1479 1479 1479 1479 1479 1479 1479 1479 1479 1479 1478 1478 1478 1478 1478 1478 1478 1478 1478 1478 1478 1478 1478 1477 1477 1477 1477 1477
1606A477%%%%%%%%%j%%%%%%%%%%%%%%j%%%%%%%%%%%%%%%%j%%%%%%%%%%%%%%%%j%%%%%%%%%
$$ 1477 1477 1477 1477 1477 1477 1477 1477 1477 1477 1476 1476 1476 1476 1476 1476 1476 1476 1476 1476 1476 1476 1476 1476 1476 1475 1475 1475 1475 1475 1475 1475 1475 1475 1475 1475 1475 1475 1475 1475 1475 1475 1474 1474 1474 1474 1474 1474 1474 1474 1474 1474 1474 1474 1474 1474 1474 1474 1474 1473 1473 1473 1473 1473 1473 1473 1473 1473 1473
1598A473%%%%%%%%%%j%%%%%%%%%%%%%%%%%%%%%%j%%%%%%%%%%%%%%%%%%%%%%%%%%j%%%%%%%
$$ 1473 1473 1473 1473 1473 1473 1473 1473 1473 1473 1473 1472 1472 1472 1472 1472 1472 1472 1472 1472 1472 1472 1472 1472 1472 1472 1472 1472 1472 1472 1472 1472 1472 1472 1471 1471 1471 1471 1471 1471 1471 1471 1471 1471 1471 1471 1471 1471 1471 1471 1471 1471 1471 1471 1471 1471 1471 1471 1471 1471 1471 1470 1470 1470 1470 1470 1470 1470 1470
1590A470%%%%%%%%%%%%%%%%%%%%%%%%%%%%%%j%%%%%%%%%%%%%%%%%%%%%%%%%%%%%%%%%%%%%
$$ 1470 1470 1470 1470 1470 1470 1470 1470 1470 1470 1470 1470 1470 1470 1470 1470 1470 1470 1470 1470 1470 1470 1470 1470 1470 1470 1470 1470 1470 1470 1470 1469 1469 1469 1469 1469 1469 1469 1469 1469 1469 1469 1469 1469 1469 1469 1469 1469 1469 1469 1469 1469 1469 1469 1469 1469 1469 1469 1469 1469 1469 1469 1469 1469 1469 1469 1469 1469 1469
1581A469%%%%%%%%%%%%%%%%%%%%%%%%%%%%%%%%%%%%%%%%%%%%%%%%%%%%%%%%%%%%%%%%%%%%
$$ 1469 1469 1469 1469 1469 1469 1469 1469 1469 1469 1469 1469 1469 1469 1469 1469 1469 1469 1469 1469 1469 1469 1469 1469 1469 1469 1469 1469 1469 1469 1469 1469 1469 1469 1469 1469 1469 1469 1469 1469 1469 1469 1469 1469 1469 1469 1469 1469 1469 1469 1469 1469 1469 1469 1469 1469 1469 1469 1469 1469 1469 1469 1469 1469 1469 1469 1469 1469 1469
1573A469%%%%%%%%%%%%%%%%%%%%%%%%%%%%%%%%J%%%%%%%%%%%%%%%%%%%%%%%%%%%%%%%%%%%
$$ 1469 1469 1469 1469 1469 1469 1469 1469 1469 1469 1469 1469 1469 1469 1469 1469 1469 1469 1469 1469 1469 1469 1469 1469 1469 1469 1469 1469 1469 1469 1469 1469 1469 1470 1470 1470 1470 1470 1470 1470 1470 1470 1470 1470 1470 1470 1470 1470 1470 1470 1470 1470 1470 1470 1470 1470 1470 1470 1470 1470 1470 1470 1470 1470 1470 1470 1470 1470 1470
1565A470%%%J%%%%%%%%%%%%%%%%%%%%%%%%%%%J%%%%%%%%%%%%%%%%%%%%%%J%%%%%%%%%%%%%
$$ 1470 1470 1470 1470 1471 1471 1471 1471 1471 1471 1471 1471 1471 1471 1471 1471 1471 1471 1471 1471 1471 1471 1471 1471 1471 1471 1471 1471 1471 1471 1471 1471 1472 1472 1472 1472 1472 1472 1472 1472 1472 1472 1472 1472 1472 1472 1472 1472 1472 1472 1472 1472 1472 1472 1472 1473 1473 1473 1473 1473 1473 1473 1473 1473 1473 1473 1473 1473 1473
1557A473%%%%%%J%%%%%%%%%%%%%%%%%%J%%%%%%%%%%%%%%%J%%%%%%%%%%%%%%%J%%%%%%%%%%
$$ 1473 1473 1473 1473 1473 1473 1473 1474 1474 1474 1474 1474 1474 1474 1474 1474 1474 1474 1474 1474 1474 1474 1474 1474 1474 1474 1475 1475 1475 1475 1475 1475 1475 1475 1475 1475 1475 1475 1475 1475 1475 1475 1476 1476 1476 1476 1476 1476 1476 1476 1476 1476 1476 1476 1476 1476 1476 1476 1477 1477 1477 1477 1477 1477 1477 1477 1477 1477 1477
1548A477%%%%J%%%%%%%%%%%%J%%%%%%%%%%%%J%%%%%%%%%%%%J%%%%%%%%%%%J%%%%%%%%%%J%
$$ 1477 1477 1477 1477 1477 1478 1478 1478 1478 1478 1478 1478 1478 1478 1478 1478 1478 1478 1479 1479 1479 1479 1479 1479 1479 1479 1479 1479 1479 1479 1479 1480 1480 1480 1480 1480 1480 1480 1480 1480 1480 1480 1480 1480 1481 1481 1481 1481 1481 1481 1481 1481 1481 1481 1481 1481 1482 1482 1482 1482 1482 1482 1482 1482 1482 1482 1482 1483 1483
1540A483%%%%%%%%%%J%%%%%%%%%J%%%%%%%%%%J%%%%%%%%%J%%%%%%%%%J%%%%%%%%J%%%%%%%
$$ 1483 1483 1483 1483 1483 1483 1483 1483 1483 1483 1483 1484 1484 1484 1484 1484 1484 1484 1484 1484 1484 1485 1485 1485 1485 1485 1485 1485 1485 1485 1485 1485 1486 1486 1486 1486 1486 1486 1486 1486 1486 1486 1487 1487 1487 1487 1487 1487 1487 1487 1487 1487 1488 1488 1488 1488 1488 1488 1488 1488 1488 1489 1489 1489 1489 1489 1489 1489 1489
1532A489%%J%%%%%%%%J%%%%%%%%J%%%%%%%J%%%%%%%%J%%%%%%%J%%%%%%%J%%%%%%%J%%%%%%
$$ 1489 1489 1489 1490 1490 1490 1490 1490 1490 1490 1490 1490 1491 1491 1491 1491 1491 1491 1491 1491 1491 1492 1492 1492 1492 1492 1492 1492 1492 1493 1493 1493 1493 1493 1493 1493 1493 1493 1494 1494 1494 1494 1494 1494 1494 1494 1495 1495 1495 1495 1495 1495 1495 1495 1496 1496 1496 1496 1496 1496 1496 1496 1497 1497 1497 1497 1497 1497 1497
1523A497%J%%%%%%%J%%%%%%%J%%%%%%J%%%%%%%J%%%%%%J%%%%%%J%%%%%%J%%%%%%J%%%%%%J
$$ 1497 1497 1498 1498 1498 1498 1498 1498 1498 1498 1499 1499 1499 1499 1499 1499 1499 1499 1500 1500 1500 1500 1500 1500 1500 1501 1501 1501 1501 1501 1501 1501 1501 1502 1502 1502 1502 1502 1502 1502 1503 1503 1503 1503 1503 1503 1503 1504 1504 1504 1504 1504 1504 1504 1505 1505 1505 1505 1505 1505 1505 1506 1506 1506 1506 1506 1506 1506 1507
1515A507%%%%%%J%%%%%%J%%%%%J%%%%%%J%%%%%J%%%%%%J%%%%%J%%%%%J%%%%%J%%%%%%J%%%
$$ 1507 1507 1507 1507 1507 1507 1507 1508 1508 1508 1508 1508 1508 1508 1509 1509 1509 1509 1509 1509 1510 1510 1510 1510 1510 1510 1510 1511 1511 1511 1511 1511 1511 1512 1512 1512 1512 1512 1512 1512 1513 1513 1513 1513 1513 1513 1514 1514 1514 1514 1514 1514 1515 1515 1515 1515 1515 1515 1516 1516 1516 1516 1516 1516 1516 1517 1517 1517 1517
1507A517%%J%%%%%J%%%%J%%%%%J%%%%%J%%%%%J%%%%%J%%%%J%%%%%J%%%%J%%%%%J%%%%J%%%
$$ 1517 1517 1517 1518 1518 1518 1518 1518 1518 1519 1519 1519 1519 1519 1520 1520 1520 1520 1520 1520 1521 1521 1521 1521 1521 1521 1522 1522 1522 1522 1522 1522 1523 1523 1523 1523 1523 1523 1524 1524 1524 1524 1524 1525 1525 1525 1525 1525 1525 1526 1526 1526 1526 1526 1527 1527 1527 1527 1527 1527 1528 1528 1528 1528 1528 1529 1529 1529 1529
1498A529%%J%%%%J%%%%J%%%%%J%%%%J%%%%J%%%%J%%%%J%%%%J%%%%J%%%%J%%%%J%%%%J%%%%
$$ 1529 1529 1529 1530 1530 1530 1530 1530 1531 1531 1531 1531 1531 1532 1532 1532 1532 1532 1532 1533 1533 1533 1533 1533 1534 1534 1534 1534 1534 1535 1535 1535 1535 1535 1536 1536 1536 1536 1536 1537 1537 1537 1537 1537 1538 1538 1538 1538 1538 1539 1539 1539 1539 1539 1540 1540 1540 1540 1540 1541 1541 1541 1541 1541 1542 1542 1542 1542 1542
1490A542J%%%%J%%%%J%%%%J%%%J%%%%J%%%%J%%%%J%%%J%%%%J%%%J%%%%J%%%J%%%%J%%%J%%
$$ 1542 1543 1543 1543 1543 1543 1544 1544 1544 1544 1544 1545 1545 1545 1545 1545 1546 1546 1546 1546 1547 1547 1547 1547 1547 1548 1548 1548 1548 1548 1549 1549 1549 1549 1549 1550 1550 1550 1550 1551 1551 1551 1551 1551 1552 1552 1552 1552 1553 1553 1553 1553 1553 1554 1554 1554 1554 1555 1555 1555 1555 1555 1556 1556 1556 1556 1557 1557 1557
1482A557%%J%%%J%%%%J%%%J%%%J%%%%J%%%J%%%J%%%%J%%%J%%%J%%%J%%%J%%%J%%%%J%%%J%
$$ 1557 1557 1557 1558 1558 1558 1558 1559 1559 1559 1559 1559 1560 1560 1560 1560 1561 1561 1561 1561 1562 1562 1562 1562 1562 1563 1563 1563 1563 1564 1564 1564 1564 1565 1565 1565 1565 1565 1566 1566 1566 1566 1567 1567 1567 1567 1568 1568 1568 1568 1569 1569 1569 1569 1570 1570 1570 1570 1571 1571 1571 1571 1571 1572 1572 1572 1572 1573 1573
1474A573%%J%%%J%%%J%%%J%%%J%%%J%%%J%%%J%%%J%%%J%%J%%%J%%%J%%%J%%%J%%%J%%J%%%
$$ 1573 1573 1573 1574 1574 1574 1574 1575 1575 1575 1575 1576 1576 1576 1576 1577 1577 1577 1577 1578 1578 1578 1578 1579 1579 1579 1579 1580 1580 1580 1580 1581 1581 1581 1581 1582 1582 1582 1582 1583 1583 1583 1584 1584 1584 1584 1585 1585 1585 1585 1586 1586 1586 1586 1587 1587 1587 1587 1588 1588 1588 1588 1589 1589 1589 1590 1590 1590 1590
1465A590J%%%J%%%J%%J%%%J%%%J%%J%%%J%%%J%%J%%%J%%J%%%J%%%J%%J%%%J%%J%%%J%%J%%
$$ 1590 1591 1591 1591 1591 1592 1592 1592 1592 1593 1593 1593 1594 1594 1594 1594 1595 1595 1595 1595 1596 1596 1596 1597 1597 1597 1597 1598 1598 1598 1598 1599 1599 1599 1600 1600 1600 1600 1601 1601 1601 1602 1602 1602 1602 1603 1603 1603 1603 1604 1604 1604 1605 1605 1605 1605 1606 1606 1606 1607 1607 1607 1607 1608 1608 1608 1609 1609 1609
1457A609%J%%J%%%J%%J%%J%%%J%%J%%%J%%J%%J%%%J%%J%%J%%%J%%J%%J%%%J%%J%%J%%J%%%
$$ 1609 1609 1610 1610 1610 1611 1611 1611 1611 1612 1612 1612 1613 1613 1613 1614 1614 1614 1614 1615 1615 1615 1616 1616 1616 1616 1617 1617 1617 1618 1618 1618 1619 1619 1619 1619 1620 1620 1620 1621 1621 1621 1622 1622 1622 1622 1623 1623 1623 1624 1624 1624 1625 1625 1625 1625 1626 1626 1626 1627 1627 1627 1628 1628 1628 1629 1629 1629 1629
1449A629J%%J%%J%%J%%J%%%J%%J%%J%%J%%J%%J%%%J%%J%%J%%J%%J%%J%%J%%J%%J%%J%%J%%
$$ 1629 1630 1630 1630 1631 1631 1631 1632 1632 1632 1633 1633 1633 1634 1634 1634 1634 1635 1635 1635 1636 1636 1636 1637 1637 1637 1638 1638 1638 1639 1639 1639 1640 1640 1640 1640 1641 1641 1641 1642 1642 1642 1643 1643 1643 1644 1644 1644 1645 1645 1645 1646 1646 1646 1647 1647 1647 1648 1648 1648 1649 1649 1649 1650 1650 1650 1651 1651 1651
1440A651J%%J%%J%%J%%J%%J%%J%%J%%J%%J%%J%%J%%J%%J%%J%J%%J%%J%%J%%J%%J%%J%J%%J
$$ 1651 1652 1652 1652 1653 1653 1653 1654 1654 1654 1655 1655 1655 1656 1656 1656 1657 1657 1657 1658 1658 1658 1659 1659 1659 1660 1660 1660 1661 1661 1661 1662 1662 1662 1663 1663 1663 1664 1664 1664 1665 1665 1665 1666 1666 1667 1667 1667 1668 1668 1668 1669 1669 1669 1670 1670 1670 1671 1671 1671 1672 1672 1672 1673 1673 1674 1674 1674 1675
1432A675%%J%%J%%J%J%%J%%J%%J%%J%J%%J%%J%J%%J%%J%%J%J%%J%%J%J%%J%%J%J%%J%%J%J
$$ 1675 1675 1675 1676 1676 1676 1677 1677 1677 1678 1678 1679 1679 1679 1680 1680 1680 1681 1681 1681 1682 1682 1682 1683 1683 1684 1684 1684 1685 1685 1685 1686 1686 1687 1687 1687 1688 1688 1688 1689 1689 1689 1690 1690 1691 1691 1691 1692 1692 1692 1693 1693 1694 1694 1694 1695 1695 1695 1696 1696 1697 1697 1697 1698 1698 1698 1699 1699 1700
1424A700%%J%%J%J%%J%J%%J%%J%J%%J%J%%J%%J%J%%J%J%%J%J%%J%J%%J%J%%J%J%%J%J%%J%
$$ 1700 1700 1700 1701 1701 1701 1702 1702 1703 1703 1703 1704 1704 1705 1705 1705 1706 1706 1706 1707 1707 1708 1708 1708 1709 1709 1710 1710 1710 1711 1711 1711 1712 1712 1713 1713 1713 1714 1714 1715 1715 1715 1716 1716 1717 1717 1717 1718 1718 1719 1719 1719 1720 1720 1721 1721 1721 1722 1722 1723 1723 1723 1724 1724 1725 1725 1725 1726 1726
1415A726J%%J%J%%J%J%%J%J%%J%J%J%%J%J%%J%J%J%%J%J%%J%J%J%%J%J%J%%J%J%%J%J%J%%
$$ 1726 1727 1727 1727 1728 1728 1729 1729 1729 1730 1730 1731 1731 1731 1732 1732 1733 1733 1733 1734 1734 1735 1735 1736 1736 1736 1737 1737 1738 1738 1738 1739 1739 1740 1740 1741 1741 1741 1742 1742 1743 1743 1743 1744 1744 1745 1745 1746 1746 1746 1747 1747 1748 1748 1749 1749 1749 1750 1750 1751 1751 1751 1752 1752 1753 1753 1754 1754 1754
1407A754J%J%J%%J%J%J%J%%J%J%J%%J%J%J%J%%J%J%J%J%%J%J%J%J%%J%J%J%J%%J%J%J%J%J
$$ 1754 1755 1755 1756 1756 1757 1757 1757 1758 1758 1759 1759 1760 1760 1761 1761 1761 1762 1762 1763 1763 1764 1764 1764 1765 1765 1766 1766 1767 1767 1768 1768 1768 1769 1769 1770 1770 1771 1771 1772 1772 1772 1773 1773 1774 1774 1775 1775 1776 1776 1776 1777 1777 1778 1778 1779 1779 1780 1780 1780 1781 1781 1782 1782 1783 1783 1784 1784 1785
1399A785%%J%J%J%J%J%J%%J%J%J%J%J%J%J%%J%J%J%J%J%J%J%J%%J%J%J%J%J%J%J%J%J%J%J
$$ 1785 1785 1785 1786 1786 1787 1787 1788 1788 1789 1789 1790 1790 1791 1791 1791 1792 1792 1793 1793 1794 1794 1795 1795 1796 1796 1797 1797 1798 1798 1798 1799 1799 1800 1800 1801 1801 1802 1802 1803 1803 1804 1804 1805 1805 1806 1806 1806 1807 1807 1808 1808 1809 1809 1810 1810 1811 1811 1812 1812 1813 1813 1814 1814 1815 1815 1816 1816 1817
1390A817%%J%J%J%J%J%J%J%J%J%J%J%J%J%J%J%J%J%J%J%J%J%J%J%J%J%J%J%J%J%J%J%J%J%
$$ 1817 1817 1817 1818 1818 1819 1819 1820 1820 1821 1821 1822 1822 1823 1823 1824 1824 1825 1825 1826 1826 1827 1827 1828 1828 1829 1829 1830 1830 1831 1831 1832 1832 1833 1833 1834 1834 1835 1835 1836 1836 1837 1837 1838 1838 1839 1839 1840 1840 1841 1841 1842 1842 1843 1843 1844 1844 1845 1845 1846 1846 1847 1847 1848 1848 1849 1849 1850 1850
1382A850J%J%J%JJ%J%J%J%J%J%J%J%J%J%J%JJ%J%J%J%J%J%J%J%JJ%J%J%J%J%J%JJ%J%J%J%
$$ 1850 1851 1851 1852 1852 1853 1853 1854 1855 1855 1856 1856 1857 1857 1858 1858 1859 1859 1860 1860 1861 1861 1862 1862 1863 1863 1864 1864 1865 1865 1866 1867 1867 1868 1868 1869 1869 1870 1870 1871 1871 1872 1872 1873 1873 1874 1874 1875 1876 1876 1877 1877 1878 1878 1879 1879 1880 1880 1881 1881 1882 1883 1883 1884 1884 1885 1885 1886 1886
1374A886J%J%JJ%J%J%J%JJ%J%J%J%J%JJ%J%J%J%JJ%J%J%JJ%J%J%J%JJ%J%J%JJ%J%J%JJ%J%
$$ 1886 1887 1887 1888 1888 1889 1890 1890 1891 1891 1892 1892 1893 1893 1894 1895 1895 1896 1896 1897 1897 1898 1898 1899 1899 1900 1901 1901 1902 1902 1903 1903 1904 1904 1905 1906 1906 1907 1907 1908 1908 1909 1910 1910 1911 1911 1912 1912 1913 1913 1914 1915 1915 1916 1916 1917 1917 1918 1919 1919 1920 1920 1921 1921 1922 1923 1923 1924 1924
1366A924J%JJ%J%JJ%J%J%JJ%J%JJ%J%J%JJ%J%JJ%J%JJ%J%J%JJ%J%JJ%J%JJ%J%JJ%JJ%J%JJ
$$ 1924 1925 1925 1926 1927 1927 1928 1928 1929 1930 1930 1931 1931 1932 1932 1933 1934 1934 1935 1935 1936 1937 1937 1938 1938 1939 1939 1940 1941 1941 1942 1942 1943 1944 1944 1945 1945 1946 1947 1947 1948 1948 1949 1949 1950 1951 1951 1952 1952 1953 1954 1954 1955 1955 1956 1957 1957 1958 1958 1959 1960 1960 1961 1962 1962 1963 1963 1964 1965
1357A965%J%JJ%J%JJ%J%JJ%JJ%J%JJ%JJ%J%JJ%JJ%J%JJ%JJ%J%JJ%JJ%JJ%J%JJ%JJ%JJ%J%J
$$ 1965 1965 1966 1966 1967 1968 1968 1969 1969 1970 1971 1971 1972 1972 1973 1974 1974 1975 1976 1976 1977 1977 1978 1979 1979 1980 1981 1981 1982 1982 1983 1984 1984 1985 1986 1986 1987 1987 1988 1989 1989 1990 1991 1991 1992 1992 1993 1994 1994 1995 1996 1996 1997 1998 1998 1999 1999 2000 2001 2001 2002 2003 2003 2004 2005 2005 2006 2006 2007
1349B007J%JJ%JJ%JJ%JJ%J%JJ%JJ%JJ%JJ%JJ%JJ%JJ%JJ%JJ%JJ%JJ%JJ%JJ%JJ%JJ%JJ%JJ%J
$$ 2007 2008 2008 2009 2010 2010 2011 2012 2012 2013 2014 2014 2015 2016 2016 2017 2017 2018 2019 2019 2020 2021 2021 2022 2023 2023 2024 2025 2025 2026 2027 2027 2028 2029 2029 2030 2031 2031 2032 2033 2033 2034 2035 2035 2036 2037 2037 2038 2039 2039 2040 2041 2041 2042 2043 2043 2044 2045 2045 2046 2047 2047 2048 2049 2049 2050 2051 2051 2052
1341B052J%JJJ%JJ%JJ%JJ%JJ%JJJ%JJ%JJ%JJ%JJJ%JJ%JJ%JJJ%JJ%JJJ%JJ%JJJ%JJ%JJJ%JJ
$$ 2052 2053 2053 2054 2055 2056 2056 2057 2058 2058 2059 2060 2060 2061 2062 2062 2063 2064 2064 2065 2066 2067 2067 2068 2069 2069 2070 2071 2071 2072 2073 2073 2074 2075 2076 2076 2077 2078 2078 2079 2080 2080 2081 2082 2083 2083 2084 2085 2085 2086 2087 2088 2088 2089 2090 2090 2091 2092 2093 2093 2094 2095 2095 2096 2097 2098 2098 2099 2100
1332B100%JJJ%JJ%JJJ%JJJ%JJ%JJJ%JJJ%JJJ%JJ%JJJ%JJJ%JJJ%JJJ%JJJ%JJJ%JJJ%JJJ%JJ
$$ 2100 2100 2101 2102 2103 2103 2104 2105 2105 2106 2107 2108 2108 2109 2110 2111 2111 2112 2113 2113 2114 2115 2116 2116 2117 2118 2119 2119 2120 2121 2122 2122 2123 2124 2124 2125 2126 2127 2127 2128 2129 2130 2130 2131 2132 2133 2133 2134 2135 2136 2136 2137 2138 2139 2139 2140 2141 2142 2142 2143 2144 2145 2145 2146 2147 2148 2148 2149 2150
1324B150JJ%JJJ%JJJ%JJJ%JJJJ%JJJ%JJJJ%JJJ%JJJJ%JJJ%JJJJ%JJJJ%JJJJ%JJJJ%JJJJ%J
$$ 2150 2151 2152 2152 2153 2154 2155 2155 2156 2157 2158 2158 2159 2160 2161 2161 2162 2163 2164 2165 2165 2166 2167 2168 2168 2169 2170 2171 2172 2172 2173 2174 2175 2175 2176 2177 2178 2179 2179 2180 2181 2182 2182 2183 2184 2185 2186 2186 2187 2188 2189 2190 2190 2191 2192 2193 2194 2194 2195 2196 2197 2198 2198 2199 2200 2201 2202 2202 2203
1316B203JJJ%JJJJ%JJJJJ%JJJJ%JJJJ%JJJJJ%JJJJJ%JJJJJ%JJJJJ%JJJJJ%JJJJJ%JJJJJJ%
$$ 2203 2204 2205 2206 2206 2207 2208 2209 2210 2210 2211 2212 2213 2214 2215 2215 2216 2217 2218 2219 2219 2220 2221 2222 2223 2223 2224 2225 2226 2227 2228 2228 2229 2230 2231 2232 2233 2233 2234 2235 2236 2237 2238 2238 2239 2240 2241 2242 2243 2243 2244 2245 2246 2247 2248 2248 2249 2250 2251 2252 2253 2253 2254 2255 2256 2257 2258 2259 2259
1307B259JJJJJJ%JJJJJJ%JJJJJJ%JJJJJJJ%JJJJJJJ%JJJJJJJ%JJJJJJJJ%JJJJJJJJ%JJJJJ
$$ 2259 2260 2261 2262 2263 2264 2265 2265 2266 2267 2268 2269 2270 2271 2271 2272 2273 2274 2275 2276 2277 2277 2278 2279 2280 2281 2282 2283 2284 2284 2285 2286 2287 2288 2289 2290 2291 2291 2292 2293 2294 2295 2296 2297 2298 2298 2299 2300 2301 2302 2303 2304 2305 2306 2306 2307 2308 2309 2310 2311 2312 2313 2314 2314 2315 2316 2317 2318 2319
1299B319JJJJ%JJJJJJJJJ%JJJJJJJJJJJ%JJJJJJJJJJJJ%JJJJJJJJJJJJJJJ%JJJJJJJJJJJJ
$$ 2319 2320 2321 2322 2323 2323 2324 2325 2326 2327 2328 2329 2330 2331 2332 2332 2333 2334 2335 2336 2337 2338 2339 2340 2341 2342 2343 2343 2344 2345 2346 2347 2348 2349 2350 2351 2352 2353 2354 2355 2355 2356 2357 2358 2359 2360 2361 2362 2363 2364 2365 2366 2367 2368 2369 2370 2370 2371 2372 2373 2374 2375 2376 2377 2378 2379 2380 2381 2382
1291B382JJJJJJJ%JJJJJJJJJJJJJJJJJJJJJJJJJJJJJJJJJJJ%JJJJJJJJJJJJJJJJJJJJJJJJ
$$ 2382 2383 2384 2385 2386 2387 2388 2389 2389 2390 2391 2392 2393 2394 2395 2396 2397 2398 2399 2400 2401 2402 2403 2404 2405 2406 2407 2408 2409 2410 2411 2412 2413 2414 2415 2416 2417 2418 2419 2420 2421 2422 2423 2424 2424 2425 2426 2427 2428 2429 2430 2431 2432 2433 2434 2435 2436 2437 2438 2439 2440 2441 2442 2443 2444 2445 2446 2447 2448
1283B448JJJJJJJKJJJJJJJJJJJJJJJJJJJJJJJJJJJJJJJJJJKJJJJJJJJJJJJJJJJJJKJJJJJJ
$$ 2448 2449 2450 2451 2452 2453 2454 2455 2457 2458 2459 2460 2461 2462 2463 2464 2465 2466 2467 2468 2469 2470 2471 2472 2473 2474 2475 2476 2477 2478 2479 2480 2481 2482 2483 2484 2485 2486 2487 2488 2489 2490 2491 2493 2494 2495 2496 2497 2498 2499 2500 2501 2502 2503 2504 2505 2506 2507 2508 2509 2510 2511 2513 2514 2515 2516 2517 2518 2519
1274B519JJJJJJJJKJJJJJJJJJJJKJJJJJJJJJJKJJJJJJJJJKJJJJJJJJKJJJJJJJJKJJJJJJJK
$$ 2519 2520 2521 2522 2523 2524 2525 2526 2527 2529 2530 2531 2532 2533 2534 2535 2536 2537 2538 2539 2540 2542 2543 2544 2545 2546 2547 2548 2549 2550 2551 2552 2554 2555 2556 2557 2558 2559 2560 2561 2562 2563 2565 2566 2567 2568 2569 2570 2571 2572 2573 2575 2576 2577 2578 2579 2580 2581 2582 2583 2585 2586 2587 2588 2589 2590 2591 2592 2594
1266B594JJJJJJKJJJJJJKJJJJJJKJJJJJJKJJJJJKJJJJJKJJJJJKJJJJKJJJJJKJJJJKJJJJKJ
$$ 2594 2595 2596 2597 2598 2599 2600 2602 2603 2604 2605 2606 2607 2608 2610 2611 2612 2613 2614 2615 2616 2618 2619 2620 2621 2622 2623 2624 2626 2627 2628 2629 2630 2631 2633 2634 2635 2636 2637 2638 2640 2641 2642 2643 2644 2645 2647 2648 2649 2650 2651 2653 2654 2655 2656 2657 2658 2660 2661 2662 2663 2664 2666 2667 2668 2669 2670 2672 2673
1258B673JJJKJJJJKJJJJKJJJJKJJJKJJJJKJJJKJJJKJJJKJJJJKJJJKJJJKJJJKJJKJJJKJJJK
$$ 2673 2674 2675 2676 2678 2679 2680 2681 2682 2684 2685 2686 2687 2688 2690 2691 2692 2693 2694 2696 2697 2698 2699 2701 2702 2703 2704 2705 2707 2708 2709 2710 2712 2713 2714 2715 2717 2718 2719 2720 2722 2723 2724 2725 2726 2728 2729 2730 2731 2733 2734 2735 2736 2738 2739 2740 2741 2743 2744 2745 2747 2748 2749 2750 2752 2753 2754 2755 2757
1249B757JJJKJJKJJJKJJKJJJKJJKJJKJJJKJJKJJKJJJKJJKJJKJJKJJKJJKJJKJJKJJKJJKJJK
$$ 2757 2758 2759 2760 2762 2763 2764 2766 2767 2768 2769 2771 2772 2773 2775 2776 2777 2778 2780 2781 2782 2784 2785 2786 2788 2789 2790 2791 2793 2794 2795 2797 2798 2799 2801 2802 2803 2804 2806 2807 2808 2810 2811 2812 2814 2815 2816 2818 2819 2820 2822 2823 2824 2826 2827 2828 2830 2831 2832 2834 2835 2836 2838 2839 2840 2842 2843 2844 2846
1241B846JJKJKJJKJJKJJKJJKJKJJKJJKJKJJKJKJJKJKJJKJJKJKJKJJKJKJJKJKJJKJKJKJJKJ
$$ 2846 2847 2848 2850 2851 2853 2854 2855 2857 2858 2859 2861 2862 2863 2865 2866 2867 2869 2870 2872 2873 2874 2876 2877 2878 2880 2881 2883 2884 2885 2887 2888 2890 2891 2892 2894 2895 2897 2898 2899 2901 2902 2903 2905 2906 2908 2909 2911 2912 2913 2915 2916 2918 2919 2920 2922 2923 2925 2926 2927 2929 2930 2932 2933 2935 2936 2937 2939 2940
1233B940KJKJKJJKJKJKJKJJKJKJKJKJKJKJJKJKJKJKJKJKJKJKJKJKJKJKJKJKJKJKJKJKJKJK
$$ 2940 2942 2943 2945 2946 2948 2949 2950 2952 2953 2955 2956 2958 2959 2961 2962 2963 2965 2966 2968 2969 2971 2972 2974 2975 2977 2978 2980 2981 2982 2984 2985 2987 2988 2990 2991 2993 2994 2996 2997 2999 3000 3002 3003 3005 3006 3008 3009 3011 3012 3014 3015 3017 3018 3020 3021 3023 3024 3026 3027 3029 3030 3032 3033 3035 3036 3038 3039 3041
1224C041JKJKKJKJKJKJKJKJKKJKJKJKJKKJKJKJKKJKJKJKKJKJKKJKJKJKKJKKJKJKKJKJKKJK
$$ 3041 3042 3044 3045 3047 3049 3050 3052 3053 3055 3056 3058 3059 3061 3062 3064 3065 3067 3069 3070 3072 3073 3075 3076 3078 3079 3081 3083 3084 3086 3087 3089 3090 3092 3094 3095 3097 3098 3100 3101 3103 3105 3106 3108 3109 3111 3113 3114 3116 3117 3119 3120 3122 3124 3125 3127 3129 3130 3132 3133 3135 3137 3138 3140 3141 3143 3145 3146 3148
1216C148JKKJKKJKKJKJKKJKKJKKJKKJKKJKKJKKJKKJKKJKKJKKJKKKJKKJKKJKKKJKKJKKKJKK
$$ 3148 3149 3151 3153 3154 3156 3158 3159 3161 3163 3164 3166 3167 3169 3171 3172 3174 3176 3177 3179 3181 3182 3184 3186 3187 3189 3191 3192 3194 3196 3197 3199 3201 3202 3204 3206 3207 3209 3211 3212 3214 3216 3217 3219 3221 3222 3224 3226 3228 3229 3231 3233 3234 3236 3238 3239 3241 3243 3245 3246 3248 3250 3251 3253 3255 3257 3258 3260 3262
1208C262KJKKJKKKJKKKJKKKJKKKJKKKKJKKKJKKKKJKKKKJKKKJKKKKKJKKKKJKKKKKJKKKKKJK
$$ 3262 3264 3265 3267 3269 3270 3272 3274 3276 3277 3279 3281 3283 3284 3286 3288 3290 3291 3293 3295 3297 3298 3300 3302 3304 3306 3307 3309 3311 3313 3314 3316 3318 3320 3322 3323 3325 3327 3329 3331 3332 3334 3336 3338 3339 3341 3343 3345 3347 3349 3350 3352 3354 3356 3358 3359 3361 3363 3365 3367 3369 3370 3372 3374 3376 3378 3380 3381 3383
1200C383KKKKKJKKKKKKJKKKKKKKJKKKKKKKKJKKKKKKKKKJKKKKKKKKKKKKKKJKKKKKKKKKKKKK
$$ 3383 3385 3387 3389 3391 3393 3394 3396 3398 3400 3402 3404 3406 3407 3409 3411 3413 3415 3417 3419 3421 3422 3424 3426 3428 3430 3432 3434 3436 3438 3439 3441 3443 3445 3447 3449 3451 3453 3455 3457 3458 3460 3462 3464 3466 3468 3470 3472 3474 3476 3478 3480 3482 3484 3486 3487 3489 3491 3493 3495 3497 3499 3501 3503 3505 3507 3509 3511 3513
1191C513KKKKKKKKKKKKKKKKKKKKKKKKKKKKKKKKKKKKKKKKKKKKLKKKKKKKKKKKKKLKKKKKKKKK
$$ 3513 3515 3517 3519 3521 3523 3525 3527 3529 3531 3533 3535 3537 3539 3541 3543 3545 3547 3549 3551 3553 3555 3557 3559 3561 3563 3565 3567 3569 3571 3573 3575 3577 3579 3581 3583 3585 3587 3589 3591 3593 3595 3597 3599 3601 3604 3606 3608 3610 3612 3614 3616 3618 3620 3622 3624 3626 3628 3630 3633 3635 3637 3639 3641 3643 3645 3647 3649 3651
1183C651LKKKKKKKKLKKKKKKLKKKKKKLKKKKKLKKKKKLKKKKLKKKKLKKKKLKKKLKKKKLKKKLKKKL
$$ 3651 3654 3656 3658 3660 3662 3664 3666 3668 3670 3673 3675 3677 3679 3681 3683 3685 3688 3690 3692 3694 3696 3698 3700 3703 3705 3707 3709 3711 3713 3716 3718 3720 3722 3724 3726 3729 3731 3733 3735 3737 3740 3742 3744 3746 3748 3751 3753 3755 3757 3759 3762 3764 3766 3768 3771 3773 3775 3777 3779 3782 3784 3786 3788 3791 3793 3795 3797 3800
1175C800KKKLKKLKKKLKKLKKKLKKLKKKLKKLKKLKKLKKLKKLKKLKLKKLKKLKLKKLKKLKLKKLKLKL
$$ 3800 3802 3804 3806 3809 3811 3813 3816 3818 3820 3822 3825 3827 3829 3832 3834 3836 3838 3841 3843 3845 3848 3850 3852 3854 3857 3859 3861 3864 3866 3868 3871 3873 3875 3878 3880 3882 3885 3887 3889 3892 3894 3896 3899 3901 3904 3906 3908 3911 3913 3915 3918 3920 3923 3925 3927 3930 3932 3934 3937 3939 3942 3944 3946 3949 3951 3954 3956 3959
1166C959KKLKLKLKKLKLKLKLKKLKLKLKLKLKLKLKLKLKLKLKLKLKLLKLKLKLKLKLLKLKLKLLKLKL
$$ 3959 3961 3963 3966 3968 3971 3973 3976 3978 3980 3983 3985 3988 3990 3993 3995 3998 4000 4002 4005 4007 4010 4012 4015 4017 4020 4022 4025 4027 4030 4032 4035 4037 4040 4042 4045 4047 4050 4052 4055 4057 4060 4062 4065 4067 4070 4073 4075 4078 4080 4083 4085 4088 4090 4093 4095 4098 4101 4103 4106 4108 4111 4113 4116 4119 4121 4124 4126 4129
1158D129LKLKLLKLKLLKLLKLLKLLKLKLLKLLLKLLKLLKLLKLLLKLLKLLLKLLLKLLLKLLLLKLLLKL
$$ 4129 4132 4134 4137 4139 4142 4145 4147 4150 4152 4155 4158 4160 4163 4166 4168 4171 4174 4176 4179 4182 4184 4187 4189 4192 4195 4197 4200 4203 4206 4208 4211 4214 4216 4219 4222 4224 4227 4230 4232 4235 4238 4241 4243 4246 4249 4251 4254 4257 4260 4262 4265 4268 4271 4273 4276 4279 4282 4284 4287 4290 4293 4296 4298 4301 4304 4307 4309 4312
1150D312LLLKLLLLKLLLLLKLLLLLLKLLLLLLLKLLLLLLLLLKLLLLLLLLLLLLLLLLLLLLKLLLLLLL
$$ 4312 4315 4318 4321 4323 4326 4329 4332 4335 4337 4340 4343 4346 4349 4352 4354 4357 4360 4363 4366 4369 4372 4374 4377 4380 4383 4386 4389 4392 4395 4397 4400 4403 4406 4409 4412 4415 4418 4421 4424 4426 4429 4432 4435 4438 4441 4444 4447 4450 4453 4456 4459 4462 4465 4468 4471 4474 4477 4480 4483 4486 4488 4491 4494 4497 4500 4503 4506 4509
1141D509LMLLLLLLLLLLLLLLLLLLLMLLLLLLLLLMLLLLLLMLLLLLLMLLLLMLLLLMLLLLMLLLMLLL
$$ 4509 4512 4516 4519 4522 4525 4528 4531 4534 4537 4540 4543 4546 4549 4552 4555 4558 4561 4564 4567 4570 4573 4577 4580 4583 4586 4589 4592 4595 4598 4601 4604 4608 4611 4614 4617 4620 4623 4626 4630 4633 4636 4639 4642 4645 4648 4652 4655 4658 4661 4664 4668 4671 4674 4677 4680 4684 4687 4690 4693 4696 4700 4703 4706 4709 4713 4716 4719 4722
1133D722MLLLMLLLMLLMLLLMLLMLLMLLMLLMLLMLMLLMLMLLMLMLLMLMLMLLMLMLMLMLMLMLMLML
$$ 4722 4726 4729 4732 4735 4739 4742 4745 4748 4752 4755 4758 4762 4765 4768 4771 4775 4778 4781 4785 4788 4791 4795 4798 4801 4805 4808 4811 4815 4818 4821 4825 4828 4832 4835 4838 4842 4845 4849 4852 4855 4859 4862 4866 4869 4872 4876 4879 4883 4886 4890 4893 4896 4900 4903 4907 4910 4914 4917 4921 4924 4928 4931 4935 4938 4942 4945 4949 4952
1125D952MLMLMLMLMMLMLMLMMLMLMMLMLMMLMMLMMLMLMMMLMMLMMLMMMLMMLMMMMLMMMLMMMMLM
$$ 4952 4956 4959 4963 4966 4970 4973 4977 4980 4984 4988 4991 4995 4998 5002 5005 5009 5013 5016 5020 5023 5027 5031 5034 5038 5041 5045 5049 5052 5056 5060 5063 5067 5071 5074 5078 5081 5085 5089 5093 5096 5100 5104 5107 5111 5115 5118 5122 5126 5130 5133 5137 5141 5144 5148 5152 5156 5160 5163 5167 5171 5175 5178 5182 5186 5190 5194 5197 5201
1117E201MMMLMMMMMMLMMMMMMMLMMMMMMMMMMMMMMLMMMMMMMMMMMMNMMMMMMMMMMMMMNMMMMMMM
$$ 5201 5205 5209 5213 5216 5220 5224 5228 5232 5236 5240 5243 5247 5251 5255 5259 5263 5267 5271 5274 5278 5282 5286 5290 5294 5298 5302 5306 5310 5314 5318 5322 5326 5330 5333 5337 5341 5345 5349 5353 5357 5361 5365 5369 5373 5377 5381 5386 5390 5394 5398 5402 5406 5410 5414 5418 5422 5426 5430 5434 5438 5443 5447 5451 5455 5459 5463 5467 5471
1108E471NMMMMMNMMMMMNMMMNMMMNMMMNMMMNMMNMMNMMNMMNMMNMMNMNMMNMNMNMNMMNMNMNMNM
$$ 5471 5476 5480 5484 5488 5492 5496 5501 5505 5509 5513 5517 5521 5526 5530 5534 5538 5543 5547 5551 5555 5560 5564 5568 5572 5577 5581 5585 5589 5594 5598 5602 5607 5611 5615 5620 5624 5628 5633 5637 5641 5646 5650 5654 5659 5663 5667 5672 5676 5681 5685 5689 5694 5698 5703 5707 5712 5716 5721 5725 5729 5734 5738 5743 5747 5752 5756 5761 5765
1100E765NMNMNNMNMNMNMNNMNMNNMNNMNNMNNMNNMNNNMNNMNNNNMNNNMNNNNNMNNNNNNMNNNNNN
$$ 5765 5770 5774 5779 5783 5788 5793 5797 5802 5806 5811 5815 5820 5824 5829 5834 5838 5843 5847 5852 5857 5861 5866 5871 5875 5880 5885 5889 5894 5899 5903 5908 5913 5917 5922 5927 5932 5936 5941 5946 5950 5955 5960 5965 5970 5974 5979 5984 5989 5993 5998 6003 6008 6013 6018 6022 6027 6032 6037 6042 6047 6052 6056 6061 6066 6071 6076 6081 6086
1092F086NNNNNNNNNMNNNONNNNNNNNNNNNNNONNNNNNONNNNNONNNONNNONNNONNONNONNONNONN
$$ 6086 6091 6096 6101 6106 6111 6116 6121 6126 6131 6135 6140 6145 6150 6156 6161 6166 6171 6176 6181 6186 6191 6196 6201 6206 6211 6216 6221 6226 6232 6237 6242 6247 6252 6257 6262 6268 6273 6278 6283 6288 6293 6299 6304 6309 6314 6320 6325 6330 6335 6341 6346 6351 6356 6362 6367 6372 6378 6383 6388 6394 6399 6404 6410 6415 6420 6426 6431 6436
1083F436ONONONNONONONONONONONONOONONOONOONONOOONOONOOONOOONOOOONOOOOONOOOOOO
$$ 6436 6442 6447 6453 6458 6464 6469 6474 6480 6485 6491 6496 6502 6507 6513 6518 6524 6529 6535 6540 6546 6551 6557 6562 6568 6574 6579 6585 6590 6596 6602 6607 6613 6619 6624 6630 6635 6641 6647 6653 6658 6664 6670 6675 6681 6687 6693 6698 6704 6710 6716 6721 6727 6733 6739 6745 6750 6756 6762 6768 6774 6780 6785 6791 6797 6803 6809 6815 6821
1075F821OOOOOOOOOOOOOOOOOOOOOOOOPOOOOOPOOOOPOOOPOOPOOOPOOPOPOOPOPOOPOPOPOPOP
$$ 6821 6827 6833 6839 6845 6851 6857 6863 6869 6875 6881 6887 6893 6899 6905 6911 6917 6923 6929 6935 6941 6947 6953 6959 6965 6972 6978 6984 6990 6996 7002 7009 7015 7021 7027 7033 7040 7046 7052 7058 7065 7071 7077 7084 7090 7096 7102 7109 7115 7121 7128 7134 7141 7147 7153 7160 7166 7173 7179 7185 7192 7198 7205 7211 7218 7224 7231 7237 7244
1067G244OPOPPOPOPPOPOPPOPPPOPPOPPPPOPPPPOPPPPPPPPPPOPPPPPPPQPPPPPPPPPQPPPPPQ
$$ 7244 7250 7257 7263 7270 7277 7283 7290 7296 7303 7310 7316 7323 7329 7336 7343 7349 7356 7363 7370 7376 7383 7390 7396 7403 7410 7417 7424 7430 7437 7444 7451 7458 7464 7471 7478 7485 7492 7499 7506 7513 7520 7527 7534 7540 7547 7554 7561 7568 7575 7582 7589 7597 7604 7611 7618 7625 7632 7639 7646 7653 7660 7668 7675 7682 7689 7696 7703 7711
1058G711PPPQPPPQPPQPPQPQPPQPQPQPQPQPQPQPQPQQPQQPQQPQQQPQQQPQQQQQPQQQQQQQQQQQ
$$ 7711 7718 7725 7732 7740 7747 7754 7761 7769 7776 7783 7791 7798 7805 7813 7820 7828 7835 7842 7850 7857 7865 7872 7880 7887 7895 7902 7910 7917 7925 7932 7940 7947 7955 7962 7970 7978 7985 7993 8001 8008 8016 8024 8031 8039 8047 8055 8062 8070 8078 8086 8093 8101 8109 8117 8125 8133 8140 8148 8156 8164 8172 8180 8188 8196 8204 8212 8220 8228
1050H228QQQQQQQQQRQQQQQRQQQRQQQRQQRQQRQRQRQQRQRRQRQRQRRQRRQRRQRRRQRRRRQRRRRR
$$ 8228 8236 8244 8252 8260 8268 8276 8284 8292 8300 8309 8317 8325 8333 8341 8349 8358 8366 8374 8382 8391 8399 8407 8415 8424 8432 8440 8449 8457 8465 8474 8482 8491 8499 8508 8516 8524 8533 8541 8550 8559 8567 8576 8584 8593 8601 8610 8619 8627 8636 8645 8653 8662 8671 8679 8688 8697 8706 8714 8723 8732 8741 8750 8758 8767 8776 8785 8794 8803
1042H803RRRRRRRRRRRRRRJ0RRRRRJ0RRRJ0RRJ0RRJ0RJ0RJ0RRJ0RJ0J0RJ0RJ0J0RJ0RJ0J0J0
$$ 8803 8812 8821 8830 8839 8848 8857 8866 8875 8884 8893 8902 8911 8920 8929 8939 8948 8957 8966 8975 8984 8994 9003 9012 9021 9031 9040 9049 9059 9068 9077 9087 9096 9106 9115 9125 9134 9143 9153 9162 9172 9182 9191 9201 9210 9220 9230 9239 9249 9258 9268 9278 9288
1035I288RJ0J0J0RJ0J0J0J0J0J0J0RJ0J0J0J0J0J0J0J1J0J0J0J0J0J0J1J0J0J0J0J1J0J0J1
$$ 9288 9297 9307 9317 9327 9336 9346 9356 9366 9376 9386 9396 9406 9415 9425 9435 9445 9455 9465 9475 9485 9496 9506 9516 9526 9536 9546 9556 9567 9577 9587 9597 9607 9618 9628 9638 9649
1031I649J0J0J1J0J1J0J1J0J1J0J1J0J1J0J1J0J1J1J0J1J1J1J0J1J1J1J1J0J1J1J1J1J1J1
$$ 9649 9659 9669 9680 9690 9701 9711 9722 9732 9743 9753 9764 9774 9785 9795 9806 9816 9827 9838 9848 9859 9870 9881 9891 9902 9913 9924 9935 9945 9956 9967 9978 9989 10000 10011
1027A0011J1J1J1J1J1J1J1J1J1J2J1J1J1J1J2J1J1J1J2J1J2J1J1J2J1J2J1J2J1J2J1J2J2J1
$$ 10011 10022 10033 10044 10055 10066 10077 10088 10099 10110 10122 10133 10144 10155 10166 10178 10189 10200 10211 10223 10234 10246 10257 10268 10280 10291 10303 10314 10326 10337 10349 10360 10372 10384 10395
1023A0395J2J2J1J2J2J2J1J2J2J2J2J2J1J2J2J2J2J2J2J2J3J2J2J2J2J2J3J2J2J2J3J2J2J3
$$ 10395 10407 10419 10430 10442 10454 10466 10477 10489 10501 10513 10525 10537 10548 10560 10572 10584 10596 10608 10620 10632 10645 10657 10669 10681 10693 10705 10718 10730 10742 10754 10767 10779 10791 10804
1019A0804J2J3J2J3J2J3J2J3J2J3J2J3J3J2J3J3J3J3J2J3J3J3J3J3J3J3J3J3J3J3J3J3J3J4
$$ 10804 10816 10829 10841 10854 10866 10879 10891 10904 10916 10929 10941 10954 10967 10979 10992 11005 11018 11031 11043 11056 11069 11082 11095 11108 11121 11134 11147 11160 11173 11186 11199 11212 11225 11239
1014A1239J3J3J3J4J3J3J4J3J3J4J3J4J3J4J3J4J4J3J4J4J3J4J4J4J3J4J4J4J4J4J4J4J4J4
$$ 11239 11252 11265 11278 11292 11305 11318 11332 11345 11358 11372 11385 11399 11412 11426 11439 11453 11467 11480 11494 11508 11521 11535 11549 11563 11576 11590 11604 11618 11632 11646 11660 11674 11688 11702
1010A1702J4J4J4J5J4J4J4J5J4J4J5J4J4J5J4J5J4J5J5J4J5J4J5J5J5J4J5J5J5J5J5J5J5J5
$$ 11702 11716 11730 11744 11759 11773 11787 11801 11816 11830 11844 11859 11873 11887 11902 11916 11931 11945 11960 11975 11989 12004 12018 12033 12048 12063 12077 12092 12107 12122 12137 12152 12167 12182 12197
1006A2197J5J5J5J5J5J6J5J5J5J6J5J5J6J5J6J5J6J5J6J6J5J6J6J6J5J6J6J6J6J6J6J6J6J6
$$ 12197 12212 12227 12242 12257 12272 12288 12303 12318 12333 12349 12364 12379 12395 12410 12426 12441 12457 12472 12488 12504 12519 12535 12551 12567 12582 12598 12614 12630 12646 12662 12678 12694 12710 12726
1002A2726J6J6J6J7J6J6J6J7J6J7J6J6J7J7J6J7J6J7J7J6J7J7J7J7J7J7J7J7J7J7J7J7J7J8
$$ 12726 12742 12758 12774 12791 12807 12823 12839 12856 12872 12889 12905 12921 12938 12955 12971 12988 13004 13021 13038 13054 13071 13088 13105 13122 13139 13156 13173 13190 13207 13224 13241 13258 13275 13293
998A3293J7J7J8J7J7J8J7J8J7J8J8J7J8J8J8J7J8J8J8J8J8J8J8J8J9J8J8J8J9J8J8J9J8J9
$$ 13293 13310 13327 13345 13362 13379 13397 13414 13432 13449 13467 13485 13502 13520 13538 13556 13573 13591 13609 13627 13645 13663 13681 13699 13717 13736 13754 13772 13790 13809 13827 13845 13864 13882 13901
994A3901J8J9J9J8J9J9J8J9J9J9J9J9J9J9J9J9K0J9J9K0J9J9K0J9K0J9K0K0J9K0K0K0K0K0
$$ 13901 13919 13938 13957 13975 13994 14013 14031 14050 14069 14088 14107 14126 14145 14164 14183 14202 14222 14241 14260 14280 14299 14318 14338 14357 14377 14396 14416 14436 14455 14475 14495 14515 14535 14555
990A4555K0K0K0K0K0K0K0K1K0K0K1K0K1K0K1K0K1K1K1K0K1K1K1K1K1K1K1K2K1K1K2K1K1K2
$$ 14555 14575 14595 14615 14635 14655 14675 14695 14716 14736 14756 14777 14797 14818 14838 14859 14879 14900 14921 14942 14962 14983 15004 15025 15046 15067 15088 15109 15131 15152 15173 15195 15216 15237 15259
985A5259K1K2K2K1K2K2K2K2K1K2K2K3K2K2K2K2K3K2K3K2K3K2K3K2K3K3K3K3K3K3K3K3K3K3
$$ 15259 15280 15302 15324 15345 15367 15389 15411 15433 15454 15476 15498 15521 15543 15565 15587 15609 15632 15654 15677 15699 15722 15744 15767 15789 15812 15835 15858 15881 15904 15927 15950 15973 15996 16019
981A6019K4K3K3K4K3K4K3K4K4K3K4K4K4K4K4K4K4K5K4K4K5K4K5K4K5K4K5K5K5K5K5K5K5K5
$$ 16019 16043 16066 16089 16113 16136 16160 16183 16207 16231 16254 16278 16302 16326 16350 16374 16398 16422 16447 16471 16495 16520 16544 16569 16593 16618 16642 16667 16692 16717 16742 16767 16792 16817 16842
977A6842K5K6K5K5K6K5K6K5K6K6K6K6K6K6K6K6K6K6K7K6K7K6K7K6K7K7K7K7K7K7K7K7K7K7
$$ 16842 16867 16893 16918 16943 16969 16994 17020 17045 17071 17097 17123 17149 17175 17201 17227 17253 17279 17305 17332 17358 17385 17411 17438 17464 17491 17518 17545 17572 17599 17626 17653 17680 17707 17734
973A7734K8K7K8K7K8K8K8K7K8K8K8K9K8K8K8K9K8K9K9K8K9K9K9K9K9K9K9L0K9K9L0L0K9L0
$$ 17734 17762 17789 17817 17844 17872 17900 17928 17955 17983 18011 18039 18068 18096 18124 18152 18181 18209 18238 18267 18295 18324 18353 18382 18411 18440 18469 18498 18528 18557 18586 18616 18646 18675 18705
969A8705L0L0L0L0L0L0L0L1L0L1L0L1L1L0L1L1L1L2L1L1L1L2L1L2L2L2L2L1L3L2L2L2L3L2
$$ 18705 18735 18765 18795 18825 18855 18885 18915 18946 18976 19007 19037 19068 19099 19129 19160 19191 19222 19254 19285 19316 19347 19379 19410 19442 19474 19506 19538 19569 19602 19634 19666 19698 19731 19763
965A9763L3L2L3L3L3L3L3L3L3L4L3L4L3L4L4L4L4L4L4L4L4L5L4L5L5L4L5L5L5L6L5L5L6L5
$$ 19763 19796 19828 19861 19894 19927 19960 19993 20026 20059 20093 20126 20160 20193 20227 20261 20295 20329 20363 20397 20431 20465 20500 20534 20569 20604 20638 20673 20708 20743 20779 20814 20849 20885 20920
960B0920L6L6L6L5L7L6L6L6L7L6L7L7L7L7L7L7L7L7L8L7L8L8L8L8L8L8L8L9L8L9L9L9L9L9
$$ 20920 20956 20992 21028 21063 21100 21136 21172 21208 21245 21281 21318 21355 21392 21429 21466 21503 21540 21577 21615 21652 21690 21728 21766 21804 21842 21880 21918 21957 21995 22034 22073 22112 22151 22190
956B2190L9L9M0L9M0L9M0M0M0M1M0M0M1M1M0M1M1M1M2M1M1M2M2M2M2M2M2M2M3M2M3M3M3M3
$$ 22190 22229 22268 22308 22347 22387 22426 22466 22506 22546 22587 22627 22667 22708 22749 22789 22830 22871 22912 22954 22995 23036 23078 23120 23162 23204 23246 23288 23330 23373 23415 23458 23501 23544 23587
952B3587M3M3M4M3M4M4M4M4M4M5M4M5M5M4M6M5M5M5M6M6M6M6M6M6M6M7M7M6M7M7M8M7M8M7
$$ 23587 23630 23673 23717 23760 23804 23848 23892 23936 23980 24025 24069 24114 24159 24203 24249 24294 24339 24384 24430 24476 24522 24568 24614 24660 24706 24753 24800 24846 24893 24940 24988 25035 25083 25130
948B5130M8M8M8M8M9M8M9M9M9M9M9N0M9N0N0N0N0N1N0N1N1N1N1N1N2N2N1N2N3N2N2N3N3N3
$$ 25130 25178 25226 25274 25322 25371 25419 25468 25517 25566 25615 25664 25714 25763 25813 25863 25913 25963 26014 26064 26115 26166 26217 26268 26319 26371 26423 26474 26526 26579 26631 26683 26736 26789 26842
944B6842N3N3N4N3N4N4N4N5N4N5N5N5N5N5N6N6N6N6N6N6N7N7N7N7N8N7N8N8N8N8N9N9N9N9
$$ 26842 26895 26948 27002 27055 27109 27163 27217 27272 27326 27381 27436 27491 27546 27601 27657 27713 27769 27825 27881 27937 27994 28051 28108 28165 28223 28280 28338 28396 28454 28512 28571 28630 28689 28748
940B8748N9N9O0O0O0O0O1O1O1O1O1O1O2O2O2O3O2O3O3O3O3O4O4O4O4O5O4O5O6O5O6O5O6O7
$$ 28748 28807 28866 28926 28986 29046 29106 29167 29228 29289 29350 29411 29472 29534 29596 29658 29721 29783 29846 29909 29972 30035 30099 30163 30227 30291 30356 30420 30485 30551 30616 30682 30747 30813 30880
936C0880O6O7O7O7O8O7O8O8O9O8O9O9P0O9P0P0P0P1P1P1P1P2P1P3P2P2P3P3P4P3P4P4P5P5
$$ 30880 30946 31013 31080 31147 31215 31282 31350 31418 31487 31555 31624 31693 31763 31832 31902 31972 32042 32113 32184 32255 32326 32398 32469 32542 32614 32686 32759 32832 32906 32979 33053 33127 33202 33277
931C3277P5P5P5P6P6P7P6P7P7P8P7P8P9P8P9P9Q0Q0Q0Q0Q1Q1Q1Q1Q2Q2Q3Q3Q3Q3Q4Q4Q4Q5
$$ 33277 33352 33427 33502 33578 33654 33731 33807 33884 33961 34039 34116 34194 34273 34351 34430 34509 34589 34669 34749 34829 34910 34991 35072 35153 35235 35317 35400 35483 35566 35649 35733 35817 35901 35986
927C5986Q5Q5Q6Q6Q6Q7Q7Q7Q7Q8Q9Q8Q9R0Q9R0R1R0R1R2R1R3R2R3R3R4R4R4R4R6R5R6R6R6
$$ 35986 36071 36156 36242 36328 36414 36501 36588 36675 36762 36850 36939 37027 37116 37206 37295 37385 37476 37566 37657 37749 37840 37933 38025 38118 38211 38305 38399 38493 38587 38683 38778 38874 38970 39066
923C9066R7R8R7R9R8R9R9J00J00J00J01J02J01J02J03J03J03J04J04J05J05J06J06J06J07
$$ 39066 39163 39261 39358 39457 39555 39654 39753 39853 39953 40053 40154 40256 40357 40459 40562 40665 40768 40872 40976 41081 41186 41292 41398 41504 41611
920D1611J07J08J08J08J09J10J10J10J11J11J12J13J12J14J13J14J15J15J16J16J17J17J17
$$ 41611 41718 41826 41934 42042 42151 42261 42371 42481 42592 42703 42815 42928 43040 43154 43267 43381 43496 43611 43727 43843 43960 44077 44194
917D4194J18J19J19J20J20J21J21J22J22J23J23J24J24J25J26J26J26J28J27J29J28J30J30
$$ 44194 44312 44431 44550 44670 44790 44911 45032 45154 45276 45399 45522 45646 45770 45895 46021 46147 46273 46401 46528 46657 46785 46915 47045
914D7045J30J32J31J33J33J33J34J35J35J36J37J37J38J38J39J40J40J41J42J42J43J43J45
$$ 47045 47175 47307 47438 47571 47704 47837 47971 48106 48241 48377 48514 48651 48789 48927 49066 49206 49346 49487 49629 49771 49914 50057 50202
912E0202J45J45J46J47J48J48J49J50J50J51J52J53J53J54J55J55J56J57J58J58J59J60J61
$$ 50202 50347 50492 50638 50785 50933 51081 51230 51380 51530 51681 51833 51986 52139 52293 52448 52603 52759 52916 53074 53232 53391 53551 53712
909E3712J62J62J63J64J64J66J66J67J68J69J69J70J72J72J73J73J75J75J77J77J78J79J80
$$ 53712 53874 54036 54199 54363 54527 54693 54859 55026 55194 55363 55532 55702 55874 56046 56219 56392 56567 56742 56919 57096 57274 57453 57633
906E7633J81J81J83J84J84J86J86J87J88J90J90J91J92J93J95J95J96J97J98J99K01K01K02
$$ 57633 57814 57995 58178 58362 58546 58732 58918 59105 59293 59483 59673 59864 60056 60249 60444 60639 60835 61032 61230 61429 61630 61831 62033
903F2033K04K04K06K07K07K09K10K11K13K13K15K15K17K18K19K21K21K23K24K25K26K28K29
$$ 62033 62237 62441 62647 62854 63061 63270 63480 63691 63904 64117 64332 64547 64764 64982 65201 65422 65643 65866 66090 66315 66541 66769 66998
900F6998K30K32K32K34K36K36K38K40K40K42K44K44K46K48K49K50K52K53K54K56K58K59K60
$$ 66998 67228 67460 67692 67926 68162 68398 68636 68876 69116 69358 69602 69846 70092 70340 70589 70839 71091 71344 71598 71854 72112 72371 72631
898G2631K62K64K65K67K68K70K71K73K74K76K78K80K81K82K85K86K88K89K91K94K94K97K98
$$ 72631 72893 73157 73422 73689 73957 74227 74498 74771 75045 75321 75599 75879 76160 76442 76727 77013 77301 77590 77881 78175 78469 78766 79064
895G9064L01L02L04L05L08L10L11L13L16L17L19L21L24L25L27L30L31L34L35L38L40L42L45
$$ 79064 79365 79667 79971 80276 80584 80894 81205 81518 81834 82151 82470 82791 83115 83440 83767 84097 84428 84762 85097 85435 85775 86117 86462
892H6462L46L49L51L54L55L58L60L63L65L67L70L72L75L77L80L82L85L87L90L93L95L98M01
$$ 86462 86808 87157 87508 87862 88217 88575 88935 89298 89663 90030 90400 90772 91147 91524 91904 92286 92671 93058 93448 93841 94236 94634 95035
889I5035M03M06M09M12M14M18M20M23M26M30M32M35M38M41M45M47M51M54M57M60M64M67M71
$$ 95035 95438 95844 96253 96665 97079 97497 97917 98340 98766 99196 99628 100063 100501 100942 101387 101834 102285 102739 103196 103656 104120 104587 105058
886A05058M73M78M80M85M87M92M95M98N03N06N10N13N18N21N25N29N34N37N41N46N50N53N59
$$ 105058 105531 106009 106489 106974 107461 107953 108448 108946 109449 109955 110465 110978 111496 112017 112542 113071 113605 114142 114683 115229 115779 116332 116891
884A16891N62N67N71N76N80N85N89N94N99O03O08O13O18O23O28O33O38O44O48O54O60O64O70
$$ 116891 117453 118020 118591 119167 119747 120332 120921 121515 122114 122717 123325 123938 124556 125179 125807 126440 127078 127722 128370 129024 129684 130348 131018
881A31018O76O82O87O92O99P04P11P16P23P28P35P41P48P54P61P67P74P80P88P94Q02Q08Q16
$$ 131018 131694 132376 133063 133755 134454 135158 135869 136585 137308 138036 138771 139512 140260 141014 141775 142542 143316 144096 144884 145678 146480 147288 148104
878A48104Q23Q31Q38Q45Q53Q61Q69Q77Q84Q93R01R10R18R26R36R44R53R62R71R80R90J000
$$ 148104 148927 149758 150596 151441 152294 153155 154024 154901 155785 156678 157579 158489 159407 160333 161269 162213 163166 164128 165099 166079 167069 168069
875A68069J009J018J029J039J049J059J070J080J092J102J113J124J136J147J159J170J183
$$ 168069 169078 170096 171125 172164 173213 174272 175342 176422 177514 178616 179729 180853 181989 183136 184295 185465 186648
873A86648J195J207J220J233J245J259J272J285J299J313J327J342J356J370J386J401J416
$$ 186648 187843 189050 190270 191503 192748 194007 195279 196564 197863 199176 200503 201845 203201 204571 205957 207358 208774
871B08774J432J448J464J480J497J514J531J549J566J584J603J621J640J659J679J699J719
$$ 208774 210206 211654 213118 214598 216095 217609 219140 220689 222255 223839 225442 227063 228703 230362 232041 233740 235459
869B35459J739J760J782J803J824J847J870J893J916J940J965J989K014K040K066K092K119
$$ 235459 237198 238958 240740 242543 244367 246214 248084 249977 251893 253833 255798 257787 259801 261841 263907 265999 268118
867B68118K147K174K204K232K261K292K322K353K385K418K450K484K518K554K588K625K662
$$ 268118 270265 272439 274643 276875 279136 281428 283750 286103 288488 290906 293356 295840 298358 300912 303500 306125 308787
865C08787K700K738K778K817K858K900K943K985L031L075L121L169L216L266L316L367L419
$$ 308787 311487 314225 317003 319820 322678 325578 328521 331506 334537 337612 340733 343902 347118 350384 353700 357067 360486
863C60486L473L528L583L641L699L759L820L882L946M012M078M147M217M289M362M437M515
$$ 360486 363959 367487 371070 374711 378410 382169 385989 389871 393817 397829 401907 406054 410271 414560 418922 423359 427874
861D27874M593M674M757M842M929N018N110N203N300N399N500N604N710N821N933O049O167
$$ 427874 432467 437141 441898 446740 451669 456687 461797 467000 472300 477699 483199 488803 494513 500334 506267 512316 518483
859E18483O290O416O544O677O814O955P099P247P401P559P721P888Q062Q238Q423Q611Q807
$$ 518483 524773 531189 537733 544410 551224 558179 565278 572525 579926 587485 595206 603094 611156 619394 627817 636428 645235
857F45235R008R216R430R652R881J0118J0362J0616J0877J1148J1429J1719J2020J2331J2654
$$ 645235 654243 663459 672889 682541 692422 702540 712902 723518 734395 745543 756972 768691 780711 793042 805696
855H05696J2990J3337J3698J4072J4462J4865J5286J5723J6177J6650J7144J7657J8191J8750
$$ 805696 818686 832023 845721 859793 874255 889120 904406 920129 936306 952956 970100 987757 1005948 1024698
853A024698J9333J9940K0575K1239K1933K2659K3419K4215K5050K5925K6843K7808K8821K9888
$$ 1024698 1044031 1063971 1084546 1105785 1127718 1150377 1173796 1198011 1223061 1248986 1275829 1303637 1332458 1362346
851A362346L1010L2191L3437L4751L6137L7603L9153M0792M2531M4373M6328M8407N0617N2970
$$ 1362346 1393356 1425547 1458984 1493735 1529872 1567475 1606628 1647420 1689951 1734324 1780652 1829059 1879676 1932646
850A932646N5479N8155O1017O4075O7354P0869P4645P8706Q3080Q7801R2900R8421J04407
$$ 1932646 1988125 2046280 2107297 2171372 2238726 2309595 2384240 2462946 2546026 2633827 2726727 2825148 2929555
848B929555J10909J17988J25705J34141J43378J53519J64678J76988J90603K05706K22506
$$ 2929555 3040464 3158452 3284157 3418298 3561676 3715195 3879873 4056861 4247464 4453170 4675676
847D675676K41254K62245K85828L12422L42528L76757M15842M60689N12410N72386O42347
$$ 4675676 4916930 5179175 5465003 5777425 6119953 6496710 6912552 7373241 7885651 8458037 9100384
845I100384P24478Q21564R37193J076037J244257J450085J704682K023421K427878K948915
$$ 9100384 9824862 10646426 11583619 12659656 13903913 15353998 17058680 19082101 21509979 24458894
844B4458894L631697M544011N790532P538235J0063570J3843988J9744082K9410411M6120421
$$ 24458894 28090591 32634602 38425134 45963369 56026939 69870927 89615009 119025420 165145841
843A65145841P6417289J31073706K09024739K32916418J10690444q0973215k22771323k19926834
$$ 165145841 241563130 372636836 581661575 814577993 925268437 844295222 621523899 401597065
842D01597065j42518182q3052327m9619211l1266769k0736815j4357917j0294542p590381
$$ 401597065 259078883 176026556 126407345 95140576 74403761 60045844 49751302 42160921
841D2160921n721416m386274l403872k661092k084753j625954j250982r35866o62941m18652
$$ 42160921 36439505 32053231 28649359 25988267 23903514 22277560 21026578 20090712 19427771 19009119
840A9009119j92080K6158K44713M72250P18154R93383J311500J690174K153324K734470L482053
$$ 19009119 18817039 18843197 19087910 19560160 20278314 21271697 22583197 24273371 26426695 29161165 32643218
838C2643218M468216N803835P665206J0343401J4339949K0561232L0732126M8297756Q0243090
$$ 32643218 37111434 42915269 50580475 60923876 75263825 95825057 126557183 174854939 255098029
837B55098029J38681141K24905428K54001040J05099600j33147415k59308076k14174417j29547493
$$ 255098029 393779170 618684598 872685638 977785238 844637823 585329747 371155330 241607837
836B41607837p5206099m5665187k9335874j9818069j3963120j0186250p649291n885676m623239
$$ 241607837 166401738 120736551 91400677 71582608 57619488 47433238 39783947 33898271 29275032
835B9275032l696531l001260k469584k056118j729750j468673j257303j084316r41328q22074
$$ 29275032 25578501 22577241 20107657 18051539 16321789 14853116 13595813 12511497 11570169 10748095
834A0748095p21776o36777n64225n01886m47984m01104l60103l24050k92188k63889k38637
$$ 10748095 10026319 9389542 8825317 8323431 7875447 7474343 7114240 6790190 6498002 6234113 5995476
833E995476k15996j95604j77152j60383j45071j31028j18087j06108r4962q4543p4753o5504
$$ 5995476 5779480 5583876 5406724 5246341 5101270 4970242 4852155 4746047 4651085 4566542 4491789 4426285
831D426285n6720m8332m0273l2486k4917j7512j0224l003M197J1420J8718K6134L3719M1526
$$ 4426285 4369565 4321233 4280960 4248474 4223557 4206045 4195821 4192818 4197015 4208435 4227153 4253287 4287006 4328532
830D328532M9608N8028O6846P6135Q5973R6447J07655J19706J32727J46865J62283J79177
$$ 4328532 4378140 4436168 4503014 4579149 4665122 4761569 4869224 4988930 5121657 5268522 5430805 5609982
828E609982J97768K18324K41153K66624K95178L27337L63741M05158M52533N07028N70084
$$ 5609982 5807750 6026074 6267227 6533851 6829029 7156366 7520107 7925265 8377798 8884826 9454910
827I454910O43506P29573Q31194R52105J097178J272841J487667J753285K085708K507379
$$ 9454910 10098416 10827989 11659183 12611288 13708466 14981307 16468974 18222259 20307967 22815346
826B2815346L050408L761709M711632O008617P825361J0447118J4365437K0468818L0449993
$$ 22815346 25865754 29627463 34339095 40347712 48173073 58620191 72985628 93454446 123904439
824A23904439M7702978P9194122J37561690K27522561K67696864J21312803j30057666k68992911
$$ 123904439 171607417 250801539 388363229 615885790 883582654 1004895457 874837791 605844880
823F05844880k23767352j34432349p7371528m6622992k9741817j9948976j3943094j0074576
$$ 605844880 382077528 247645179 170273651 123650659 93908842 73959866 60016772 49942196
822D9942196p475667n665176m363198l399810k667922k097692j642132j268663r53972o80800
$$ 49942196 42466529 36801353 32438155 29038345 26370423 24272731 22630599 21361936 20407964 19727164
821A9727164m35839k08321J1051K30871M59778P07141R83915J303649J683991K148821K731558
$$ 19727164 19291325 19083004 19094055 19324926 19784704 20491845 21475760 22779409 24463400 26612221 29343779
820B9343779L480437M467201N801903P659194J0326807J4299263K0467998L0526178M7858221
$$ 29343779 32824216 37291417 43093320 50752514 61079321 75378584 95846582 126372760 174230981
819A74230981P9400943J37833807K28777972K72491188J23374534j39399469k74822856k22739765
$$ 174230981 253631924 391465731 620243703 892734891 1016109425 876709956 601887100 379147335
818C79147335j33067330p6880359m6609546k9927969k0215555j4243851j0392896p806902
$$ 379147335 246080005 169199646 122590100 92662131 72446576 58202725 47809829 40002927
817D0002927o009724m723661l779922l072142k531120k110583j778806j513562j298970j123486
$$ 40002927 33993203 29269542 25489620 22417478 19886358 17775775 15996969 14483407 13184437 12060951
816A2060951r78578q57852p56455o70658n97558n34882m80829m33956l93102l57326l25855
$$ 12060951 11082373 10224521 9468066 8797408 8199850 7664968 7184139 6750183 6357081 5999755 5673900
814E673900k98059k73410k51472k31879k14323j98542j84316j71457j59800j49208j39561
$$ 5673900 5375841 5102431 4850959 4619080 4404757 4206215 4021899 3850442 3690642 3541434 3401873
813C401873j30753j22694j15306j08519j02271r6511r1189q6265q1703p7466p3530o9865o6448
$$ 3401873 3271120 3148426 3033120 2924601 2822330 2725819 2634630 2548365 2466662 2389196 2315666 2245801 2179353
811B179353o3259o0278n7489n4875n2424n0122m7959m5922m4004m2195m0488l8876l7352l5909
$$ 2179353 2116094 2055816 1998327 1943452 1891028 1840906 1792947 1747025 1703021 1660826 1620338 1581462 1544110 1508201
810A508201l4542l3247l2018l0852k9744k8691k7688k6733k5825k4957k4131k3342k2587k1868
$$ 1508201 1473659 1440412 1408394 1377542 1347798 1319107 1291419 1264686 1238861 1213904 1189773 1166431 1143844 1121976
808A121976k1178k0520j9888j9284j8706j8150j7617j7107j6616j6144j5692j5256j4837j4434
$$ 1121976 1100798 1080278 1060390 1041106 1022400 1004250 986633 969526 952910 936766 921074 905818 890981 876547
806H76547j4046j3672j3312j2965j2631j2307j1997j1695j1406j1124j0854j0593j0338j0094
$$ 876547 862501 848829 835517 822552 809921 797614 785617 773922 762516 751392 740538 729945 719607 709513
805G09513r857r628r406r190q983q780q586q395q212q033p860p692p529p371p217p068o922
$$ 709513 699656 690028 680622 671432 662449 653669 645083 636688 628476 620443 612583 604891 597362 589991 582774 575706 568784
802E68784o782o644o511o381o255o132o013n897n783n673n565n461n358n260n162n068m976
$$ 568784 562002 555358 548847 542466 536211 530079 524066 518169 512386 506713 501148 495687 490329 485069 479907 474839 469863
800D69863m886m799m713m629m548m469m391m315m241m168m099m029l961l896l831l768l707
$$ 469863 464977 460178 455465 450836 446288 441819 437428 433113 428872 424704 420605 416576 412615 408719 404888 401120 397413
798C97413l646l588l529l474l418l364l311l259l209l159l110l063l016k971k925k882k839
$$ 397413 393767 390179 386650 383176 379758 376394 373083 369824 366615 363456 360346 357283 354267 351296 348371 345489 342650
796C42650k796k756k714k675k637k597k561k524k487k453k417k384k350k317k285k253k222
$$ 342650 339854 337098 334384 331709 329072 326475 323914 321390 318903 316450 314033 311649 309299 306982 304697 302444 300222
794C00222k192k162k132k104k075k047k020j993j966j941j915j889j865j841j817j793j771
$$ 300222 298030 295868 293736 291632 289557 287510 285490 283497 281531 279590 277675 275786 273921 272080 270263 268470 266699
792B66699j747j725j703j682j660j640j618j599j579j558j540j521j501j484j465j447j430
$$ 266699 264952 263227 261524 259842 258182 256542 254924 253325 251746 250188 248648 247127 245626 244142 242677 241230 239800
790B39800j413j395j378j362j346j329j314j298j283j267j253j237j224j209j194j181j167
$$ 239800 238387 236992 235614 234252 232906 231577 230263 228965 227682 226415 225162 223925 222701 221492 220298 219117 217950
788B17950j154j140j128j114j101j089j076j064j052j040j028j016j005r94r82r72r60r50
$$ 217950 216796 215656 214528 213414 212313 211224 210148 209084 208032 206992 205964 204948 203943 202949 201967 200995 200035 199085
786A99085r39r29r18r08q98q88q78q68q59q49q40q30q22q12q04p94p86p77p69p61p52p43p36
$$ 199085 198146 197217 196299 195391 194493 193605 192727 191859 191000 190151 189311 188481 187659 186847 186043 185249 184463 183686 182917 182156 181404 180661 179925
783A79925p28p19p12p04o96o89o82o73o67o59o52o45o38o31o24o17o10o04n97n91n84n78n72
$$ 179925 179197 178478 177766 177062 176366 175677 174995 174322 173655 172996 172344 171699 171061 170430 169806 169189 168579 167975 167378 166787 166203 165625 165053
780A65053n65n59n53n46n41n35n29n23n17n11n06n00m95m89m84m78m73m67m62m57m52m47m41
$$ 165053 164488 163929 163376 162830 162289 161754 161225 160702 160185 159674 159168 158668 158173 157684 157200 156722 156249 155782 155320 154863 154411 153964 153523
777A53523m37m31m27m22m17m12m07m02l98l93l88l84l80l74l71l66l61l57l53l48l45l39l36
$$ 153523 153086 152655 152228 151806 151389 150977 150570 150168 149770 149377 148989 148605 148225 147851 147480 147114 146753 146396 146043 145695 145350 145011 144675
774A44675l32l27l23l20l15l11l07l03k99k95k92k87k84k80k76k72k69k65k61k57k54k50k47
$$ 144675 144343 144016 143693 143373 143058 142747 142440 142137 141838 141543 141251 140964 140680 140400 140124 139852 139583 139318 139057 138800 138546 138296 138049
772A38049k43k40k35k33k29k25k22k19k15k12k08k05k02j98j96j91j89j85j82j79j75j73j69
$$ 138049 137806 137566 137331 137098 136869 136644 136422 136203 135988 135776 135568 135363 135161 134963 134767 134576 134387 134202 134020 133841 133666 133493 133324
769A33324j66j63j59j57j53j51j47j44j41j38j35j32j29j26j23j20j17j14j12j08j05j02j00
$$ 133324 133158 132995 132836 132679 132526 132375 132228 132084 131943 131805 131670 131538 131409 131283 131160 131040 130923 130809 130697 130589 130484 130382 130282
766A30282r6r4r0q8q5q2p9p6p4p0o8o5o2n9n7n3n1m8m5m3l9l7l4l2k8k6k3k0j8j4j2rpljK
$$ 130282 130186 130092 130002 129914 129829 129747 129668 129592 129518 129448 129380 129315 129253 129194 129137 129084 129033 128985 128940 128897 128858 128821 128787 128755 128727 128701 128678 128658 128640 128626 128614 128605 128598 128595 128594 128596
762A28596MQJ0J3J6J8K1K4K7K9L2L5L8M1M3M6M9N1N5N7O0O3O5O9P1P4P6Q0Q2Q5Q9R0R4R7R9
$$ 128596 128600 128608 128618 128631 128647 128665 128686 128710 128737 128766 128798 128833 128871 128912 128955 129001 129050 129101 129156 129213 129273 129336 129401 129470 129541 129615 129691 129771 129853 129938 130027 130117 130211 130308 130407
757A30407J02J06J08J11J13J17J20J22J26J28J32J34J37J40J44J46J49J52J56J58J61J65J67
$$ 130407 130509 130615 130723 130834 130947 131064 131184 131306 131432 131560 131692 131826 131963 132103 132247 132393 132542 132694 132850 133008 133169 133334 133501
755A33501J71J73J77J80J83J86J89J93J96J98K03K05K08K12K15K19K22K25K28K32K35K38K42
$$ 133501 133672 133845 134022 134202 134385 134571 134760 134953 135149 135347 135550 135755 135963 136175 136390 136609 136831 137056 137284 137516 137751 137989 138231
752A38231K46K49K52K56K59K63K66K70K74K77K81K84K88K92K96K99L03L07L11L15L18L22L27
$$ 138231 138477 138726 138978 139234 139493 139756 140022 140292 140566 140843 141124 141408 141696 141988 142284 142583 142886 143193 143504 143819 144137 144459 144786
749A44786L30L34L39L42L46L51L54L59L63L67L71L76L80L84L89L93L98M02M06M11M16M20M25
$$ 144786 145116 145450 145789 146131 146477 146828 147182 147541 147904 148271 148642 149018 149398 149782 150171 150564 150962 151364 151770 152181 152597 153017 153442
746A53442M30M34M39M44M49M53M59M64M68M74M79M83M89M95M99N05N11N15N21N27N32N38N44
$$ 153442 153872 154306 154745 155189 155638 156091 156550 157014 157482 157956 158435 158918 159407 159902 160401 160906 161417 161932 162453 162980 163512 164050 164594
743A64594N49N55N61N67N73N78N85N91N97O03O10O16O22O29O36O42O49O55O62O69O77O83O90
$$ 164594 165143 165698 166259 166826 167399 167977 168562 169153 169750 170353 170963 171579 172201 172830 173466 174108 174757 175412 176074 176743 177420 178103 178793
741A78793O97P05P12P20P27P34P42P50P58P65P74P81P90P98Q06Q15Q23Q32Q41Q49Q59Q67Q77
$$ 178793 179490 180195 180907 181627 182354 183088 183830 184580 185338 186103 186877 187658 188448 189246 190052 190867 191690 192522 193363 194212 195071 195938 196815
738A96815Q86Q95R04R14R24R34R43R54R63R74R85R95J005J016J028J038J049J061J072J084
$$ 196815 197701 198596 199500 200414 201338 202272 203215 204169 205132 206106 207091 208086 209091 210107 211135 212173 213222 214283 215355 216439
735B16439J095J108J119J132J144J157J169J182J195J209J222J235J249J263J277J291J306
$$ 216439 217534 218642 219761 220893 222037 223194 224363 225545 226740 227949 229171 230406 231655 232918 234195 235486 236792
733B36792J321J335J351J365J382J397J413J429J445J463J479J496J513J531J549J568J585
$$ 236792 238113 239448 240799 242164 243546 244943 246356 247785 249230 250693 252172 253668 255181 256712 258261 259829 261414
731B61414J604J623J643J662J681J702J722J743J764J785J807J829J851J874J897J921J944
$$ 261414 263018 264641 266284 267946 269627 271329 273051 274794 276558 278343 280150 281979 283830 285704 287601 289522 291466
729B91466J968J993K018K043K070K095K122K149K176K205K232K262K291K321K352K382K414
$$ 291466 293434 295427 297445 299488 301558 303653 305775 307924 310100 312305 314537 316799 319090 321411 323763 326145 328559
727C28559K446K478K512K545K580K614K650K687K723K760K799K837K878K917K959L000L043
$$ 328559 331005 333483 335995 338540 341120 343734 346384 349071 351794 354554 357353 360190 363068 365985 368944 371944 374987
725C74987L087L131L176L222L269L316L366L415L465L518L570L624L679L735L791L851L909
$$ 374987 378074 381205 384381 387603 390872 394188 397554 400969 404434 407952 411522 415146 418825 422560 426351 430202 434111
723D34111L971M033M095M161M227M294M363M434M506M579M655M731M810M891M973N057N143
$$ 434111 438082 442115 446210 450371 454598 458892 463255 467689 472195 476774 481429 486160 490970 495861 500834 505891 511034
721E11034N232N321N414N508N605N705N805N910O016O126O237O352O470O591O714O841O971
$$ 511034 516266 521587 527001 532509 538114 543819 549624 555534 561550 567676 573913 580265 586735 593326 600040 606881 613852
719F13852P105P243P383P528P676P830P986Q147Q314Q483Q660Q839R025R216R413R616R824
$$ 613852 620957 628200 635583 643111 650787 658617 666603 674750 683064 691547 700207 709046 718071 727287 736700 746316 756140
717G56140J0039J0261J0489J0724J0968J1218J1476J1744J2019J2304J2599J2903J3217J3542
$$ 756140 766179 776440 786929 797653 808621 819839 831315 843059 855078 867382 879981 892884 906101 919643
715I19643J3879J4228J4588J4961J5349J5750J6167J6598J7045J7511J7995J8496J9018J9560
$$ 919643 933522 947750 962338 977299 992648 1008398 1024565 1041163 1058208 1075719 1093714 1112210 1131228 1150788
713A150788K0126K0714K1325K1964K2630K3323K4048K4804K5595K6421K7286K8191K9138L0132
$$ 1150788 1170914 1191628 1212953 1234917 1257547 1280870 1304918 1329722 1355317 1381738 1409024 1437215 1466353 1496485
711A496485L1174L2268L3416L4623L5893L7230L8638M0122M1688M3343M5092M6941M8902N0978
$$ 1496485 1527659 1559927 1593343 1627966 1663859 1701089 1739727 1779849 1821537 1864880 1909972 1956913 2005815 2056793
710B056793N3183N5524N8015O0665O3491O6507O9729P3176P6870Q0831Q5088Q9668R4604R9933
$$ 2056793 2109976 2165500 2223515 2284180 2347671 2414178 2483907 2557083 2633953 2714784 2799872 2889540 2984144 3084077
708C084077J05693J11935J18706J26070J34093J42852J52436J62946J74504J87240K01317
$$ 3084077 3189770 3301705 3420411 3546481 3680574 3823426 3975862 4138808 4313312 4500552 4701869
707D701869K16919K34261K53598K75233K99523L26894L57862L93045M33195M79238N32304
$$ 4701869 4918788 5153049 5406647 5681880 5981403 6308297 6666159 7059204 7492399 7971637 8503941
705H503941N93806O65506P49632Q49020R67327J109309J281236J491483J751397K076606K489020
$$ 8503941 9097747 9763253 10512885 11361905 12329232 13438541 14719777 16211260 17962657 20039263 22528283
704B2528283L019984L715327M643814N911560P687780J0252510J4089153K0072733K9868869
$$ 22528283 25548267 29263594 33907408 39818968 47506748 57759258 71848411 91921144 121790013
703A21790013M6791924P7470742J33010717K14067782K45570678J28457636o1694183k19595041
$$ 121790013 168581937 246052679 379063396 593131178 838701856 967159492 905465309 685870268
702F85870268k38437697j60557816r3827182n5583341l4688563k2820881j5705967j1216561
$$ 685870268 447432571 286874755 193047573 137464232 102775669 79954788 64248821 53032260
701E3032260q254638o224409m786382l738350k955048k356179j888648j516403j214329r64533
$$ 53032260 44777622 38553213 33766831 30028481 27073433 24717254 22828606 21312203 20097874 19133341
700A9133341p53992n72996m14168k71739j41088j8385R9667K16026L33481M54790N82828P20720
$$ 19133341 18379349 17806353 17392185 17120446 16979358 16960973 17060640 17276666 17610147 18064937 18647765 19368485
698A9368485Q72000J040826J232199J452292J708893K011988K374604K814011L353518M025077
$$ 19368485 20240485 21281311 22513510 23965802 25674695 27686683 30061287 32875298 36228816 40253893
697D0253893M873359N962040P383979R277929J1857150J5459878K0642401K8358147M0320341
$$ 40253893 45127252 51089292 58473271 67751200 79608350 95068228 115710629 144068776 184389117
696A84389117N9774430R3214823J54166975K69342430M64710502O08761347L13124023l22607909
$$ 184389117 244163547 337378370 491545345 760887775 1225598277 1834359624 2147483647 1824875738
695A824875738o08962512m60969416k66738194j52778523r2468252n9348844m0062346k8192700
$$ 1824875738 1215913226 754943810 488205616 335427093 242958841 183609997 143547651 115354951
694A15354951k0530840j5381135j1799149r233434p348466n932581m847984m002417l332576
$$ 115354951 94824111 79442976 67643827 58410393 51061927 45129346 40281362 36278945 32946369
693C2946369k794042k355010j992284j688647j431100j209663j016539q45519o91551n50413
$$ 32946369 30152327 27797317 25805033 24116386 22685286 21475623 20459084 19613565 18922014 18371601
692A8371601m18470k92469j69381m6239Q0022K12702L55569N13059O90617Q95119J135482
$$ 18371601 17953131 17660662 17491281 17445042 17525064 17737766 18093335 18606394 19297011 20192130 21327612
690B1327612J423537J775340K213149K768493L487104M436955N721945P505821J0055784J3825313
$$ 21327612 22751149 24526489 26739638 29508131 32995235 37432190 43154135 50659956 60715740 74541053
689G4541053J9618742K8933939M4703788P2904386J25502568K19686113L25219674K02783673
$$ 74541053 94159795 123093734 167797522 240701908 366204476 585890589 911110263 1113893936
688A113893936k02559667l25507049k20059623j25818204p3179350m4960063k9183496j9867910
$$ 1113893936 911334269 585827220 365767597 239949393 166770043 121809980 92626484 72758574
687G2758574j4077766j0313977p771670n997111m723041l785723l081357k542088k122373
$$ 72758574 58680808 48366831 40595161 34598050 29875009 26089286 23007929 20465841 18343468
686A8343468j790889j525638j310876j135128r89912q68859p67131o81008o07593n44613m90268
$$ 18343468 16552579 15026941 13716065 12580937 11591025 10722166 9955035 9274027 8666434 8121821 7631553
685G631553m43117m01998l65969l34257l06229k81359k59210k39413k21662k05694j91287
$$ 7631553 7188436 6786438 6420469 6086212 5779983 5498624 5239414 5000001 4778339 4572645 4381358
683D381358j78254j66429j55676j45872j36913j28708j21177j14254j07872j01983r6537r1492
$$ 4381358 4203104 4036675 3880999 3735127 3598214 3469506 3348329 3234075 3126203 3024220 2927683 2836191
682B836191q6811q2462p8413p4640p1119o7827o4748o1862n9155n6612n4222n1971m9851m7852
$$ 2836191 2749380 2666918 2588505 2513865 2442746 2374919 2310171 2248309 2189154 2132542 2078320 2026349 1976498 1928646
680A928646m5963m4178m2491m0892l9378l7942l6578l5283l4052l2881l1766l0704k9690k8725
$$ 1928646 1882683 1838505 1796014 1755122 1715744 1677802 1641224 1605941 1571889 1539008 1507242 1476538 1446848 1418123
679A418123k7802k6920k6079k5273k4502k3764k3058k2379k1729k1106k0506j9932j9379j8847
$$ 1418123 1390321 1363401 1337322 1312049 1287547 1263783 1240725 1218346 1196617 1175511 1155005 1135073 1115694 1096847
677A096847j8336j7845j7371j6915j6476j6052j5644j5250j4869j4503j4148j3806j3475j3156
$$ 1096847 1078511 1060666 1043295 1026380 1009904 993852 978208 962958 948089 933586 919438 905632 892157 879001
675H79001j2846j2546j2257j1977j1705j1442j1188j0941j0701j0470j0244j0025r814r608
$$ 879001 866155 853609 841352 829375 817670 806228 795040 784099 773398 762928 752684 742659 732845 723237
673G23237r408r215r025q842q665q491q323q159q000p844p694p548p404p265p129o997o868
$$ 723237 713829 704614 695589 686747 678082 669591 661268 653109 645109 637265 629571 622023 614619 607354 600225 593228 586360
671E86360o743o620o501o385o271o161o053n947n844n744n646n550n456n365n276n189n103
$$ 586360 579617 572997 566496 560111 553840 547679 541626 535679 529835 524091 518445 512895 507439 502074 496798 491609 486506
669D86506n020m939m859m781m705m630m558m486m416m348m282m215m152m089m028l967l909
$$ 486506 481486 476547 471688 466907 462202 457572 453014 448528 444112 439764 435482 431267 427115 423026 418998 415031 411122
667D11122l850l795l738l685l631l579l527l478l428l381l332l287l241l196l152l110l067
$$ 411122 407272 403477 399739 396054 392423 388844 385317 381839 378411 375030 371698 368411 365170 361974 358822 355712 352645
665C52645l025k986k945k906k867k830k793k756k720k686k650k617k584k550k519k487k456
$$ 352645 349620 346634 343689 340783 337916 335086 332293 329537 326817 324131 321481 318864 316280 313730 311211 308724 306268
663C06268k425k395k366k336k308k280k253k225k199k172k146k121k096k071k047k024j999
$$ 306268 303843 301448 299082 296746 294438 292158 289905 287680 285481 283309 281163 279042 276946 274875 272828 270804 268805
661B68805j977j954j932j909j888j867j845j825j804j785j764j746j726j707j688j670j652
$$ 268805 266828 264874 262942 261033 259145 257278 255433 253608 251804 250019 248255 246509 244783 243076 241388 239718 238066
659B38066j634j617j600j582j566j549j533j516j501j485j470j455j440j425j410j396j382
$$ 238066 236432 234815 233215 231633 230067 228518 226985 225469 223968 222483 221013 219558 218118 216693 215283 213887 212505
657B12505j368j354j341j327j314j301j288j275j263j251j238j227j214j203j191j180j168
$$ 212505 211137 209783 208442 207115 205801 204500 203212 201937 200674 199423 198185 196958 195744 194541 193350 192170 191002
655A91002j158j146j136j125j114j104j094j084j073j064j054j044j035j025j016j007r97
$$ 191002 189844 188698 187562 186437 185323 184219 183125 182041 180968 179904 178850 177806 176771 175746 174730 173723 172726
653A72726r89r80r71r63r53r46r37r29r21r13r05q97q89q81q74q67q59q52q45q37q30q24q16
$$ 172726 171737 170757 169786 168823 167870 166924 165987 165058 164137 163224 162319 161422 160533 159652 158778 157911 157052 156200 155355 154518 153688 152864 152048
650A52048q10q03p96p90p83p76p71p64p57p52p45p40p33p28p22p16p10p05o99o93o88o83o77
$$ 152048 151238 150435 149639 148849 148066 147290 146519 145755 144998 144246 143501 142761 142028 141300 140578 139862 139152 138447 137748 137055 136367 135684 135007
647A35007o72o67o61o57o51o46o42o36o32o26o22o18o12o08o04n99n94n90n86n81n77n72n69
$$ 135007 134335 133668 133007 132350 131699 131053 130411 129775 129143 128517 127895 127277 126665 126057 125453 124854 124260 123670 123084 122503 121926 121354 120785
644A20785n64n60n56n52n48n44n40n37n32n28n25n21n17n14n10n06n03m99m96m93m88m86m82
$$ 120785 120221 119661 119105 118553 118005 117461 116921 116384 115852 115324 114799 114278 113761 113247 112737 112231 111728 111229 110733 110240 109752 109266 108784
641A08784m79m75m72m69m66m63m59m56m53m51m47m44m41m38m35m32m30m26m24m21m18m15m13
$$ 108784 108305 107830 107358 106889 106423 105960 105501 105045 104592 104141 103694 103250 102809 102371 101936 101504 101074 100648 100224 99803 99385 98970 98557
639I8557m10m07m05m02l99l97l94l92l89l87l84l82l79l77l74l73l69l68l65l63l61l58l56
$$ 98557 98147 97740 97335 96933 96534 96137 95743 95351 94962 94575 94191 93809 93430 93053 92679 92306 91937 91569 91204 90841 90480 90122 89766
636H9766l54l52l49l48l45l43l41l39l37l35l33l31l28l27l25l23l21l19l17l15l13l12l10
$$ 89766 89412 89060 88711 88363 88018 87675 87334 86995 86658 86323 85990 85659 85331 85004 84679 84356 84035 83716 83399 83084 82771 82459 82149
633H2149l07l06l05l02l01k99k97k95k94k92k90k89k87k85k84k82k80k79k78k75k74k73k71
$$ 82149 81842 81536 81231 80929 80628 80329 80032 79737 79443 79151 78861 78572 78285 78000 77716 77434 77154 76875 76597 76322 76048 75775 75504
630G5504k70k68k66k65k64k62k60k59k58k57k54k54k52k51k49k48k47k45k44k42k42k40k38
$$ 75504 75234 74966 74700 74435 74171 73909 73649 73390 73132 72875 72621 72367 72115 71864 71615 71367 71120 70875 70631 70389 70147 69907 69669
627F9669k38k36k35k34k32k31k30k29k27k27k25k24k22k22k20k19k19k17k15k15k14k12k12
$$ 69669 69431 69195 68960 68726 68494 68263 68033 67804 67577 67350 67125 66901 66679 66457 66237 66018 65799 65582 65367 65152 64938 64726 64514
625F4514k10k09k08k07k07k05k03k03k02k01k00j99j98j96j96j95j94j93j92j91j90j89j88
$$ 64514 64304 64095 63887 63680 63473 63268 63065 62862 62660 62459 62259 62060 61862 61666 61470 61275 61081 60888 60696 60505 60315 60126 59938
622E9938j88j86j85j85j84j82j82j81j80j79j79j77j77j75j75j74j74j72j71j71j70j69j69
$$ 59938 59750 59564 59379 59194 59010 58828 58646 58465 58285 58106 57927 57750 57573 57398 57223 57049 56875 56703 56532 56361 56191 56022 55853
619E5853j67j67j66j65j64j64j63j62j61j61j59j60j58j57j57j57j55j55j54j53j53j51j52
$$ 55853 55686 55519 55353 55188 55024 54860 54697 54535 54374 54213 54054 53894 53736 53579 53422 53265 53110 52955 52801 52648 52495 52344 52192
616E2192j50j50j49j49j47j47j47j46j45j44j44j43j43j42j41j41j40j39j39j38j38j37j36
$$ 52192 52042 51892 51743 51594 51447 51300 51153 51007 50862 50718 50574 50431 50288 50146 50005 49864 49724 49585 49446 49308 49170 49033 48897
613D8897j36j35j35j34j33j33j32j32j31j30j30j30j29j28j28j27j26j27j25j25j25j24j23
$$ 48897 48761 48626 48491 48357 48224 48091 47959 47827 47696 47566 47436 47306 47177 47049 46921 46794 46668 46541 46416 46291 46166 46042 45919
611D5919j23j22j22j22j21j20j20j19j19j18j18j18j16j17j16j15j15j15j14j13j13j13j12
$$ 45919 45796 45674 45552 45430 45309 45189 45069 44950 44831 44713 44595 44477 44361 44244 44128 44013 43898 43783 43669 43556 43443 43330 43218
608D3218j12j11j11j10j10j09j09j09j08j08j07j07j06j06j06j05j04j05j04j03j03j03j02
$$ 43218 43106 42995 42884 42774 42664 42555 42446 42337 42229 42121 42014 41907 41801 41695 41589 41484 41380 41275 41171 41068 40965 40862 40760
605D0760j02j01j01j01j00j00r9r9r9r8r8r8r7r6r7r6r5r6r5r4r4r4r3r4r2r3r2r1r2r1r0
$$ 40760 40658 40557 40456 40355 40255 40155 40056 39957 39858 39760 39662 39564 39467 39371 39274 39178 39083 38987 38892 38798 38704 38610 38517 38423 38331 38238 38146 38055 37963 37872 37782
601C7782r1r0q9q9q9q9q8q8q8q7q7q7q6q6q6q5q5q5q4q4q4q4q3q3q2q3q1q2q2q1q0q1q0q0
$$ 37782 37691 37601 37512 37423 37334 37245 37157 37069 36981 36894 36807 36720 36634 36548 36462 36377 36292 36207 36123 36039 35955 35871 35788 35705 35623 35540 35459 35377 35295 35214 35134 35053 34973 34893
597C4893q0p9p9p9p8p8p8p8p7p7p7p7p6p6p6p5p5p5p5p4p4p4p4p3p3p3p3p2p2p2p2p1p1p1
$$ 34893 34813 34734 34655 34576 34498 34420 34342 34264 34187 34110 34033 33956 33880 33804 33728 33653 33578 33503 33428 33354 33280 33206 33132 33059 32986 32913 32840 32768 32696 32624 32552 32481 32410 32339
593C2339p0p1p0p0o9p0o9o9o8o9o8o8o8o7o8o7o7o6o6o7o6o5o6o5o5o5o5o4o4o4o4o3o4o3
$$ 32339 32269 32198 32128 32058 31989 31919 31850 31781 31713 31644 31576 31508 31440 31373 31305 31238 31171 31105 31039 30972 30906 30841 30775 30710 30645 30580 30515 30451 30387 30323 30259 30196 30132 30069
589C0069o3o2o3o2o2o2o2o1o2o1o1o0o1o0o0o0o0n9n9o0n9n8n9n8n8n8n8n8n7n7n7n7n7n6
$$ 30069 30006 29944 29881 29819 29757 29695 29633 29572 29510 29449 29388 29328 29267 29207 29147 29087 29027 28968 28909 28849 28790 28732 28673 28615 28557 28499 28441 28383 28326 28269 28212 28155 28098 28042
585B8042n7n6n6n6n5n6n5n5n5n5n4n5n4n4n4n4n3n4n3n3n3n3n2n3n2n2n2n2n1n2n1n1n1n1
$$ 28042 27985 27929 27873 27817 27762 27706 27651 27596 27541 27486 27432 27377 27323 27269 27215 27161 27108 27054 27001 26948 26895 26842 26790 26737 26685 26633 26581 26529 26478 26426 26375 26324 26273 26222
580B6222n1n0n0n1n0n0m9n0m9n0m9m9m9m8m9m8m8m9m8m7m8m8m7m7m7m7m7m7m6m7m6m6m6m6
$$ 26222 26171 26121 26071 26020 25970 25920 25871 25821 25772 25722 25673 25624 25575 25527 25478 25430 25382 25333 25285 25238 25190 25142 25095 25048 25001 24954 24907 24860 24814 24767 24721 24675 24629 24583
576B4583m6m6m5m5m6m5m5m4m5m5m4m4m5m4m3m4m4m3m4m3m3m3m3m3m3m2m3m2m2m2m2m2m2m1
$$ 24583 24537 24491 24446 24401 24355 24310 24265 24221 24176 24131 24087 24043 23998 23954 23911 23867 23823 23780 23736 23693 23650 23607 23564 23521 23478 23436 23393 23351 23309 23267 23225 23183 23141 23100
572B3100m2m1m1m1m1m1m1m0m1m0m1m0m0m0m0m0l9m0l9l9m0l9l9l8l9l9l8l9l8l8l9l8l7l8
$$ 23100 23058 23017 22976 22935 22894 22853 22812 22772 22731 22691 22650 22610 22570 22530 22490 22450 22411 22371 22332 22293 22253 22214 22175 22137 22098 22059 22021 21982 21944 21906 21867 21829 21792 21754
568B1754l8l8l7l7l8l7l7l7l7l7l6l7l6l7l6l6l6l6l6l6l6l5l6l5l6l5l5l5l5l5l5l4l5l4
$$ 21754 21716 21678 21641 21604 21566 21529 21492 21455 21418 21381 21345 21308 21272 21235 21199 21163 21127 21091 21055 21019 20983 20948 20912 20877 20841 20806 20771 20736 20701 20666 20631 20597 20562 20528
564B0528l5l4l4l4l4l4l4l4l4l3l4l3l4l3l3l3l3l3l3l2l3l3l2l2l3l2l2l2l2l2l2l2l1l2
$$ 20528 20493 20459 20425 20391 20357 20323 20289 20255 20221 20188 20154 20121 20087 20054 20021 19988 19955 19922 19889 19857 19824 19791 19759 19727 19694 19662 19630 19598 19566 19534 19502 19470 19439 19407
560A9407l1l2l1l1l1l1l1l1l1l1l1l0l1l0l1l0l0l0l0l0l0l0l0l0k9l0k9l0k9k9k9k9l0k8
$$ 19407 19376 19344 19313 19282 19251 19220 19189 19158 19127 19096 19065 19035 19004 18974 18943 18913 18883 18853 18823 18793 18763 18733 18703 18673 18644 18614 18585 18555 18526 18497 18468 18439 18409 18381
555A8381k9k9k9k9k8k9k8k9k8k8k8k8k9k7k8k8k8k8k7k8k7k8k7k8k7k7k7k7k7k7k7k7k6k7
$$ 18381 18352 18323 18294 18265 18237 18208 18180 18151 18123 18095 18067 18039 18010 17983 17955 17927 17899 17871 17844 17816 17789 17761 17734 17706 17679 17652 17625 17598 17571 17544 17517 17490 17464 17437
551A7437k7k6k6k7k6k6k7k6k6k6k6k6k6k5k6k6k5k6k5k6k5k5k6k5k5k5k5k5k5k4k5k5k5k4
$$ 17437 17410 17384 17358 17331 17305 17279 17252 17226 17200 17174 17148 17122 17096 17071 17045 17019 16994 16968 16943 16917 16892 16867 16841 16816 16791 16766 16741 16716 16691 16667 16642 16617 16592 16568
547A6568k5k4k5k4k4k4k5k4k4k4k4k4k4k3k4k4k3k4k3k4k3k4k3k3k3k4k3k3k3k3k3k2k3k3
$$ 16568 16543 16519 16494 16470 16446 16422 16397 16373 16349 16325 16301 16277 16253 16230 16206 16182 16159 16135 16112 16088 16065 16041 16018 15995 15972 15948 15925 15902 15879 15856 15833 15811 15788 15765
543A5765k3k2k3k2k3k2k3k2k2k2k3k2k2k2k2k2k1k2k2k2k1k2k2k1k2k1k2k1k1k1k2k1k1k1
$$ 15765 15742 15720 15697 15675 15652 15630 15607 15585 15563 15541 15518 15496 15474 15452 15430 15408 15387 15365 15343 15321 15300 15278 15256 15235 15213 15192 15170 15149 15128 15107 15085 15064 15043 15022
539A5022k1k1k1k1k1k0k1k1k0k1k1k0k1k0k0k1k0k0k0k1k0k0k0k0k0k0j9k0k0k0j9k0k0j9
$$ 15022 15001 14980 14959 14938 14917 14897 14876 14855 14835 14814 14793 14773 14752 14732 14712 14691 14671 14651 14631 14610 14590 14570 14550 14530 14510 14490 14471 14451 14431 14411 14392 14372 14352 14333
535A4333k0j9k0j9j9k0j9j9j9k0j9j9j9j9j9j9j8j9j9j9j8j9j9j8j9j8j9j8j9j8j8j9j8j8
$$ 14333 14313 14294 14274 14255 14236 14216 14197 14178 14159 14139 14120 14101 14082 14063 14044 14025 14007 13988 13969 13950 13932 13913 13894 13876 13857 13839 13820 13802 13783 13765 13747 13728 13710 13692
531A3692j8j8j8j8j8j8j8j8j8j8j8j7j8j8j7j8j8j7j8j7j8j7j7j8j7j7j7j7j8j7j7j7j7j7
$$ 13692 13674 13656 13638 13620 13602 13584 13566 13548 13530 13512 13494 13477 13459 13441 13424 13406 13388 13371 13353 13336 13318 13301 13284 13266 13249 13232 13215 13198 13180 13163 13146 13129 13112 13095
526A3095j7j7j6j7j7j7j7j6j7j7j6j7j6j7j6j7j6j6j7j6j6j6j7j6j6j6j6j6j6j6j6j6j6j6
$$ 13095 13078 13061 13045 13028 13011 12994 12977 12961 12944 12927 12911 12894 12878 12861 12845 12828 12812 12796 12779 12763 12747 12731 12714 12698 12682 12666 12650 12634 12618 12602 12586 12570 12554 12538
522A2538j5j6j6j6j5j6j6j5j6j5j6j5j6j5j6j5j5j5j6j5j5j5j5j6j5j5j5j5j5j5j5j4j5j5
$$ 12538 12523 12507 12491 12475 12460 12444 12428 12413 12397 12382 12366 12351 12335 12320 12304 12289 12274 12259 12243 12228 12213 12198 12183 12167 12152 12137 12122 12107 12092 12077 12062 12048 12033 12018
518A2018j5j5j4j5j5j4j5j5j4j5j4j5j4j5j4j4j5j4j4j5j4j4j4j4j4j5j4j4j4j4j4j4j3j4
$$ 12018 12003 11988 11974 11959 11944 11930 11915 11900 11886 11871 11857 11842 11828 11813 11799 11785 11770 11756 11742 11727 11713 11699 11685 11671 11657 11642 11628 11614 11600 11586 11572 11558 11545 11531
514A1531j4j4j4j4j3j4j4j4j3j4j3j4j4j3j4j3j3j4j3j4j3j3j4j3j3j3j4j3j3j3j3j3j3j3
$$ 11531 11517 11503 11489 11475 11462 11448 11434 11420 11407 11393 11380 11366 11352 11339 11325 11312 11299 11285 11272 11258 11245 11232 11218 11205 11192 11179 11165 11152 11139 11126 11113 11100 11087 11074
510A1074j3j3j3j3j3j3j3j3j3j2j3j3j3j2j3j3j2j3j2j3j3j2j3j2j2j3j2j3j2j2j3j2j2j2
$$ 11074 11061 11048 11035 11022 11009 10996 10983 10970 10957 10945 10932 10919 10906 10894 10881 10868 10856 10843 10831 10818 10805 10793 10780 10768 10756 10743 10731 10718 10706 10694 10681 10669 10657 10645
506A0645j3j2j2j2j2j2j3j2j2j2j2j2j2j2j2j1j2j2j2j2j2j1j2j2j2j1j2j2j1j2j1j2j2j1
$$ 10645 10632 10620 10608 10596 10584 10572 10559 10547 10535 10523 10511 10499 10487 10475 10463 10452 10440 10428 10416 10404 10392 10381 10369 10357 10345 10334 10322 10310 10299 10287 10276 10264 10252 10241
501A0241j2j1j1j2j1j2j1j2j1j1j1j2j1j1j1j2j1j1j1j1j1j2j1j1j1j1j1j1j1j1j0j1j1j1
$$ 10241 10229 10218 10207 10195 10184 10172 10161 10149 10138 10127 10116 10104 10093 10082 10071 10059 10048 10037 10026 10015 10004 9992 9981 9970 9959 9948 9937 9926 9915 9904 9894 9883 9872 9861
497I861j1j1j1j0j1j1j1j0j1j1j0j1j1j0j1j0j1j0j1j0j1j0j1j0j1j0j0j1j0j0j1j0j0j1j0
$$ 9861 9850 9839 9828 9818 9807 9796 9785 9775 9764 9753 9743 9732 9721 9711 9700 9690 9679 9669 9658 9648 9637 9627 9616 9606 9595 9585 9575 9564 9554 9544 9533 9523 9513 9502 9492
493I492j0j0j0j1j0j0j0j0j0j0j0j0j0j0j0j0j0j0j0j0j0j0rj0j0j0j0rj0j0j0rj0j0rj0j0
$$ 9492 9482 9472 9462 9451 9441 9431 9421 9411 9401 9391 9381 9371 9361 9351 9341 9331 9321 9311 9301 9291 9281 9271 9262 9252 9242 9232 9222 9213 9203 9193 9183 9174 9164 9154 9145 9135 9125
489I125rj0rj0rj0rj0rj0rj0rj0rrj0rrj0rrrj0rrrj0rrrrrrrrj0rrrrrrrqrrrrrrrqrrrr
$$ 9125 9116 9106 9097 9087 9078 9068 9059 9049 9040 9030 9021 9011 9002 8992 8983 8974 8964 8955 8946 8936 8927 8918 8909 8899 8890 8881 8872 8862 8853 8844 8835 8826 8817 8808 8799 8790 8780 8771 8762 8753 8744 8735 8726 8717 8709 8700 8691 8682 8673 8664 8655 8646 8638 8629 8620 8611 8602
482H602qrrrqrrqrrqrqrqrrqrqrqqrqrqrqqrqqrqqqrqqqrqqqqqrqqqqqqqqqqqqqqqqqqqqq
$$ 8602 8594 8585 8576 8567 8559 8550 8541 8533 8524 8515 8507 8498 8490 8481 8473 8464 8455 8447 8438 8430 8421 8413 8405 8396 8388 8379 8371 8362 8354 8346 8337 8329 8321 8312 8304 8296 8288 8279 8271 8263 8255 8246 8238 8230 8222 8214 8206 8197 8189 8181 8173 8165 8157 8149 8141 8133 8125 8117 8109 8101 8093 8085 8077 8069 8061 8053 8045 8037 8029
473H029pqqqqpqqqqpqqpqqqpqpqqpqpqqpqpqpqpqpqppqpqppqppqppqpppqppppqpppppqppp
$$ 8029 8022 8014 8006 7998 7990 7983 7975 7967 7959 7951 7944 7936 7928 7921 7913 7905 7897 7890 7882 7875 7867 7859 7852 7844 7837 7829 7821 7814 7806 7799 7791 7784 7776 7769 7761 7754 7746 7739 7732 7724 7717 7709 7702 7695 7687 7680 7673 7665 7658 7651 7643 7636 7629 7622 7614 7607 7600 7593 7586 7578 7571 7564 7557 7550 7543 7535 7528 7521 7514
465G514pppppppppppppppppppppopppppoppppopppoppoppoppoppopoppopopopopopopopoo
$$ 7514 7507 7500 7493 7486 7479 7472 7465 7458 7451 7444 7437 7430 7423 7416 7409 7402 7395 7388 7381 7374 7367 7361 7354 7347 7340 7333 7326 7320 7313 7306 7299 7292 7286 7279 7272 7265 7259 7252 7245 7239 7232 7225 7219 7212 7205 7199 7192 7185 7179 7172 7166 7159 7152 7146 7139 7133 7126 7120 7113 7107 7100 7094 7087 7081 7074 7068 7061 7055 7049
456G049popoopoopoopoopoopoooopoooopoooooopoooooooooooooooooooooooooonoooooon
$$ 7049 7042 7036 7029 7023 7017 7010 7004 6998 6991 6985 6979 6972 6966 6960 6953 6947 6941 6934 6928 6922 6916 6910 6903 6897 6891 6885 6879 6872 6866 6860 6854 6848 6842 6836 6829 6823 6817 6811 6805 6799 6793 6787 6781 6775 6769 6763 6757 6751 6745 6739 6733 6727 6721 6715 6709 6703 6697 6691 6685 6679 6673 6668 6662 6656 6650 6644 6638 6632 6627
448F627ooooonooonooonoonoonoonoonoononoononononononononononnonononnonnonnonn
$$ 6627 6621 6615 6609 6603 6597 6592 6586 6580 6574 6569 6563 6557 6551 6546 6540 6534 6529 6523 6517 6512 6506 6500 6495 6489 6483 6478 6472 6466 6461 6455 6450 6444 6438 6433 6427 6422 6416 6411 6405 6400 6394 6389 6383 6378 6372 6367 6361 6356 6350 6345 6339 6334 6329 6323 6318 6312 6307 6301 6296 6291 6285 6280 6275 6269 6264 6259 6253 6248 6243
439F243onnonnnonnnonnnnonnnnonnnnnnnonnnnnnnnnnnnnnnnnnnnnnnnnnnnnnnnmnnnnnn
$$ 6243 6237 6232 6227 6221 6216 6211 6206 6200 6195 6190 6185 6179 6174 6169 6164 6159 6153 6148 6143 6138 6133 6127 6122 6117 6112 6107 6102 6097 6092 6086 6081 6076 6071 6066 6061 6056 6051 6046 6041 6036 6031 6026 6021 6016 6011 6006 6001 5996 5991 5986 5981 5976 5971 5966 5961 5956 5951 5946 5941 5936 5931 5926 5922 5917 5912 5907 5902 5897 5892
431E892nmnnnnnmnnnmnnnnmnnnmnnmnnnmnnmnnmnmnnmnnmnmnnmnmnmnmnnmnmnmnmnmnmmnm
$$ 5892 5887 5883 5878 5873 5868 5863 5858 5854 5849 5844 5839 5835 5830 5825 5820 5815 5811 5806 5801 5796 5792 5787 5782 5778 5773 5768 5763 5759 5754 5749 5745 5740 5735 5731 5726 5722 5717 5712 5708 5703 5698 5694 5689 5685 5680 5675 5671 5666 5662 5657 5653 5648 5644 5639 5634 5630 5625 5621 5616 5612 5607 5603 5598 5594 5589 5585 5581 5576 5572
423E572nmnmnmmnmnmmnmmnmnmmnmmnmmmnmmnmmmnmmmnmmmnmmmmnmmmmnmmmmmnmmmmmmmmnm
$$ 5572 5567 5563 5558 5554 5549 5545 5541 5536 5532 5527 5523 5519 5514 5510 5506 5501 5497 5492 5488 5484 5479 5475 5471 5466 5462 5458 5454 5449 5445 5441 5436 5432 5428 5424 5419 5415 5411 5407 5402 5398 5394 5390 5385 5381 5377 5373 5369 5364 5360 5356 5352 5348 5343 5339 5335 5331 5327 5323 5318 5314 5310 5306 5302 5298 5294 5290 5286 5281 5277
414E277mmmmmmmmmmmmmmmmmmmmmmmmmmmmmmmmmmmmmmlmmmmmmmmlmmmmmlmmmmmlmmmmlmmml
$$ 5277 5273 5269 5265 5261 5257 5253 5249 5245 5241 5237 5233 5229 5225 5221 5217 5213 5209 5205 5201 5197 5193 5189 5185 5181 5177 5173 5169 5165 5161 5157 5153 5149 5145 5141 5137 5133 5129 5125 5122 5118 5114 5110 5106 5102 5098 5094 5090 5087 5083 5079 5075 5071 5067 5064 5060 5056 5052 5048 5044 5041 5037 5033 5029 5025 5022 5018 5014 5010 5007
406E007mmmlmmmlmmmlmmlmmmlmmlmmlmmlmmlmlmmlmlmmlmlmmlmlmlmmlmlmlmlmlmlmlmlml
$$ 5007 5003 4999 4995 4992 4988 4984 4980 4977 4973 4969 4965 4962 4958 4954 4951 4947 4943 4939 4936 4932 4928 4925 4921 4917 4914 4910 4906 4903 4899 4895 4892 4888 4885 4881 4877 4874 4870 4867 4863 4859 4856 4852 4849 4845 4841 4838 4834 4831 4827 4824 4820 4816 4813 4809 4806 4802 4799 4795 4792 4788 4785 4781 4778 4774 4771 4767 4764 4760 4757
397D757mlmlmlmllmlmlmllmlmllmlmllmlmllmllmllmllmllmllmlllmllmlllmlllmlllmlll
$$ 4757 4753 4750 4746 4743 4739 4736 4732 4729 4726 4722 4719 4715 4712 4708 4705 4702 4698 4695 4691 4688 4685 4681 4678 4674 4671 4668 4664 4661 4657 4654 4651 4647 4644 4641 4637 4634 4631 4627 4624 4621 4617 4614 4611 4607 4604 4601 4597 4594 4591 4588 4584 4581 4578 4574 4571 4568 4565 4561 4558 4555 4552 4548 4545 4542 4539 4535 4532 4529 4526
389D526lmlllmlllllmllllmllllllmlllllllmllllllllllmllllllllllllllllllllllllll
$$ 4526 4523 4519 4516 4513 4510 4506 4503 4500 4497 4494 4491 4487 4484 4481 4478 4475 4471 4468 4465 4462 4459 4456 4453 4449 4446 4443 4440 4437 4434 4431 4428 4424 4421 4418 4415 4412 4409 4406 4403 4400 4397 4394 4390 4387 4384 4381 4378 4375 4372 4369 4366 4363 4360 4357 4354 4351 4348 4345 4342 4339 4336 4333 4330 4327 4324 4321 4318 4315 4312
380D312llllllllllllllllllklllllllllllklllllllkllllllklllllklllllkllllklllkll
$$ 4312 4309 4306 4303 4300 4297 4294 4291 4288 4285 4282 4279 4276 4273 4270 4267 4264 4261 4258 4256 4253 4250 4247 4244 4241 4238 4235 4232 4229 4226 4223 4221 4218 4215 4212 4209 4206 4203 4200 4198 4195 4192 4189 4186 4183 4180 4178 4175 4172 4169 4166 4163 4161 4158 4155 4152 4149 4146 4144 4141 4138 4135 4132 4130 4127 4124 4121 4119 4116 4113
372D113llklllklllklllklllkllklllkllkllkllkllkllkllkllkllkllklkllkllklkllklkl
$$ 4113 4110 4107 4105 4102 4099 4096 4094 4091 4088 4085 4083 4080 4077 4074 4072 4069 4066 4063 4061 4058 4055 4053 4050 4047 4044 4042 4039 4036 4034 4031 4028 4026 4023 4020 4018 4015 4012 4010 4007 4004 4002 3999 3996 3994 3991 3988 3986 3983 3980 3978 3975 3972 3970 3967 3965 3962 3959 3957 3954 3951 3949 3946 3944 3941 3938 3936 3933 3931 3928
364C928lklklkllklklklkllklklklklklklklklklklklklklklklklkklklklklkklklklkklk
$$ 3928 3925 3923 3920 3918 3915 3913 3910 3907 3905 3902 3900 3897 3895 3892 3890 3887 3884 3882 3879 3877 3874 3872 3869 3867 3864 3862 3859 3857 3854 3852 3849 3847 3844 3842 3839 3837 3834 3832 3829 3827 3824 3822 3819 3817 3814 3812 3809 3807 3804 3802 3800 3797 3795 3792 3790 3787 3785 3782 3780 3778 3775 3773 3770 3768 3765 3763 3761 3758 3756
355C756lkklklkklklkklklkklkklkklklkklkklkklkklkkklkklkklkklkkklkklkkklkkklkk
$$ 3756 3753 3751 3749 3746 3744 3741 3739 3737 3734 3732 3729 3727 3725 3722 3720 3717 3715 3713 3710 3708 3706 3703 3701 3699 3696 3694 3691 3689 3687 3684 3682 3680 3677 3675 3673 3670 3668 3666 3663 3661 3659 3657 3654 3652 3650 3647 3645 3643 3640 3638 3636 3633 3631 3629 3627 3624 3622 3620 3617 3615 3613 3611 3608 3606 3604 3602 3599 3597 3595
347C595klkkklkkklkkkklkkklkkkklkkkklkkkklkkkkklkkkkklkkkkkklkkkkkklkkkkkkklk
$$ 3595 3593 3590 3588 3586 3584 3581 3579 3577 3575 3572 3570 3568 3566 3564 3561 3559 3557 3555 3552 3550 3548 3546 3544 3541 3539 3537 3535 3533 3530 3528 3526 3524 3522 3519 3517 3515 3513 3511 3509 3506 3504 3502 3500 3498 3496 3493 3491 3489 3487 3485 3483 3481 3478 3476 3474 3472 3470 3468 3466 3463 3461 3459 3457 3455 3453 3451 3449 3446 3444
338C444kkkkkkkklkkkkkkkkkkkklkkkkkkkkkkkkkkkkkkkklkkkkkkkkkkkkkkkkkkkkkkkkkk
$$ 3444 3442 3440 3438 3436 3434 3432 3430 3428 3425 3423 3421 3419 3417 3415 3413 3411 3409 3407 3405 3403 3401 3398 3396 3394 3392 3390 3388 3386 3384 3382 3380 3378 3376 3374 3372 3370 3368 3366 3364 3362 3360 3358 3355 3353 3351 3349 3347 3345 3343 3341 3339 3337 3335 3333 3331 3329 3327 3325 3323 3321 3319 3317 3315 3313 3311 3309 3307 3305 3303
330C303kkjkkkkkkkkkkkkkkkkkkkkkjkkkkkkkkkkkkjkkkkkkkkkjkkkkkkkkjkkkkkkjkkkkk
$$ 3303 3301 3299 3298 3296 3294 3292 3290 3288 3286 3284 3282 3280 3278 3276 3274 3272 3270 3268 3266 3264 3262 3260 3258 3256 3255 3253 3251 3249 3247 3245 3243 3241 3239 3237 3235 3233 3231 3230 3228 3226 3224 3222 3220 3218 3216 3214 3212 3211 3209 3207 3205 3203 3201 3199 3197 3195 3194 3192 3190 3188 3186 3184 3182 3181 3179 3177 3175 3173 3171
321C171kjkkkkkkjkkkkkjkkkkkjkkkkjkkkkkjkkkkjkkkkjkkkjkkkkjkkkjkkkjkkkkjkkkjk
$$ 3171 3169 3168 3166 3164 3162 3160 3158 3156 3155 3153 3151 3149 3147 3145 3144 3142 3140 3138 3136 3134 3133 3131 3129 3127 3125 3124 3122 3120 3118 3116 3114 3113 3111 3109 3107 3105 3104 3102 3100 3098 3096 3095 3093 3091 3089 3088 3086 3084 3082 3080 3079 3077 3075 3073 3072 3070 3068 3066 3065 3063 3061 3059 3057 3056 3054 3052 3050 3049 3047
313C047kjkkkjkkkjkkkjkkjkkkjkkjkkkjkkjkkjkkkjkkjkkjkkjkkjkkjkkjkkjkkjkkjkkjk
$$ 3047 3045 3044 3042 3040 3038 3037 3035 3033 3031 3030 3028 3026 3024 3023 3021 3019 3018 3016 3014 3012 3011 3009 3007 3006 3004 3002 3000 2999 2997 2995 2994 2992 2990 2989 2987 2985 2983 2982 2980 2978 2977 2975 2973 2972 2970 2968 2967 2965 2963 2962 2960 2958 2957 2955 2953 2952 2950 2948 2947 2945 2943 2942 2940 2938 2937 2935 2933 2932 2930
305B930jkkjkkjkkjkjkkjkkjkjkkjkjkkjkkjkjkkjkjkjkkjkjkkjkjkjkkjkjkjkjkkjkjkjk
$$ 2930 2929 2927 2925 2924 2922 2920 2919 2917 2915 2914 2912 2911 2909 2907 2906 2904 2902 2901 2899 2898 2896 2894 2893 2891 2890 2888 2886 2885 2883 2881 2880 2878 2877 2875 2873 2872 2870 2869 2867 2866 2864 2862 2861 2859 2858 2856 2854 2853 2851 2850 2848 2847 2845 2843 2842 2840 2839 2837 2836 2834 2833 2831 2829 2828 2826 2825 2823 2822 2820
296B820jkkjkjkjkjkjkjkkjkjkjkjkjkjkjkjkjkjkjkjkjkjkjkjkjkjkjkjkjkjkjjkjkjkjk
$$ 2820 2819 2817 2815 2814 2812 2811 2809 2808 2806 2805 2803 2802 2800 2799 2797 2795 2794 2792 2791 2789 2788 2786 2785 2783 2782 2780 2779 2777 2776 2774 2773 2771 2770 2768 2767 2765 2764 2762 2761 2759 2758 2756 2755 2753 2752 2750 2749 2747 2746 2744 2743 2741 2740 2738 2737 2735 2734 2732 2731 2729 2728 2727 2725 2724 2722 2721 2719 2718 2716
288B716jkjkjjkjkjkjkjkjjkjkjkjjkjkjkjjkjkjkjjkjkjjkjkjkjjkjkjjkjkjjkjjkjkjjk
$$ 2716 2715 2713 2712 2710 2709 2708 2706 2705 2703 2702 2700 2699 2697 2696 2694 2693 2692 2690 2689 2687 2686 2684 2683 2682 2680 2679 2677 2676 2674 2673 2672 2670 2669 2667 2666 2664 2663 2662 2660 2659 2657 2656 2655 2653 2652 2650 2649 2647 2646 2645 2643 2642 2640 2639 2638 2636 2635 2633 2632 2631 2629 2628 2627 2625 2624 2622 2621 2620 2618
279B618jkjjkjjkjkjjkjjkjjkjkjjkjjkjjkjjkjjkjjkjjkjjkjjkjjkjjkjjkjjkjjkjjkjjj
$$ 2618 2617 2615 2614 2613 2611 2610 2609 2607 2606 2604 2603 2602 2600 2599 2598 2596 2595 2594 2592 2591 2589 2588 2587 2585 2584 2583 2581 2580 2579 2577 2576 2575 2573 2572 2571 2569 2568 2567 2565 2564 2563 2561 2560 2559 2557 2556 2555 2553 2552 2551 2549 2548 2547 2545 2544 2543 2541 2540 2539 2537 2536 2535 2533 2532 2531 2529 2528 2527 2526
271B526kjjkjjkjjjkjjkjjkjjjkjjjkjjkjjjkjjkjjjkjjjkjjjkjjjkjjjkjjjkjjjkjjjkjj
$$ 2526 2524 2523 2522 2520 2519 2518 2516 2515 2514 2513 2511 2510 2509 2507 2506 2505 2503 2502 2501 2500 2498 2497 2496 2495 2493 2492 2491 2489 2488 2487 2486 2484 2483 2482 2480 2479 2478 2477 2475 2474 2473 2472 2470 2469 2468 2467 2465 2464 2463 2462 2460 2459 2458 2457 2455 2454 2453 2452 2450 2449 2448 2447 2445 2444 2443 2442 2440 2439 2438
263B438jkjjjkjjjjkjjjkjjjjkjjjkjjjjkjjjjkjjjjkjjjjkjjjjkjjjjkjjjjjkjjjjkjjjj
$$ 2438 2437 2435 2434 2433 2432 2430 2429 2428 2427 2426 2424 2423 2422 2421 2419 2418 2417 2416 2415 2413 2412 2411 2410 2408 2407 2406 2405 2404 2402 2401 2400 2399 2398 2396 2395 2394 2393 2392 2390 2389 2388 2387 2386 2384 2383 2382 2381 2380 2378 2377 2376 2375 2374 2372 2371 2370 2369 2368 2367 2365 2364 2363 2362 2361 2359 2358 2357 2356 2355
254B355jkjjjjjkjjjjjkjjjjjkjjjjjjkjjjjjjkjjjjjjkjjjjjjkjjjjjjjkjjjjjjjjkjjjj
$$ 2355 2354 2352 2351 2350 2349 2348 2347 2345 2344 2343 2342 2341 2340 2338 2337 2336 2335 2334 2333 2331 2330 2329 2328 2327 2326 2325 2323 2322 2321 2320 2319 2318 2317 2315 2314 2313 2312 2311 2310 2309 2307 2306 2305 2304 2303 2302 2301 2299 2298 2297 2296 2295 2294 2293 2292 2290 2289 2288 2287 2286 2285 2284 2283 2282 2280 2279 2278 2277 2276
246B276jjjkjjjjjjjjjkjjjjjjjjjkjjjjjjjjjjjkjjjjjjjjjjjkjjjjjjjjjjjjjjkjjjjjj
$$ 2276 2275 2274 2273 2271 2270 2269 2268 2267 2266 2265 2264 2263 2262 2260 2259 2258 2257 2256 2255 2254 2253 2252 2251 2249 2248 2247 2246 2245 2244 2243 2242 2241 2240 2239 2238 2236 2235 2234 2233 2232 2231 2230 2229 2228 2227 2226 2225 2223 2222 2221 2220 2219 2218 2217 2216 2215 2214 2213 2212 2211 2210 2209 2207 2206 2205 2204 2203 2202 2201
237B201jjjjjjjjjjjjkjjjjjjjjjjjjjjjjjjjjjjjjjjkjjjjjjjjjjjjjjjjjjjjjjjjjjjjj
$$ 2201 2200 2199 2198 2197 2196 2195 2194 2193 2192 2191 2190 2189 2187 2186 2185 2184 2183 2182 2181 2180 2179 2178 2177 2176 2175 2174 2173 2172 2171 2170 2169 2168 2167 2166 2165 2164 2163 2162 2161 2159 2158 2157 2156 2155 2154 2153 2152 2151 2150 2149 2148 2147 2146 2145 2144 2143 2142 2141 2140 2139 2138 2137 2136 2135 2134 2133 2132 2131 2130
229B130jjjjjjjjjjjjjjjjjjjjjjjjjjjjjjjjjjjjjjjjjj%jjjjjjjjjjjjjjjjjjjjjjjjjj
$$ 2130 2129 2128 2127 2126 2125 2124 2123 2122 2121 2120 2119 2118 2117 2116 2115 2114 2113 2112 2111 2110 2109 2108 2107 2106 2105 2104 2103 2102 2101 2100 2099 2098 2097 2096 2095 2094 2093 2092 2091 2090 2089 2088 2088 2087 2086 2085 2084 2083 2082 2081 2080 2079 2078 2077 2076 2075 2074 2073 2072 2071 2070 2069 2068 2067 2066 2065 2064 2063 2062
220B062j%jjjjjjjjjjjjjjjjjj%jjjjjjjjjjjjjjj%jjjjjjjjjjjjj%jjjjjjjjjjj%jjjjjj
$$ 2062 2061 2061 2060 2059 2058 2057 2056 2055 2054 2053 2052 2051 2050 2049 2048 2047 2046 2045 2044 2043 2043 2042 2041 2040 2039 2038 2037 2036 2035 2034 2033 2032 2031 2030 2029 2028 2028 2027 2026 2025 2024 2023 2022 2021 2020 2019 2018 2017 2016 2015 2015 2014 2013 2012 2011 2010 2009 2008 2007 2006 2005 2004 2004 2003 2002 2001 2000 1999 1998
212A998jjjj%jjjjjjjjjj%jjjjjjjj%jjjjjjjjj%jjjjjjj%jjjjjjjj%jjjjjjj%jjjjjjj%j
$$ 1998 1997 1996 1995 1994 1994 1993 1992 1991 1990 1989 1988 1987 1986 1985 1984 1984 1983 1982 1981 1980 1979 1978 1977 1976 1976 1975 1974 1973 1972 1971 1970 1969 1968 1967 1967 1966 1965 1964 1963 1962 1961 1960 1960 1959 1958 1957 1956 1955 1954 1953 1952 1952 1951 1950 1949 1948 1947 1946 1945 1945 1944 1943 1942 1941 1940 1939 1938 1938 1937
204A937jjjjj%jjjjjj%jjjjjj%jjjjjj%jjjjjj%jjjjj%jjjjjj%jjjjj%jjjjj%jjjjj%jjjj
$$ 1937 1936 1935 1934 1933 1932 1932 1931 1930 1929 1928 1927 1926 1926 1925 1924 1923 1922 1921 1920 1920 1919 1918 1917 1916 1915 1914 1914 1913 1912 1911 1910 1909 1908 1908 1907 1906 1905 1904 1903 1903 1902 1901 1900 1899 1898 1897 1897 1896 1895 1894 1893 1892 1892 1891 1890 1889 1888 1887 1887 1886 1885 1884 1883 1882 1882 1881 1880 1879 1878
195A878j%jjjj%jjjjj%jjjjj%jjjj%jjjj%jjjjj%jjjj%jjjj%jjjj%jjjj%jjjj%jjjj%jjjj
$$ 1878 1877 1877 1876 1875 1874 1873 1873 1872 1871 1870 1869 1868 1868 1867 1866 1865 1864 1863 1863 1862 1861 1860 1859 1859 1858 1857 1856 1855 1855 1854 1853 1852 1851 1850 1850 1849 1848 1847 1846 1846 1845 1844 1843 1842 1842 1841 1840 1839 1838 1838 1837 1836 1835 1834 1834 1833 1832 1831 1830 1830 1829 1828 1827 1826 1826 1825 1824 1823 1822
187A822%jjj%jjjj%jjjj%jjj%jjjj%jjj%jjjj%jjj%jjj%jjjj%jjj%jjj%jjj%jjj%jjjj%jj
$$ 1822 1822 1821 1820 1819 1819 1818 1817 1816 1815 1815 1814 1813 1812 1811 1811 1810 1809 1808 1808 1807 1806 1805 1804 1804 1803 1802 1801 1801 1800 1799 1798 1797 1797 1796 1795 1794 1794 1793 1792 1791 1791 1790 1789 1788 1787 1787 1786 1785 1784 1784 1783 1782 1781 1781 1780 1779 1778 1778 1777 1776 1775 1775 1774 1773 1772 1771 1771 1770 1769
178A769j%jjj%jjj%jjj%jjj%jjj%jjj%jj%jjj%jjj%jjj%jjj%jj%jjj%jjj%jj%jjj%jjj%jj
$$ 1769 1768 1768 1767 1766 1765 1765 1764 1763 1762 1762 1761 1760 1759 1759 1758 1757 1756 1756 1755 1754 1753 1753 1752 1751 1750 1750 1749 1748 1748 1747 1746 1745 1745 1744 1743 1742 1742 1741 1740 1739 1739 1738 1737 1736 1736 1735 1734 1734 1733 1732 1731 1731 1730 1729 1728 1728 1727 1726 1726 1725 1724 1723 1723 1722 1721 1720 1720 1719 1718
170A718%jjj%jj%jjj%jj%jjj%jj%jjj%jj%jjj%jj%jj%jjj%jj%jjj%jj%jj%jj%jjj%jj%jj%
$$ 1718 1718 1717 1716 1715 1715 1714 1713 1713 1712 1711 1710 1710 1709 1708 1708 1707 1706 1705 1705 1704 1703 1703 1702 1701 1700 1700 1699 1698 1698 1697 1696 1695 1695 1694 1693 1693 1692 1691 1691 1690 1689 1688 1688 1687 1686 1686 1685 1684 1683 1683 1682 1681 1681 1680 1679 1679 1678 1677 1677 1676 1675 1674 1674 1673 1672 1672 1671 1670 1670
161A670jj%jjj%jj%jj%jj%jj%jj%jjj%jj%jj%jj%jj%jj%jj%jj%jj%jj%jj%jj%jj%jj%jj%j
$$ 1670 1669 1668 1668 1667 1666 1665 1665 1664 1663 1663 1662 1661 1661 1660 1659 1659 1658 1657 1657 1656 1655 1655 1654 1653 1652 1652 1651 1650 1650 1649 1648 1648 1647 1646 1646 1645 1644 1644 1643 1642 1642 1641 1640 1640 1639 1638 1638 1637 1636 1636 1635 1634 1634 1633 1632 1632 1631 1630 1630 1629 1628 1628 1627 1626 1626 1625 1624 1624 1623
153A623j%jj%jj%jj%jj%jj%j%jj%jj%jj%jj%jj%jj%j%jj%jj%jj%jj%j%jj%jj%jj%j%jj%jj
$$ 1623 1622 1622 1621 1620 1620 1619 1618 1618 1617 1616 1616 1615 1614 1614 1613 1612 1612 1611 1611 1610 1609 1609 1608 1607 1607 1606 1605 1605 1604 1603 1603 1602 1601 1601 1600 1599 1599 1598 1598 1597 1596 1596 1595 1594 1594 1593 1592 1592 1591 1590 1590 1589 1589 1588 1587 1587 1586 1585 1585 1584 1583 1583 1582 1582 1581 1580 1580 1579 1578
145A578%jj%j%jj%jj%j%jj%jj%j%jj%jj%j%jj%jj%j%jj%jj%j%jj%j%jj%j%jj%jj%j%jj%j%
$$ 1578 1578 1577 1576 1576 1575 1575 1574 1573 1573 1572 1571 1571 1570 1570 1569 1568 1568 1567 1566 1566 1565 1565 1564 1563 1563 1562 1561 1561 1560 1560 1559 1558 1558 1557 1556 1556 1555 1555 1554 1553 1553 1552 1551 1551 1550 1550 1549 1548 1548 1547 1547 1546 1545 1545 1544 1544 1543 1542 1542 1541 1540 1540 1539 1539 1538 1537 1537 1536 1536
136A536jj%j%jj%j%jj%j%jj%j%jj%j%jj%j%jj%j%jj%j%jj%j%jj%j%j%jj%j%jj%j%jj%j%j%
$$ 1536 1535 1534 1534 1533 1533 1532 1531 1531 1530 1530 1529 1528 1528 1527 1527 1526 1525 1525 1524 1524 1523 1522 1522 1521 1521 1520 1519 1519 1518 1518 1517 1516 1516 1515 1515 1514 1513 1513 1512 1512 1511 1510 1510 1509 1509 1508 1507 1507 1506 1506 1505 1505 1504 1503 1503 1502 1502 1501 1500 1500 1499 1499 1498 1497 1497 1496 1496 1495 1495
128A495jj%j%j%jj%j%jj%j%j%jj%j%j%jj%j%j%jj%j%j%jj%j%j%jj%j%j%j%jj%j%j%jj%j%j
$$ 1495 1494 1493 1493 1492 1492 1491 1491 1490 1489 1489 1488 1488 1487 1486 1486 1485 1485 1484 1484 1483 1482 1482 1481 1481 1480 1480 1479 1478 1478 1477 1477 1476 1476 1475 1474 1474 1473 1473 1472 1472 1471 1470 1470 1469 1469 1468 1468 1467 1466 1466 1465 1465 1464 1464 1463 1463 1462 1461 1461 1460 1460 1459 1459 1458 1457 1457 1456 1456 1455
119A455%j%jj%j%j%j%jj%j%j%j%jj%j%j%j%j%jj%j%j%j%jj%j%j%j%j%j%jj%j%j%j%j%j%jj
$$ 1455 1455 1454 1454 1453 1452 1452 1451 1451 1450 1450 1449 1449 1448 1447 1447 1446 1446 1445 1445 1444 1444 1443 1442 1442 1441 1441 1440 1440 1439 1439 1438 1438 1437 1436 1436 1435 1435 1434 1434 1433 1433 1432 1431 1431 1430 1430 1429 1429 1428 1428 1427 1427 1426 1426 1425 1424 1424 1423 1423 1422 1422 1421 1421 1420 1420 1419 1419 1418 1417
111A417%j%j%j%j%j%jj%j%j%j%j%j%j%j%jj%j%j%j%j%j%j%j%j%j%jj%j%j%j%j%j%j%j%j%j
$$ 1417 1417 1416 1416 1415 1415 1414 1414 1413 1413 1412 1412 1411 1410 1410 1409 1409 1408 1408 1407 1407 1406 1406 1405 1405 1404 1404 1403 1403 1402 1401 1401 1400 1400 1399 1399 1398 1398 1397 1397 1396 1396 1395 1395 1394 1394 1393 1393 1392 1392 1391 1390 1390 1389 1389 1388 1388 1387 1387 1386 1386 1385 1385 1384 1384 1383 1383 1382 1382 1381
102A381%j%j%j%j%jj%j%j%j%j%j%j%j%j%j%j%j%j%j%j%j%j%j%j%j%j%j%j%j%j%j%j%j%j%j
$$ 1381 1381 1380 1380 1379 1379 1378 1378 1377 1377 1376 1375 1375 1374 1374 1373 1373 1372 1372 1371 1371 1370 1370 1369 1369 1368 1368 1367 1367 1366 1366 1365 1365 1364 1364 1363 1363 1362 1362 1361 1361 1360 1360 1359 1359 1358 1358 1357 1357 1356 1356 1355 1355 1354 1354 1353 1353 1352 1352 1351 1351 1350 1350 1349 1349 1348 1348 1347 1347 1346
94A346%j%j%j%j%j%j%j%j%j%j%j%j%j%j%%j%j%j%j%j%j%j%j%j%j%j%j%j%j%%j%j%j%j%j%j
$$ 1346 1346 1345 1345 1344 1344 1343 1343 1342 1342 1341 1341 1340 1340 1339 1339 1338 1338 1337 1337 1336 1336 1335 1335 1334 1334 1333 1333 1332 1332 1332 1331 1331 1330 1330 1329 1329 1328 1328 1327 1327 1326 1326 1325 1325 1324 1324 1323 1323 1322 1322 1321 1321 1320 1320 1319 1319 1318 1318 1318 1317 1317 1316 1316 1315 1315 1314 1314 1313 1313 1312
85A312%j%j%j%j%j%%j%j%j%j%j%j%j%j%%j%j%j%j%j%j%j%%j%j%j%j%j%j%%j%j%j%j%j%j%%
$$ 1312 1312 1311 1311 1310 1310 1309 1309 1308 1308 1307 1307 1307 1306 1306 1305 1305 1304 1304 1303 1303 1302 1302 1301 1301 1300 1300 1299 1299 1299 1298 1298 1297 1297 1296 1296 1295 1295 1294 1294 1293 1293 1292 1292 1292 1291 1291 1290 1290 1289 1289 1288 1288 1287 1287 1286 1286 1286 1285 1285 1284 1284 1283 1283 1282 1282 1281 1281 1280 1280 1280
77A280j%j%j%j%j%%j%j%j%j%j%%j%j%j%j%j%%j%j%j%j%j%%j%j%j%j%%j%j%j%j%%j%j%j%j%
$$ 1280 1279 1279 1278 1278 1277 1277 1276 1276 1275 1275 1275 1274 1274 1273 1273 1272 1272 1271 1271 1270 1270 1270 1269 1269 1268 1268 1267 1267 1266 1266 1265 1265 1265 1264 1264 1263 1263 1262 1262 1261 1261 1260 1260 1260 1259 1259 1258 1258 1257 1257 1256 1256 1256 1255 1255 1254 1254 1253 1253 1252 1252 1252 1251 1251 1250 1250 1249 1249 1248 1248
68A248%j%j%j%%j%j%j%j%%j%j%j%%j%j%j%j%%j%j%j%%j%j%j%%j%j%j%%j%j%j%%j%j%j%%j%
$$ 1248 1248 1247 1247 1246 1246 1245 1245 1245 1244 1244 1243 1243 1242 1242 1241 1241 1241 1240 1240 1239 1239 1238 1238 1238 1237 1237 1236 1236 1235 1235 1234 1234 1234 1233 1233 1232 1232 1231 1231 1231 1230 1230 1229 1229 1228 1228 1228 1227 1227 1226 1226 1225 1225 1225 1224 1224 1223 1223 1222 1222 1222 1221 1221 1220 1220 1219 1219 1219 1218 1218
60A218j%j%%j%j%%j%j%j%%j%j%j%%j%j%%j%j%j%%j%j%%j%j%j%%j%j%%j%j%j%%j%j%%j%j%%
$$ 1218 1217 1217 1216 1216 1216 1215 1215 1214 1214 1214 1213 1213 1212 1212 1211 1211 1211 1210 1210 1209 1209 1208 1208 1208 1207 1207 1206 1206 1206 1205 1205 1204 1204 1203 1203 1203 1202 1202 1201 1201 1201 1200 1200 1199 1199 1198 1198 1198 1197 1197 1196 1196 1196 1195 1195 1194 1194 1193 1193 1193 1192 1192 1191 1191 1191 1190 1190 1189 1189 1189
51A189j%j%%j%j%j%%j%j%%j%j%%j%j%%j%j%%j%j%%j%j%%j%j%%j%j%%j%j%%j%j%%j%j%%j%j
$$ 1189 1188 1188 1187 1187 1187 1186 1186 1185 1185 1184 1184 1184 1183 1183 1182 1182 1182 1181 1181 1180 1180 1180 1179 1179 1178 1178 1178 1177 1177 1176 1176 1176 1175 1175 1174 1174 1174 1173 1173 1172 1172 1172 1171 1171 1170 1170 1170 1169 1169 1168 1168 1168 1167 1167 1166 1166 1166 1165 1165 1164 1164 1164 1163 1163 1162 1162 1162 1161 1161 1160
43A160%%j%j%%j%j%%j%%j%j%%j%j%%j%j%%j%%j%j%%j%j%%j%%j%j%%j%j%%j%%j%j%%j%j%%j
$$ 1160 1160 1160 1159 1159 1158 1158 1158 1157 1157 1156 1156 1156 1155 1155 1155 1154 1154 1153 1153 1153 1152 1152 1151 1151 1151 1150 1150 1149 1149 1149 1148 1148 1148 1147 1147 1146 1146 1146 1145 1145 1144 1144 1144 1143 1143 1143 1142 1142 1141 1141 1141 1140 1140 1139 1139 1139 1138 1138 1138 1137 1137 1136 1136 1136 1135 1135 1134 1134 1134 1133
34A133%%j%j%%j%%j%j%%j%j%%j%%j%j%%j%%j%j%%j%%j%%j%j%%j%%j%j%%j%%j%j%%j%%j%%j
$$ 1133 1133 1133 1132 1132 1131 1131 1131 1130 1130 1130 1129 1129 1128 1128 1128 1127 1127 1126 1126 1126 1125 1125 1125 1124 1124 1123 1123 1123 1122 1122 1122 1121 1121 1120 1120 1120 1119 1119 1119 1118 1118 1118 1117 1117 1116 1116 1116 1115 1115 1115 1114 1114 1113 1113 1113 1112 1112 1112 1111 1111 1110 1110 1110 1109 1109 1109 1108 1108 1108 1107
26A107%j%%j%%j%%j%j%%j%%j%j%%j%%j%%j%%j%j%%j%%j%%j%j%%j%%j%%j%%j%j%%j%%j%%j%
$$ 1107 1107 1106 1106 1106 1105 1105 1105 1104 1104 1104 1103 1103 1102 1102 1102 1101 1101 1101 1100 1100 1099 1099 1099 1098 1098 1098 1097 1097 1097 1096 1096 1096 1095 1095 1094 1094 1094 1093 1093 1093 1092 1092 1092 1091 1091 1090 1090 1090 1089 1089 1089 1088 1088 1088 1087 1087 1087 1086 1086 1085 1085 1085 1084 1084 1084 1083 1083 1083 1082 1082
17A082%j%%j%j%%j%%j%%j%%j%%j%j%%j%%j%%j%%j%%j%%j%%j%j%%j%%j%%j%%j%%j%%j%%j%%
$$ 1082 1082 1081 1081 1081 1080 1080 1079 1079 1079 1078 1078 1078 1077 1077 1077 1076 1076 1076 1075 1075 1075 1074 1074 1073 1073 1073 1072 1072 1072 1071 1071 1071 1070 1070 1070 1069 1069 1069 1068 1068 1068 1067 1067 1067 1066 1066 1065 1065 1065 1064 1064 1064 1063 1063 1063 1062 1062 1062 1061 1061 1061 1060 1060 1060 1059 1059 1059 1058 1058 1058
9A058j%%j%%j%j%%j%%j%%j%%j%%j%%j%%j%%j%%j%%j%%j%%j%%j%%j%%j%%j%%j%%j%%j%%j%%
$$ 1058 1057 1057 1057 1056 1056 1056 1055 1055 1054 1054 1054 1053 1053 1053 1052 1052 1052 1051 1051 1051 1050 1050 1050 1049 1049 1049 1048 1048 1048 1047 1047 1047 1046 1046 1046 1045 1045 1045 1044 1044 1044 1043 1043 1043 1042 1042 1042 1041 1041 1041 1040 1040 1040 1039 1039 1039 1038 1038 1038 1037 1037 1037 1036 1036 1036 1035 1035 1035 1034 1034 1034
0A034j%%j%%j%%j%%j%%j%%j%%j%%j%%%j%%j%%j%%j%%j%%j%%j%%j%%j%%j%%j%%%j%%j%%j%%
$$ 1034 1033 1033 1033 1032 1032 1032 1031 1031 1031 1030 1030 1030 1029 1029 1029 1028 1028 1028 1027 1027 1027 1026 1026 1026 1025 1025 1025 1025 1024 1024 1024 1023 1023 1023 1022 1022 1022 1021 1021 1021 1020 1020 1020 1019 1019 1019 1018 1018 1018 1017 1017 1017 1016 1016 1016 1015 1015 1015 1014 1014 1014 1014 1013 1013 1013 1012 1012 1012 1011 1011 1011
-9A011j%%j%%j%%j%%%j%%j%%j%%j%%j%%j%%%j%%j%%j%%j%%j%%%j%%j%%j%%j%%j%%%j%%j%%
$$ 1011 1010 1010 1010 1009 1009 1009 1008 1008 1008 1007 1007 1007 1007 1006 1006 1006 1005 1005 1005 1004 1004 1004 1003 1003 1003 1002 1002 1002 1001 1001 1001 1001 1000 1000 1000 999 999 999 998 998 998 997 997 997 996 996 996 996 995 995 995 994 994 994 993 993 993 992 992 992 991 991 991 991 990 990 990 989 989 989
-17I89j%%j%%%j%%j%%j%%j%%%j%%j%%j%%%j%%j%%j%%j%%%j%%j%%j%%%j%%j%%j%%%j%%j%%j
$$ 989 988 988 988 987 987 987 987 986 986 986 985 985 985 984 984 984 983 983 983 983 982 982 982 981 981 981 980 980 980 980 979 979 979 978 978 978 977 977 977 976 976 976 976 975 975 975 974 974 974 973 973 973 973 972 972 972 971 971 971 970 970 970 970 969 969 969 968 968 968 967
-26I67%%%j%%j%%j%%%j%%j%%%j%%j%%j%%%j%%j%%%j%%j%%j%%%j%%j%%%j%%j%%%j%%j%%%j%
$$ 967 967 967 967 966 966 966 965 965 965 964 964 964 964 963 963 963 962 962 962 962 961 961 961 960 960 960 959 959 959 959 958 958 958 957 957 957 957 956 956 956 955 955 955 954 954 954 954 953 953 953 952 952 952 952 951 951 951 950 950 950 950 949 949 949 948 948 948 948 947 947
-34I47%j%%j%%%j%%j%%%j%%j%%%j%%j%%%j%%j%%%j%%j%%%j%%%j%%j%%%j%%j%%%j%%j%%%j%
$$ 947 947 946 946 946 945 945 945 945 944 944 944 943 943 943 943 942 942 942 941 941 941 941 940 940 940 939 939 939 939 938 938 938 937 937 937 937 936 936 936 935 935 935 935 934 934 934 934 933 933 933 932 932 932 932 931 931 931 930 930 930 930 929 929 929 928 928 928 928 927 927
-43I27%j%%%j%%%j%%j%%%j%%j%%%j%%%j%%j%%%j%%%j%%j%%%j%%%j%%j%%%j%%%j%%j%%%j%%
$$ 927 927 926 926 926 926 925 925 925 925 924 924 924 923 923 923 923 922 922 922 921 921 921 921 920 920 920 920 919 919 919 918 918 918 918 917 917 917 917 916 916 916 915 915 915 915 914 914 914 914 913 913 913 912 912 912 912 911 911 911 911 910 910 910 909 909 909 909 908 908 908
-52I08%j%%j%%%j%%%j%%%j%%j%%%j%%%j%%j%%%j%%%j%%%j%%%j%%j%%%j%%%j%%%j%%j%%%j%
$$ 908 908 907 907 907 906 906 906 906 905 905 905 905 904 904 904 904 903 903 903 902 902 902 902 901 901 901 901 900 900 900 899 899 899 899 898 898 898 898 897 897 897 897 896 896 896 896 895 895 895 894 894 894 894 893 893 893 893 892 892 892 892 891 891 891 890 890 890 890 889 889
-60H89%%j%%%j%%%j%%%j%%j%%%j%%%j%%%j%%%j%%%j%%%j%%%j%%j%%%j%%%j%%%j%%%j%%%j%
$$ 889 889 889 888 888 888 888 887 887 887 887 886 886 886 886 885 885 885 884 884 884 884 883 883 883 883 882 882 882 882 881 881 881 881 880 880 880 880 879 879 879 879 878 878 878 878 877 877 877 876 876 876 876 875 875 875 875 874 874 874 874 873 873 873 873 872 872 872 872 871 871
-69H71%%j%%%j%%%j%%%j%%%j%%%j%%%j%%%j%%%j%%%j%%%j%%%j%%%j%%%j%%%j%%%j%%%j%%%
$$ 871 871 871 870 870 870 870 869 869 869 869 868 868 868 868 867 867 867 867 866 866 866 866 865 865 865 865 864 864 864 864 863 863 863 863 862 862 862 862 861 861 861 861 860 860 860 860 859 859 859 859 858 858 858 858 857 857 857 857 856 856 856 856 855 855 855 855 854 854 854 854
-77H54j%%%j%%%j%%%j%%%j%%%j%%%%j%%%j%%%j%%%j%%%j%%%j%%%j%%%j%%%%j%%%j%%%j%%%
$$ 854 853 853 853 853 852 852 852 852 851 851 851 851 850 850 850 850 849 849 849 849 848 848 848 848 848 847 847 847 847 846 846 846 846 845 845 845 845 844 844 844 844 843 843 843 843 842 842 842 842 841 841 841 841 840 840 840 840 840 839 839 839 839 838 838 838 838 837 837 837 837
-86H37j%%%j%%%%j%%%j%%%j%%%j%%%j%%%%j%%%j%%%j%%%%j%%%j%%%j%%%j%%%%j%%%j%%%j%
$$ 837 836 836 836 836 835 835 835 835 835 834 834 834 834 833 833 833 833 832 832 832 832 831 831 831 831 830 830 830 830 830 829 829 829 829 828 828 828 828 827 827 827 827 827 826 826 826 826 825 825 825 825 824 824 824 824 823 823 823 823 823 822 822 822 822 821 821 821 821 820 820
-94H20%%%j%%%j%%%j%%%%j%%%j%%%j%%%%j%%%j%%%j%%%%j%%%j%%%%j%%%j%%%%j%%%j%%%j%
$$ 820 820 820 820 819 819 819 819 818 818 818 818 817 817 817 817 817 816 816 816 816 815 815 815 815 814 814 814 814 814 813 813 813 813 812 812 812 812 811 811 811 811 811 810 810 810 810 809 809 809 809 809 808 808 808 808 807 807 807 807 807 806 806 806 806 805 805 805 805 804 804
-103H04%%%j%%%j%%%%j%%%j%%%%j%%%j%%%%j%%%j%%%%j%%%j%%%%j%%%j%%%%j%%%%j%%%j%%
$$ 804 804 804 804 803 803 803 803 802 802 802 802 802 801 801 801 801 800 800 800 800 800 799 799 799 799 798 798 798 798 798 797 797 797 797 796 796 796 796 796 795 795 795 795 794 794 794 794 794 793 793 793 793 792 792 792 792 792 791 791 791 791 791 790 790 790 790 789 789 789
-111G89%%j%%%j%%%%j%%%%j%%%j%%%%j%%%j%%%%j%%%%j%%%j%%%%j%%%%j%%%j%%%%j%%%%j%
$$ 789 789 789 788 788 788 788 787 787 787 787 787 786 786 786 786 786 785 785 785 785 784 784 784 784 784 783 783 783 783 782 782 782 782 782 781 781 781 781 781 780 780 780 780 779 779 779 779 779 778 778 778 778 778 777 777 777 777 776 776 776 776 776 775 775 775 775 775 774 774
-120G74%%%j%%%j%%%%j%%%%j%%%%j%%%j%%%%j%%%%j%%%%j%%%%j%%%j%%%%j%%%%j%%%%j%%%
$$ 774 774 774 774 773 773 773 773 772 772 772 772 772 771 771 771 771 771 770 770 770 770 770 769 769 769 769 768 768 768 768 768 767 767 767 767 767 766 766 766 766 766 765 765 765 765 765 764 764 764 764 763 763 763 763 763 762 762 762 762 762 761 761 761 761 761 760 760 760 760
-128G60%j%%%%j%%%%j%%%j%%%%j%%%%j%%%%j%%%%j%%%%j%%%%j%%%%j%%%%j%%%%j%%%%j%%%
$$ 760 760 759 759 759 759 759 758 758 758 758 758 757 757 757 757 756 756 756 756 756 755 755 755 755 755 754 754 754 754 754 753 753 753 753 753 752 752 752 752 752 751 751 751 751 751 750 750 750 750 750 749 749 749 749 749 748 748 748 748 748 747 747 747 747 747 746 746 746 746
-137G46%j%%%%j%%%%j%%%%j%%%%j%%%%j%%%%j%%%%j%%%%j%%%%j%%%%j%%%%j%%%%%j%%%%j%
$$ 746 746 745 745 745 745 745 744 744 744 744 744 743 743 743 743 743 742 742 742 742 742 741 741 741 741 741 740 740 740 740 740 739 739 739 739 739 738 738 738 738 738 737 737 737 737 737 736 736 736 736 736 735 735 735 735 735 734 734 734 734 734 734 733 733 733 733 733 732 732
-145G32%%%j%%%%j%%%%j%%%%j%%%%%j%%%%j%%%%j%%%%j%%%%j%%%%%j%%%%j%%%%j%%%%j%%%
$$ 732 732 732 732 731 731 731 731 731 730 730 730 730 730 729 729 729 729 729 728 728 728 728 728 728 727 727 727 727 727 726 726 726 726 726 725 725 725 725 725 724 724 724 724 724 723 723 723 723 723 723 722 722 722 722 722 721 721 721 721 721 720 720 720 720 720 719 719 719 719
-153G19%%j%%%%j%%%%j%%%%%j%%%%j%%%%j%%%%%j%%%%j%%%%%j%%%%j%%%%j%%%%%j%%%%j%%
$$ 719 719 719 718 718 718 718 718 717 717 717 717 717 716 716 716 716 716 716 715 715 715 715 715 714 714 714 714 714 713 713 713 713 713 713 712 712 712 712 712 711 711 711 711 711 711 710 710 710 710 710 709 709 709 709 709 708 708 708 708 708 708 707 707 707 707 707 706 706 706
-162G06%%%j%%%%j%%%%%j%%%%j%%%%j%%%%%j%%%%j%%%%%j%%%%%j%%%%j%%%%%j%%%%j%%%%%
$$ 706 706 706 706 705 705 705 705 705 704 704 704 704 704 704 703 703 703 703 703 702 702 702 702 702 701 701 701 701 701 701 700 700 700 700 700 699 699 699 699 699 699 698 698 698 698 698 698 697 697 697 697 697 696 696 696 696 696 696 695 695 695 695 695 694 694 694 694 694 694
-170F94j%%%%j%%%%%j%%%%%j%%%%j%%%%%j%%%%%j%%%%j%%%%%j%%%%%j%%%%j%%%%%j%%%%%j
$$ 694 693 693 693 693 693 692 692 692 692 692 692 691 691 691 691 691 691 690 690 690 690 690 689 689 689 689 689 689 688 688 688 688 688 688 687 687 687 687 687 686 686 686 686 686 686 685 685 685 685 685 685 684 684 684 684 684 683 683 683 683 683 683 682 682 682 682 682 682 681
-179F81%%%%%j%%%%j%%%%%j%%%%%j%%%%%j%%%%%j%%%%j%%%%%j%%%%%j%%%%%j%%%%%j%%%%%
$$ 681 681 681 681 681 681 680 680 680 680 680 679 679 679 679 679 679 678 678 678 678 678 678 677 677 677 677 677 677 676 676 676 676 676 676 675 675 675 675 675 674 674 674 674 674 674 673 673 673 673 673 673 672 672 672 672 672 672 671 671 671 671 671 671 670 670 670 670 670 670
-187F70j%%%%%j%%%%%j%%%%j%%%%%j%%%%%j%%%%%j%%%%%j%%%%%j%%%%%j%%%%%j%%%%%j%%%
$$ 670 669 669 669 669 669 669 668 668 668 668 668 668 667 667 667 667 667 666 666 666 666 666 666 665 665 665 665 665 665 664 664 664 664 664 664 663 663 663 663 663 663 662 662 662 662 662 662 661 661 661 661 661 661 660 660 660 660 660 660 659 659 659 659 659 659 658 658 658 658
-195F58%%j%%%%%%j%%%%%j%%%%%j%%%%%j%%%%%j%%%%%j%%%%%j%%%%%j%%%%%%j%%%%%j%%%%
$$ 658 658 658 657 657 657 657 657 657 657 656 656 656 656 656 656 655 655 655 655 655 655 654 654 654 654 654 654 653 653 653 653 653 653 652 652 652 652 652 652 651 651 651 651 651 651 650 650 650 650 650 650 649 649 649 649 649 649 649 648 648 648 648 648 648 647 647 647 647 647
-204F47%j%%%%%j%%%%%%j%%%%%j%%%%%j%%%%%j%%%%%%j%%%%%j%%%%%j%%%%%%j%%%%%j%%%%
$$ 647 647 646 646 646 646 646 646 645 645 645 645 645 645 645 644 644 644 644 644 644 643 643 643 643 643 643 642 642 642 642 642 642 641 641 641 641 641 641 641 640 640 640 640 640 640 639 639 639 639 639 639 638 638 638 638 638 638 638 637 637 637 637 637 637 636 636 636 636 636
-212F36%%j%%%%%j%%%%%j%%%%%%j%%%%%j%%%%%%j%%%%%j%%%%%%j%%%%%j%%%%%%j%%%%%j%%
$$ 636 636 636 635 635 635 635 635 635 634 634 634 634 634 634 633 633 633 633 633 633 633 632 632 632 632 632 632 631 631 631 631 631 631 631 630 630 630 630 630 630 629 629 629 629 629 629 629 628 628 628 628 628 628 627 627 627 627 627 627 627 626 626 626 626 626 626 625 625 625
-221F25%%%%j%%%%%j%%%%%%j%%%%%%j%%%%%j%%%%%%j%%%%%j%%%%%%j%%%%%%j%%%%%%j%%%%
$$ 625 625 625 625 625 624 624 624 624 624 624 623 623 623 623 623 623 623 622 622 622 622 622 622 622 621 621 621 621 621 621 620 620 620 620 620 620 620 619 619 619 619 619 619 618 618 618 618 618 618 618 617 617 617 617 617 617 617 616 616 616 616 616 616 616 615 615 615 615 615
-229F15%j%%%%%%j%%%%%%j%%%%%%j%%%%%j%%%%%%j%%%%%%j%%%%%%j%%%%%%j%%%%%%j%%%%%
$$ 615 615 614 614 614 614 614 614 614 613 613 613 613 613 613 613 612 612 612 612 612 612 612 611 611 611 611 611 611 610 610 610 610 610 610 610 609 609 609 609 609 609 609 608 608 608 608 608 608 608 607 607 607 607 607 607 607 606 606 606 606 606 606 606 605 605 605 605 605 605
-238F05j%%%%%%j%%%%%%j%%%%%%j%%%%%%j%%%%%%j%%%%%%j%%%%%%j%%%%%%j%%%%%%j%%%%%
$$ 605 604 604 604 604 604 604 604 603 603 603 603 603 603 603 602 602 602 602 602 602 602 601 601 601 601 601 601 601 600 600 600 600 600 600 600 599 599 599 599 599 599 599 598 598 598 598 598 598 598 597 597 597 597 597 597 597 596 596 596 596 596 596 596 595 595 595 595 595 595
-246E95%j%%%%%%j%%%%%%%j%%%%%%j%%%%%%j%%%%%%j%%%%%%j%%%%%%j%%%%%%%j%%%%%%j%%
$$ 595 595 594 594 594 594 594 594 594 593 593 593 593 593 593 593 593 592 592 592 592 592 592 592 591 591 591 591 591 591 591 590 590 590 590 590 590 590 589 589 589 589 589 589 589 588 588 588 588 588 588 588 587 587 587 587 587 587 587 587 586 586 586 586 586 586 586 585 585 585
-254E85%%%%j%%%%%%j%%%%%%%j%%%%%%j%%%%%%j%%%%%%%j%%%%%%j%%%%%%j%%%%%%%j%%%%%
$$ 585 585 585 585 585 584 584 584 584 584 584 584 583 583 583 583 583 583 583 583 582 582 582 582 582 582 582 581 581 581 581 581 581 581 580 580 580 580 580 580 580 580 579 579 579 579 579 579 579 578 578 578 578 578 578 578 577 577 577 577 577 577 577 577 576 576 576 576 576 576
-263E76%j%%%%%%%j%%%%%%j%%%%%%%j%%%%%%j%%%%%%%j%%%%%%j%%%%%%%j%%%%%%%j%%%%%%
$$ 576 576 575 575 575 575 575 575 575 575 574 574 574 574 574 574 574 573 573 573 573 573 573 573 573 572 572 572 572 572 572 572 571 571 571 571 571 571 571 571 570 570 570 570 570 570 570 569 569 569 569 569 569 569 569 568 568 568 568 568 568 568 568 567 567 567 567 567 567 567
-271E67j%%%%%%%j%%%%%%j%%%%%%%j%%%%%%%j%%%%%%%j%%%%%%j%%%%%%%j%%%%%%%j%%%%%%
$$ 567 566 566 566 566 566 566 566 566 565 565 565 565 565 565 565 564 564 564 564 564 564 564 564 563 563 563 563 563 563 563 563 562 562 562 562 562 562 562 562 561 561 561 561 561 561 561 560 560 560 560 560 560 560 560 559 559 559 559 559 559 559 559 558 558 558 558 558 558 558
-280E58%j%%%%%%j%%%%%%%j%%%%%%%j%%%%%%%j%%%%%%%j%%%%%%%j%%%%%%%j%%%%%%%j%%%%
$$ 558 558 557 557 557 557 557 557 557 556 556 556 556 556 556 556 556 555 555 555 555 555 555 555 555 554 554 554 554 554 554 554 554 553 553 553 553 553 553 553 553 552 552 552 552 552 552 552 552 551 551 551 551 551 551 551 551 550 550 550 550 550 550 550 550 549 549 549 549 549
-288E49%%%j%%%%%%%j%%%%%%%j%%%%%%%j%%%%%%%j%%%%%%%j%%%%%%%j%%%%%%%%j%%%%%%%j
$$ 549 549 549 549 548 548 548 548 548 548 548 548 547 547 547 547 547 547 547 547 546 546 546 546 546 546 546 546 545 545 545 545 545 545 545 545 544 544 544 544 544 544 544 544 543 543 543 543 543 543 543 543 542 542 542 542 542 542 542 542 542 541 541 541 541 541 541 541 541 540
-297E40%%%%%%%j%%%%%%%j%%%%%%%j%%%%%%%%j%%%%%%%j%%%%%%%j%%%%%%%%j%%%%%%%j%%%
$$ 540 540 540 540 540 540 540 540 539 539 539 539 539 539 539 539 538 538 538 538 538 538 538 538 537 537 537 537 537 537 537 537 537 536 536 536 536 536 536 536 536 535 535 535 535 535 535 535 535 534 534 534 534 534 534 534 534 534 533 533 533 533 533 533 533 533 532 532 532 532
-305E32%%%%j%%%%%%%%j%%%%%%%j%%%%%%%%j%%%%%%%j%%%%%%%%j%%%%%%%j%%%%%%%%j%%%%
$$ 532 532 532 532 532 531 531 531 531 531 531 531 531 531 530 530 530 530 530 530 530 530 529 529 529 529 529 529 529 529 529 528 528 528 528 528 528 528 528 527 527 527 527 527 527 527 527 527 526 526 526 526 526 526 526 526 525 525 525 525 525 525 525 525 525 524 524 524 524 524
-313E24%%%%j%%%%%%%j%%%%%%%%j%%%%%%%j%%%%%%%%j%%%%%%%%j%%%%%%%%j%%%%%%%j%%%%
$$ 524 524 524 524 524 523 523 523 523 523 523 523 523 522 522 522 522 522 522 522 522 522 521 521 521 521 521 521 521 521 520 520 520 520 520 520 520 520 520 519 519 519 519 519 519 519 519 519 518 518 518 518 518 518 518 518 518 517 517 517 517 517 517 517 517 516 516 516 516 516
-322E16%%%%j%%%%%%%%j%%%%%%%%j%%%%%%%%j%%%%%%%%j%%%%%%%%j%%%%%%%%j%%%%%%%%j%
$$ 516 516 516 516 516 515 515 515 515 515 515 515 515 515 514 514 514 514 514 514 514 514 514 513 513 513 513 513 513 513 513 513 512 512 512 512 512 512 512 512 512 511 511 511 511 511 511 511 511 511 510 510 510 510 510 510 510 510 510 509 509 509 509 509 509 509 509 509 508 508
-330E08%%%%%%%j%%%%%%%%j%%%%%%%%j%%%%%%%%j%%%%%%%%j%%%%%%%%j%%%%%%%%j%%%%%%%
$$ 508 508 508 508 508 508 508 508 507 507 507 507 507 507 507 507 507 506 506 506 506 506 506 506 506 506 505 505 505 505 505 505 505 505 505 504 504 504 504 504 504 504 504 504 503 503 503 503 503 503 503 503 503 502 502 502 502 502 502 502 502 502 501 501 501 501 501 501 501 501
-339E01%%j%%%%%%%%j%%%%%%%%j%%%%%%%%j%%%%%%%%%j%%%%%%%%j%%%%%%%%j%%%%%%%%%j%
$$ 501 501 501 500 500 500 500 500 500 500 500 500 499 499 499 499 499 499 499 499 499 498 498 498 498 498 498 498 498 498 497 497 497 497 497 497 497 497 497 497 496 496 496 496 496 496 496 496 496 495 495 495 495 495 495 495 495 495 494 494 494 494 494 494 494 494 494 494 493 493
-347D93%%%%%%%j%%%%%%%%%j%%%%%%%%j%%%%%%%%%j%%%%%%%%j%%%%%%%%%j%%%%%%%%j%%%%
$$ 493 493 493 493 493 493 493 493 492 492 492 492 492 492 492 492 492 492 491 491 491 491 491 491 491 491 491 490 490 490 490 490 490 490 490 490 490 489 489 489 489 489 489 489 489 489 488 488 488 488 488 488 488 488 488 488 487 487 487 487 487 487 487 487 487 486 486 486 486 486
-356D86%%%%%j%%%%%%%%%j%%%%%%%%%j%%%%%%%%j%%%%%%%%%j%%%%%%%%%j%%%%%%%%%j%%%%
$$ 486 486 486 486 486 486 485 485 485 485 485 485 485 485 485 485 484 484 484 484 484 484 484 484 484 484 483 483 483 483 483 483 483 483 483 482 482 482 482 482 482 482 482 482 482 481 481 481 481 481 481 481 481 481 481 480 480 480 480 480 480 480 480 480 480 479 479 479 479 479
-364D79%%%%%j%%%%%%%%j%%%%%%%%%j%%%%%%%%%j%%%%%%%%%j%%%%%%%%%j%%%%%%%%%j%%%%
$$ 479 479 479 479 479 479 478 478 478 478 478 478 478 478 478 477 477 477 477 477 477 477 477 477 477 476 476 476 476 476 476 476 476 476 476 475 475 475 475 475 475 475 475 475 475 474 474 474 474 474 474 474 474 474 474 473 473 473 473 473 473 473 473 473 473 472 472 472 472 472
-372D72%%%%%%j%%%%%%%%%j%%%%%%%%%j%%%%%%%%%j%%%%%%%%%j%%%%%%%%%j%%%%%%%%%%j%
$$ 472 472 472 472 472 472 472 471 471 471 471 471 471 471 471 471 471 470 470 470 470 470 470 470 470 470 470 469 469 469 469 469 469 469 469 469 469 468 468 468 468 468 468 468 468 468 468 467 467 467 467 467 467 467 467 467 467 466 466 466 466 466 466 466 466 466 466 466 465 465
-381D65%%%%%%%%j%%%%%%%%%j%%%%%%%%%%j%%%%%%%%%j%%%%%%%%%%j%%%%%%%%%j%%%%%%%%
$$ 465 465 465 465 465 465 465 465 465 464 464 464 464 464 464 464 464 464 464 463 463 463 463 463 463 463 463 463 463 463 462 462 462 462 462 462 462 462 462 462 461 461 461 461 461 461 461 461 461 461 461 460 460 460 460 460 460 460 460 460 460 459 459 459 459 459 459 459 459 459
-389D59%%j%%%%%%%%%j%%%%%%%%%%j%%%%%%%%%%j%%%%%%%%%j%%%%%%%%%%j%%%%%%%%%%j%%
$$ 459 459 459 458 458 458 458 458 458 458 458 458 458 457 457 457 457 457 457 457 457 457 457 457 456 456 456 456 456 456 456 456 456 456 456 455 455 455 455 455 455 455 455 455 455 454 454 454 454 454 454 454 454 454 454 454 453 453 453 453 453 453 453 453 453 453 453 452 452 452
-398D52%%%%%%%%j%%%%%%%%%j%%%%%%%%%%j%%%%%%%%%%j%%%%%%%%%%j%%%%%%%%%%j%%%%%%
$$ 452 452 452 452 452 452 452 452 452 451 451 451 451 451 451 451 451 451 451 450 450 450 450 450 450 450 450 450 450 450 449 449 449 449 449 449 449 449 449 449 449 448 448 448 448 448 448 448 448 448 448 448 447 447 447 447 447 447 447 447 447 447 447 446 446 446 446 446 446 446
-406D46%%%%j%%%%%%%%%%j%%%%%%%%%%j%%%%%%%%%%j%%%%%%%%%%j%%%%%%%%%%%j%%%%%%%%
$$ 446 446 446 446 446 445 445 445 445 445 445 445 445 445 445 445 444 444 444 444 444 444 444 444 444 444 444 443 443 443 443 443 443 443 443 443 443 443 442 442 442 442 442 442 442 442 442 442 442 441 441 441 441 441 441 441 441 441 441 441 441 440 440 440 440 440 440 440 440 440
-415D40%%j%%%%%%%%%%j%%%%%%%%%%j%%%%%%%%%%%j%%%%%%%%%%j%%%%%%%%%%%j%%%%%%%%%
$$ 440 440 440 439 439 439 439 439 439 439 439 439 439 439 438 438 438 438 438 438 438 438 438 438 438 437 437 437 437 437 437 437 437 437 437 437 437 436 436 436 436 436 436 436 436 436 436 436 435 435 435 435 435 435 435 435 435 435 435 435 434 434 434 434 434 434 434 434 434 434
-423D34%j%%%%%%%%%%%j%%%%%%%%%%j%%%%%%%%%%%j%%%%%%%%%%j%%%%%%%%%%%j%%%%%%%%%
$$ 434 434 433 433 433 433 433 433 433 433 433 433 433 433 432 432 432 432 432 432 432 432 432 432 432 431 431 431 431 431 431 431 431 431 431 431 431 430 430 430 430 430 430 430 430 430 430 430 429 429 429 429 429 429 429 429 429 429 429 429 428 428 428 428 428 428 428 428 428 428
-431D28%%j%%%%%%%%%%%j%%%%%%%%%%j%%%%%%%%%%%j%%%%%%%%%%%j%%%%%%%%%%%j%%%%%%%
$$ 428 428 428 427 427 427 427 427 427 427 427 427 427 427 427 426 426 426 426 426 426 426 426 426 426 426 425 425 425 425 425 425 425 425 425 425 425 425 424 424 424 424 424 424 424 424 424 424 424 424 423 423 423 423 423 423 423 423 423 423 423 423 422 422 422 422 422 422 422 422
-440D22%%%%j%%%%%%%%%%%j%%%%%%%%%%%j%%%%%%%%%%%j%%%%%%%%%%%%j%%%%%%%%%%%j%%%
$$ 422 422 422 422 422 421 421 421 421 421 421 421 421 421 421 421 421 420 420 420 420 420 420 420 420 420 420 420 420 419 419 419 419 419 419 419 419 419 419 419 419 418 418 418 418 418 418 418 418 418 418 418 418 418 417 417 417 417 417 417 417 417 417 417 417 417 416 416 416 416
-448D16%%%%%%%%j%%%%%%%%%%%j%%%%%%%%%%%%j%%%%%%%%%%%j%%%%%%%%%%%j%%%%%%%%%%%
$$ 416 416 416 416 416 416 416 416 416 415 415 415 415 415 415 415 415 415 415 415 415 414 414 414 414 414 414 414 414 414 414 414 414 414 413 413 413 413 413 413 413 413 413 413 413 413 412 412 412 412 412 412 412 412 412 412 412 412 411 411 411 411 411 411 411 411 411 411 411 411
-457D11%j%%%%%%%%%%%j%%%%%%%%%%%%j%%%%%%%%%%%%j%%%%%%%%%%%j%%%%%%%%%%%%j%%%%
$$ 411 411 410 410 410 410 410 410 410 410 410 410 410 410 409 409 409 409 409 409 409 409 409 409 409 409 409 408 408 408 408 408 408 408 408 408 408 408 408 408 407 407 407 407 407 407 407 407 407 407 407 407 406 406 406 406 406 406 406 406 406 406 406 406 406 405 405 405 405 405
-465D05%%%%%%%%j%%%%%%%%%%%%j%%%%%%%%%%%j%%%%%%%%%%%%j%%%%%%%%%%%%j%%%%%%%%%
$$ 405 405 405 405 405 405 405 405 405 404 404 404 404 404 404 404 404 404 404 404 404 404 403 403 403 403 403 403 403 403 403 403 403 403 402 402 402 402 402 402 402 402 402 402 402 402 402 401 401 401 401 401 401 401 401 401 401 401 401 401 400 400 400 400 400 400 400 400 400 400
-474D00%%%j%%%%%%%%%%%%j%%%%%%%%%%%%%j%%%%%%%%%%%%j%%%%%%%%%%%%j%%%%%%%%%%%%
$$ 400 400 400 400 399 399 399 399 399 399 399 399 399 399 399 399 399 398 398 398 398 398 398 398 398 398 398 398 398 398 398 397 397 397 397 397 397 397 397 397 397 397 397 397 396 396 396 396 396 396 396 396 396 396 396 396 396 395 395 395 395 395 395 395 395 395 395 395 395 395
-482C95j%%%%%%%%%%%%j%%%%%%%%%%%%%j%%%%%%%%%%%%j%%%%%%%%%%%%%j%%%%%%%%%%%%j%
$$ 395 394 394 394 394 394 394 394 394 394 394 394 394 394 393 393 393 393 393 393 393 393 393 393 393 393 393 393 392 392 392 392 392 392 392 392 392 392 392 392 392 391 391 391 391 391 391 391 391 391 391 391 391 391 391 390 390 390 390 390 390 390 390 390 390 390 390 390 389 389
-490C89%%%%%%%%%%%%j%%%%%%%%%%%%j%%%%%%%%%%%%%j%%%%%%%%%%%%%j%%%%%%%%%%%%%j%
$$ 389 389 389 389 389 389 389 389 389 389 389 389 389 388 388 388 388 388 388 388 388 388 388 388 388 388 387 387 387 387 387 387 387 387 387 387 387 387 387 387 386 386 386 386 386 386 386 386 386 386 386 386 386 386 385 385 385 385 385 385 385 385 385 385 385 385 385 385 384 384
-499C84%%%%%%%%%%%%j%%%%%%%%%%%%j%%%%%%%%%%%%%j%%%%%%%%%%%%%j%%%%%%%%%%%%%%j
$$ 384 384 384 384 384 384 384 384 384 384 384 384 384 383 383 383 383 383 383 383 383 383 383 383 383 383 382 382 382 382 382 382 382 382 382 382 382 382 382 382 381 381 381 381 381 381 381 381 381 381 381 381 381 381 380 380 380 380 380 380 380 380 380 380 380 380 380 380 380 379
-507C79%%%%%%%%%%%%%j%%%%%%%%%%%%%j%%%%%%%%%%%%%j%%%%%%%%%%%%%j%%%%%%%%%%%%%
$$ 379 379 379 379 379 379 379 379 379 379 379 379 379 379 378 378 378 378 378 378 378 378 378 378 378 378 378 378 377 377 377 377 377 377 377 377 377 377 377 377 377 377 376 376 376 376 376 376 376 376 376 376 376 376 376 376 375 375 375 375 375 375 375 375 375 375 375 375 375 375
-516C75%j%%%%%%%%%%%%%j%%%%%%%%%%%%%%j%%%%%%%%%%%%%j%%%%%%%%%%%%%%j%%%%%%%%%
$$ 375 375 374 374 374 374 374 374 374 374 374 374 374 374 374 374 373 373 373 373 373 373 373 373 373 373 373 373 373 373 373 372 372 372 372 372 372 372 372 372 372 372 372 372 372 371 371 371 371 371 371 371 371 371 371 371 371 371 371 371 370 370 370 370 370 370 370 370 370 370
-524C70%%%%j%%%%%%%%%%%%%%j%%%%%%%%%%%%%%j%%%%%%%%%%%%%%j%%%%%%%%%%%%%%j%%%%
$$ 370 370 370 370 370 369 369 369 369 369 369 369 369 369 369 369 369 369 369 369 368 368 368 368 368 368 368 368 368 368 368 368 368 368 368 367 367 367 367 367 367 367 367 367 367 367 367 367 367 367 366 366 366 366 366 366 366 366 366 366 366 366 366 366 366 365 365 365 365 365
-532C65%%%%%%%%%%j%%%%%%%%%%%%%%j%%%%%%%%%%%%%%j%%%%%%%%%%%%%%j%%%%%%%%%%%%%
$$ 365 365 365 365 365 365 365 365 365 365 365 364 364 364 364 364 364 364 364 364 364 364 364 364 364 364 363 363 363 363 363 363 363 363 363 363 363 363 363 363 363 362 362 362 362 362 362 362 362 362 362 362 362 362 362 362 361 361 361 361 361 361 361 361 361 361 361 361 361 361
-541C61%j%%%%%%%%%%%%%%j%%%%%%%%%%%%%%%j%%%%%%%%%%%%%%j%%%%%%%%%%%%%%%j%%%%%
$$ 361 361 360 360 360 360 360 360 360 360 360 360 360 360 360 360 360 359 359 359 359 359 359 359 359 359 359 359 359 359 359 359 359 358 358 358 358 358 358 358 358 358 358 358 358 358 358 358 357 357 357 357 357 357 357 357 357 357 357 357 357 357 357 357 356 356 356 356 356 356
-549C56%%%%%%%%%j%%%%%%%%%%%%%%%j%%%%%%%%%%%%%%%j%%%%%%%%%%%%%%j%%%%%%%%%%%%
$$ 356 356 356 356 356 356 356 356 356 356 355 355 355 355 355 355 355 355 355 355 355 355 355 355 355 355 354 354 354 354 354 354 354 354 354 354 354 354 354 354 354 354 353 353 353 353 353 353 353 353 353 353 353 353 353 353 353 352 352 352 352 352 352 352 352 352 352 352 352 352
-558C52%%%j%%%%%%%%%%%%%%%j%%%%%%%%%%%%%%%j%%%%%%%%%%%%%%%j%%%%%%%%%%%%%%%j%
$$ 352 352 352 352 351 351 351 351 351 351 351 351 351 351 351 351 351 351 351 351 350 350 350 350 350 350 350 350 350 350 350 350 350 350 350 350 349 349 349 349 349 349 349 349 349 349 349 349 349 349 349 349 348 348 348 348 348 348 348 348 348 348 348 348 348 348 348 348 347 347
-566C47%%%%%%%%%%%%%%j%%%%%%%%%%%%%%%%j%%%%%%%%%%%%%%%j%%%%%%%%%%%%%%%j%%%%%
$$ 347 347 347 347 347 347 347 347 347 347 347 347 347 347 347 346 346 346 346 346 346 346 346 346 346 346 346 346 346 346 346 346 345 345 345 345 345 345 345 345 345 345 345 345 345 345 345 345 344 344 344 344 344 344 344 344 344 344 344 344 344 344 344 344 343 343 343 343 343 343
-575C43%%%%%%%%%%%j%%%%%%%%%%%%%%%j%%%%%%%%%%%%%%%%j%%%%%%%%%%%%%%%%j%%%%%%%
$$ 343 343 343 343 343 343 343 343 343 343 343 343 342 342 342 342 342 342 342 342 342 342 342 342 342 342 342 342 341 341 341 341 341 341 341 341 341 341 341 341 341 341 341 341 341 340 340 340 340 340 340 340 340 340 340 340 340 340 340 340 340 340 339 339 339 339 339 339 339 339
-583C39%%%%%%%%j%%%%%%%%%%%%%%%%j%%%%%%%%%%%%%%%%j%%%%%%%%%%%%%%%%j%%%%%%%%%
$$ 339 339 339 339 339 339 339 339 339 338 338 338 338 338 338 338 338 338 338 338 338 338 338 338 338 338 337 337 337 337 337 337 337 337 337 337 337 337 337 337 337 337 337 336 336 336 336 336 336 336 336 336 336 336 336 336 336 336 336 336 335 335 335 335 335 335 335 335 335 335
-591C35%%%%%%%j%%%%%%%%%%%%%%%%j%%%%%%%%%%%%%%%%%j%%%%%%%%%%%%%%%%j%%%%%%%%%
$$ 335 335 335 335 335 335 335 335 334 334 334 334 334 334 334 334 334 334 334 334 334 334 334 334 334 333 333 333 333 333 333 333 333 333 333 333 333 333 333 333 333 333 333 332 332 332 332 332 332 332 332 332 332 332 332 332 332 332 332 332 331 331 331 331 331 331 331 331 331 331
-600C31%%%%%%%j%%%%%%%%%%%%%%%%%j%%%%%%%%%%%%%%%%j%%%%%%%%%%%%%%%%%j%%%%%%%%
$$ 331 331 331 331 331 331 331 331 330 330 330 330 330 330 330 330 330 330 330 330 330 330 330 330 330 330 329 329 329 329 329 329 329 329 329 329 329 329 329 329 329 329 329 328 328 328 328 328 328 328 328 328 328 328 328 328 328 328 328 328 328 327 327 327 327 327 327 327 327 327
-608C27%%%%%%%%%j%%%%%%%%%%%%%%%%%j%%%%%%%%%%%%%%%%j%%%%%%%%%%%%%%%%%j%%%%%%
$$ 327 327 327 327 327 327 327 327 327 327 326 326 326 326 326 326 326 326 326 326 326 326 326 326 326 326 326 326 325 325 325 325 325 325 325 325 325 325 325 325 325 325 325 325 325 324 324 324 324 324 324 324 324 324 324 324 324 324 324 324 324 324 324 323 323 323 323 323 323 323
-617C23%%%%%%%%%%%j%%%%%%%%%%%%%%%%%%j%%%%%%%%%%%%%%%%%j%%%%%%%%%%%%%%%%%j%%
$$ 323 323 323 323 323 323 323 323 323 323 323 323 322 322 322 322 322 322 322 322 322 322 322 322 322 322 322 322 322 322 322 321 321 321 321 321 321 321 321 321 321 321 321 321 321 321 321 321 321 320 320 320 320 320 320 320 320 320 320 320 320 320 320 320 320 320 320 319 319 319
-625C19%%%%%%%%%%%%%%%%j%%%%%%%%%%%%%%%%%j%%%%%%%%%%%%%%%%%%j%%%%%%%%%%%%%%%
$$ 319 319 319 319 319 319 319 319 319 319 319 319 319 319 319 319 319 318 318 318 318 318 318 318 318 318 318 318 318 318 318 318 318 318 318 317 317 317 317 317 317 317 317 317 317 317 317 317 317 317 317 317 317 317 316 316 316 316 316 316 316 316 316 316 316 316 316 316 316 316
-634C16%%j%%%%%%%%%%%%%%%%%%j%%%%%%%%%%%%%%%%%%j%%%%%%%%%%%%%%%%%%j%%%%%%%%%
$$ 316 316 316 315 315 315 315 315 315 315 315 315 315 315 315 315 315 315 315 315 315 315 314 314 314 314 314 314 314 314 314 314 314 314 314 314 314 314 314 314 314 313 313 313 313 313 313 313 313 313 313 313 313 313 313 313 313 313 313 313 312 312 312 312 312 312 312 312 312 312
-642C12%%%%%%%%%j%%%%%%%%%%%%%%%%%%j%%%%%%%%%%%%%%%%%%j%%%%%%%%%%%%%%%%%%%j%
$$ 312 312 312 312 312 312 312 312 312 312 311 311 311 311 311 311 311 311 311 311 311 311 311 311 311 311 311 311 311 310 310 310 310 310 310 310 310 310 310 310 310 310 310 310 310 310 310 310 309 309 309 309 309 309 309 309 309 309 309 309 309 309 309 309 309 309 309 309 308 308
-650C08%%%%%%%%%%%%%%%%%j%%%%%%%%%%%%%%%%%%%j%%%%%%%%%%%%%%%%%%j%%%%%%%%%%%%
$$ 308 308 308 308 308 308 308 308 308 308 308 308 308 308 308 308 308 308 307 307 307 307 307 307 307 307 307 307 307 307 307 307 307 307 307 307 307 307 306 306 306 306 306 306 306 306 306 306 306 306 306 306 306 306 306 306 306 305 305 305 305 305 305 305 305 305 305 305 305 305
-659C05%%%%%%%j%%%%%%%%%%%%%%%%%%%j%%%%%%%%%%%%%%%%%%%j%%%%%%%%%%%%%%%%%%%j%
$$ 305 305 305 305 305 305 305 305 304 304 304 304 304 304 304 304 304 304 304 304 304 304 304 304 304 304 304 304 303 303 303 303 303 303 303 303 303 303 303 303 303 303 303 303 303 303 303 303 302 302 302 302 302 302 302 302 302 302 302 302 302 302 302 302 302 302 302 302 301 301
-667C01%%%%%%%%%%%%%%%%%%j%%%%%%%%%%%%%%%%%%%j%%%%%%%%%%%%%%%%%%%j%%%%%%%%%%
$$ 301 301 301 301 301 301 301 301 301 301 301 301 301 301 301 301 301 301 301 300 300 300 300 300 300 300 300 300 300 300 300 300 300 300 300 300 300 300 300 299 299 299 299 299 299 299 299 299 299 299 299 299 299 299 299 299 299 299 299 298 298 298 298 298 298 298 298 298 298 298
-676B98%%%%%%%%%%j%%%%%%%%%%%%%%%%%%%j%%%%%%%%%%%%%%%%%%%%j%%%%%%%%%%%%%%%%%
$$ 298 298 298 298 298 298 298 298 298 298 298 297 297 297 297 297 297 297 297 297 297 297 297 297 297 297 297 297 297 297 297 296 296 296 296 296 296 296 296 296 296 296 296 296 296 296 296 296 296 296 296 296 295 295 295 295 295 295 295 295 295 295 295 295 295 295 295 295 295 295
-684B95%%%j%%%%%%%%%%%%%%%%%%%%j%%%%%%%%%%%%%%%%%%%j%%%%%%%%%%%%%%%%%%%%%j%%
$$ 295 295 295 295 294 294 294 294 294 294 294 294 294 294 294 294 294 294 294 294 294 294 294 294 294 293 293 293 293 293 293 293 293 293 293 293 293 293 293 293 293 293 293 293 293 292 292 292 292 292 292 292 292 292 292 292 292 292 292 292 292 292 292 292 292 292 292 291 291 291
-693B91%%%%%%%%%%%%%%%%%%j%%%%%%%%%%%%%%%%%%%%j%%%%%%%%%%%%%%%%%%%%j%%%%%%%%
$$ 291 291 291 291 291 291 291 291 291 291 291 291 291 291 291 291 291 291 291 290 290 290 290 290 290 290 290 290 290 290 290 290 290 290 290 290 290 290 290 290 289 289 289 289 289 289 289 289 289 289 289 289 289 289 289 289 289 289 289 289 289 288 288 288 288 288 288 288 288 288
-701B88%%%%%%%%%%%%%j%%%%%%%%%%%%%%%%%%%%%j%%%%%%%%%%%%%%%%%%%%j%%%%%%%%%%%%
$$ 288 288 288 288 288 288 288 288 288 288 288 288 288 288 287 287 287 287 287 287 287 287 287 287 287 287 287 287 287 287 287 287 287 287 287 287 286 286 286 286 286 286 286 286 286 286 286 286 286 286 286 286 286 286 286 286 286 285 285 285 285 285 285 285 285 285 285 285 285 285
-709B85%%%%%%%%%j%%%%%%%%%%%%%%%%%%%%%j%%%%%%%%%%%%%%%%%%%%%j%%%%%%%%%%%%%%%
$$ 285 285 285 285 285 285 285 285 285 285 284 284 284 284 284 284 284 284 284 284 284 284 284 284 284 284 284 284 284 284 284 284 283 283 283 283 283 283 283 283 283 283 283 283 283 283 283 283 283 283 283 283 283 283 282 282 282 282 282 282 282 282 282 282 282 282 282 282 282 282
-718B82%%%%%%%j%%%%%%%%%%%%%%%%%%%%%j%%%%%%%%%%%%%%%%%%%%%j%%%%%%%%%%%%%%%%%
$$ 282 282 282 282 282 282 282 282 281 281 281 281 281 281 281 281 281 281 281 281 281 281 281 281 281 281 281 281 281 281 280 280 280 280 280 280 280 280 280 280 280 280 280 280 280 280 280 280 280 280 280 280 279 279 279 279 279 279 279 279 279 279 279 279 279 279 279 279 279 279
-726B79%%%%%j%%%%%%%%%%%%%%%%%%%%%%j%%%%%%%%%%%%%%%%%%%%%%j%%%%%%%%%%%%%%%%%
$$ 279 279 279 279 279 279 278 278 278 278 278 278 278 278 278 278 278 278 278 278 278 278 278 278 278 278 278 278 278 277 277 277 277 277 277 277 277 277 277 277 277 277 277 277 277 277 277 277 277 277 277 277 276 276 276 276 276 276 276 276 276 276 276 276 276 276 276 276 276 276
-735B76%%%%%j%%%%%%%%%%%%%%%%%%%%%%j%%%%%%%%%%%%%%%%%%%%%%j%%%%%%%%%%%%%%%%%
$$ 276 276 276 276 276 276 275 275 275 275 275 275 275 275 275 275 275 275 275 275 275 275 275 275 275 275 275 275 275 274 274 274 274 274 274 274 274 274 274 274 274 274 274 274 274 274 274 274 274 274 274 274 273 273 273 273 273 273 273 273 273 273 273 273 273 273 273 273 273 273
-743B73%%%%%j%%%%%%%%%%%%%%%%%%%%%%%j%%%%%%%%%%%%%%%%%%%%%%j%%%%%%%%%%%%%%%%
$$ 273 273 273 273 273 273 272 272 272 272 272 272 272 272 272 272 272 272 272 272 272 272 272 272 272 272 272 272 272 272 271 271 271 271 271 271 271 271 271 271 271 271 271 271 271 271 271 271 271 271 271 271 271 270 270 270 270 270 270 270 270 270 270 270 270 270 270 270 270 270
-752B70%%%%%%%j%%%%%%%%%%%%%%%%%%%%%%%j%%%%%%%%%%%%%%%%%%%%%%%j%%%%%%%%%%%%%
$$ 270 270 270 270 270 270 270 270 269 269 269 269 269 269 269 269 269 269 269 269 269 269 269 269 269 269 269 269 269 269 269 269 268 268 268 268 268 268 268 268 268 268 268 268 268 268 268 268 268 268 268 268 268 268 268 268 267 267 267 267 267 267 267 267 267 267 267 267 267 267
-760B67%%%%%%%%%%j%%%%%%%%%%%%%%%%%%%%%%%%j%%%%%%%%%%%%%%%%%%%%%%%j%%%%%%%%%
$$ 267 267 267 267 267 267 267 267 267 267 267 266 266 266 266 266 266 266 266 266 266 266 266 266 266 266 266 266 266 266 266 266 266 266 266 266 265 265 265 265 265 265 265 265 265 265 265 265 265 265 265 265 265 265 265 265 265 265 265 265 264 264 264 264 264 264 264 264 264 264
-768B64%%%%%%%%%%%%%%%j%%%%%%%%%%%%%%%%%%%%%%%j%%%%%%%%%%%%%%%%%%%%%%%%j%%%%
$$ 264 264 264 264 264 264 264 264 264 264 264 264 264 264 264 264 263 263 263 263 263 263 263 263 263 263 263 263 263 263 263 263 263 263 263 263 263 263 263 263 262 262 262 262 262 262 262 262 262 262 262 262 262 262 262 262 262 262 262 262 262 262 262 262 262 261 261 261 261 261
-777B61%%%%%%%%%%%%%%%%%%%%j%%%%%%%%%%%%%%%%%%%%%%%%j%%%%%%%%%%%%%%%%%%%%%%%
$$ 261 261 261 261 261 261 261 261 261 261 261 261 261 261 261 261 261 261 261 261 261 260 260 260 260 260 260 260 260 260 260 260 260 260 260 260 260 260 260 260 260 260 260 260 260 260 259 259 259 259 259 259 259 259 259 259 259 259 259 259 259 259 259 259 259 259 259 259 259 259
-785B59%%j%%%%%%%%%%%%%%%%%%%%%%%%j%%%%%%%%%%%%%%%%%%%%%%%%%j%%%%%%%%%%%%%%%
$$ 259 259 259 258 258 258 258 258 258 258 258 258 258 258 258 258 258 258 258 258 258 258 258 258 258 258 258 258 257 257 257 257 257 257 257 257 257 257 257 257 257 257 257 257 257 257 257 257 257 257 257 257 257 257 256 256 256 256 256 256 256 256 256 256 256 256 256 256 256 256
-794B56%%%%%%%%%%j%%%%%%%%%%%%%%%%%%%%%%%%%j%%%%%%%%%%%%%%%%%%%%%%%%%j%%%%%%
$$ 256 256 256 256 256 256 256 256 256 256 256 255 255 255 255 255 255 255 255 255 255 255 255 255 255 255 255 255 255 255 255 255 255 255 255 255 255 254 254 254 254 254 254 254 254 254 254 254 254 254 254 254 254 254 254 254 254 254 254 254 254 254 254 253 253 253 253 253 253 253
-802B53%%%%%%%%%%%%%%%%%%%j%%%%%%%%%%%%%%%%%%%%%%%%%j%%%%%%%%%%%%%%%%%%%%%%%
$$ 253 253 253 253 253 253 253 253 253 253 253 253 253 253 253 253 253 253 253 253 252 252 252 252 252 252 252 252 252 252 252 252 252 252 252 252 252 252 252 252 252 252 252 252 252 252 251 251 251 251 251 251 251 251 251 251 251 251 251 251 251 251 251 251 251 251 251 251 251 251
-811B51%%%j%%%%%%%%%%%%%%%%%%%%%%%%%%j%%%%%%%%%%%%%%%%%%%%%%%%%%j%%%%%%%%%%%
$$ 251 251 251 251 250 250 250 250 250 250 250 250 250 250 250 250 250 250 250 250 250 250 250 250 250 250 250 250 250 250 250 249 249 249 249 249 249 249 249 249 249 249 249 249 249 249 249 249 249 249 249 249 249 249 249 249 249 249 248 248 248 248 248 248 248 248 248 248 248 248
-819B48%%%%%%%%%%%%%%%j%%%%%%%%%%%%%%%%%%%%%%%%%%j%%%%%%%%%%%%%%%%%%%%%%%%%%
$$ 248 248 248 248 248 248 248 248 248 248 248 248 248 248 248 248 247 247 247 247 247 247 247 247 247 247 247 247 247 247 247 247 247 247 247 247 247 247 247 247 247 247 247 246 246 246 246 246 246 246 246 246 246 246 246 246 246 246 246 246 246 246 246 246 246 246 246 246 246 246
-827B46j%%%%%%%%%%%%%%%%%%%%%%%%%%%j%%%%%%%%%%%%%%%%%%%%%%%%%%%j%%%%%%%%%%%%
$$ 246 245 245 245 245 245 245 245 245 245 245 245 245 245 245 245 245 245 245 245 245 245 245 245 245 245 245 245 245 244 244 244 244 244 244 244 244 244 244 244 244 244 244 244 244 244 244 244 244 244 244 244 244 244 244 244 244 243 243 243 243 243 243 243 243 243 243 243 243 243
-836B43%%%%%%%%%%%%%%j%%%%%%%%%%%%%%%%%%%%%%%%%%%%j%%%%%%%%%%%%%%%%%%%%%%%%%
$$ 243 243 243 243 243 243 243 243 243 243 243 243 243 243 243 242 242 242 242 242 242 242 242 242 242 242 242 242 242 242 242 242 242 242 242 242 242 242 242 242 242 242 242 242 241 241 241 241 241 241 241 241 241 241 241 241 241 241 241 241 241 241 241 241 241 241 241 241 241 241
-844B41%%j%%%%%%%%%%%%%%%%%%%%%%%%%%%j%%%%%%%%%%%%%%%%%%%%%%%%%%%%j%%%%%%%%%
$$ 241 241 241 240 240 240 240 240 240 240 240 240 240 240 240 240 240 240 240 240 240 240 240 240 240 240 240 240 240 240 240 239 239 239 239 239 239 239 239 239 239 239 239 239 239 239 239 239 239 239 239 239 239 239 239 239 239 239 239 239 238 238 238 238 238 238 238 238 238 238
-853B38%%%%%%%%%%%%%%%%%%%j%%%%%%%%%%%%%%%%%%%%%%%%%%%%j%%%%%%%%%%%%%%%%%%%%
$$ 238 238 238 238 238 238 238 238 238 238 238 238 238 238 238 238 238 238 238 238 237 237 237 237 237 237 237 237 237 237 237 237 237 237 237 237 237 237 237 237 237 237 237 237 237 237 237 237 237 236 236 236 236 236 236 236 236 236 236 236 236 236 236 236 236 236 236 236 236 236
-861B36%%%%%%%%j%%%%%%%%%%%%%%%%%%%%%%%%%%%%j%%%%%%%%%%%%%%%%%%%%%%%%%%%%%j%
$$ 236 236 236 236 236 236 236 236 236 235 235 235 235 235 235 235 235 235 235 235 235 235 235 235 235 235 235 235 235 235 235 235 235 235 235 235 235 235 234 234 234 234 234 234 234 234 234 234 234 234 234 234 234 234 234 234 234 234 234 234 234 234 234 234 234 234 234 234 233 233
-869B33%%%%%%%%%%%%%%%%%%%%%%%%%%%%j%%%%%%%%%%%%%%%%%%%%%%%%%%%%%j%%%%%%%%%%
$$ 233 233 233 233 233 233 233 233 233 233 233 233 233 233 233 233 233 233 233 233 233 233 233 233 233 233 233 233 233 232 232 232 232 232 232 232 232 232 232 232 232 232 232 232 232 232 232 232 232 232 232 232 232 232 232 232 232 232 232 231 231 231 231 231 231 231 231 231 231 231
-878B31%%%%%%%%%%%%%%%%%%%j%%%%%%%%%%%%%%%%%%%%%%%%%%%%%j%%%%%%%%%%%%%%%%%%%
$$ 231 231 231 231 231 231 231 231 231 231 231 231 231 231 231 231 231 231 231 231 230 230 230 230 230 230 230 230 230 230 230 230 230 230 230 230 230 230 230 230 230 230 230 230 230 230 230 230 230 230 229 229 229 229 229 229 229 229 229 229 229 229 229 229 229 229 229 229 229 229
-886B29%%%%%%%%%%%j%%%%%%%%%%%%%%%%%%%%%%%%%%%%%%j%%%%%%%%%%%%%%%%%%%%%%%%%%
$$ 229 229 229 229 229 229 229 229 229 229 229 229 228 228 228 228 228 228 228 228 228 228 228 228 228 228 228 228 228 228 228 228 228 228 228 228 228 228 228 228 228 228 228 227 227 227 227 227 227 227 227 227 227 227 227 227 227 227 227 227 227 227 227 227 227 227 227 227 227 227
-895B27%%%%j%%%%%%%%%%%%%%%%%%%%%%%%%%%%%%j%%%%%%%%%%%%%%%%%%%%%%%%%%%%%%j%%
$$ 227 227 227 227 227 226 226 226 226 226 226 226 226 226 226 226 226 226 226 226 226 226 226 226 226 226 226 226 226 226 226 226 226 226 226 226 225 225 225 225 225 225 225 225 225 225 225 225 225 225 225 225 225 225 225 225 225 225 225 225 225 225 225 225 225 225 225 224 224 224
$$ [...]
-1000@
##END=		$$ NMR SPECTRUM
##TITLE=	
##JCAMP-DX=	6.0	$$ MestReNova 15.0.0-34764
##DATA TYPE=	NMR PEAK TABLE
##DATA CLASS=	PEAK TABLE
##BLOCK_ID=	3
##ORIGIN=	Mestrelab Research S.L.
##OWNER=	PC
##CROSS REFERENCE=	NMR SPECTRUM: BLOCK_ID=2                                     
##.OBSERVE FREQUENCY=	500.12699922000001607
##.OBSERVE NUCLEUS=	^Unknown
##NPOINTS=	15
##FIRSTX=	1.3759846568568909753
##LASTX=	4.3004828109748141074
##XFACTOR=	1
##YFACTOR=	1
##FIRSTY=	0.05742228463141114958
##XUNITS=	PPM
##YUNITS=	ARBITRARY UNITS
##PEAK TABLE=	(XYW..XYW)
1.3759846568568909753,0.05742228463141114958,0.0010250066368588013361
1.3899029813252099519,0.11088417665524151479,0.0011067505327021351022
1.4040170147554644764,0.050007167837117581788,0.0012849612953857933451
1.6360042176670874792,0.052407604121971686217,0.0011710063395452686812
1.64698726396967432,0.051805798671462441329,0.0011828078784271312939
1.6733653845812699323,0.050433097900799403468,0.0011994371050253994308
1.6843165741530685686,0.047735756830577930065,0.0012683117319051060139
4.2397691618632098454,0.0098268628308888304052,0.0010250066368588013361
4.2537442657441468796,0.030224760091934858852,0.0010250066368588013361
4.2583263312079875362,0.0096892653905919952362,0.0010250066368588013361
4.2678478727122364234,0.027939195660875649346,0.001121228109264612487
4.2722883622776146595,0.028039524128651883983,0.0011582521376041746055
4.2817639718338318389,0.0095018977554591418921,0.0010250066368588013361
4.2863999662351472963,0.028921667836852495148,0.0010250066368588013361
4.3004828109748141074,0.0088071161196761355711,0.0011441693977953407233
##$MNOVA/PEAK_DATA_TABLE=	(T,F,A,ST,SP,APT,APC)
$$ Complementary to PEAK TABLE
$$ T: Type
$$ F: Flags
$$ A: Annotation
$$ ST: Shape Type
$$ SP: Shape Parameter
$$ APT: Attached Peaks Type
$$ APC: Attached Peaks Count
Compound,None,,1,0.044112305670300250293,0,0
Compound,None,,1,0.27629115156032690859,0,0
Compound,None,,1,0.58539415677347239608,0,0
Compound,None,,1,0.36245648020293536051,0,0
Compound,None,,1,0.40000000000000007772,0,0
Compound,None,,1,0.39848693651000383076,0,0
Compound,None,,1,0.53390274388978675724,0,0
Compound,None,,1,0.057119921235918393043,0,0
Compound,None,,1,0.2000000000000000111,0,0
Compound,None,,1,0.057363743096716157677,0,0
Compound,None,,1,0.40000000000000007772,0,0
Compound,None,,1,0.40000000000000007772,0,0
Compound,None,,1,0.050847380775204571723,0,0
Compound,None,,1,0.044452053132024563209,0,0
Compound,None,,1,0.40000000000000007772,0,0
##END=		$$ NMR PEAK TABLE
##END=		$$ LINK
